lucene-dev mailing list archives

Site index · List index
Message view « Date » · « Thread »
Top « Date » · « Thread »
From Policeman Jenkins Server <jenk...@thetaphi.de>
Subject [JENKINS-EA] Lucene-Solr-6.x-Linux (32bit/jdk-9-jigsaw-ea+110) - Build # 199 - Failure!
Date Mon, 21 Mar 2016 19:58:14 GMT
Build: http://jenkins.thetaphi.de/job/Lucene-Solr-6.x-Linux/199/
Java: 32bit/jdk-9-jigsaw-ea+110 -client -XX:+UseConcMarkSweepGC -XX:-CompactStrings

1 tests failed.
FAILED:  org.apache.solr.handler.TestReqParamsAPI.test

Error Message:
Could not get expected value  'CY val' for path 'params/c' full output: {   "responseHeader":{     "status":0,     "QTime":0},   "params":{     "a":"A val",     "b":"B val",     "wt":"json",     "useParams":""},   "context":{     "webapp":"",     "path":"/dump1",     "httpMethod":"GET"}}

Stack Trace:
java.lang.AssertionError: Could not get expected value  'CY val' for path 'params/c' full output: {
  "responseHeader":{
    "status":0,
    "QTime":0},
  "params":{
    "a":"A val",
    "b":"B val",
    "wt":"json",
    "useParams":""},
  "context":{
    "webapp":"",
    "path":"/dump1",
    "httpMethod":"GET"}}
	at __randomizedtesting.SeedInfo.seed([15741E16B47C1B9E:9D2021CC1A807666]:0)
	at org.junit.Assert.fail(Assert.java:93)
	at org.junit.Assert.assertTrue(Assert.java:43)
	at org.apache.solr.core.TestSolrConfigHandler.testForResponseElement(TestSolrConfigHandler.java:458)
	at org.apache.solr.handler.TestReqParamsAPI.testReqParams(TestReqParamsAPI.java:177)
	at org.apache.solr.handler.TestReqParamsAPI.test(TestReqParamsAPI.java:67)
	at sun.reflect.NativeMethodAccessorImpl.invoke0(java.base@9-ea/Native Method)
	at sun.reflect.NativeMethodAccessorImpl.invoke(java.base@9-ea/NativeMethodAccessorImpl.java:62)
	at sun.reflect.DelegatingMethodAccessorImpl.invoke(java.base@9-ea/DelegatingMethodAccessorImpl.java:43)
	at java.lang.reflect.Method.invoke(java.base@9-ea/Method.java:531)
	at com.carrotsearch.randomizedtesting.RandomizedRunner.invoke(RandomizedRunner.java:1764)
	at com.carrotsearch.randomizedtesting.RandomizedRunner$8.evaluate(RandomizedRunner.java:871)
	at com.carrotsearch.randomizedtesting.RandomizedRunner$9.evaluate(RandomizedRunner.java:907)
	at com.carrotsearch.randomizedtesting.RandomizedRunner$10.evaluate(RandomizedRunner.java:921)
	at org.apache.solr.BaseDistributedSearchTestCase$ShardsRepeatRule$ShardsFixedStatement.callStatement(BaseDistributedSearchTestCase.java:996)
	at org.apache.solr.BaseDistributedSearchTestCase$ShardsRepeatRule$ShardsStatement.evaluate(BaseDistributedSearchTestCase.java:971)
	at com.carrotsearch.randomizedtesting.rules.SystemPropertiesRestoreRule$1.evaluate(SystemPropertiesRestoreRule.java:57)
	at org.apache.lucene.util.TestRuleSetupTeardownChained$1.evaluate(TestRuleSetupTeardownChained.java:49)
	at org.apache.lucene.util.AbstractBeforeAfterRule$1.evaluate(AbstractBeforeAfterRule.java:45)
	at org.apache.lucene.util.TestRuleThreadAndTestName$1.evaluate(TestRuleThreadAndTestName.java:48)
	at org.apache.lucene.util.TestRuleIgnoreAfterMaxFailures$1.evaluate(TestRuleIgnoreAfterMaxFailures.java:64)
	at org.apache.lucene.util.TestRuleMarkFailure$1.evaluate(TestRuleMarkFailure.java:47)
	at com.carrotsearch.randomizedtesting.rules.StatementAdapter.evaluate(StatementAdapter.java:36)
	at com.carrotsearch.randomizedtesting.ThreadLeakControl$StatementRunner.run(ThreadLeakControl.java:367)
	at com.carrotsearch.randomizedtesting.ThreadLeakControl.forkTimeoutingTask(ThreadLeakControl.java:809)
	at com.carrotsearch.randomizedtesting.ThreadLeakControl$3.evaluate(ThreadLeakControl.java:460)
	at com.carrotsearch.randomizedtesting.RandomizedRunner.runSingleTest(RandomizedRunner.java:880)
	at com.carrotsearch.randomizedtesting.RandomizedRunner$5.evaluate(RandomizedRunner.java:781)
	at com.carrotsearch.randomizedtesting.RandomizedRunner$6.evaluate(RandomizedRunner.java:816)
	at com.carrotsearch.randomizedtesting.RandomizedRunner$7.evaluate(RandomizedRunner.java:827)
	at com.carrotsearch.randomizedtesting.rules.StatementAdapter.evaluate(StatementAdapter.java:36)
	at com.carrotsearch.randomizedtesting.rules.SystemPropertiesRestoreRule$1.evaluate(SystemPropertiesRestoreRule.java:57)
	at org.apache.lucene.util.AbstractBeforeAfterRule$1.evaluate(AbstractBeforeAfterRule.java:45)
	at com.carrotsearch.randomizedtesting.rules.StatementAdapter.evaluate(StatementAdapter.java:36)
	at org.apache.lucene.util.TestRuleStoreClassName$1.evaluate(TestRuleStoreClassName.java:41)
	at com.carrotsearch.randomizedtesting.rules.NoShadowingOrOverridesOnMethodsRule$1.evaluate(NoShadowingOrOverridesOnMethodsRule.java:40)
	at com.carrotsearch.randomizedtesting.rules.NoShadowingOrOverridesOnMethodsRule$1.evaluate(NoShadowingOrOverridesOnMethodsRule.java:40)
	at com.carrotsearch.randomizedtesting.rules.StatementAdapter.evaluate(StatementAdapter.java:36)
	at com.carrotsearch.randomizedtesting.rules.StatementAdapter.evaluate(StatementAdapter.java:36)
	at com.carrotsearch.randomizedtesting.rules.StatementAdapter.evaluate(StatementAdapter.java:36)
	at org.apache.lucene.util.TestRuleAssertionsRequired$1.evaluate(TestRuleAssertionsRequired.java:53)
	at org.apache.lucene.util.TestRuleMarkFailure$1.evaluate(TestRuleMarkFailure.java:47)
	at org.apache.lucene.util.TestRuleIgnoreAfterMaxFailures$1.evaluate(TestRuleIgnoreAfterMaxFailures.java:64)
	at org.apache.lucene.util.TestRuleIgnoreTestSuites$1.evaluate(TestRuleIgnoreTestSuites.java:54)
	at com.carrotsearch.randomizedtesting.rules.StatementAdapter.evaluate(StatementAdapter.java:36)
	at com.carrotsearch.randomizedtesting.ThreadLeakControl$StatementRunner.run(ThreadLeakControl.java:367)
	at java.lang.Thread.run(java.base@9-ea/Thread.java:804)




Build Log:
[...truncated 12199 lines...]
   [junit4] Suite: org.apache.solr.handler.TestReqParamsAPI
   [junit4]   2> Creating dataDir: /home/jenkins/workspace/Lucene-Solr-6.x-Linux/solr/build/solr-core/test/J0/temp/solr.handler.TestReqParamsAPI_15741E16B47C1B9E-001/init-core-data-001
   [junit4]   2> 1827137 INFO  (SUITE-TestReqParamsAPI-seed#[15741E16B47C1B9E]-worker) [    ] o.a.s.SolrTestCaseJ4 Randomized ssl (false) and clientAuth (true)
   [junit4]   2> 1827137 INFO  (SUITE-TestReqParamsAPI-seed#[15741E16B47C1B9E]-worker) [    ] o.a.s.BaseDistributedSearchTestCase Setting hostContext system property: /
   [junit4]   2> 1827139 INFO  (TEST-TestReqParamsAPI.test-seed#[15741E16B47C1B9E]) [    ] o.a.s.c.ZkTestServer STARTING ZK TEST SERVER
   [junit4]   2> 1827139 INFO  (Thread-4603) [    ] o.a.s.c.ZkTestServer client port:0.0.0.0/0.0.0.0:0
   [junit4]   2> 1827139 INFO  (Thread-4603) [    ] o.a.s.c.ZkTestServer Starting server
   [junit4]   2> 1827239 INFO  (TEST-TestReqParamsAPI.test-seed#[15741E16B47C1B9E]) [    ] o.a.s.c.ZkTestServer start zk server on port:41021
   [junit4]   2> 1827239 INFO  (TEST-TestReqParamsAPI.test-seed#[15741E16B47C1B9E]) [    ] o.a.s.c.c.SolrZkClient Using default ZkCredentialsProvider
   [junit4]   2> 1827240 INFO  (TEST-TestReqParamsAPI.test-seed#[15741E16B47C1B9E]) [    ] o.a.s.c.c.ConnectionManager Waiting for client to connect to ZooKeeper
   [junit4]   2> 1827241 INFO  (zkCallback-2271-thread-1) [    ] o.a.s.c.c.ConnectionManager Watcher org.apache.solr.common.cloud.ConnectionManager@e8ecc2 name:ZooKeeperConnection Watcher:127.0.0.1:41021 got event WatchedEvent state:SyncConnected type:None path:null path:null type:None
   [junit4]   2> 1827242 INFO  (TEST-TestReqParamsAPI.test-seed#[15741E16B47C1B9E]) [    ] o.a.s.c.c.ConnectionManager Client is connected to ZooKeeper
   [junit4]   2> 1827242 INFO  (TEST-TestReqParamsAPI.test-seed#[15741E16B47C1B9E]) [    ] o.a.s.c.c.SolrZkClient Using default ZkACLProvider
   [junit4]   2> 1827242 INFO  (TEST-TestReqParamsAPI.test-seed#[15741E16B47C1B9E]) [    ] o.a.s.c.c.SolrZkClient makePath: /solr
   [junit4]   2> 1827243 INFO  (TEST-TestReqParamsAPI.test-seed#[15741E16B47C1B9E]) [    ] o.a.s.c.c.SolrZkClient Using default ZkCredentialsProvider
   [junit4]   2> 1827243 INFO  (TEST-TestReqParamsAPI.test-seed#[15741E16B47C1B9E]) [    ] o.a.s.c.c.ConnectionManager Waiting for client to connect to ZooKeeper
   [junit4]   2> 1827244 INFO  (zkCallback-2272-thread-1) [    ] o.a.s.c.c.ConnectionManager Watcher org.apache.solr.common.cloud.ConnectionManager@161bf69 name:ZooKeeperConnection Watcher:127.0.0.1:41021/solr got event WatchedEvent state:SyncConnected type:None path:null path:null type:None
   [junit4]   2> 1827245 INFO  (TEST-TestReqParamsAPI.test-seed#[15741E16B47C1B9E]) [    ] o.a.s.c.c.ConnectionManager Client is connected to ZooKeeper
   [junit4]   2> 1827245 INFO  (TEST-TestReqParamsAPI.test-seed#[15741E16B47C1B9E]) [    ] o.a.s.c.c.SolrZkClient Using default ZkACLProvider
   [junit4]   2> 1827245 INFO  (TEST-TestReqParamsAPI.test-seed#[15741E16B47C1B9E]) [    ] o.a.s.c.c.SolrZkClient makePath: /collections/collection1
   [junit4]   2> 1827246 INFO  (TEST-TestReqParamsAPI.test-seed#[15741E16B47C1B9E]) [    ] o.a.s.c.c.SolrZkClient makePath: /collections/collection1/shards
   [junit4]   2> 1827246 INFO  (TEST-TestReqParamsAPI.test-seed#[15741E16B47C1B9E]) [    ] o.a.s.c.c.SolrZkClient makePath: /collections/control_collection
   [junit4]   2> 1827247 INFO  (TEST-TestReqParamsAPI.test-seed#[15741E16B47C1B9E]) [    ] o.a.s.c.c.SolrZkClient makePath: /collections/control_collection/shards
   [junit4]   2> 1827247 INFO  (TEST-TestReqParamsAPI.test-seed#[15741E16B47C1B9E]) [    ] o.a.s.c.AbstractZkTestCase put /home/jenkins/workspace/Lucene-Solr-6.x-Linux/solr/core/src/test-files/solr/collection1/conf/solrconfig-tlog.xml to /configs/conf1/solrconfig.xml
   [junit4]   2> 1827248 INFO  (TEST-TestReqParamsAPI.test-seed#[15741E16B47C1B9E]) [    ] o.a.s.c.c.SolrZkClient makePath: /configs/conf1/solrconfig.xml
   [junit4]   2> 1827249 INFO  (TEST-TestReqParamsAPI.test-seed#[15741E16B47C1B9E]) [    ] o.a.s.c.AbstractZkTestCase put /home/jenkins/workspace/Lucene-Solr-6.x-Linux/solr/core/src/test-files/solr/collection1/conf/schema.xml to /configs/conf1/schema.xml
   [junit4]   2> 1827249 INFO  (TEST-TestReqParamsAPI.test-seed#[15741E16B47C1B9E]) [    ] o.a.s.c.c.SolrZkClient makePath: /configs/conf1/schema.xml
   [junit4]   2> 1827250 INFO  (TEST-TestReqParamsAPI.test-seed#[15741E16B47C1B9E]) [    ] o.a.s.c.AbstractZkTestCase put /home/jenkins/workspace/Lucene-Solr-6.x-Linux/solr/core/src/test-files/solr/collection1/conf/solrconfig.snippet.randomindexconfig.xml to /configs/conf1/solrconfig.snippet.randomindexconfig.xml
   [junit4]   2> 1827250 INFO  (TEST-TestReqParamsAPI.test-seed#[15741E16B47C1B9E]) [    ] o.a.s.c.c.SolrZkClient makePath: /configs/conf1/solrconfig.snippet.randomindexconfig.xml
   [junit4]   2> 1827251 INFO  (TEST-TestReqParamsAPI.test-seed#[15741E16B47C1B9E]) [    ] o.a.s.c.AbstractZkTestCase put /home/jenkins/workspace/Lucene-Solr-6.x-Linux/solr/core/src/test-files/solr/collection1/conf/stopwords.txt to /configs/conf1/stopwords.txt
   [junit4]   2> 1827251 INFO  (TEST-TestReqParamsAPI.test-seed#[15741E16B47C1B9E]) [    ] o.a.s.c.c.SolrZkClient makePath: /configs/conf1/stopwords.txt
   [junit4]   2> 1827251 INFO  (TEST-TestReqParamsAPI.test-seed#[15741E16B47C1B9E]) [    ] o.a.s.c.AbstractZkTestCase put /home/jenkins/workspace/Lucene-Solr-6.x-Linux/solr/core/src/test-files/solr/collection1/conf/protwords.txt to /configs/conf1/protwords.txt
   [junit4]   2> 1827252 INFO  (TEST-TestReqParamsAPI.test-seed#[15741E16B47C1B9E]) [    ] o.a.s.c.c.SolrZkClient makePath: /configs/conf1/protwords.txt
   [junit4]   2> 1827252 INFO  (TEST-TestReqParamsAPI.test-seed#[15741E16B47C1B9E]) [    ] o.a.s.c.AbstractZkTestCase put /home/jenkins/workspace/Lucene-Solr-6.x-Linux/solr/core/src/test-files/solr/collection1/conf/currency.xml to /configs/conf1/currency.xml
   [junit4]   2> 1827252 INFO  (TEST-TestReqParamsAPI.test-seed#[15741E16B47C1B9E]) [    ] o.a.s.c.c.SolrZkClient makePath: /configs/conf1/currency.xml
   [junit4]   2> 1827253 INFO  (TEST-TestReqParamsAPI.test-seed#[15741E16B47C1B9E]) [    ] o.a.s.c.AbstractZkTestCase put /home/jenkins/workspace/Lucene-Solr-6.x-Linux/solr/core/src/test-files/solr/collection1/conf/enumsConfig.xml to /configs/conf1/enumsConfig.xml
   [junit4]   2> 1827253 INFO  (TEST-TestReqParamsAPI.test-seed#[15741E16B47C1B9E]) [    ] o.a.s.c.c.SolrZkClient makePath: /configs/conf1/enumsConfig.xml
   [junit4]   2> 1827253 INFO  (TEST-TestReqParamsAPI.test-seed#[15741E16B47C1B9E]) [    ] o.a.s.c.AbstractZkTestCase put /home/jenkins/workspace/Lucene-Solr-6.x-Linux/solr/core/src/test-files/solr/collection1/conf/open-exchange-rates.json to /configs/conf1/open-exchange-rates.json
   [junit4]   2> 1827254 INFO  (TEST-TestReqParamsAPI.test-seed#[15741E16B47C1B9E]) [    ] o.a.s.c.c.SolrZkClient makePath: /configs/conf1/open-exchange-rates.json
   [junit4]   2> 1827254 INFO  (TEST-TestReqParamsAPI.test-seed#[15741E16B47C1B9E]) [    ] o.a.s.c.AbstractZkTestCase put /home/jenkins/workspace/Lucene-Solr-6.x-Linux/solr/core/src/test-files/solr/collection1/conf/mapping-ISOLatin1Accent.txt to /configs/conf1/mapping-ISOLatin1Accent.txt
   [junit4]   2> 1827254 INFO  (TEST-TestReqParamsAPI.test-seed#[15741E16B47C1B9E]) [    ] o.a.s.c.c.SolrZkClient makePath: /configs/conf1/mapping-ISOLatin1Accent.txt
   [junit4]   2> 1827255 INFO  (TEST-TestReqParamsAPI.test-seed#[15741E16B47C1B9E]) [    ] o.a.s.c.AbstractZkTestCase put /home/jenkins/workspace/Lucene-Solr-6.x-Linux/solr/core/src/test-files/solr/collection1/conf/old_synonyms.txt to /configs/conf1/old_synonyms.txt
   [junit4]   2> 1827255 INFO  (TEST-TestReqParamsAPI.test-seed#[15741E16B47C1B9E]) [    ] o.a.s.c.c.SolrZkClient makePath: /configs/conf1/old_synonyms.txt
   [junit4]   2> 1827255 INFO  (TEST-TestReqParamsAPI.test-seed#[15741E16B47C1B9E]) [    ] o.a.s.c.AbstractZkTestCase put /home/jenkins/workspace/Lucene-Solr-6.x-Linux/solr/core/src/test-files/solr/collection1/conf/synonyms.txt to /configs/conf1/synonyms.txt
   [junit4]   2> 1827256 INFO  (TEST-TestReqParamsAPI.test-seed#[15741E16B47C1B9E]) [    ] o.a.s.c.c.SolrZkClient makePath: /configs/conf1/synonyms.txt
   [junit4]   2> 1827324 INFO  (TEST-TestReqParamsAPI.test-seed#[15741E16B47C1B9E]) [    ] o.a.s.SolrTestCaseJ4 Writing core.properties file to /home/jenkins/workspace/Lucene-Solr-6.x-Linux/solr/build/solr-core/test/J0/temp/solr.handler.TestReqParamsAPI_15741E16B47C1B9E-001/control-001/cores/collection1
   [junit4]   2> 1827325 INFO  (TEST-TestReqParamsAPI.test-seed#[15741E16B47C1B9E]) [    ] o.e.j.s.Server jetty-9.3.8.v20160314
   [junit4]   2> 1827326 INFO  (TEST-TestReqParamsAPI.test-seed#[15741E16B47C1B9E]) [    ] o.e.j.s.h.ContextHandler Started o.e.j.s.ServletContextHandler@15ec8a8{/,null,AVAILABLE}
   [junit4]   2> 1827329 INFO  (TEST-TestReqParamsAPI.test-seed#[15741E16B47C1B9E]) [    ] o.e.j.s.ServerConnector Started ServerConnector@19aef74{HTTP/1.1,[http/1.1]}{127.0.0.1:35762}
   [junit4]   2> 1827329 INFO  (TEST-TestReqParamsAPI.test-seed#[15741E16B47C1B9E]) [    ] o.e.j.s.Server Started @1828682ms
   [junit4]   2> 1827329 INFO  (TEST-TestReqParamsAPI.test-seed#[15741E16B47C1B9E]) [    ] o.a.s.c.s.e.JettySolrRunner Jetty properties: {solr.data.dir=/home/jenkins/workspace/Lucene-Solr-6.x-Linux/solr/build/solr-core/test/J0/temp/solr.handler.TestReqParamsAPI_15741E16B47C1B9E-001/tempDir-001/control/data, hostContext=/, hostPort=35762, coreRootDirectory=/home/jenkins/workspace/Lucene-Solr-6.x-Linux/solr/build/solr-core/test/J0/../../../../../../../../../home/jenkins/workspace/Lucene-Solr-6.x-Linux/solr/build/solr-core/test/J0/temp/solr.handler.TestReqParamsAPI_15741E16B47C1B9E-001/control-001/cores}
   [junit4]   2> 1827329 INFO  (TEST-TestReqParamsAPI.test-seed#[15741E16B47C1B9E]) [    ] o.a.s.s.SolrDispatchFilter SolrDispatchFilter.init(): jdk.internal.loader.ClassLoaders$AppClassLoader@864e92
   [junit4]   2> 1827329 INFO  (TEST-TestReqParamsAPI.test-seed#[15741E16B47C1B9E]) [    ] o.a.s.c.SolrResourceLoader new SolrResourceLoader for directory: '/home/jenkins/workspace/Lucene-Solr-6.x-Linux/solr/build/solr-core/test/J0/temp/solr.handler.TestReqParamsAPI_15741E16B47C1B9E-001/control-001'
   [junit4]   2> 1827329 INFO  (TEST-TestReqParamsAPI.test-seed#[15741E16B47C1B9E]) [    ] o.a.s.c.SolrResourceLoader JNDI not configured for solr (NoInitialContextEx)
   [junit4]   2> 1827329 INFO  (TEST-TestReqParamsAPI.test-seed#[15741E16B47C1B9E]) [    ] o.a.s.c.SolrResourceLoader solr home defaulted to 'solr/' (could not find system property or JNDI)
   [junit4]   2> 1827330 INFO  (TEST-TestReqParamsAPI.test-seed#[15741E16B47C1B9E]) [    ] o.a.s.c.c.SolrZkClient Using default ZkCredentialsProvider
   [junit4]   2> 1827330 INFO  (TEST-TestReqParamsAPI.test-seed#[15741E16B47C1B9E]) [    ] o.a.s.c.c.ConnectionManager Waiting for client to connect to ZooKeeper
   [junit4]   2> 1827331 INFO  (zkCallback-2273-thread-1) [    ] o.a.s.c.c.ConnectionManager Watcher org.apache.solr.common.cloud.ConnectionManager@6abcc7 name:ZooKeeperConnection Watcher:127.0.0.1:41021/solr got event WatchedEvent state:SyncConnected type:None path:null path:null type:None
   [junit4]   2> 1827331 INFO  (TEST-TestReqParamsAPI.test-seed#[15741E16B47C1B9E]) [    ] o.a.s.c.c.ConnectionManager Client is connected to ZooKeeper
   [junit4]   2> 1827331 INFO  (TEST-TestReqParamsAPI.test-seed#[15741E16B47C1B9E]) [    ] o.a.s.c.c.SolrZkClient Using default ZkACLProvider
   [junit4]   2> 1827332 INFO  (TEST-TestReqParamsAPI.test-seed#[15741E16B47C1B9E]) [    ] o.a.s.s.SolrDispatchFilter Loading solr.xml from SolrHome (not found in ZooKeeper)
   [junit4]   2> 1827332 INFO  (TEST-TestReqParamsAPI.test-seed#[15741E16B47C1B9E]) [    ] o.a.s.c.SolrXmlConfig Loading container configuration from /home/jenkins/workspace/Lucene-Solr-6.x-Linux/solr/build/solr-core/test/J0/temp/solr.handler.TestReqParamsAPI_15741E16B47C1B9E-001/control-001/solr.xml
   [junit4]   2> 1827336 INFO  (TEST-TestReqParamsAPI.test-seed#[15741E16B47C1B9E]) [    ] o.a.s.c.CorePropertiesLocator Config-defined core root directory: /home/jenkins/workspace/Lucene-Solr-6.x-Linux/solr/build/solr-core/test/J0/../../../../../../../../../home/jenkins/workspace/Lucene-Solr-6.x-Linux/solr/build/solr-core/test/J0/temp/solr.handler.TestReqParamsAPI_15741E16B47C1B9E-001/control-001/cores
   [junit4]   2> 1827336 INFO  (TEST-TestReqParamsAPI.test-seed#[15741E16B47C1B9E]) [    ] o.a.s.c.CoreContainer New CoreContainer 12265690
   [junit4]   2> 1827336 INFO  (TEST-TestReqParamsAPI.test-seed#[15741E16B47C1B9E]) [    ] o.a.s.c.CoreContainer Loading cores into CoreContainer [instanceDir=/home/jenkins/workspace/Lucene-Solr-6.x-Linux/solr/build/solr-core/test/J0/temp/solr.handler.TestReqParamsAPI_15741E16B47C1B9E-001/control-001]
   [junit4]   2> 1827336 WARN  (TEST-TestReqParamsAPI.test-seed#[15741E16B47C1B9E]) [    ] o.a.s.c.CoreContainer Couldn't add files from /home/jenkins/workspace/Lucene-Solr-6.x-Linux/solr/build/solr-core/test/J0/temp/solr.handler.TestReqParamsAPI_15741E16B47C1B9E-001/control-001/lib to classpath: /home/jenkins/workspace/Lucene-Solr-6.x-Linux/solr/build/solr-core/test/J0/temp/solr.handler.TestReqParamsAPI_15741E16B47C1B9E-001/control-001/lib
   [junit4]   2> 1827336 INFO  (TEST-TestReqParamsAPI.test-seed#[15741E16B47C1B9E]) [    ] o.a.s.h.c.HttpShardHandlerFactory created with socketTimeout : 90000,urlScheme : ,connTimeout : 15000,maxConnectionsPerHost : 20,maxConnections : 10000,corePoolSize : 0,maximumPoolSize : 2147483647,maxThreadIdleTime : 5,sizeOfQueue : -1,fairnessPolicy : false,useRetries : false,
   [junit4]   2> 1827337 INFO  (TEST-TestReqParamsAPI.test-seed#[15741E16B47C1B9E]) [    ] o.a.s.u.UpdateShardHandler Creating UpdateShardHandler HTTP client with params: socketTimeout=340000&connTimeout=45000&retry=true
   [junit4]   2> 1827337 INFO  (TEST-TestReqParamsAPI.test-seed#[15741E16B47C1B9E]) [    ] o.a.s.l.LogWatcher SLF4J impl is org.slf4j.impl.Log4jLoggerFactory
   [junit4]   2> 1827337 INFO  (TEST-TestReqParamsAPI.test-seed#[15741E16B47C1B9E]) [    ] o.a.s.l.LogWatcher Registering Log Listener [Log4j (org.slf4j.impl.Log4jLoggerFactory)]
   [junit4]   2> 1827337 INFO  (TEST-TestReqParamsAPI.test-seed#[15741E16B47C1B9E]) [    ] o.a.s.c.ZkContainer Zookeeper client=127.0.0.1:41021/solr
   [junit4]   2> 1827337 INFO  (TEST-TestReqParamsAPI.test-seed#[15741E16B47C1B9E]) [    ] o.a.s.c.ZkController zkHost includes chroot
   [junit4]   2> 1827338 INFO  (TEST-TestReqParamsAPI.test-seed#[15741E16B47C1B9E]) [    ] o.a.s.c.c.SolrZkClient Using default ZkCredentialsProvider
   [junit4]   2> 1827338 INFO  (TEST-TestReqParamsAPI.test-seed#[15741E16B47C1B9E]) [    ] o.a.s.c.c.ConnectionManager Waiting for client to connect to ZooKeeper
   [junit4]   2> 1827339 INFO  (zkCallback-2276-thread-1) [    ] o.a.s.c.c.ConnectionManager Watcher org.apache.solr.common.cloud.ConnectionManager@124c3e1 name:ZooKeeperConnection Watcher:127.0.0.1:41021 got event WatchedEvent state:SyncConnected type:None path:null path:null type:None
   [junit4]   2> 1827339 INFO  (TEST-TestReqParamsAPI.test-seed#[15741E16B47C1B9E]) [    ] o.a.s.c.c.ConnectionManager Client is connected to ZooKeeper
   [junit4]   2> 1827339 INFO  (TEST-TestReqParamsAPI.test-seed#[15741E16B47C1B9E]) [    ] o.a.s.c.c.SolrZkClient Using default ZkACLProvider
   [junit4]   2> 1827340 INFO  (TEST-TestReqParamsAPI.test-seed#[15741E16B47C1B9E]) [    ] o.a.s.c.c.ConnectionManager Waiting for client to connect to ZooKeeper
   [junit4]   2> 1827341 INFO  (zkCallback-2277-thread-1) [    ] o.a.s.c.c.ConnectionManager Watcher org.apache.solr.common.cloud.ConnectionManager@1f345a2 name:ZooKeeperConnection Watcher:127.0.0.1:41021/solr got event WatchedEvent state:SyncConnected type:None path:null path:null type:None
   [junit4]   2> 1827341 INFO  (TEST-TestReqParamsAPI.test-seed#[15741E16B47C1B9E]) [    ] o.a.s.c.c.ConnectionManager Client is connected to ZooKeeper
   [junit4]   2> 1827341 INFO  (TEST-TestReqParamsAPI.test-seed#[15741E16B47C1B9E]) [    ] o.a.s.c.c.SolrZkClient makePath: /overseer/queue
   [junit4]   2> 1827342 INFO  (TEST-TestReqParamsAPI.test-seed#[15741E16B47C1B9E]) [    ] o.a.s.c.c.SolrZkClient makePath: /overseer/collection-queue-work
   [junit4]   2> 1827344 INFO  (TEST-TestReqParamsAPI.test-seed#[15741E16B47C1B9E]) [    ] o.a.s.c.c.SolrZkClient makePath: /overseer/collection-map-running
   [junit4]   2> 1827345 INFO  (TEST-TestReqParamsAPI.test-seed#[15741E16B47C1B9E]) [    ] o.a.s.c.c.SolrZkClient makePath: /overseer/collection-map-completed
   [junit4]   2> 1827345 INFO  (TEST-TestReqParamsAPI.test-seed#[15741E16B47C1B9E]) [    ] o.a.s.c.c.SolrZkClient makePath: /overseer/collection-map-failure
   [junit4]   2> 1827346 INFO  (TEST-TestReqParamsAPI.test-seed#[15741E16B47C1B9E]) [    ] o.a.s.c.c.SolrZkClient makePath: /live_nodes
   [junit4]   2> 1827346 INFO  (TEST-TestReqParamsAPI.test-seed#[15741E16B47C1B9E]) [    ] o.a.s.c.c.SolrZkClient makePath: /aliases.json
   [junit4]   2> 1827347 INFO  (TEST-TestReqParamsAPI.test-seed#[15741E16B47C1B9E]) [    ] o.a.s.c.c.SolrZkClient makePath: /clusterstate.json
   [junit4]   2> 1827347 INFO  (TEST-TestReqParamsAPI.test-seed#[15741E16B47C1B9E]) [    ] o.a.s.c.c.SolrZkClient makePath: /security.json
   [junit4]   2> 1827347 INFO  (TEST-TestReqParamsAPI.test-seed#[15741E16B47C1B9E]) [    ] o.a.s.c.c.ZkStateReader Updating cluster state from ZooKeeper... 
   [junit4]   2> 1827348 INFO  (TEST-TestReqParamsAPI.test-seed#[15741E16B47C1B9E]) [    ] o.a.s.c.c.ZkStateReader Updated live nodes from ZooKeeper... (0) -> (0)
   [junit4]   2> 1827349 INFO  (TEST-TestReqParamsAPI.test-seed#[15741E16B47C1B9E]) [    ] o.a.s.c.c.SolrZkClient makePath: /overseer_elect
   [junit4]   2> 1827349 INFO  (TEST-TestReqParamsAPI.test-seed#[15741E16B47C1B9E]) [    ] o.a.s.c.c.SolrZkClient makePath: /overseer_elect/election
   [junit4]   2> 1827350 INFO  (TEST-TestReqParamsAPI.test-seed#[15741E16B47C1B9E]) [    ] o.a.s.c.Overseer Overseer (id=null) closing
   [junit4]   2> 1827350 INFO  (TEST-TestReqParamsAPI.test-seed#[15741E16B47C1B9E]) [    ] o.a.s.c.LeaderElector Joined leadership election with path: /overseer_elect/election/95590159100149764-127.0.0.1:35762_-n_0000000000
   [junit4]   2> 1827350 INFO  (TEST-TestReqParamsAPI.test-seed#[15741E16B47C1B9E]) [    ] o.a.s.c.OverseerElectionContext I am going to be the leader 127.0.0.1:35762_
   [junit4]   2> 1827350 INFO  (TEST-TestReqParamsAPI.test-seed#[15741E16B47C1B9E]) [    ] o.a.s.c.c.SolrZkClient makePath: /overseer_elect/leader
   [junit4]   2> 1827351 INFO  (TEST-TestReqParamsAPI.test-seed#[15741E16B47C1B9E]) [    ] o.a.s.c.Overseer Overseer (id=95590159100149764-127.0.0.1:35762_-n_0000000000) starting
   [junit4]   2> 1827351 INFO  (TEST-TestReqParamsAPI.test-seed#[15741E16B47C1B9E]) [    ] o.a.s.c.c.SolrZkClient makePath: /overseer/queue-work
   [junit4]   2> 1827354 INFO  (TEST-TestReqParamsAPI.test-seed#[15741E16B47C1B9E]) [    ] o.a.s.c.OverseerAutoReplicaFailoverThread Starting OverseerAutoReplicaFailoverThread autoReplicaFailoverWorkLoopDelay=10000 autoReplicaFailoverWaitAfterExpiration=30000 autoReplicaFailoverBadNodeExpiration=60000
   [junit4]   2> 1827354 INFO  (OverseerCollectionConfigSetProcessor-95590159100149764-127.0.0.1:35762_-n_0000000000) [    ] o.a.s.c.OverseerTaskProcessor Process current queue of overseer operations
   [junit4]   2> 1827354 INFO  (OverseerStateUpdate-95590159100149764-127.0.0.1:35762_-n_0000000000) [    ] o.a.s.c.Overseer Starting to work on the main queue
   [junit4]   2> 1827355 INFO  (TEST-TestReqParamsAPI.test-seed#[15741E16B47C1B9E]) [    ] o.a.s.c.ZkController Register node as live in ZooKeeper:/live_nodes/127.0.0.1:35762_
   [junit4]   2> 1827355 INFO  (TEST-TestReqParamsAPI.test-seed#[15741E16B47C1B9E]) [    ] o.a.s.c.c.SolrZkClient makePath: /live_nodes/127.0.0.1:35762_
   [junit4]   2> 1827355 INFO  (OverseerStateUpdate-95590159100149764-127.0.0.1:35762_-n_0000000000) [    ] o.a.s.c.c.ZkStateReader Updated live nodes from ZooKeeper... (0) -> (0)
   [junit4]   2> 1827355 INFO  (zkCallback-2277-thread-1) [    ] o.a.s.c.c.ZkStateReader A live node change: [WatchedEvent state:SyncConnected type:NodeChildrenChanged path:/live_nodes], has occurred - updating... (live nodes size: [0])
   [junit4]   2> 1827356 INFO  (zkCallback-2277-thread-1) [    ] o.a.s.c.c.ZkStateReader Updated live nodes from ZooKeeper... (0) -> (1)
   [junit4]   2> 1827405 INFO  (TEST-TestReqParamsAPI.test-seed#[15741E16B47C1B9E]) [    ] o.a.s.c.CoreContainer Security conf doesn't exist. Skipping setup for authorization module.
   [junit4]   2> 1827405 INFO  (TEST-TestReqParamsAPI.test-seed#[15741E16B47C1B9E]) [    ] o.a.s.c.CoreContainer No authentication plugin used.
   [junit4]   2> 1827406 INFO  (TEST-TestReqParamsAPI.test-seed#[15741E16B47C1B9E]) [    ] o.a.s.c.CorePropertiesLocator Looking for core definitions underneath /home/jenkins/workspace/Lucene-Solr-6.x-Linux/solr/build/solr-core/test/J0/../../../../../../../../../home/jenkins/workspace/Lucene-Solr-6.x-Linux/solr/build/solr-core/test/J0/temp/solr.handler.TestReqParamsAPI_15741E16B47C1B9E-001/control-001/cores
   [junit4]   2> 1827406 INFO  (TEST-TestReqParamsAPI.test-seed#[15741E16B47C1B9E]) [    ] o.a.s.c.CoreDescriptor Created CoreDescriptor: {name=collection1, config=solrconfig.xml, transient=false, schema=schema.xml, loadOnStartup=true, configSetProperties=configsetprops.json, collection=control_collection, coreNodeName=, dataDir=data/, shard=}
   [junit4]   2> 1827407 INFO  (TEST-TestReqParamsAPI.test-seed#[15741E16B47C1B9E]) [    ] o.a.s.c.CorePropertiesLocator Found core collection1 in /home/jenkins/workspace/Lucene-Solr-6.x-Linux/solr/build/solr-core/test/J0/../../../../../../../../../home/jenkins/workspace/Lucene-Solr-6.x-Linux/solr/build/solr-core/test/J0/temp/solr.handler.TestReqParamsAPI_15741E16B47C1B9E-001/control-001/cores/collection1
   [junit4]   2> 1827407 INFO  (TEST-TestReqParamsAPI.test-seed#[15741E16B47C1B9E]) [    ] o.a.s.c.CorePropertiesLocator Found 1 core definitions
   [junit4]   2> 1827407 INFO  (TEST-TestReqParamsAPI.test-seed#[15741E16B47C1B9E]) [    ] o.a.s.s.SolrDispatchFilter user.dir=/home/jenkins/workspace/Lucene-Solr-6.x-Linux/solr/build/solr-core/test/J0
   [junit4]   2> 1827407 INFO  (TEST-TestReqParamsAPI.test-seed#[15741E16B47C1B9E]) [    ] o.a.s.s.SolrDispatchFilter SolrDispatchFilter.init() done
   [junit4]   2> 1827407 INFO  (coreLoadExecutor-6077-thread-1) [    ] o.a.s.c.ZkController publishing state=down
   [junit4]   2> 1827407 INFO  (coreLoadExecutor-6077-thread-1) [    ] o.a.s.c.ZkController numShards not found on descriptor - reading it from system property
   [junit4]   2> 1827408 INFO  (coreLoadExecutor-6077-thread-1) [    ] o.a.s.c.ZkController look for our core node name
   [junit4]   2> 1827408 INFO  (OverseerStateUpdate-95590159100149764-127.0.0.1:35762_-n_0000000000) [    ] o.a.s.c.Overseer processMessage: queueSize: 1, message = {
   [junit4]   2>   "core":"collection1",
   [junit4]   2>   "roles":null,
   [junit4]   2>   "base_url":"http://127.0.0.1:35762",
   [junit4]   2>   "node_name":"127.0.0.1:35762_",
   [junit4]   2>   "numShards":"1",
   [junit4]   2>   "state":"down",
   [junit4]   2>   "shard":null,
   [junit4]   2>   "collection":"control_collection",
   [junit4]   2>   "operation":"state"} current state version: 0
   [junit4]   2> 1827409 INFO  (OverseerStateUpdate-95590159100149764-127.0.0.1:35762_-n_0000000000) [    ] o.a.s.c.o.ReplicaMutator Update state numShards=1 message={
   [junit4]   2>   "core":"collection1",
   [junit4]   2>   "roles":null,
   [junit4]   2>   "base_url":"http://127.0.0.1:35762",
   [junit4]   2>   "node_name":"127.0.0.1:35762_",
   [junit4]   2>   "numShards":"1",
   [junit4]   2>   "state":"down",
   [junit4]   2>   "shard":null,
   [junit4]   2>   "collection":"control_collection",
   [junit4]   2>   "operation":"state"}
   [junit4]   2> 1827409 INFO  (OverseerStateUpdate-95590159100149764-127.0.0.1:35762_-n_0000000000) [    ] o.a.s.c.o.ClusterStateMutator building a new cName: control_collection
   [junit4]   2> 1827409 INFO  (OverseerStateUpdate-95590159100149764-127.0.0.1:35762_-n_0000000000) [    ] o.a.s.c.o.ReplicaMutator Assigning new node to shard shard=shard1
   [junit4]   2> 1827410 INFO  (zkCallback-2277-thread-1) [    ] o.a.s.c.c.ZkStateReader A cluster state change: [WatchedEvent state:SyncConnected type:NodeDataChanged path:/clusterstate.json], has occurred - updating... (live nodes size: [1])
   [junit4]   2> 1828409 INFO  (coreLoadExecutor-6077-thread-1) [    ] o.a.s.c.ZkController waiting to find shard id in clusterstate for collection1
   [junit4]   2> 1828409 INFO  (coreLoadExecutor-6077-thread-1) [    ] o.a.s.c.ZkController Check for collection zkNode:control_collection
   [junit4]   2> 1828409 INFO  (coreLoadExecutor-6077-thread-1) [    ] o.a.s.c.ZkController Collection zkNode exists
   [junit4]   2> 1828409 INFO  (coreLoadExecutor-6077-thread-1) [    ] o.a.s.c.c.ZkStateReader Load collection config from: [/collections/control_collection]
   [junit4]   2> 1828409 INFO  (coreLoadExecutor-6077-thread-1) [    ] o.a.s.c.c.ZkStateReader path=[/collections/control_collection] [configName]=[conf1] specified config exists in ZooKeeper
   [junit4]   2> 1828410 INFO  (coreLoadExecutor-6077-thread-1) [    ] o.a.s.c.SolrResourceLoader new SolrResourceLoader for directory: '/home/jenkins/workspace/Lucene-Solr-6.x-Linux/solr/build/solr-core/test/J0/temp/solr.handler.TestReqParamsAPI_15741E16B47C1B9E-001/control-001/cores/collection1'
   [junit4]   2> 1828410 INFO  (coreLoadExecutor-6077-thread-1) [    ] o.a.s.c.SolrResourceLoader JNDI not configured for solr (NoInitialContextEx)
   [junit4]   2> 1828410 INFO  (coreLoadExecutor-6077-thread-1) [    ] o.a.s.c.SolrResourceLoader solr home defaulted to 'solr/' (could not find system property or JNDI)
   [junit4]   2> 1828411 INFO  (coreLoadExecutor-6077-thread-1) [    ] o.a.s.c.Config loaded config solrconfig.xml with version 0 
   [junit4]   2> 1828415 INFO  (coreLoadExecutor-6077-thread-1) [    ] o.a.s.c.SolrConfig current version of requestparams : -1
   [junit4]   2> 1828418 INFO  (coreLoadExecutor-6077-thread-1) [    ] o.a.s.c.SolrConfig Using Lucene MatchVersion: 6.1.0
   [junit4]   2> 1828425 INFO  (coreLoadExecutor-6077-thread-1) [    ] o.a.s.c.SolrConfig Loaded SolrConfig: solrconfig.xml
   [junit4]   2> 1828431 INFO  (coreLoadExecutor-6077-thread-1) [    ] o.a.s.s.IndexSchema [collection1] Schema name=test
   [junit4]   2> 1828503 INFO  (coreLoadExecutor-6077-thread-1) [    ] o.a.s.s.OpenExchangeRatesOrgProvider Initialized with rates=open-exchange-rates.json, refreshInterval=1440.
   [junit4]   2> 1828507 INFO  (coreLoadExecutor-6077-thread-1) [    ] o.a.s.s.IndexSchema default search field in schema is text
   [junit4]   2> 1828508 INFO  (coreLoadExecutor-6077-thread-1) [    ] o.a.s.s.IndexSchema unique key field: id
   [junit4]   2> 1828513 INFO  (coreLoadExecutor-6077-thread-1) [    ] o.a.s.s.FileExchangeRateProvider Reloading exchange rates from file currency.xml
   [junit4]   2> 1828515 INFO  (coreLoadExecutor-6077-thread-1) [    ] o.a.s.s.FileExchangeRateProvider Reloading exchange rates from file currency.xml
   [junit4]   2> 1828516 INFO  (coreLoadExecutor-6077-thread-1) [    ] o.a.s.s.OpenExchangeRatesOrgProvider Reloading exchange rates from open-exchange-rates.json
   [junit4]   2> 1828517 INFO  (coreLoadExecutor-6077-thread-1) [    ] o.a.s.s.OpenExchangeRatesOrgProvider Reloading exchange rates from open-exchange-rates.json
   [junit4]   2> 1828518 INFO  (coreLoadExecutor-6077-thread-1) [    ] o.a.s.c.ConfigSetProperties Did not find ConfigSet properties, assuming default properties: Can't find resource 'configsetprops.json' in classpath or '/configs/conf1', cwd=/home/jenkins/workspace/Lucene-Solr-6.x-Linux/solr/build/solr-core/test/J0
   [junit4]   2> 1828518 INFO  (coreLoadExecutor-6077-thread-1) [    ] o.a.s.c.CoreContainer Creating SolrCore 'collection1' using configuration from collection control_collection
   [junit4]   2> 1828518 INFO  (coreLoadExecutor-6077-thread-1) [    ] o.a.s.c.SolrCore org.apache.solr.core.MockDirectoryFactory
   [junit4]   2> 1828519 INFO  (coreLoadExecutor-6077-thread-1) [    ] o.a.s.c.SolrCore [[collection1] ] Opening new SolrCore at [/home/jenkins/workspace/Lucene-Solr-6.x-Linux/solr/build/solr-core/test/J0/temp/solr.handler.TestReqParamsAPI_15741E16B47C1B9E-001/control-001/cores/collection1], dataDir=[/home/jenkins/workspace/Lucene-Solr-6.x-Linux/solr/build/solr-core/test/J0/../../../../../../../../../home/jenkins/workspace/Lucene-Solr-6.x-Linux/solr/build/solr-core/test/J0/temp/solr.handler.TestReqParamsAPI_15741E16B47C1B9E-001/control-001/cores/collection1/data/]
   [junit4]   2> 1828519 INFO  (coreLoadExecutor-6077-thread-1) [    ] o.a.s.c.JmxMonitoredMap JMX monitoring is enabled. Adding Solr mbeans to JMX Server: com.sun.jmx.mbeanserver.JmxMBeanServer@1afe8e9
   [junit4]   2> 1828519 INFO  (coreLoadExecutor-6077-thread-1) [    ] o.a.s.c.CachingDirectoryFactory return new directory for /home/jenkins/workspace/Lucene-Solr-6.x-Linux/solr/build/solr-core/test/J0/../../../../../../../../../home/jenkins/workspace/Lucene-Solr-6.x-Linux/solr/build/solr-core/test/J0/temp/solr.handler.TestReqParamsAPI_15741E16B47C1B9E-001/control-001/cores/collection1/data
   [junit4]   2> 1828520 INFO  (coreLoadExecutor-6077-thread-1) [    ] o.a.s.c.SolrCore New index directory detected: old=null new=/home/jenkins/workspace/Lucene-Solr-6.x-Linux/solr/build/solr-core/test/J0/../../../../../../../../../home/jenkins/workspace/Lucene-Solr-6.x-Linux/solr/build/solr-core/test/J0/temp/solr.handler.TestReqParamsAPI_15741E16B47C1B9E-001/control-001/cores/collection1/data/index/
   [junit4]   2> 1828520 WARN  (coreLoadExecutor-6077-thread-1) [    ] o.a.s.c.SolrCore [collection1] Solr index directory '/home/jenkins/workspace/Lucene-Solr-6.x-Linux/solr/build/solr-core/test/J0/../../../../../../../../../home/jenkins/workspace/Lucene-Solr-6.x-Linux/solr/build/solr-core/test/J0/temp/solr.handler.TestReqParamsAPI_15741E16B47C1B9E-001/control-001/cores/collection1/data/index' doesn't exist. Creating new index...
   [junit4]   2> 1828520 INFO  (coreLoadExecutor-6077-thread-1) [    ] o.a.s.c.CachingDirectoryFactory return new directory for /home/jenkins/workspace/Lucene-Solr-6.x-Linux/solr/build/solr-core/test/J0/../../../../../../../../../home/jenkins/workspace/Lucene-Solr-6.x-Linux/solr/build/solr-core/test/J0/temp/solr.handler.TestReqParamsAPI_15741E16B47C1B9E-001/control-001/cores/collection1/data/index
   [junit4]   2> 1828520 INFO  (coreLoadExecutor-6077-thread-1) [    ] o.a.s.u.RandomMergePolicy RandomMergePolicy wrapping class org.apache.lucene.index.TieredMergePolicy: [TieredMergePolicy: maxMergeAtOnce=18, maxMergeAtOnceExplicit=27, maxMergedSegmentMB=87.56640625, floorSegmentMB=0.953125, forceMergeDeletesPctAllowed=11.111810133851495, segmentsPerTier=49.0, maxCFSSegmentSizeMB=8.796093022207999E12, noCFSRatio=0.7541655634799548
   [junit4]   2> 1828521 INFO  (coreLoadExecutor-6077-thread-1) [    ] o.a.s.c.SolrDeletionPolicy SolrDeletionPolicy.onCommit: commits: num=1
   [junit4]   2> 	commit{dir=MockDirectoryWrapper(RAMDirectory@901acb lockFactory=org.apache.lucene.store.SingleInstanceLockFactory@d2475a),segFN=segments_1,generation=1}
   [junit4]   2> 1828521 INFO  (coreLoadExecutor-6077-thread-1) [    ] o.a.s.c.SolrDeletionPolicy newest commit generation = 1
   [junit4]   2> 1828521 INFO  (OldIndexDirectoryCleanupThreadForCore-collection1) [    ] o.a.s.c.SolrCore Looking for old index directories to cleanup for core collection1 in /home/jenkins/workspace/Lucene-Solr-6.x-Linux/solr/build/solr-core/test/J0/../../../../../../../../../home/jenkins/workspace/Lucene-Solr-6.x-Linux/solr/build/solr-core/test/J0/temp/solr.handler.TestReqParamsAPI_15741E16B47C1B9E-001/control-001/cores/collection1/data/
   [junit4]   2> 1828521 WARN  (OldIndexDirectoryCleanupThreadForCore-collection1) [    ] o.a.s.c.DirectoryFactory /home/jenkins/workspace/Lucene-Solr-6.x-Linux/solr/build/solr-core/test/J0/../../../../../../../../../home/jenkins/workspace/Lucene-Solr-6.x-Linux/solr/build/solr-core/test/J0/temp/solr.handler.TestReqParamsAPI_15741E16B47C1B9E-001/control-001/cores/collection1/data/ does not point to a valid data directory; skipping clean-up of old index directories.
   [junit4]   2> 1828524 INFO  (coreLoadExecutor-6077-thread-1) [    ] o.a.s.u.p.UpdateRequestProcessorChain creating updateRequestProcessorChain "nodistrib"
   [junit4]   2> 1828524 INFO  (coreLoadExecutor-6077-thread-1) [    ] o.a.s.u.p.UpdateRequestProcessorChain creating updateRequestProcessorChain "dedupe"
   [junit4]   2> 1828524 INFO  (coreLoadExecutor-6077-thread-1) [    ] o.a.s.u.p.UpdateRequestProcessorChain inserting DistributedUpdateProcessorFactory into updateRequestProcessorChain "dedupe"
   [junit4]   2> 1828524 INFO  (coreLoadExecutor-6077-thread-1) [    ] o.a.s.u.p.UpdateRequestProcessorChain creating updateRequestProcessorChain "stored_sig"
   [junit4]   2> 1828524 INFO  (coreLoadExecutor-6077-thread-1) [    ] o.a.s.u.p.UpdateRequestProcessorChain inserting DistributedUpdateProcessorFactory into updateRequestProcessorChain "stored_sig"
   [junit4]   2> 1828524 INFO  (coreLoadExecutor-6077-thread-1) [    ] o.a.s.u.p.UpdateRequestProcessorChain creating updateRequestProcessorChain "distrib-dup-test-chain-explicit"
   [junit4]   2> 1828524 INFO  (coreLoadExecutor-6077-thread-1) [    ] o.a.s.u.p.UpdateRequestProcessorChain creating updateRequestProcessorChain "distrib-dup-test-chain-implicit"
   [junit4]   2> 1828524 INFO  (coreLoadExecutor-6077-thread-1) [    ] o.a.s.u.p.UpdateRequestProcessorChain inserting DistributedUpdateProcessorFactory into updateRequestProcessorChain "distrib-dup-test-chain-implicit"
   [junit4]   2> 1828524 INFO  (coreLoadExecutor-6077-thread-1) [    ] o.a.s.c.SolrCore no updateRequestProcessorChain defined as default, creating implicit default
   [junit4]   2> 1828525 WARN  (coreLoadExecutor-6077-thread-1) [    ] o.a.s.c.RequestHandlers INVALID paramSet a in requestHandler {type = requestHandler,name = /dump,class = DumpRequestHandler,args = {defaults={a=A,b=B}}}
   [junit4]   2> 1828526 INFO  (coreLoadExecutor-6077-thread-1) [    ] o.a.s.h.l.XMLLoader xsltCacheLifetimeSeconds=60
   [junit4]   2> 1828527 INFO  (coreLoadExecutor-6077-thread-1) [    ] o.a.s.h.l.XMLLoader xsltCacheLifetimeSeconds=60
   [junit4]   2> 1828529 INFO  (coreLoadExecutor-6077-thread-1) [    ] o.a.s.h.l.XMLLoader xsltCacheLifetimeSeconds=60
   [junit4]   2> 1828530 INFO  (coreLoadExecutor-6077-thread-1) [    ] o.a.s.h.l.XMLLoader xsltCacheLifetimeSeconds=60
   [junit4]   2> 1828534 INFO  (coreLoadExecutor-6077-thread-1) [    ] o.a.s.c.RequestHandlers Registered paths: /admin/mbeans,standard,/dump,/update/csv,/sql,/update/json/docs,/admin/luke,/export,/admin/segments,/get,/admin/system,/replication,/admin/properties,/config,/stream,/schema,/admin/plugins,/admin/logging,/update/json,/admin/ping,/admin/threads,/update,/admin/file
   [junit4]   2> 1828534 INFO  (coreLoadExecutor-6077-thread-1) [    ] o.a.s.c.SolrCore Using default statsCache cache: org.apache.solr.search.stats.LocalStatsCache
   [junit4]   2> 1828534 INFO  (coreLoadExecutor-6077-thread-1) [    ] o.a.s.u.UpdateHandler Using UpdateLog implementation: org.apache.solr.update.UpdateLog
   [junit4]   2> 1828534 INFO  (coreLoadExecutor-6077-thread-1) [    ] o.a.s.u.UpdateLog Initializing UpdateLog: dataDir= defaultSyncLevel=FLUSH numRecordsToKeep=100 maxNumLogsToKeep=10 numVersionBuckets=65536
   [junit4]   2> 1828535 INFO  (coreLoadExecutor-6077-thread-1) [    ] o.a.s.u.CommitTracker Hard AutoCommit: disabled
   [junit4]   2> 1828535 INFO  (coreLoadExecutor-6077-thread-1) [    ] o.a.s.u.CommitTracker Soft AutoCommit: disabled
   [junit4]   2> 1828535 INFO  (coreLoadExecutor-6077-thread-1) [    ] o.a.s.u.RandomMergePolicy RandomMergePolicy wrapping class org.apache.lucene.index.TieredMergePolicy: [TieredMergePolicy: maxMergeAtOnce=40, maxMergeAtOnceExplicit=29, maxMergedSegmentMB=20.59765625, floorSegmentMB=0.2138671875, forceMergeDeletesPctAllowed=11.492992877126532, segmentsPerTier=23.0, maxCFSSegmentSizeMB=8.796093022207999E12, noCFSRatio=0.0
   [junit4]   2> 1828536 INFO  (coreLoadExecutor-6077-thread-1) [    ] o.a.s.c.SolrDeletionPolicy SolrDeletionPolicy.onInit: commits: num=1
   [junit4]   2> 	commit{dir=MockDirectoryWrapper(RAMDirectory@901acb lockFactory=org.apache.lucene.store.SingleInstanceLockFactory@d2475a),segFN=segments_1,generation=1}
   [junit4]   2> 1828536 INFO  (coreLoadExecutor-6077-thread-1) [    ] o.a.s.c.SolrDeletionPolicy newest commit generation = 1
   [junit4]   2> 1828536 INFO  (coreLoadExecutor-6077-thread-1) [    ] o.a.s.s.SolrIndexSearcher Opening [Searcher@14921b[collection1] main]
   [junit4]   2> 1828536 INFO  (coreLoadExecutor-6077-thread-1) [    ] o.a.s.c.c.ZkStateReader Load collection config from: [/collections/control_collection]
   [junit4]   2> 1828536 INFO  (coreLoadExecutor-6077-thread-1) [    ] o.a.s.c.c.ZkStateReader path=[/collections/control_collection] [configName]=[conf1] specified config exists in ZooKeeper
   [junit4]   2> 1828536 INFO  (coreLoadExecutor-6077-thread-1) [    ] o.a.s.r.ManagedResourceStorage Setting up ZooKeeper-based storage for the RestManager with znodeBase: /configs/conf1
   [junit4]   2> 1828537 INFO  (coreLoadExecutor-6077-thread-1) [    ] o.a.s.r.ManagedResourceStorage Configured ZooKeeperStorageIO with znodeBase: /configs/conf1
   [junit4]   2> 1828537 INFO  (coreLoadExecutor-6077-thread-1) [    ] o.a.s.r.RestManager Initializing RestManager with initArgs: {}
   [junit4]   2> 1828537 INFO  (coreLoadExecutor-6077-thread-1) [    ] o.a.s.r.ManagedResourceStorage Reading _rest_managed.json using ZooKeeperStorageIO:path=/configs/conf1
   [junit4]   2> 1828537 INFO  (coreLoadExecutor-6077-thread-1) [    ] o.a.s.r.ManagedResourceStorage No data found for znode /configs/conf1/_rest_managed.json
   [junit4]   2> 1828537 INFO  (coreLoadExecutor-6077-thread-1) [    ] o.a.s.r.ManagedResourceStorage Loaded null at path _rest_managed.json using ZooKeeperStorageIO:path=/configs/conf1
   [junit4]   2> 1828537 INFO  (coreLoadExecutor-6077-thread-1) [    ] o.a.s.r.RestManager Initializing 0 registered ManagedResources
   [junit4]   2> 1828537 INFO  (coreLoadExecutor-6077-thread-1) [    ] o.a.s.h.ReplicationHandler Commits will be reserved for  10000
   [junit4]   2> 1828538 INFO  (searcherExecutor-6078-thread-1) [    ] o.a.s.c.SolrCore [collection1] Registered new searcher Searcher@14921b[collection1] main{ExitableDirectoryReader(UninvertingDirectoryReader())}
   [junit4]   2> 1828538 INFO  (coreLoadExecutor-6077-thread-1) [    ] o.a.s.u.UpdateLog Looking up max value of version field to seed version buckets
   [junit4]   2> 1828538 INFO  (coreLoadExecutor-6077-thread-1) [    ] o.a.s.u.VersionInfo Refreshing highest value of _version_ for 65536 version buckets from index
   [junit4]   2> 1828538 INFO  (coreLoadExecutor-6077-thread-1) [    ] o.a.s.u.VersionInfo No terms found for _version_, cannot seed version bucket highest value from index
   [junit4]   2> 1828538 INFO  (coreLoadExecutor-6077-thread-1) [    ] o.a.s.u.UpdateLog Could not find max version in index or recent updates, using new clock 1529442547068305408
   [junit4]   2> 1828540 INFO  (coreLoadExecutor-6077-thread-1) [    ] o.a.s.u.UpdateLog Took 1.0ms to seed version buckets with highest version 1529442547068305408
   [junit4]   2> 1828541 INFO  (coreLoadExecutor-6077-thread-1) [    ] o.a.s.c.ZkController watch zkdir /configs/conf1
   [junit4]   2> 1828541 INFO  (coreLoadExecutor-6077-thread-1) [    ] o.a.s.c.CoreContainer registering core: collection1
   [junit4]   2> 1828542 INFO  (coreZkRegister-6071-thread-1) [    ] o.a.s.c.ZkController Register replica - core:collection1 address:http://127.0.0.1:35762 collection:control_collection shard:shard1
   [junit4]   2> 1828542 INFO  (coreZkRegister-6071-thread-1) [    ] o.a.s.c.c.SolrZkClient makePath: /collections/control_collection/leader_elect/shard1/election
   [junit4]   2> 1828543 INFO  (coreZkRegister-6071-thread-1) [    ] o.a.s.c.LeaderElector Joined leadership election with path: /collections/control_collection/leader_elect/shard1/election/95590159100149764-core_node1-n_0000000000
   [junit4]   2> 1828543 INFO  (coreZkRegister-6071-thread-1) [    ] o.a.s.c.ShardLeaderElectionContext Running the leader process for shard=shard1 and weAreReplacement=false and leaderVoteWait=10000
   [junit4]   2> 1828544 INFO  (coreZkRegister-6071-thread-1) [    ] o.a.s.c.ShardLeaderElectionContext Enough replicas found to continue.
   [junit4]   2> 1828544 INFO  (coreZkRegister-6071-thread-1) [    ] o.a.s.c.ShardLeaderElectionContext I may be the new leader - try and sync
   [junit4]   2> 1828544 INFO  (coreZkRegister-6071-thread-1) [    ] o.a.s.c.SyncStrategy Sync replicas to http://127.0.0.1:35762/collection1/
   [junit4]   2> 1828544 INFO  (coreZkRegister-6071-thread-1) [    ] o.a.s.c.SyncStrategy Sync Success - now sync replicas to me
   [junit4]   2> 1828544 INFO  (coreZkRegister-6071-thread-1) [    ] o.a.s.c.SyncStrategy http://127.0.0.1:35762/collection1/ has no replicas
   [junit4]   2> 1828544 INFO  (OverseerStateUpdate-95590159100149764-127.0.0.1:35762_-n_0000000000) [    ] o.a.s.c.Overseer processMessage: queueSize: 1, message = {
   [junit4]   2>   "operation":"leader",
   [junit4]   2>   "shard":"shard1",
   [junit4]   2>   "collection":"control_collection"} current state version: 1
   [junit4]   2> 1828544 INFO  (coreZkRegister-6071-thread-1) [    ] o.a.s.c.c.SolrZkClient makePath: /collections/control_collection/leaders/shard1
   [junit4]   2> 1828546 INFO  (coreZkRegister-6071-thread-1) [    ] o.a.s.c.ShardLeaderElectionContextBase Creating leader registration node /collections/control_collection/leaders/shard1/leader after winning as /collections/control_collection/leader_elect/shard1/election/95590159100149764-core_node1-n_0000000000
   [junit4]   2> 1828547 INFO  (coreZkRegister-6071-thread-1) [    ] o.a.s.c.ShardLeaderElectionContext I am the new leader: http://127.0.0.1:35762/collection1/ shard1
   [junit4]   2> 1828547 INFO  (OverseerStateUpdate-95590159100149764-127.0.0.1:35762_-n_0000000000) [    ] o.a.s.c.Overseer processMessage: queueSize: 1, message = {
   [junit4]   2>   "operation":"leader",
   [junit4]   2>   "shard":"shard1",
   [junit4]   2>   "collection":"control_collection",
   [junit4]   2>   "base_url":"http://127.0.0.1:35762",
   [junit4]   2>   "core":"collection1",
   [junit4]   2>   "state":"active"} current state version: 1
   [junit4]   2> 1828648 INFO  (zkCallback-2277-thread-1) [    ] o.a.s.c.c.ZkStateReader A cluster state change: [WatchedEvent state:SyncConnected type:NodeDataChanged path:/clusterstate.json], has occurred - updating... (live nodes size: [1])
   [junit4]   2> 1828697 INFO  (coreZkRegister-6071-thread-1) [    ] o.a.s.c.ZkController We are http://127.0.0.1:35762/collection1/ and leader is http://127.0.0.1:35762/collection1/
   [junit4]   2> 1828697 INFO  (coreZkRegister-6071-thread-1) [    ] o.a.s.c.ZkController No LogReplay needed for core=collection1 baseURL=http://127.0.0.1:35762
   [junit4]   2> 1828697 INFO  (coreZkRegister-6071-thread-1) [    ] o.a.s.c.ZkController I am the leader, no recovery necessary
   [junit4]   2> 1828697 INFO  (coreZkRegister-6071-thread-1) [    ] o.a.s.c.ZkController publishing state=active
   [junit4]   2> 1828697 INFO  (coreZkRegister-6071-thread-1) [    ] o.a.s.c.ZkController numShards not found on descriptor - reading it from system property
   [junit4]   2> 1828698 INFO  (OverseerStateUpdate-95590159100149764-127.0.0.1:35762_-n_0000000000) [    ] o.a.s.c.Overseer processMessage: queueSize: 1, message = {
   [junit4]   2>   "core":"collection1",
   [junit4]   2>   "core_node_name":"core_node1",
   [junit4]   2>   "roles":null,
   [junit4]   2>   "base_url":"http://127.0.0.1:35762",
   [junit4]   2>   "node_name":"127.0.0.1:35762_",
   [junit4]   2>   "numShards":"1",
   [junit4]   2>   "state":"active",
   [junit4]   2>   "shard":"shard1",
   [junit4]   2>   "collection":"control_collection",
   [junit4]   2>   "operation":"state"} current state version: 2
   [junit4]   2> 1828699 INFO  (OverseerStateUpdate-95590159100149764-127.0.0.1:35762_-n_0000000000) [    ] o.a.s.c.o.ReplicaMutator Update state numShards=1 message={
   [junit4]   2>   "core":"collection1",
   [junit4]   2>   "core_node_name":"core_node1",
   [junit4]   2>   "roles":null,
   [junit4]   2>   "base_url":"http://127.0.0.1:35762",
   [junit4]   2>   "node_name":"127.0.0.1:35762_",
   [junit4]   2>   "numShards":"1",
   [junit4]   2>   "state":"active",
   [junit4]   2>   "shard":"shard1",
   [junit4]   2>   "collection":"control_collection",
   [junit4]   2>   "operation":"state"}
   [junit4]   2> 1828800 INFO  (zkCallback-2277-thread-1) [    ] o.a.s.c.c.ZkStateReader A cluster state change: [WatchedEvent state:SyncConnected type:NodeDataChanged path:/clusterstate.json], has occurred - updating... (live nodes size: [1])
   [junit4]   2> 1828909 INFO  (TEST-TestReqParamsAPI.test-seed#[15741E16B47C1B9E]) [    ] o.a.s.c.c.SolrZkClient Using default ZkCredentialsProvider
   [junit4]   2> 1828909 INFO  (TEST-TestReqParamsAPI.test-seed#[15741E16B47C1B9E]) [    ] o.a.s.c.c.ConnectionManager Waiting for client to connect to ZooKeeper
   [junit4]   2> 1828910 INFO  (zkCallback-2279-thread-1) [    ] o.a.s.c.c.ConnectionManager Watcher org.apache.solr.common.cloud.ConnectionManager@3ad68c name:ZooKeeperConnection Watcher:127.0.0.1:41021/solr got event WatchedEvent state:SyncConnected type:None path:null path:null type:None
   [junit4]   2> 1828910 INFO  (TEST-TestReqParamsAPI.test-seed#[15741E16B47C1B9E]) [    ] o.a.s.c.c.ConnectionManager Client is connected to ZooKeeper
   [junit4]   2> 1828910 INFO  (TEST-TestReqParamsAPI.test-seed#[15741E16B47C1B9E]) [    ] o.a.s.c.c.SolrZkClient Using default ZkACLProvider
   [junit4]   2> 1828911 INFO  (TEST-TestReqParamsAPI.test-seed#[15741E16B47C1B9E]) [    ] o.a.s.c.c.ZkStateReader Updating cluster state from ZooKeeper... 
   [junit4]   2> 1828911 INFO  (TEST-TestReqParamsAPI.test-seed#[15741E16B47C1B9E]) [    ] o.a.s.c.c.ZkStateReader Updated live nodes from ZooKeeper... (0) -> (1)
   [junit4]   2> 1828912 INFO  (TEST-TestReqParamsAPI.test-seed#[15741E16B47C1B9E]) [    ] o.a.s.c.ChaosMonkey monkey: init - expire sessions:false cause connection loss:false
   [junit4]   2> 1828912 INFO  (TEST-TestReqParamsAPI.test-seed#[15741E16B47C1B9E]) [    ] o.a.s.c.AbstractFullDistribZkTestBase Creating collection1 with stateFormat=2
   [junit4]   2> 1828912 INFO  (TEST-TestReqParamsAPI.test-seed#[15741E16B47C1B9E]) [    ] o.a.s.c.c.SolrZkClient Using default ZkCredentialsProvider
   [junit4]   2> 1828912 INFO  (TEST-TestReqParamsAPI.test-seed#[15741E16B47C1B9E]) [    ] o.a.s.c.c.ConnectionManager Waiting for client to connect to ZooKeeper
   [junit4]   2> 1828916 INFO  (zkCallback-2280-thread-1) [    ] o.a.s.c.c.ConnectionManager Watcher org.apache.solr.common.cloud.ConnectionManager@10d2430 name:ZooKeeperConnection Watcher:127.0.0.1:41021/solr got event WatchedEvent state:SyncConnected type:None path:null path:null type:None
   [junit4]   2> 1828916 INFO  (TEST-TestReqParamsAPI.test-seed#[15741E16B47C1B9E]) [    ] o.a.s.c.c.ConnectionManager Client is connected to ZooKeeper
   [junit4]   2> 1828917 INFO  (TEST-TestReqParamsAPI.test-seed#[15741E16B47C1B9E]) [    ] o.a.s.c.c.SolrZkClient Using default ZkACLProvider
   [junit4]   2> 1828918 INFO  (OverseerStateUpdate-95590159100149764-127.0.0.1:35762_-n_0000000000) [    ] o.a.s.c.Overseer processMessage: queueSize: 1, message = {
   [junit4]   2>   "operation":"create",
   [junit4]   2>   "name":"collection1",
   [junit4]   2>   "numShards":"2",
   [junit4]   2>   "stateFormat":"2"} current state version: 3
   [junit4]   2> 1828918 INFO  (OverseerStateUpdate-95590159100149764-127.0.0.1:35762_-n_0000000000) [    ] o.a.s.c.o.ClusterStateMutator building a new cName: collection1
   [junit4]   2> 1828985 INFO  (TEST-TestReqParamsAPI.test-seed#[15741E16B47C1B9E]) [    ] o.a.s.SolrTestCaseJ4 Writing core.properties file to /home/jenkins/workspace/Lucene-Solr-6.x-Linux/solr/build/solr-core/test/J0/temp/solr.handler.TestReqParamsAPI_15741E16B47C1B9E-001/shard-1-001/cores/collection1
   [junit4]   2> 1828986 INFO  (TEST-TestReqParamsAPI.test-seed#[15741E16B47C1B9E]) [    ] o.a.s.c.AbstractFullDistribZkTestBase create jetty 1 in directory /home/jenkins/workspace/Lucene-Solr-6.x-Linux/solr/build/solr-core/test/J0/temp/solr.handler.TestReqParamsAPI_15741E16B47C1B9E-001/shard-1-001
   [junit4]   2> 1828986 INFO  (TEST-TestReqParamsAPI.test-seed#[15741E16B47C1B9E]) [    ] o.e.j.s.Server jetty-9.3.8.v20160314
   [junit4]   2> 1828987 INFO  (TEST-TestReqParamsAPI.test-seed#[15741E16B47C1B9E]) [    ] o.e.j.s.h.ContextHandler Started o.e.j.s.ServletContextHandler@95da19{/,null,AVAILABLE}
   [junit4]   2> 1828987 INFO  (TEST-TestReqParamsAPI.test-seed#[15741E16B47C1B9E]) [    ] o.e.j.s.ServerConnector Started ServerConnector@1a187db{HTTP/1.1,[http/1.1]}{127.0.0.1:37953}
   [junit4]   2> 1828987 INFO  (TEST-TestReqParamsAPI.test-seed#[15741E16B47C1B9E]) [    ] o.e.j.s.Server Started @1830341ms
   [junit4]   2> 1828987 INFO  (TEST-TestReqParamsAPI.test-seed#[15741E16B47C1B9E]) [    ] o.a.s.c.s.e.JettySolrRunner Jetty properties: {solr.data.dir=/home/jenkins/workspace/Lucene-Solr-6.x-Linux/solr/build/solr-core/test/J0/temp/solr.handler.TestReqParamsAPI_15741E16B47C1B9E-001/tempDir-001/jetty1, solrconfig=solrconfig.xml, hostContext=/, hostPort=37953, coreRootDirectory=/home/jenkins/workspace/Lucene-Solr-6.x-Linux/solr/build/solr-core/test/J0/../../../../../../../../../home/jenkins/workspace/Lucene-Solr-6.x-Linux/solr/build/solr-core/test/J0/temp/solr.handler.TestReqParamsAPI_15741E16B47C1B9E-001/shard-1-001/cores}
   [junit4]   2> 1828988 INFO  (TEST-TestReqParamsAPI.test-seed#[15741E16B47C1B9E]) [    ] o.a.s.s.SolrDispatchFilter SolrDispatchFilter.init(): jdk.internal.loader.ClassLoaders$AppClassLoader@864e92
   [junit4]   2> 1828988 INFO  (TEST-TestReqParamsAPI.test-seed#[15741E16B47C1B9E]) [    ] o.a.s.c.SolrResourceLoader new SolrResourceLoader for directory: '/home/jenkins/workspace/Lucene-Solr-6.x-Linux/solr/build/solr-core/test/J0/temp/solr.handler.TestReqParamsAPI_15741E16B47C1B9E-001/shard-1-001'
   [junit4]   2> 1828988 INFO  (TEST-TestReqParamsAPI.test-seed#[15741E16B47C1B9E]) [    ] o.a.s.c.SolrResourceLoader JNDI not configured for solr (NoInitialContextEx)
   [junit4]   2> 1828988 INFO  (TEST-TestReqParamsAPI.test-seed#[15741E16B47C1B9E]) [    ] o.a.s.c.SolrResourceLoader solr home defaulted to 'solr/' (could not find system property or JNDI)
   [junit4]   2> 1828988 INFO  (TEST-TestReqParamsAPI.test-seed#[15741E16B47C1B9E]) [    ] o.a.s.c.c.SolrZkClient Using default ZkCredentialsProvider
   [junit4]   2> 1828988 INFO  (TEST-TestReqParamsAPI.test-seed#[15741E16B47C1B9E]) [    ] o.a.s.c.c.ConnectionManager Waiting for client to connect to ZooKeeper
   [junit4]   2> 1828989 INFO  (zkCallback-2281-thread-1) [    ] o.a.s.c.c.ConnectionManager Watcher org.apache.solr.common.cloud.ConnectionManager@cd0e6f name:ZooKeeperConnection Watcher:127.0.0.1:41021/solr got event WatchedEvent state:SyncConnected type:None path:null path:null type:None
   [junit4]   2> 1828989 INFO  (TEST-TestReqParamsAPI.test-seed#[15741E16B47C1B9E]) [    ] o.a.s.c.c.ConnectionManager Client is connected to ZooKeeper
   [junit4]   2> 1828990 INFO  (TEST-TestReqParamsAPI.test-seed#[15741E16B47C1B9E]) [    ] o.a.s.c.c.SolrZkClient Using default ZkACLProvider
   [junit4]   2> 1828990 INFO  (TEST-TestReqParamsAPI.test-seed#[15741E16B47C1B9E]) [    ] o.a.s.s.SolrDispatchFilter Loading solr.xml from SolrHome (not found in ZooKeeper)
   [junit4]   2> 1828990 INFO  (TEST-TestReqParamsAPI.test-seed#[15741E16B47C1B9E]) [    ] o.a.s.c.SolrXmlConfig Loading container configuration from /home/jenkins/workspace/Lucene-Solr-6.x-Linux/solr/build/solr-core/test/J0/temp/solr.handler.TestReqParamsAPI_15741E16B47C1B9E-001/shard-1-001/solr.xml
   [junit4]   2> 1828994 INFO  (TEST-TestReqParamsAPI.test-seed#[15741E16B47C1B9E]) [    ] o.a.s.c.CorePropertiesLocator Config-defined core root directory: /home/jenkins/workspace/Lucene-Solr-6.x-Linux/solr/build/solr-core/test/J0/../../../../../../../../../home/jenkins/workspace/Lucene-Solr-6.x-Linux/solr/build/solr-core/test/J0/temp/solr.handler.TestReqParamsAPI_15741E16B47C1B9E-001/shard-1-001/cores
   [junit4]   2> 1828994 INFO  (TEST-TestReqParamsAPI.test-seed#[15741E16B47C1B9E]) [    ] o.a.s.c.CoreContainer New CoreContainer 5075255
   [junit4]   2> 1828994 INFO  (TEST-TestReqParamsAPI.test-seed#[15741E16B47C1B9E]) [    ] o.a.s.c.CoreContainer Loading cores into CoreContainer [instanceDir=/home/jenkins/workspace/Lucene-Solr-6.x-Linux/solr/build/solr-core/test/J0/temp/solr.handler.TestReqParamsAPI_15741E16B47C1B9E-001/shard-1-001]
   [junit4]   2> 1828994 WARN  (TEST-TestReqParamsAPI.test-seed#[15741E16B47C1B9E]) [    ] o.a.s.c.CoreContainer Couldn't add files from /home/jenkins/workspace/Lucene-Solr-6.x-Linux/solr/build/solr-core/test/J0/temp/solr.handler.TestReqParamsAPI_15741E16B47C1B9E-001/shard-1-001/lib to classpath: /home/jenkins/workspace/Lucene-Solr-6.x-Linux/solr/build/solr-core/test/J0/temp/solr.handler.TestReqParamsAPI_15741E16B47C1B9E-001/shard-1-001/lib
   [junit4]   2> 1828994 INFO  (TEST-TestReqParamsAPI.test-seed#[15741E16B47C1B9E]) [    ] o.a.s.h.c.HttpShardHandlerFactory created with socketTimeout : 90000,urlScheme : ,connTimeout : 15000,maxConnectionsPerHost : 20,maxConnections : 10000,corePoolSize : 0,maximumPoolSize : 2147483647,maxThreadIdleTime : 5,sizeOfQueue : -1,fairnessPolicy : false,useRetries : false,
   [junit4]   2> 1828995 INFO  (TEST-TestReqParamsAPI.test-seed#[15741E16B47C1B9E]) [    ] o.a.s.u.UpdateShardHandler Creating UpdateShardHandler HTTP client with params: socketTimeout=340000&connTimeout=45000&retry=true
   [junit4]   2> 1828995 INFO  (TEST-TestReqParamsAPI.test-seed#[15741E16B47C1B9E]) [    ] o.a.s.l.LogWatcher SLF4J impl is org.slf4j.impl.Log4jLoggerFactory
   [junit4]   2> 1828995 INFO  (TEST-TestReqParamsAPI.test-seed#[15741E16B47C1B9E]) [    ] o.a.s.l.LogWatcher Registering Log Listener [Log4j (org.slf4j.impl.Log4jLoggerFactory)]
   [junit4]   2> 1828995 INFO  (TEST-TestReqParamsAPI.test-seed#[15741E16B47C1B9E]) [    ] o.a.s.c.ZkContainer Zookeeper client=127.0.0.1:41021/solr
   [junit4]   2> 1828996 INFO  (TEST-TestReqParamsAPI.test-seed#[15741E16B47C1B9E]) [    ] o.a.s.c.ZkController zkHost includes chroot
   [junit4]   2> 1828996 INFO  (TEST-TestReqParamsAPI.test-seed#[15741E16B47C1B9E]) [    ] o.a.s.c.c.SolrZkClient Using default ZkCredentialsProvider
   [junit4]   2> 1828996 INFO  (TEST-TestReqParamsAPI.test-seed#[15741E16B47C1B9E]) [    ] o.a.s.c.c.ConnectionManager Waiting for client to connect to ZooKeeper
   [junit4]   2> 1828997 INFO  (zkCallback-2284-thread-1) [    ] o.a.s.c.c.ConnectionManager Watcher org.apache.solr.common.cloud.ConnectionManager@8ddd51 name:ZooKeeperConnection Watcher:127.0.0.1:41021 got event WatchedEvent state:SyncConnected type:None path:null path:null type:None
   [junit4]   2> 1828997 INFO  (TEST-TestReqParamsAPI.test-seed#[15741E16B47C1B9E]) [    ] o.a.s.c.c.ConnectionManager Client is connected to ZooKeeper
   [junit4]   2> 1828997 INFO  (TEST-TestReqParamsAPI.test-seed#[15741E16B47C1B9E]) [    ] o.a.s.c.c.SolrZkClient Using default ZkACLProvider
   [junit4]   2> 1828998 INFO  (TEST-TestReqParamsAPI.test-seed#[15741E16B47C1B9E]) [    ] o.a.s.c.c.ConnectionManager Waiting for client to connect to ZooKeeper
   [junit4]   2> 1828999 INFO  (zkCallback-2285-thread-1) [    ] o.a.s.c.c.ConnectionManager Watcher org.apache.solr.common.cloud.ConnectionManager@1960c25 name:ZooKeeperConnection Watcher:127.0.0.1:41021/solr got event WatchedEvent state:SyncConnected type:None path:null path:null type:None
   [junit4]   2> 1828999 INFO  (TEST-TestReqParamsAPI.test-seed#[15741E16B47C1B9E]) [    ] o.a.s.c.c.ConnectionManager Client is connected to ZooKeeper
   [junit4]   2> 1829002 INFO  (TEST-TestReqParamsAPI.test-seed#[15741E16B47C1B9E]) [    ] o.a.s.c.c.ZkStateReader Updating cluster state from ZooKeeper... 
   [junit4]   2> 1829002 INFO  (TEST-TestReqParamsAPI.test-seed#[15741E16B47C1B9E]) [    ] o.a.s.c.c.ZkStateReader Updated live nodes from ZooKeeper... (0) -> (1)
   [junit4]   2> 1829003 INFO  (TEST-TestReqParamsAPI.test-seed#[15741E16B47C1B9E]) [    ] o.a.s.c.Overseer Overseer (id=null) closing
   [junit4]   2> 1829003 INFO  (TEST-TestReqParamsAPI.test-seed#[15741E16B47C1B9E]) [    ] o.a.s.c.LeaderElector Joined leadership election with path: /overseer_elect/election/95590159100149769-127.0.0.1:37953_-n_0000000001
   [junit4]   2> 1829004 INFO  (TEST-TestReqParamsAPI.test-seed#[15741E16B47C1B9E]) [    ] o.a.s.c.LeaderElector Watching path /overseer_elect/election/95590159100149764-127.0.0.1:35762_-n_0000000000 to know if I could be the leader
   [junit4]   2> 1829004 INFO  (TEST-TestReqParamsAPI.test-seed#[15741E16B47C1B9E]) [    ] o.a.s.c.ZkController Publish node=127.0.0.1:37953_ as DOWN
   [junit4]   2> 1829005 INFO  (OverseerStateUpdate-95590159100149764-127.0.0.1:35762_-n_0000000000) [    ] o.a.s.c.Overseer processMessage: queueSize: 1, message = {
   [junit4]   2>   "operation":"downnode",
   [junit4]   2>   "node_name":"127.0.0.1:37953_"} current state version: 3
   [junit4]   2> 1829005 INFO  (OverseerStateUpdate-95590159100149764-127.0.0.1:35762_-n_0000000000) [    ] o.a.s.c.o.NodeMutator DownNode state invoked for node: 127.0.0.1:37953_
   [junit4]   2> 1829005 INFO  (OverseerStateUpdate-95590159100149764-127.0.0.1:35762_-n_0000000000) [    ] o.a.s.c.o.ZkStateWriter going to create_collection /collections/collection1/state.json
   [junit4]   2> 1829108 INFO  (zkCallback-2277-thread-1) [    ] o.a.s.c.c.ZkStateReader A cluster state change: [WatchedEvent state:SyncConnected type:NodeDataChanged path:/clusterstate.json], has occurred - updating... (live nodes size: [1])
   [junit4]   2> 1829108 INFO  (zkCallback-2285-thread-1) [    ] o.a.s.c.c.ZkStateReader A cluster state change: [WatchedEvent state:SyncConnected type:NodeDataChanged path:/clusterstate.json], has occurred - updating... (live nodes size: [1])
   [junit4]   2> 1829108 INFO  (zkCallback-2279-thread-1) [    ] o.a.s.c.c.ZkStateReader A cluster state change: [WatchedEvent state:SyncConnected type:NodeDataChanged path:/clusterstate.json], has occurred - updating... (live nodes size: [1])
   [junit4]   2> 1830005 INFO  (TEST-TestReqParamsAPI.test-seed#[15741E16B47C1B9E]) [    ] o.a.s.c.ZkController Register node as live in ZooKeeper:/live_nodes/127.0.0.1:37953_
   [junit4]   2> 1830005 INFO  (TEST-TestReqParamsAPI.test-seed#[15741E16B47C1B9E]) [    ] o.a.s.c.c.SolrZkClient makePath: /live_nodes/127.0.0.1:37953_
   [junit4]   2> 1830006 INFO  (zkCallback-2277-thread-1) [    ] o.a.s.c.c.ZkStateReader A live node change: [WatchedEvent state:SyncConnected type:NodeChildrenChanged path:/live_nodes], has occurred - updating... (live nodes size: [1])
   [junit4]   2> 1830006 INFO  (zkCallback-2279-thread-1) [    ] o.a.s.c.c.ZkStateReader A live node change: [WatchedEvent state:SyncConnected type:NodeChildrenChanged path:/live_nodes], has occurred - updating... (live nodes size: [1])
   [junit4]   2> 1830006 INFO  (zkCallback-2285-thread-1) [    ] o.a.s.c.c.ZkStateReader A live node change: [WatchedEvent state:SyncConnected type:NodeChildrenChanged path:/live_nodes], has occurred - updating... (live nodes size: [1])
   [junit4]   2> 1830006 INFO  (zkCallback-2277-thread-1) [    ] o.a.s.c.c.ZkStateReader Updated live nodes from ZooKeeper... (1) -> (2)
   [junit4]   2> 1830006 INFO  (zkCallback-2279-thread-1) [    ] o.a.s.c.c.ZkStateReader Updated live nodes from ZooKeeper... (1) -> (2)
   [junit4]   2> 1830006 INFO  (zkCallback-2285-thread-1) [    ] o.a.s.c.c.ZkStateReader Updated live nodes from ZooKeeper... (1) -> (2)
   [junit4]   2> 1830041 INFO  (TEST-TestReqParamsAPI.test-seed#[15741E16B47C1B9E]) [    ] o.a.s.c.CoreContainer Security conf doesn't exist. Skipping setup for authorization module.
   [junit4]   2> 1830041 INFO  (TEST-TestReqParamsAPI.test-seed#[15741E16B47C1B9E]) [    ] o.a.s.c.CoreContainer No authentication plugin used.
   [junit4]   2> 1830041 INFO  (TEST-TestReqParamsAPI.test-seed#[15741E16B47C1B9E]) [    ] o.a.s.c.CorePropertiesLocator Looking for core definitions underneath /home/jenkins/workspace/Lucene-Solr-6.x-Linux/solr/build/solr-core/test/J0/../../../../../../../../../home/jenkins/workspace/Lucene-Solr-6.x-Linux/solr/build/solr-core/test/J0/temp/solr.handler.TestReqParamsAPI_15741E16B47C1B9E-001/shard-1-001/cores
   [junit4]   2> 1830042 INFO  (TEST-TestReqParamsAPI.test-seed#[15741E16B47C1B9E]) [    ] o.a.s.c.CoreDescriptor Created CoreDescriptor: {name=collection1, config=solrconfig.xml, transient=false, schema=schema.xml, loadOnStartup=true, configSetProperties=configsetprops.json, collection=collection1, coreNodeName=, dataDir=data/, shard=}
   [junit4]   2> 1830042 INFO  (TEST-TestReqParamsAPI.test-seed#[15741E16B47C1B9E]) [    ] o.a.s.c.CorePropertiesLocator Found core collection1 in /home/jenkins/workspace/Lucene-Solr-6.x-Linux/solr/build/solr-core/test/J0/../../../../../../../../../home/jenkins/workspace/Lucene-Solr-6.x-Linux/solr/build/solr-core/test/J0/temp/solr.handler.TestReqParamsAPI_15741E16B47C1B9E-001/shard-1-001/cores/collection1
   [junit4]   2> 1830042 INFO  (TEST-TestReqParamsAPI.test-seed#[15741E16B47C1B9E]) [    ] o.a.s.c.CorePropertiesLocator Found 1 core definitions
   [junit4]   2> 1830043 INFO  (TEST-TestReqParamsAPI.test-seed#[15741E16B47C1B9E]) [    ] o.a.s.s.SolrDispatchFilter user.dir=/home/jenkins/workspace/Lucene-Solr-6.x-Linux/solr/build/solr-core/test/J0
   [junit4]   2> 1830043 INFO  (TEST-TestReqParamsAPI.test-seed#[15741E16B47C1B9E]) [    ] o.a.s.s.SolrDispatchFilter SolrDispatchFilter.init() done
   [junit4]   2> 1830043 INFO  (coreLoadExecutor-6088-thread-1) [    ] o.a.s.c.ZkController publishing state=down
   [junit4]   2> 1830043 INFO  (coreLoadExecutor-6088-thread-1) [    ] o.a.s.c.ZkController numShards not found on descriptor - reading it from system property
   [junit4]   2> 1830044 INFO  (coreLoadExecutor-6088-thread-1) [    ] o.a.s.c.ZkController Registering watch for collection collection1
   [junit4]   2> 1830044 INFO  (coreLoadExecutor-6088-thread-1) [    ] o.a.s.c.c.ZkStateReader addZkWatch [collection1]
   [junit4]   2> 1830044 INFO  (OverseerStateUpdate-95590159100149764-127.0.0.1:35762_-n_0000000000) [    ] o.a.s.c.Overseer processMessage: queueSize: 1, message = {
   [junit4]   2>   "core":"collection1",
   [junit4]   2>   "roles":null,
   [junit4]   2>   "base_url":"http://127.0.0.1:37953",
   [junit4]   2>   "node_name":"127.0.0.1:37953_",
   [junit4]   2>   "numShards":"2",
   [junit4]   2>   "state":"down",
   [junit4]   2>   "shard":null,
   [junit4]   2>   "collection":"collection1",
   [junit4]   2>   "operation":"state"} current state version: 4
   [junit4]   2> 1830044 INFO  (coreLoadExecutor-6088-thread-1) [    ] o.a.s.c.c.ZkStateReader Add data for [collection1] ver [0]
   [junit4]   2> 1830044 INFO  (coreLoadExecutor-6088-thread-1) [    ] o.a.s.c.ZkController look for our core node name
   [junit4]   2> 1830044 INFO  (OverseerStateUpdate-95590159100149764-127.0.0.1:35762_-n_0000000000) [    ] o.a.s.c.o.ReplicaMutator Update state numShards=2 message={
   [junit4]   2>   "core":"collection1",
   [junit4]   2>   "roles":null,
   [junit4]   2>   "base_url":"http://127.0.0.1:37953",
   [junit4]   2>   "node_name":"127.0.0.1:37953_",
   [junit4]   2>   "numShards":"2",
   [junit4]   2>   "state":"down",
   [junit4]   2>   "shard":null,
   [junit4]   2>   "collection":"collection1",
   [junit4]   2>   "operation":"state"}
   [junit4]   2> 1830044 INFO  (OverseerStateUpdate-95590159100149764-127.0.0.1:35762_-n_0000000000) [    ] o.a.s.c.o.ReplicaMutator Collection already exists with numShards=2
   [junit4]   2> 1830044 INFO  (OverseerStateUpdate-95590159100149764-127.0.0.1:35762_-n_0000000000) [    ] o.a.s.c.o.ReplicaMutator Assigning new node to shard shard=shard2
   [junit4]   2> 1830145 INFO  (OverseerStateUpdate-95590159100149764-127.0.0.1:35762_-n_0000000000) [    ] o.a.s.c.o.ZkStateWriter going to update_collection /collections/collection1/state.json version: 0
   [junit4]   2> 1830146 INFO  (zkCallback-2285-thread-1) [    ] o.a.s.c.c.ZkStateReader A cluster state change: [WatchedEvent state:SyncConnected type:NodeDataChanged path:/collections/collection1/state.json] for collection [collection1] has occurred - updating... (live nodes size: [2])
   [junit4]   2> 1830146 INFO  (zkCallback-2285-thread-1) [    ] o.a.s.c.c.ZkStateReader Updating data for [collection1] from [0] to [1]
   [junit4]   2> 1831044 INFO  (coreLoadExecutor-6088-thread-1) [    ] o.a.s.c.ZkController waiting to find shard id in clusterstate for collection1
   [junit4]   2> 1831044 INFO  (coreLoadExecutor-6088-thread-1) [    ] o.a.s.c.ZkController Check for collection zkNode:collection1
   [junit4]   2> 1831045 INFO  (coreLoadExecutor-6088-thread-1) [    ] o.a.s.c.ZkController Collection zkNode exists
   [junit4]   2> 1831045 INFO  (coreLoadExecutor-6088-thread-1) [    ] o.a.s.c.c.ZkStateReader Load collection config from: [/collections/collection1]
   [junit4]   2> 1831045 INFO  (coreLoadExecutor-6088-thread-1) [    ] o.a.s.c.c.ZkStateReader path=[/collections/collection1] [configName]=[conf1] specified config exists in ZooKeeper
   [junit4]   2> 1831045 INFO  (coreLoadExecutor-6088-thread-1) [    ] o.a.s.c.SolrResourceLoader new SolrResourceLoader for directory: '/home/jenkins/workspace/Lucene-Solr-6.x-Linux/solr/build/solr-core/test/J0/temp/solr.handler.TestReqParamsAPI_15741E16B47C1B9E-001/shard-1-001/cores/collection1'
   [junit4]   2> 1831045 INFO  (coreLoadExecutor-6088-thread-1) [    ] o.a.s.c.SolrResourceLoader JNDI not configured for solr (NoInitialContextEx)
   [junit4]   2> 1831046 INFO  (coreLoadExecutor-6088-thread-1) [    ] o.a.s.c.SolrResourceLoader solr home defaulted to 'solr/' (could not find system property or JNDI)
   [junit4]   2> 1831046 INFO  (coreLoadExecutor-6088-thread-1) [    ] o.a.s.c.Config loaded config solrconfig.xml with version 0 
   [junit4]   2> 1831052 INFO  (coreLoadExecutor-6088-thread-1) [    ] o.a.s.c.SolrConfig current version of requestparams : -1
   [junit4]   2> 1831056 INFO  (coreLoadExecutor-6088-thread-1) [    ] o.a.s.c.SolrConfig Using Lucene MatchVersion: 6.1.0
   [junit4]   2> 1831064 INFO  (coreLoadExecutor-6088-thread-1) [    ] o.a.s.c.SolrConfig Loaded SolrConfig: solrconfig.xml
   [junit4]   2> 1831070 INFO  (coreLoadExecutor-6088-thread-1) [    ] o.a.s.s.IndexSchema [collection1] Schema name=test
   [junit4]   2> 1831157 INFO  (coreLoadExecutor-6088-thread-1) [    ] o.a.s.s.OpenExchangeRatesOrgProvider Initialized with rates=open-exchange-rates.json, refreshInterval=1440.
   [junit4]   2> 1831162 INFO  (coreLoadExecutor-6088-thread-1) [    ] o.a.s.s.IndexSchema default search field in schema is text
   [junit4]   2> 1831163 INFO  (coreLoadExecutor-6088-thread-1) [    ] o.a.s.s.IndexSchema unique key field: id
   [junit4]   2> 1831169 INFO  (coreLoadExecutor-6088-thread-1) [    ] o.a.s.s.FileExchangeRateProvider Reloading exchange rates from file currency.xml
   [junit4]   2> 1831171 INFO  (coreLoadExecutor-6088-thread-1) [    ] o.a.s.s.FileExchangeRateProvider Reloading exchange rates from file currency.xml
   [junit4]   2> 1831173 INFO  (coreLoadExecutor-6088-thread-1) [    ] o.a.s.s.OpenExchangeRatesOrgProvider Reloading exchange rates from open-exchange-rates.json
   [junit4]   2> 1831173 INFO  (coreLoadExecutor-6088-thread-1) [    ] o.a.s.s.OpenExchangeRatesOrgProvider Reloading exchange rates from open-exchange-rates.json
   [junit4]   2> 1831174 INFO  (coreLoadExecutor-6088-thread-1) [    ] o.a.s.c.ConfigSetProperties Did not find ConfigSet properties, assuming default properties: Can't find resource 'configsetprops.json' in classpath or '/configs/conf1', cwd=/home/jenkins/workspace/Lucene-Solr-6.x-Linux/solr/build/solr-core/test/J0
   [junit4]   2> 1831175 INFO  (coreLoadExecutor-6088-thread-1) [    ] o.a.s.c.CoreContainer Creating SolrCore 'collection1' using configuration from collection collection1
   [junit4]   2> 1831175 INFO  (coreLoadExecutor-6088-thread-1) [    ] o.a.s.c.SolrCore org.apache.solr.core.MockDirectoryFactory
   [junit4]   2> 1831175 INFO  (coreLoadExecutor-6088-thread-1) [    ] o.a.s.c.SolrCore [[collection1] ] Opening new SolrCore at [/home/jenkins/workspace/Lucene-Solr-6.x-Linux/solr/build/solr-core/test/J0/temp/solr.handler.TestReqParamsAPI_15741E16B47C1B9E-001/shard-1-001/cores/collection1], dataDir=[/home/jenkins/workspace/Lucene-Solr-6.x-Linux/solr/build/solr-core/test/J0/../../../../../../../../../home/jenkins/workspace/Lucene-Solr-6.x-Linux/solr/build/solr-core/test/J0/temp/solr.handler.TestReqParamsAPI_15741E16B47C1B9E-001/shard-1-001/cores/collection1/data/]
   [junit4]   2> 1831175 INFO  (coreLoadExecutor-6088-thread-1) [    ] o.a.s.c.JmxMonitoredMap JMX monitoring is enabled. Adding Solr mbeans to JMX Server: com.sun.jmx.mbeanserver.JmxMBeanServer@1afe8e9
   [junit4]   2> 1831176 INFO  (coreLoadExecutor-6088-thread-1) [    ] o.a.s.c.CachingDirectoryFactory return new directory for /home/jenkins/workspace/Lucene-Solr-6.x-Linux/solr/build/solr-core/test/J0/../../../../../../../../../home/jenkins/workspace/Lucene-Solr-6.x-Linux/solr/build/solr-core/test/J0/temp/solr.handler.TestReqParamsAPI_15741E16B47C1B9E-001/shard-1-001/cores/collection1/data
   [junit4]   2> 1831176 INFO  (coreLoadExecutor-6088-thread-1) [    ] o.a.s.c.SolrCore New index directory detected: old=null new=/home/jenkins/workspace/Lucene-Solr-6.x-Linux/solr/build/solr-core/test/J0/../../../../../../../../../home/jenkins/workspace/Lucene-Solr-6.x-Linux/solr/build/solr-core/test/J0/temp/solr.handler.TestReqParamsAPI_15741E16B47C1B9E-001/shard-1-001/cores/collection1/data/index/
   [junit4]   2> 1831176 WARN  (coreLoadExecutor-6088-thread-1) [    ] o.a.s.c.SolrCore [collection1] Solr index directory '/home/jenkins/workspace/Lucene-Solr-6.x-Linux/solr/build/solr-core/test/J0/../../../../../../../../../home/jenkins/workspace/Lucene-Solr-6.x-Linux/solr/build/solr-core/test/J0/temp/solr.handler.TestReqParamsAPI_15741E16B47C1B9E-001/shard-1-001/cores/collection1/data/index' doesn't exist. Creating new index...
   [junit4]   2> 1831176 INFO  (coreLoadExecutor-6088-thread-1) [    ] o.a.s.c.CachingDirectoryFactory return new directory for /home/jenkins/workspace/Lucene-Solr-6.x-Linux/solr/build/solr-core/test/J0/../../../../../../../../../home/jenkins/workspace/Lucene-Solr-6.x-Linux/solr/build/solr-core/test/J0/temp/solr.handler.TestReqParamsAPI_15741E16B47C1B9E-001/shard-1-001/cores/collection1/data/index
   [junit4]   2> 1831176 INFO  (coreLoadExecutor-6088-thread-1) [    ] o.a.s.u.RandomMergePolicy RandomMergePolicy wrapping class org.apache.lucene.index.TieredMergePolicy: [TieredMergePolicy: maxMergeAtOnce=18, maxMergeAtOnceExplicit=27, maxMergedSegmentMB=87.56640625, floorSegmentMB=0.953125, forceMergeDeletesPctAllowed=11.111810133851495, segmentsPerTier=49.0, maxCFSSegmentSizeMB=8.796093022207999E12, noCFSRatio=0.7541655634799548
   [junit4]   2> 1831177 INFO  (coreLoadExecutor-6088-thread-1) [    ] o.a.s.c.SolrDeletionPolicy SolrDeletionPolicy.onCommit: commits: num=1
   [junit4]   2> 	commit{dir=MockDirectoryWrapper(RAMDirectory@1490e17 lockFactory=org.apache.lucene.store.SingleInstanceLockFactory@9cbb6e),segFN=segments_1,generation=1}
   [junit4]   2> 1831177 INFO  (coreLoadExecutor-6088-thread-1) [    ] o.a.s.c.SolrDeletionPolicy newest commit generation = 1
   [junit4]   2> 1831177 INFO  (OldIndexDirectoryCleanupThreadForCore-collection1) [    ] o.a.s.c.SolrCore Looking for old index directories to cleanup for core collection1 in /home/jenkins/workspace/Lucene-Solr-6.x-Linux/solr/build/solr-core/test/J0/../../../../../../../../../home/jenkins/workspace/Lucene-Solr-6.x-Linux/solr/build/solr-core/test/J0/temp/solr.handler.TestReqParamsAPI_15741E16B47C1B9E-001/shard-1-001/cores/collection1/data/
   [junit4]   2> 1831177 WARN  (OldIndexDirectoryCleanupThreadForCore-collection1) [    ] o.a.s.c.DirectoryFactory /home/jenkins/workspace/Lucene-Solr-6.x-Linux/solr/build/solr-core/test/J0/../../../../../../../../../home/jenkins/workspace/Lucene-Solr-6.x-Linux/solr/build/solr-core/test/J0/temp/solr.handler.TestReqParamsAPI_15741E16B47C1B9E-001/shard-1-001/cores/collection1/data/ does not point to a valid data directory; skipping clean-up of old index directories.
   [junit4]   2> 1831180 INFO  (coreLoadExecutor-6088-thread-1) [    ] o.a.s.u.p.UpdateRequestProcessorChain creating updateRequestProcessorChain "nodistrib"
   [junit4]   2> 1831180 INFO  (coreLoadExecutor-6088-thread-1) [    ] o.a.s.u.p.UpdateRequestProcessorChain creating updateRequestProcessorChain "dedupe"
   [junit4]   2> 1831180 INFO  (coreLoadExecutor-6088-thread-1) [    ] o.a.s.u.p.UpdateRequestProcessorChain inserting DistributedUpdateProcessorFactory into updateRequestProcessorChain "dedupe"
   [junit4]   2> 1831180 INFO  (coreLoadExecutor-6088-thread-1) [    ] o.a.s.u.p.UpdateRequestProcessorChain creating updateRequestProcessorChain "stored_sig"
   [junit4]   2> 1831181 INFO  (coreLoadExecutor-6088-thread-1) [    ] o.a.s.u.p.UpdateRequestProcessorChain inserting DistributedUpdateProcessorFactory into updateRequestProcessorChain "stored_sig"
   [junit4]   2> 1831181 INFO  (coreLoadExecutor-6088-thread-1) [    ] o.a.s.u.p.UpdateRequestProcessorChain creating updateRequestProcessorChain "distrib-dup-test-chain-explicit"
   [junit4]   2> 1831181 INFO  (coreLoadExecutor-6088-thread-1) [    ] o.a.s.u.p.UpdateRequestProcessorChain creating updateRequestProcessorChain "distrib-dup-test-chain-implicit"
   [junit4]   2> 1831181 INFO  (coreLoadExecutor-6088-thread-1) [    ] o.a.s.u.p.UpdateRequestProcessorChain inserting DistributedUpdateProcessorFactory into updateRequestProcessorChain "distrib-dup-test-chain-implicit"
   [junit4]   2> 1831181 INFO  (coreLoadExecutor-6088-thread-1) [    ] o.a.s.c.SolrCore no updateRequestProcessorChain defined as default, creating implicit default
   [junit4]   2> 1831181 WARN  (coreLoadExecutor-6088-thread-1) [    ] o.a.s.c.RequestHandlers INVALID paramSet a in requestHandler {type = requestHandler,name = /dump,class = DumpRequestHandler,args = {defaults={a=A,b=B}}}
   [junit4]   2> 1831183 INFO  (coreLoadExecutor-6088-thread-1) [    ] o.a.s.h.l.XMLLoader xsltCacheLifetimeSeconds=60
   [junit4]   2> 1831185 INFO  (coreLoadExecutor-6088-thread-1) [    ] o.a.s.h.l.XMLLoader xsltCacheLifetimeSeconds=60
   [junit4]   2> 1831186 INFO  (coreLoadExecutor-6088-thread-1) [    ] o.a.s.h.l.XMLLoader xsltCacheLifetimeSeconds=60
   [junit4]   2> 1831187 INFO  (coreLoadExecutor-6088-thread-1) [    ] o.a.s.h.l.XMLLoader xsltCacheLifetimeSeconds=60
   [junit4]   2> 1831194 INFO  (coreLoadExecutor-6088-thread-1) [    ] o.a.s.c.RequestHandlers Registered paths: /admin/mbeans,standard,/dump,/update/csv,/sql,/update/json/docs,/admin/luke,/export,/admin/segments,/get,/admin/system,/replication,/admin/properties,/config,/stream,/schema,/admin/plugins,/admin/logging,/update/json,/admin/ping,/admin/threads,/update,/admin/file
   [junit4]   2> 1831194 INFO  (coreLoadExecutor-6088-thread-1) [    ] o.a.s.c.SolrCore Using default statsCache cache: org.apache.solr.search.stats.LocalStatsCache
   [junit4]   2> 1831194 INFO  (coreLoadExecutor-6088-thread-1) [    ] o.a.s.u.UpdateHandler Using UpdateLog implementation: org.apache.solr.update.UpdateLog
   [junit4]   2> 1831194 INFO  (coreLoadExecutor-6088-thread-1) [    ] o.a.s.u.UpdateLog Initializing UpdateLog: dataDir= defaultSyncLevel=FLUSH numRecordsToKeep=100 maxNumLogsToKeep=10 numVersionBuckets=65536
   [junit4]   2> 1831195 INFO  (coreLoadExecutor-6088-thread-1) [    ] o.a.s.u.CommitTracker Hard AutoCommit: disabled
   [junit4]   2> 1831195 INFO  (coreLoadExecutor-6088-thread-1) [    ] o.a.s.u.CommitTracker Soft AutoCommit: disabled
   [junit4]   2> 1831196 INFO  (coreLoadExecutor-6088-thread-1) [    ] o.a.s.u.RandomMergePolicy RandomMergePolicy wrapping class org.apache.lucene.index.TieredMergePolicy: [TieredMergePolicy: maxMergeAtOnce=40, maxMergeAtOnceExplicit=29, maxMergedSegmentMB=20.59765625, floorSegmentMB=0.2138671875, forceMergeDeletesPctAllowed=11.492992877126532, segmentsPerTier=23.0, maxCFSSegmentSizeMB=8.796093022207999E12, noCFSRatio=0.0
   [junit4]   2> 1831196 INFO  (coreLoadExecutor-6088-thread-1) [    ] o.a.s.c.SolrDeletionPolicy SolrDeletionPolicy.onInit: commits: num=1
   [junit4]   2> 	commit{dir=MockDirectoryWrapper(RAMDirectory@1490e17 lockFactory=org.apache.lucene.store.SingleInstanceLockFactory@9cbb6e),segFN=segments_1,generation=1}
   [junit4]   2> 1831196 INFO  (coreLoadExecutor-6088-thread-1) [    ] o.a.s.c.SolrDeletionPolicy newest commit generation = 1
   [junit4]   2> 1831196 INFO  (coreLoadExecutor-6088-thread-1) [    ] o.a.s.s.SolrIndexSearcher Opening [Searcher@a6d134[collection1] main]
   [junit4]   2> 1831196 INFO  (coreLoadExecutor-6088-thread-1) [    ] o.a.s.c.c.ZkStateReader Load collection config from: [/collections/collection1]
   [junit4]   2> 1831197 INFO  (coreLoadExecutor-6088-thread-1) [    ] o.a.s.c.c.ZkStateReader path=[/collections/collection1] [configName]=[conf1] specified config exists in ZooKeeper
   [junit4]   2> 1831197 INFO  (coreLoadExecutor-6088-thread-1) [    ] o.a.s.r.ManagedResourceStorage Setting up ZooKeeper-based storage for the RestManager with znodeBase: /configs/conf1
   [junit4]   2> 1831197 INFO  (coreLoadExecutor-6088-thread-1) [    ] o.a.s.r.ManagedResourceStorage Configured ZooKeeperStorageIO with znodeBase: /configs/conf1
   [junit4]   2> 1831197 INFO  (coreLoadExecutor-6088-thread-1) [    ] o.a.s.r.RestManager Initializing RestManager with initArgs: {}
   [junit4]   2> 1831197 INFO  (coreLoadExecutor-6088-thread-1) [    ] o.a.s.r.ManagedResourceStorage Reading _rest_managed.json using ZooKeeperStorageIO:path=/configs/conf1
   [junit4]   2> 1831197 INFO  (coreLoadExecutor-6088-thread-1) [    ] o.a.s.r.ManagedResourceStorage No data found for znode /configs/conf1/_rest_managed.json
   [junit4]   2> 1831197 INFO  (coreLoadExecutor-6088-thread-1) [    ] o.a.s.r.ManagedResourceStorage Loaded null at path _rest_managed.json using ZooKeeperStorageIO:path=/configs/conf1
   [junit4]   2> 1831198 INFO  (coreLoadExecutor-6088-thread-1) [    ] o.a.s.r.RestManager Initializing 0 registered ManagedResources
   [junit4]   2> 1831198 INFO  (coreLoadExecutor-6088-thread-1) [    ] o.a.s.h.ReplicationHandler Commits will be reserved for  10000
   [junit4]   2> 1831199 INFO  (searcherExecutor-6089-thread-1) [    ] o.a.s.c.SolrCore [collection1] Registered new searcher Searcher@a6d134[collection1] main{ExitableDirectoryReader(UninvertingDirectoryReader())}
   [junit4]   2> 1831199 INFO  (coreLoadExecutor-6088-thread-1) [    ] o.a.s.u.UpdateLog Looking up max value of version field to seed version buckets
   [junit4]   2> 1831199 INFO  (coreLoadExecutor-6088-thread-1) [    ] o.a.s.u.VersionInfo Refreshing highest value of _version_ for 65536 version buckets from index
   [junit4]   2> 1831199 INFO  (coreLoadExecutor-6088-thread-1) [    ] o.a.s.u.VersionInfo No terms found for _version_, cannot seed version bucket highest value from index
   [junit4]   2> 1831199 INFO  (coreLoadExecutor-6088-thread-1) [    ] o.a.s.u.UpdateLog Could not find max version in index or recent updates, using new clock 1529442549858566144
   [junit4]   2> 1831201 INFO  (coreLoadExecutor-6088-thread-1) [    ] o.a.s.u.UpdateLog Took 1.0ms to seed version buckets with highest version 1529442549858566144
   [junit4]   2> 1831201 INFO  (coreLoadExecutor-6088-thread-1) [    ] o.a.s.c.ZkController watch zkdir /configs/conf1
   [junit4]   2> 1831202 INFO  (coreLoadExecutor-6088-thread-1) [    ] o.a.s.c.CoreContainer registering core: collection1
   [junit4]   2> 1831202 INFO  (coreZkRegister-6083-thread-1) [    ] o.a.s.c.ZkController Register replica - core:collection1 address:http://127.0.0.1:37953 collection:collection1 shard:shard2
   [junit4]   2> 1831202 INFO  (coreZkRegister-6083-thread-1) [    ] o.a.s.c.c.SolrZkClient makePath: /collections/collection1/leader_elect/shard2/election
   [junit4]   2> 1831204 INFO  (coreZkRegister-6083-thread-1) [    ] o.a.s.c.LeaderElector Joined leadership election with path: /collections/collection1/leader_elect/shard2/election/95590159100149769-core_node1-n_0000000000
   [junit4]   2> 1831204 INFO  (coreZkRegister-6083-thread-1) [    ] o.a.s.c.ShardLeaderElectionContext Running the leader process for shard=shard2 and weAreReplacement=false and leaderVoteWait=10000
   [junit4]   2> 1831205 INFO  (coreZkRegister-6083-thread-1) [    ] o.a.s.c.ShardLeaderElectionContext Enough replicas found to continue.
   [junit4]   2> 1831205 INFO  (coreZkRegister-6083-thread-1) [    ] o.a.s.c.ShardLeaderElectionContext I may be the new leader - try and sync
   [junit4]   2> 1831205 INFO  (coreZkRegister-6083-thread-1) [    ] o.a.s.c.SyncStrategy Sync replicas to http://127.0.0.1:37953/collection1/
   [junit4]   2> 1831205 INFO  (coreZkRegister-6083-thread-1) [    ] o.a.s.c.SyncStrategy Sync Success - now sync replicas to me
   [junit4]   2> 1831205 INFO  (coreZkRegister-6083-thread-1) [    ] o.a.s.c.SyncStrategy http://127.0.0.1:37953/collection1/ has no replicas
   [junit4]   2> 1831205 INFO  (OverseerStateUpdate-95590159100149764-127.0.0.1:35762_-n_0000000000) [    ] o.a.s.c.Overseer processMessage: queueSize: 1, message = {
   [junit4]   2>   "operation":"leader",
   [junit4]   2>   "shard":"shard2",
   [junit4]   2>   "collection":"collection1"} current state version: 4
   [junit4]   2> 1831205 INFO  (coreZkRegister-6083-thread-1) [    ] o.a.s.c.c.SolrZkClient makePath: /collections/collection1/leaders/shard2
   [junit4]   2> 1831209 INFO  (coreZkRegister-6083-thread-1) [    ] o.a.s.c.ShardLeaderElectionContextBase Creating leader registration node /collections/collection1/leaders/shard2/leader after winning as /collections/collection1/leader_elect/shard2/election/95590159100149769-core_node1-n_0000000000
   [junit4]   2> 1831211 INFO  (coreZkRegister-6083-thread-1) [    ] o.a.s.c.ShardLeaderElectionContext I am the new leader: http://127.0.0.1:37953/collection1/ shard2
   [junit4]   2> 1831212 INFO  (OverseerStateUpdate-95590159100149764-127.0.0.1:35762_-n_0000000000) [    ] o.a.s.c.Overseer processMessage: queueSize: 1, message = {
   [junit4]   2>   "operation":"leader",
   [junit4]   2>   "shard":"shard2",
   [junit4]   2>   "collection":"collection1",
   [junit4]   2>   "base_url":"http://127.0.0.1:37953",
   [junit4]   2>   "core":"collection1",
   [junit4]   2>   "state":"active"} current state version: 4
   [junit4]   2> 1831313 INFO  (OverseerStateUpdate-95590159100149764-127.0.0.1:35762_-n_0000000000) [    ] o.a.s.c.o.ZkStateWriter going to update_collection /collections/collection1/state.json version: 1
   [junit4]   2> 1831313 INFO  (zkCallback-2285-thread-1) [    ] o.a.s.c.c.ZkStateReader A cluster state change: [WatchedEvent state:SyncConnected type:NodeDataChanged path:/collections/collection1/state.json] for collection [collection1] has occurred - updating... (live nodes size: [2])
   [junit4]   2> 1831314 INFO  (zkCallback-2285-thread-1) [    ] o.a.s.c.c.ZkStateReader Updating data for [collection1] from [1] to [2]
   [junit4]   2> 1831363 INFO  (coreZkRegister-6083-thread-1) [    ] o.a.s.c.ZkController We are http://127.0.0.1:37953/collection1/ and leader is http://127.0.0.1:37953/collection1/
   [junit4]   2> 1831363 INFO  (coreZkRegister-6083-thread-1) [    ] o.a.s.c.ZkController No LogReplay needed for core=collection1 baseURL=http://127.0.0.1:37953
   [junit4]   2> 1831363 INFO  (coreZkRegister-6083-thread-1) [    ] o.a.s.c.ZkController I am the leader, no recovery necessary
   [junit4]   2> 1831363 INFO  (coreZkRegister-6083-thread-1) [    ] o.a.s.c.ZkController publishing state=active
   [junit4]   2> 1831363 INFO  (coreZkRegister-6083-thread-1) [    ] o.a.s.c.ZkController numShards not found on descriptor - reading it fr

[...truncated too long message...]

eaderElector.runIamLeaderProcess(LeaderElector.java:170)
   [junit4]   2> 	at org.apache.solr.cloud.LeaderElector.checkIfIamLeader(LeaderElector.java:135)
   [junit4]   2> 	at org.apache.solr.cloud.LeaderElector.access$200(LeaderElector.java:56)
   [junit4]   2> 	at org.apache.solr.cloud.LeaderElector$ElectionWatcher.process(LeaderElector.java:348)
   [junit4]   2> 	at org.apache.solr.common.cloud.SolrZkClient$3.lambda$process$0(SolrZkClient.java:266)
   [junit4]   2> 	at java.util.concurrent.Executors$RunnableAdapter.call(java.base@9-ea/Executors.java:514)
   [junit4]   2> 	at java.util.concurrent.FutureTask.run(java.base@9-ea/FutureTask.java:266)
   [junit4]   2> 	at org.apache.solr.common.util.ExecutorUtil$MDCAwareThreadPoolExecutor.lambda$execute$0(ExecutorUtil.java:229)
   [junit4]   2> 	at java.util.concurrent.ThreadPoolExecutor.runWorker(java.base@9-ea/ThreadPoolExecutor.java:1158)
   [junit4]   2> 	at java.util.concurrent.ThreadPoolExecutor$Worker.run(java.base@9-ea/ThreadPoolExecutor.java:632)
   [junit4]   2> 	at java.lang.Thread.run(java.base@9-ea/Thread.java:804)
   [junit4]   2> 1850798 INFO  (TEST-TestReqParamsAPI.test-seed#[15741E16B47C1B9E]) [    ] o.e.j.s.ServerConnector Stopped ServerConnector@1037643{HTTP/1.1,[http/1.1]}{127.0.0.1:0}
   [junit4]   2> 1850798 INFO  (TEST-TestReqParamsAPI.test-seed#[15741E16B47C1B9E]) [    ] o.e.j.s.h.ContextHandler Stopped o.e.j.s.ServletContextHandler@22ebbb{/,null,UNAVAILABLE}
   [junit4]   2> 1850799 INFO  (TEST-TestReqParamsAPI.test-seed#[15741E16B47C1B9E]) [    ] o.a.s.c.ZkTestServer connecting to 127.0.0.1:41021 41021
   [junit4]   2> 1850811 INFO  (Thread-4603) [    ] o.a.s.c.ZkTestServer connecting to 127.0.0.1:41021 41021
   [junit4]   2> 1850812 WARN  (Thread-4603) [    ] o.a.s.c.ZkTestServer Watch limit violations: 
   [junit4]   2> Maximum concurrent create/delete watches above limit:
   [junit4]   2> 
   [junit4]   2> 	25	/solr/configs/conf1
   [junit4]   2> 	6	/solr/aliases.json
   [junit4]   2> 	5	/solr/security.json
   [junit4]   2> 
   [junit4]   2> Maximum concurrent data watches above limit:
   [junit4]   2> 
   [junit4]   2> 	6	/solr/clusterstate.json
   [junit4]   2> 	4	/solr/collections/collection1/state.json
   [junit4]   2> 
   [junit4]   2> Maximum concurrent children watches above limit:
   [junit4]   2> 
   [junit4]   2> 	6	/solr/live_nodes
   [junit4]   2> 	6	/solr/collections
   [junit4]   2> 	4	/solr/overseer/queue
   [junit4]   2> 	4	/solr/overseer/collection-queue-work
   [junit4]   2> 
   [junit4]   2> NOTE: reproduce with: ant test  -Dtestcase=TestReqParamsAPI -Dtests.method=test -Dtests.seed=15741E16B47C1B9E -Dtests.multiplier=3 -Dtests.slow=true -Dtests.locale=ksh -Dtests.timezone=Europe/Rome -Dtests.asserts=true -Dtests.file.encoding=ISO-8859-1
   [junit4] FAILURE 23.7s J0 | TestReqParamsAPI.test <<<
   [junit4]    > Throwable #1: java.lang.AssertionError: Could not get expected value  'CY val' for path 'params/c' full output: {
   [junit4]    >   "responseHeader":{
   [junit4]    >     "status":0,
   [junit4]    >     "QTime":0},
   [junit4]    >   "params":{
   [junit4]    >     "a":"A val",
   [junit4]    >     "b":"B val",
   [junit4]    >     "wt":"json",
   [junit4]    >     "useParams":""},
   [junit4]    >   "context":{
   [junit4]    >     "webapp":"",
   [junit4]    >     "path":"/dump1",
   [junit4]    >     "httpMethod":"GET"}}
   [junit4]    > 	at __randomizedtesting.SeedInfo.seed([15741E16B47C1B9E:9D2021CC1A807666]:0)
   [junit4]    > 	at org.apache.solr.core.TestSolrConfigHandler.testForResponseElement(TestSolrConfigHandler.java:458)
   [junit4]    > 	at org.apache.solr.handler.TestReqParamsAPI.testReqParams(TestReqParamsAPI.java:177)
   [junit4]    > 	at org.apache.solr.handler.TestReqParamsAPI.test(TestReqParamsAPI.java:67)
   [junit4]    > 	at org.apache.solr.BaseDistributedSearchTestCase$ShardsRepeatRule$ShardsFixedStatement.callStatement(BaseDistributedSearchTestCase.java:996)
   [junit4]    > 	at org.apache.solr.BaseDistributedSearchTestCase$ShardsRepeatRule$ShardsStatement.evaluate(BaseDistributedSearchTestCase.java:971)
   [junit4]    > 	at java.lang.Thread.run(java.base@9-ea/Thread.java:804)
   [junit4]   2> 1850816 INFO  (SUITE-TestReqParamsAPI-seed#[15741E16B47C1B9E]-worker) [    ] o.a.s.SolrTestCaseJ4 ###deleteCore
   [junit4]   2> NOTE: leaving temporary files on disk at: /home/jenkins/workspace/Lucene-Solr-6.x-Linux/solr/build/solr-core/test/J0/temp/solr.handler.TestReqParamsAPI_15741E16B47C1B9E-001
   [junit4]   2> Mar 21, 2016 7:54:57 PM com.carrotsearch.randomizedtesting.ThreadLeakControl checkThreadLeaks
   [junit4]   2> WARNING: Will linger awaiting termination of 1 leaked thread(s).
   [junit4]   2> NOTE: test params are: codec=Asserting(Lucene60): {}, docValues:{}, maxPointsInLeafNode=755, maxMBSortInHeap=4.5190508012028285, sim=ClassicSimilarity, locale=ksh, timezone=Europe/Rome
   [junit4]   2> NOTE: Linux 4.2.0-34-generic i386/Oracle Corporation 9-ea (32-bit)/cpus=12,threads=1,free=209880608,total=518979584
   [junit4]   2> NOTE: All tests run in this JVM: [DateFieldTest, TestAddFieldRealTimeGet, FileBasedSpellCheckerTest, IndexSchemaTest, SOLR749Test, URLClassifyProcessorTest, PKIAuthenticationIntegrationTest, TestLuceneMatchVersion, DistributedQueueTest, CacheHeaderTest, TestFaceting, TestReloadDeadlock, TestFileDictionaryLookup, TestShortCircuitedRequests, IgnoreCommitOptimizeUpdateProcessorFactoryTest, DocumentAnalysisRequestHandlerTest, ResourceLoaderTest, MergeStrategyTest, CopyFieldTest, AnalyticsMergeStrategyTest, TestRestoreCore, RecoveryAfterSoftCommitTest, CollectionTooManyReplicasTest, TestRealTimeGet, DistributedQueryComponentOptimizationTest, BasicDistributedZkTest, VersionInfoTest, BitVectorTest, TestPseudoReturnFields, TestOmitPositions, TestRawResponseWriter, SegmentsInfoRequestHandlerTest, WrapperMergePolicyFactoryTest, TestStandardQParsers, QueryElevationComponentTest, PreAnalyzedFieldTest, ReturnFieldsTest, PolyFieldTest, PathHierarchyTokenizerFactoryTest, TestOverriddenPrefixQueryForCustomFieldType, DefaultValueUpdateProcessorTest, StandardRequestHandlerTest, CursorPagingTest, TestNamedUpdateProcessors, TestRestManager, SystemInfoHandlerTest, PingRequestHandlerTest, CurrencyFieldOpenExchangeTest, TestShardHandlerFactory, TestCrossCoreJoin, TestRandomFaceting, CdcrVersionReplicationTest, PrimUtilsTest, TestDynamicFieldResource, TestFunctionQuery, HdfsDirectoryFactoryTest, BlockJoinFacetDistribTest, ExternalFileFieldSortTest, TestDocSet, QueryEqualityTest, TestFieldTypeCollectionResource, TestConfig, AnalysisAfterCoreReloadTest, TestLRUCache, TestBinaryField, HdfsRecoverLeaseTest, TestCSVLoader, TestCryptoKeys, TestAnalyzedSuggestions, HdfsBasicDistributedZk2Test, SolrCoreTest, TestBulkSchemaConcurrent, SmileWriterTest, HdfsDirectoryTest, TestComponentsName, TestTestInjection, TestReplicaProperties, CoreMergeIndexesAdminHandlerTest, SharedFSAutoReplicaFailoverUtilsTest, TlogReplayBufferedWhileIndexingTest, TestExclusionRuleCollectionAccess, TestSerializedLuceneMatchVersion, HLLSerializationTest, DeleteReplicaTest, TestMaxScoreQueryParser, TestTrackingShardHandlerFactory, TestCopyFieldCollectionResource, TestChildDocTransformer, DistribCursorPagingTest, SolrXmlInZkTest, RAMDirectoryFactoryTest, SolrRequestParserTest, TestIBSimilarityFactory, TestInitParams, TestClusterStateMutator, ChaosMonkeySafeLeaderTest, SyncSliceTest, OverseerTest, LeaderElectionIntegrationTest, TestReplicationHandler, ZkCLITest, ShardRoutingCustomTest, AutoCommitTest, TestHashPartitioner, TestStressReorder, HardAutoCommitTest, DistributedTermsComponentTest, TestRangeQuery, SimpleFacetsTest, TestSolr4Spatial, SpellCheckComponentTest, PeerSyncTest, TestFiltering, TermVectorComponentTest, TestArbitraryIndexDir, LoggingHandlerTest, UniqFieldsUpdateProcessorFactoryTest, TestPartialUpdateDeduplication, UpdateParamsTest, TestSolrIndexConfig, ResponseLogComponentTest, MinimalSchemaTest, TestSolrCoreProperties, NotRequiredUniqueKeyTest, TestCodecSupport, EchoParamsTest, TestPerFieldSimilarity, TestLMJelinekMercerSimilarityFactory, TestJmxMonitoredMap, TestFastOutputStream, TestFastLRUCache, ClusterStateTest, TestUtils, ZkNodePropsTest, UUIDFieldTest, CircularListTest, DistributedIntervalFacetingTest, AssignTest, AsyncCallRequestStatusResponseTest, AsyncMigrateRouteKeyTest, CollectionsAPISolrJTest, ForceLeaderTest, LeaderInitiatedRecoveryOnCommitTest, OutOfBoxZkACLAndCredentialsProvidersTest, OverriddenZkACLAndCredentialsProvidersTest, OverseerRolesTest, TestAuthenticationFramework, CachingDirectoryFactoryTest, TestConfigSetImmutable, TestConfigSetProperties, TestDynamicLoading, TestReqParamsAPI]
   [junit4] Completed [494/582 (1!)] on J0 in 23.96s, 1 test, 1 failure <<< FAILURES!

[...truncated 281 lines...]
BUILD FAILED
/home/jenkins/workspace/Lucene-Solr-6.x-Linux/build.xml:740: The following error occurred while executing this line:
/home/jenkins/workspace/Lucene-Solr-6.x-Linux/build.xml:684: The following error occurred while executing this line:
/home/jenkins/workspace/Lucene-Solr-6.x-Linux/build.xml:59: The following error occurred while executing this line:
/home/jenkins/workspace/Lucene-Solr-6.x-Linux/solr/build.xml:233: The following error occurred while executing this line:
/home/jenkins/workspace/Lucene-Solr-6.x-Linux/solr/common-build.xml:529: The following error occurred while executing this line:
/home/jenkins/workspace/Lucene-Solr-6.x-Linux/lucene/common-build.xml:1457: The following error occurred while executing this line:
/home/jenkins/workspace/Lucene-Solr-6.x-Linux/lucene/common-build.xml:1014: There were test failures: 582 suites (10 ignored), 2331 tests, 1 failure, 117 ignored (70 assumptions) [seed: 15741E16B47C1B9E]

Total time: 72 minutes 14 seconds
Build step 'Invoke Ant' marked build as failure
Archiving artifacts
[WARNINGS] Skipping publisher since build result is FAILURE
Recording test results
Email was triggered for: Failure - Any
Sending email for trigger: Failure - Any



Mime
View raw message