lucene-dev mailing list archives

Site index · List index
Message view « Date » · « Thread »
Top « Date » · « Thread »
From Policeman Jenkins Server <jenk...@thetaphi.de>
Subject [JENKINS] Lucene-Solr-6.x-Solaris (64bit/jdk1.8.0) - Build # 41 - Still Failing!
Date Tue, 29 Mar 2016 21:22:16 GMT
Build: http://jenkins.thetaphi.de/job/Lucene-Solr-6.x-Solaris/41/
Java: 64bit/jdk1.8.0 -XX:+UseCompressedOops -XX:+UseParallelGC

1 tests failed.
FAILED:  org.apache.solr.handler.TestReqParamsAPI.test

Error Message:
Could not get expected value  'null' for path 'response/params/y/p' full output: {   "responseHeader":{     "status":0,     "QTime":0},   "response":{     "znodeVersion":4,     "params":{       "x":{         "a":"A val",         "b":"B val",         "_appends_":{"add":"first"},         "_invariants_":{"fixed":"f"},         "":{"v":1}},       "y":{         "p":"P val",         "q":"Q val",         "":{"v":2}}}}}

Stack Trace:
java.lang.AssertionError: Could not get expected value  'null' for path 'response/params/y/p' full output: {
  "responseHeader":{
    "status":0,
    "QTime":0},
  "response":{
    "znodeVersion":4,
    "params":{
      "x":{
        "a":"A val",
        "b":"B val",
        "_appends_":{"add":"first"},
        "_invariants_":{"fixed":"f"},
        "":{"v":1}},
      "y":{
        "p":"P val",
        "q":"Q val",
        "":{"v":2}}}}}
	at __randomizedtesting.SeedInfo.seed([E226DD9A39E9295A:6A72E240971544A2]:0)
	at org.junit.Assert.fail(Assert.java:93)
	at org.junit.Assert.assertTrue(Assert.java:43)
	at org.apache.solr.core.TestSolrConfigHandler.testForResponseElement(TestSolrConfigHandler.java:458)
	at org.apache.solr.handler.TestReqParamsAPI.testReqParams(TestReqParamsAPI.java:264)
	at org.apache.solr.handler.TestReqParamsAPI.test(TestReqParamsAPI.java:67)
	at sun.reflect.NativeMethodAccessorImpl.invoke0(Native Method)
	at sun.reflect.NativeMethodAccessorImpl.invoke(NativeMethodAccessorImpl.java:62)
	at sun.reflect.DelegatingMethodAccessorImpl.invoke(DelegatingMethodAccessorImpl.java:43)
	at java.lang.reflect.Method.invoke(Method.java:498)
	at com.carrotsearch.randomizedtesting.RandomizedRunner.invoke(RandomizedRunner.java:1764)
	at com.carrotsearch.randomizedtesting.RandomizedRunner$8.evaluate(RandomizedRunner.java:871)
	at com.carrotsearch.randomizedtesting.RandomizedRunner$9.evaluate(RandomizedRunner.java:907)
	at com.carrotsearch.randomizedtesting.RandomizedRunner$10.evaluate(RandomizedRunner.java:921)
	at org.apache.solr.BaseDistributedSearchTestCase$ShardsRepeatRule$ShardsFixedStatement.callStatement(BaseDistributedSearchTestCase.java:996)
	at org.apache.solr.BaseDistributedSearchTestCase$ShardsRepeatRule$ShardsStatement.evaluate(BaseDistributedSearchTestCase.java:971)
	at com.carrotsearch.randomizedtesting.rules.SystemPropertiesRestoreRule$1.evaluate(SystemPropertiesRestoreRule.java:57)
	at org.apache.lucene.util.TestRuleSetupTeardownChained$1.evaluate(TestRuleSetupTeardownChained.java:49)
	at org.apache.lucene.util.AbstractBeforeAfterRule$1.evaluate(AbstractBeforeAfterRule.java:45)
	at org.apache.lucene.util.TestRuleThreadAndTestName$1.evaluate(TestRuleThreadAndTestName.java:48)
	at org.apache.lucene.util.TestRuleIgnoreAfterMaxFailures$1.evaluate(TestRuleIgnoreAfterMaxFailures.java:64)
	at org.apache.lucene.util.TestRuleMarkFailure$1.evaluate(TestRuleMarkFailure.java:47)
	at com.carrotsearch.randomizedtesting.rules.StatementAdapter.evaluate(StatementAdapter.java:36)
	at com.carrotsearch.randomizedtesting.ThreadLeakControl$StatementRunner.run(ThreadLeakControl.java:367)
	at com.carrotsearch.randomizedtesting.ThreadLeakControl.forkTimeoutingTask(ThreadLeakControl.java:809)
	at com.carrotsearch.randomizedtesting.ThreadLeakControl$3.evaluate(ThreadLeakControl.java:460)
	at com.carrotsearch.randomizedtesting.RandomizedRunner.runSingleTest(RandomizedRunner.java:880)
	at com.carrotsearch.randomizedtesting.RandomizedRunner$5.evaluate(RandomizedRunner.java:781)
	at com.carrotsearch.randomizedtesting.RandomizedRunner$6.evaluate(RandomizedRunner.java:816)
	at com.carrotsearch.randomizedtesting.RandomizedRunner$7.evaluate(RandomizedRunner.java:827)
	at com.carrotsearch.randomizedtesting.rules.StatementAdapter.evaluate(StatementAdapter.java:36)
	at com.carrotsearch.randomizedtesting.rules.SystemPropertiesRestoreRule$1.evaluate(SystemPropertiesRestoreRule.java:57)
	at org.apache.lucene.util.AbstractBeforeAfterRule$1.evaluate(AbstractBeforeAfterRule.java:45)
	at com.carrotsearch.randomizedtesting.rules.StatementAdapter.evaluate(StatementAdapter.java:36)
	at org.apache.lucene.util.TestRuleStoreClassName$1.evaluate(TestRuleStoreClassName.java:41)
	at com.carrotsearch.randomizedtesting.rules.NoShadowingOrOverridesOnMethodsRule$1.evaluate(NoShadowingOrOverridesOnMethodsRule.java:40)
	at com.carrotsearch.randomizedtesting.rules.NoShadowingOrOverridesOnMethodsRule$1.evaluate(NoShadowingOrOverridesOnMethodsRule.java:40)
	at com.carrotsearch.randomizedtesting.rules.StatementAdapter.evaluate(StatementAdapter.java:36)
	at com.carrotsearch.randomizedtesting.rules.StatementAdapter.evaluate(StatementAdapter.java:36)
	at com.carrotsearch.randomizedtesting.rules.StatementAdapter.evaluate(StatementAdapter.java:36)
	at org.apache.lucene.util.TestRuleAssertionsRequired$1.evaluate(TestRuleAssertionsRequired.java:53)
	at org.apache.lucene.util.TestRuleMarkFailure$1.evaluate(TestRuleMarkFailure.java:47)
	at org.apache.lucene.util.TestRuleIgnoreAfterMaxFailures$1.evaluate(TestRuleIgnoreAfterMaxFailures.java:64)
	at org.apache.lucene.util.TestRuleIgnoreTestSuites$1.evaluate(TestRuleIgnoreTestSuites.java:54)
	at com.carrotsearch.randomizedtesting.rules.StatementAdapter.evaluate(StatementAdapter.java:36)
	at com.carrotsearch.randomizedtesting.ThreadLeakControl$StatementRunner.run(ThreadLeakControl.java:367)
	at java.lang.Thread.run(Thread.java:745)




Build Log:
[...truncated 12132 lines...]
   [junit4] Suite: org.apache.solr.handler.TestReqParamsAPI
   [junit4]   2> Creating dataDir: /export/home/jenkins/workspace/Lucene-Solr-6.x-Solaris/solr/build/solr-core/test/J0/temp/solr.handler.TestReqParamsAPI_E226DD9A39E9295A-001/init-core-data-001
   [junit4]   2> 2969927 INFO  (SUITE-TestReqParamsAPI-seed#[E226DD9A39E9295A]-worker) [    ] o.a.s.SolrTestCaseJ4 Randomized ssl (false) and clientAuth (false)
   [junit4]   2> 2969927 INFO  (SUITE-TestReqParamsAPI-seed#[E226DD9A39E9295A]-worker) [    ] o.a.s.BaseDistributedSearchTestCase Setting hostContext system property: /bk_ioe/p
   [junit4]   2> 2969931 INFO  (TEST-TestReqParamsAPI.test-seed#[E226DD9A39E9295A]) [    ] o.a.s.c.ZkTestServer STARTING ZK TEST SERVER
   [junit4]   2> 2969931 INFO  (Thread-7386) [    ] o.a.s.c.ZkTestServer client port:0.0.0.0/0.0.0.0:0
   [junit4]   2> 2969931 INFO  (Thread-7386) [    ] o.a.s.c.ZkTestServer Starting server
   [junit4]   2> 2970031 INFO  (TEST-TestReqParamsAPI.test-seed#[E226DD9A39E9295A]) [    ] o.a.s.c.ZkTestServer start zk server on port:44470
   [junit4]   2> 2970031 INFO  (TEST-TestReqParamsAPI.test-seed#[E226DD9A39E9295A]) [    ] o.a.s.c.c.SolrZkClient Using default ZkCredentialsProvider
   [junit4]   2> 2970032 INFO  (TEST-TestReqParamsAPI.test-seed#[E226DD9A39E9295A]) [    ] o.a.s.c.c.ConnectionManager Waiting for client to connect to ZooKeeper
   [junit4]   2> 2970034 INFO  (zkCallback-3007-thread-1) [    ] o.a.s.c.c.ConnectionManager Watcher org.apache.solr.common.cloud.ConnectionManager@49b9b9b7 name:ZooKeeperConnection Watcher:127.0.0.1:44470 got event WatchedEvent state:SyncConnected type:None path:null path:null type:None
   [junit4]   2> 2970034 INFO  (TEST-TestReqParamsAPI.test-seed#[E226DD9A39E9295A]) [    ] o.a.s.c.c.ConnectionManager Client is connected to ZooKeeper
   [junit4]   2> 2970035 INFO  (TEST-TestReqParamsAPI.test-seed#[E226DD9A39E9295A]) [    ] o.a.s.c.c.SolrZkClient Using default ZkACLProvider
   [junit4]   2> 2970035 INFO  (TEST-TestReqParamsAPI.test-seed#[E226DD9A39E9295A]) [    ] o.a.s.c.c.SolrZkClient makePath: /solr
   [junit4]   2> 2970039 INFO  (TEST-TestReqParamsAPI.test-seed#[E226DD9A39E9295A]) [    ] o.a.s.c.c.SolrZkClient Using default ZkCredentialsProvider
   [junit4]   2> 2970039 INFO  (TEST-TestReqParamsAPI.test-seed#[E226DD9A39E9295A]) [    ] o.a.s.c.c.ConnectionManager Waiting for client to connect to ZooKeeper
   [junit4]   2> 2970041 INFO  (zkCallback-3008-thread-1) [    ] o.a.s.c.c.ConnectionManager Watcher org.apache.solr.common.cloud.ConnectionManager@27e78501 name:ZooKeeperConnection Watcher:127.0.0.1:44470/solr got event WatchedEvent state:SyncConnected type:None path:null path:null type:None
   [junit4]   2> 2970041 INFO  (TEST-TestReqParamsAPI.test-seed#[E226DD9A39E9295A]) [    ] o.a.s.c.c.ConnectionManager Client is connected to ZooKeeper
   [junit4]   2> 2970041 INFO  (TEST-TestReqParamsAPI.test-seed#[E226DD9A39E9295A]) [    ] o.a.s.c.c.SolrZkClient Using default ZkACLProvider
   [junit4]   2> 2970041 INFO  (TEST-TestReqParamsAPI.test-seed#[E226DD9A39E9295A]) [    ] o.a.s.c.c.SolrZkClient makePath: /collections/collection1
   [junit4]   2> 2970044 INFO  (TEST-TestReqParamsAPI.test-seed#[E226DD9A39E9295A]) [    ] o.a.s.c.c.SolrZkClient makePath: /collections/collection1/shards
   [junit4]   2> 2970046 INFO  (TEST-TestReqParamsAPI.test-seed#[E226DD9A39E9295A]) [    ] o.a.s.c.c.SolrZkClient makePath: /collections/control_collection
   [junit4]   2> 2970049 INFO  (TEST-TestReqParamsAPI.test-seed#[E226DD9A39E9295A]) [    ] o.a.s.c.c.SolrZkClient makePath: /collections/control_collection/shards
   [junit4]   2> 2970051 INFO  (TEST-TestReqParamsAPI.test-seed#[E226DD9A39E9295A]) [    ] o.a.s.c.AbstractZkTestCase put /export/home/jenkins/workspace/Lucene-Solr-6.x-Solaris/solr/core/src/test-files/solr/collection1/conf/solrconfig-tlog.xml to /configs/conf1/solrconfig.xml
   [junit4]   2> 2970051 INFO  (TEST-TestReqParamsAPI.test-seed#[E226DD9A39E9295A]) [    ] o.a.s.c.c.SolrZkClient makePath: /configs/conf1/solrconfig.xml
   [junit4]   2> 2970056 INFO  (TEST-TestReqParamsAPI.test-seed#[E226DD9A39E9295A]) [    ] o.a.s.c.AbstractZkTestCase put /export/home/jenkins/workspace/Lucene-Solr-6.x-Solaris/solr/core/src/test-files/solr/collection1/conf/schema.xml to /configs/conf1/schema.xml
   [junit4]   2> 2970056 INFO  (TEST-TestReqParamsAPI.test-seed#[E226DD9A39E9295A]) [    ] o.a.s.c.c.SolrZkClient makePath: /configs/conf1/schema.xml
   [junit4]   2> 2970059 INFO  (TEST-TestReqParamsAPI.test-seed#[E226DD9A39E9295A]) [    ] o.a.s.c.AbstractZkTestCase put /export/home/jenkins/workspace/Lucene-Solr-6.x-Solaris/solr/core/src/test-files/solr/collection1/conf/solrconfig.snippet.randomindexconfig.xml to /configs/conf1/solrconfig.snippet.randomindexconfig.xml
   [junit4]   2> 2970059 INFO  (TEST-TestReqParamsAPI.test-seed#[E226DD9A39E9295A]) [    ] o.a.s.c.c.SolrZkClient makePath: /configs/conf1/solrconfig.snippet.randomindexconfig.xml
   [junit4]   2> 2970061 INFO  (TEST-TestReqParamsAPI.test-seed#[E226DD9A39E9295A]) [    ] o.a.s.c.AbstractZkTestCase put /export/home/jenkins/workspace/Lucene-Solr-6.x-Solaris/solr/core/src/test-files/solr/collection1/conf/stopwords.txt to /configs/conf1/stopwords.txt
   [junit4]   2> 2970062 INFO  (TEST-TestReqParamsAPI.test-seed#[E226DD9A39E9295A]) [    ] o.a.s.c.c.SolrZkClient makePath: /configs/conf1/stopwords.txt
   [junit4]   2> 2970064 INFO  (TEST-TestReqParamsAPI.test-seed#[E226DD9A39E9295A]) [    ] o.a.s.c.AbstractZkTestCase put /export/home/jenkins/workspace/Lucene-Solr-6.x-Solaris/solr/core/src/test-files/solr/collection1/conf/protwords.txt to /configs/conf1/protwords.txt
   [junit4]   2> 2970064 INFO  (TEST-TestReqParamsAPI.test-seed#[E226DD9A39E9295A]) [    ] o.a.s.c.c.SolrZkClient makePath: /configs/conf1/protwords.txt
   [junit4]   2> 2970067 INFO  (TEST-TestReqParamsAPI.test-seed#[E226DD9A39E9295A]) [    ] o.a.s.c.AbstractZkTestCase put /export/home/jenkins/workspace/Lucene-Solr-6.x-Solaris/solr/core/src/test-files/solr/collection1/conf/currency.xml to /configs/conf1/currency.xml
   [junit4]   2> 2970067 INFO  (TEST-TestReqParamsAPI.test-seed#[E226DD9A39E9295A]) [    ] o.a.s.c.c.SolrZkClient makePath: /configs/conf1/currency.xml
   [junit4]   2> 2970070 INFO  (TEST-TestReqParamsAPI.test-seed#[E226DD9A39E9295A]) [    ] o.a.s.c.AbstractZkTestCase put /export/home/jenkins/workspace/Lucene-Solr-6.x-Solaris/solr/core/src/test-files/solr/collection1/conf/enumsConfig.xml to /configs/conf1/enumsConfig.xml
   [junit4]   2> 2970070 INFO  (TEST-TestReqParamsAPI.test-seed#[E226DD9A39E9295A]) [    ] o.a.s.c.c.SolrZkClient makePath: /configs/conf1/enumsConfig.xml
   [junit4]   2> 2970072 INFO  (TEST-TestReqParamsAPI.test-seed#[E226DD9A39E9295A]) [    ] o.a.s.c.AbstractZkTestCase put /export/home/jenkins/workspace/Lucene-Solr-6.x-Solaris/solr/core/src/test-files/solr/collection1/conf/open-exchange-rates.json to /configs/conf1/open-exchange-rates.json
   [junit4]   2> 2970072 INFO  (TEST-TestReqParamsAPI.test-seed#[E226DD9A39E9295A]) [    ] o.a.s.c.c.SolrZkClient makePath: /configs/conf1/open-exchange-rates.json
   [junit4]   2> 2970074 INFO  (TEST-TestReqParamsAPI.test-seed#[E226DD9A39E9295A]) [    ] o.a.s.c.AbstractZkTestCase put /export/home/jenkins/workspace/Lucene-Solr-6.x-Solaris/solr/core/src/test-files/solr/collection1/conf/mapping-ISOLatin1Accent.txt to /configs/conf1/mapping-ISOLatin1Accent.txt
   [junit4]   2> 2970074 INFO  (TEST-TestReqParamsAPI.test-seed#[E226DD9A39E9295A]) [    ] o.a.s.c.c.SolrZkClient makePath: /configs/conf1/mapping-ISOLatin1Accent.txt
   [junit4]   2> 2970077 INFO  (TEST-TestReqParamsAPI.test-seed#[E226DD9A39E9295A]) [    ] o.a.s.c.AbstractZkTestCase put /export/home/jenkins/workspace/Lucene-Solr-6.x-Solaris/solr/core/src/test-files/solr/collection1/conf/old_synonyms.txt to /configs/conf1/old_synonyms.txt
   [junit4]   2> 2970077 INFO  (TEST-TestReqParamsAPI.test-seed#[E226DD9A39E9295A]) [    ] o.a.s.c.c.SolrZkClient makePath: /configs/conf1/old_synonyms.txt
   [junit4]   2> 2970079 INFO  (TEST-TestReqParamsAPI.test-seed#[E226DD9A39E9295A]) [    ] o.a.s.c.AbstractZkTestCase put /export/home/jenkins/workspace/Lucene-Solr-6.x-Solaris/solr/core/src/test-files/solr/collection1/conf/synonyms.txt to /configs/conf1/synonyms.txt
   [junit4]   2> 2970079 INFO  (TEST-TestReqParamsAPI.test-seed#[E226DD9A39E9295A]) [    ] o.a.s.c.c.SolrZkClient makePath: /configs/conf1/synonyms.txt
   [junit4]   2> 2970675 INFO  (TEST-TestReqParamsAPI.test-seed#[E226DD9A39E9295A]) [    ] o.a.s.SolrTestCaseJ4 Writing core.properties file to /export/home/jenkins/workspace/Lucene-Solr-6.x-Solaris/solr/build/solr-core/test/J0/temp/solr.handler.TestReqParamsAPI_E226DD9A39E9295A-001/control-001/cores/collection1
   [junit4]   2> 2970676 INFO  (TEST-TestReqParamsAPI.test-seed#[E226DD9A39E9295A]) [    ] o.e.j.s.Server jetty-9.3.8.v20160314
   [junit4]   2> 2970678 INFO  (TEST-TestReqParamsAPI.test-seed#[E226DD9A39E9295A]) [    ] o.e.j.s.h.ContextHandler Started o.e.j.s.ServletContextHandler@4b6c0017{/bk_ioe/p,null,AVAILABLE}
   [junit4]   2> 2970679 INFO  (TEST-TestReqParamsAPI.test-seed#[E226DD9A39E9295A]) [    ] o.e.j.s.ServerConnector Started ServerConnector@db1e6fe{HTTP/1.1,[http/1.1]}{127.0.0.1:33611}
   [junit4]   2> 2970680 INFO  (TEST-TestReqParamsAPI.test-seed#[E226DD9A39E9295A]) [    ] o.e.j.s.Server Started @2975201ms
   [junit4]   2> 2970680 INFO  (TEST-TestReqParamsAPI.test-seed#[E226DD9A39E9295A]) [    ] o.a.s.c.s.e.JettySolrRunner Jetty properties: {solr.data.dir=/export/home/jenkins/workspace/Lucene-Solr-6.x-Solaris/solr/build/solr-core/test/J0/temp/solr.handler.TestReqParamsAPI_E226DD9A39E9295A-001/tempDir-001/control/data, hostContext=/bk_ioe/p, hostPort=33611, coreRootDirectory=/export/home/jenkins/workspace/Lucene-Solr-6.x-Solaris/solr/build/solr-core/test/J0/temp/solr.handler.TestReqParamsAPI_E226DD9A39E9295A-001/control-001/cores}
   [junit4]   2> 2970680 INFO  (TEST-TestReqParamsAPI.test-seed#[E226DD9A39E9295A]) [    ] o.a.s.s.SolrDispatchFilter SolrDispatchFilter.init(): sun.misc.Launcher$AppClassLoader@6d06d69c
   [junit4]   2> 2970680 INFO  (TEST-TestReqParamsAPI.test-seed#[E226DD9A39E9295A]) [    ] o.a.s.c.SolrResourceLoader new SolrResourceLoader for directory: '/export/home/jenkins/workspace/Lucene-Solr-6.x-Solaris/solr/build/solr-core/test/J0/temp/solr.handler.TestReqParamsAPI_E226DD9A39E9295A-001/control-001'
   [junit4]   2> 2970680 INFO  (TEST-TestReqParamsAPI.test-seed#[E226DD9A39E9295A]) [    ] o.a.s.c.SolrResourceLoader JNDI not configured for solr (NoInitialContextEx)
   [junit4]   2> 2970680 INFO  (TEST-TestReqParamsAPI.test-seed#[E226DD9A39E9295A]) [    ] o.a.s.c.SolrResourceLoader solr home defaulted to 'solr/' (could not find system property or JNDI)
   [junit4]   2> 2970680 INFO  (TEST-TestReqParamsAPI.test-seed#[E226DD9A39E9295A]) [    ] o.a.s.c.c.SolrZkClient Using default ZkCredentialsProvider
   [junit4]   2> 2970681 INFO  (TEST-TestReqParamsAPI.test-seed#[E226DD9A39E9295A]) [    ] o.a.s.c.c.ConnectionManager Waiting for client to connect to ZooKeeper
   [junit4]   2> 2970683 INFO  (zkCallback-3009-thread-1) [    ] o.a.s.c.c.ConnectionManager Watcher org.apache.solr.common.cloud.ConnectionManager@54c54200 name:ZooKeeperConnection Watcher:127.0.0.1:44470/solr got event WatchedEvent state:SyncConnected type:None path:null path:null type:None
   [junit4]   2> 2970683 INFO  (TEST-TestReqParamsAPI.test-seed#[E226DD9A39E9295A]) [    ] o.a.s.c.c.ConnectionManager Client is connected to ZooKeeper
   [junit4]   2> 2970683 INFO  (TEST-TestReqParamsAPI.test-seed#[E226DD9A39E9295A]) [    ] o.a.s.c.c.SolrZkClient Using default ZkACLProvider
   [junit4]   2> 2970685 INFO  (TEST-TestReqParamsAPI.test-seed#[E226DD9A39E9295A]) [    ] o.a.s.s.SolrDispatchFilter Loading solr.xml from SolrHome (not found in ZooKeeper)
   [junit4]   2> 2970685 INFO  (TEST-TestReqParamsAPI.test-seed#[E226DD9A39E9295A]) [    ] o.a.s.c.SolrXmlConfig Loading container configuration from /export/home/jenkins/workspace/Lucene-Solr-6.x-Solaris/solr/build/solr-core/test/J0/temp/solr.handler.TestReqParamsAPI_E226DD9A39E9295A-001/control-001/solr.xml
   [junit4]   2> 2970688 INFO  (TEST-TestReqParamsAPI.test-seed#[E226DD9A39E9295A]) [    ] o.a.s.c.CorePropertiesLocator Config-defined core root directory: /export/home/jenkins/workspace/Lucene-Solr-6.x-Solaris/solr/build/solr-core/test/J0/temp/solr.handler.TestReqParamsAPI_E226DD9A39E9295A-001/control-001/cores
   [junit4]   2> 2970688 INFO  (TEST-TestReqParamsAPI.test-seed#[E226DD9A39E9295A]) [    ] o.a.s.c.CoreContainer New CoreContainer 1846589519
   [junit4]   2> 2970688 INFO  (TEST-TestReqParamsAPI.test-seed#[E226DD9A39E9295A]) [    ] o.a.s.c.CoreContainer Loading cores into CoreContainer [instanceDir=/export/home/jenkins/workspace/Lucene-Solr-6.x-Solaris/solr/build/solr-core/test/J0/temp/solr.handler.TestReqParamsAPI_E226DD9A39E9295A-001/control-001]
   [junit4]   2> 2970689 WARN  (TEST-TestReqParamsAPI.test-seed#[E226DD9A39E9295A]) [    ] o.a.s.c.CoreContainer Couldn't add files from /export/home/jenkins/workspace/Lucene-Solr-6.x-Solaris/solr/build/solr-core/test/J0/temp/solr.handler.TestReqParamsAPI_E226DD9A39E9295A-001/control-001/lib to classpath: /export/home/jenkins/workspace/Lucene-Solr-6.x-Solaris/solr/build/solr-core/test/J0/temp/solr.handler.TestReqParamsAPI_E226DD9A39E9295A-001/control-001/lib
   [junit4]   2> 2970689 INFO  (TEST-TestReqParamsAPI.test-seed#[E226DD9A39E9295A]) [    ] o.a.s.h.c.HttpShardHandlerFactory created with socketTimeout : 90000,urlScheme : ,connTimeout : 15000,maxConnectionsPerHost : 20,maxConnections : 10000,corePoolSize : 0,maximumPoolSize : 2147483647,maxThreadIdleTime : 5,sizeOfQueue : -1,fairnessPolicy : false,useRetries : false,
   [junit4]   2> 2970690 INFO  (TEST-TestReqParamsAPI.test-seed#[E226DD9A39E9295A]) [    ] o.a.s.u.UpdateShardHandler Creating UpdateShardHandler HTTP client with params: socketTimeout=340000&connTimeout=45000&retry=true
   [junit4]   2> 2970690 INFO  (TEST-TestReqParamsAPI.test-seed#[E226DD9A39E9295A]) [    ] o.a.s.l.LogWatcher SLF4J impl is org.slf4j.impl.Log4jLoggerFactory
   [junit4]   2> 2970690 INFO  (TEST-TestReqParamsAPI.test-seed#[E226DD9A39E9295A]) [    ] o.a.s.l.LogWatcher Registering Log Listener [Log4j (org.slf4j.impl.Log4jLoggerFactory)]
   [junit4]   2> 2970690 INFO  (TEST-TestReqParamsAPI.test-seed#[E226DD9A39E9295A]) [    ] o.a.s.c.ZkContainer Zookeeper client=127.0.0.1:44470/solr
   [junit4]   2> 2970690 INFO  (TEST-TestReqParamsAPI.test-seed#[E226DD9A39E9295A]) [    ] o.a.s.c.ZkController zkHost includes chroot
   [junit4]   2> 2970691 INFO  (TEST-TestReqParamsAPI.test-seed#[E226DD9A39E9295A]) [    ] o.a.s.c.c.SolrZkClient Using default ZkCredentialsProvider
   [junit4]   2> 2970691 INFO  (TEST-TestReqParamsAPI.test-seed#[E226DD9A39E9295A]) [    ] o.a.s.c.c.ConnectionManager Waiting for client to connect to ZooKeeper
   [junit4]   2> 2970692 INFO  (zkCallback-3012-thread-1) [    ] o.a.s.c.c.ConnectionManager Watcher org.apache.solr.common.cloud.ConnectionManager@3adb889c name:ZooKeeperConnection Watcher:127.0.0.1:44470 got event WatchedEvent state:SyncConnected type:None path:null path:null type:None
   [junit4]   2> 2970693 INFO  (TEST-TestReqParamsAPI.test-seed#[E226DD9A39E9295A]) [    ] o.a.s.c.c.ConnectionManager Client is connected to ZooKeeper
   [junit4]   2> 2970693 INFO  (TEST-TestReqParamsAPI.test-seed#[E226DD9A39E9295A]) [    ] o.a.s.c.c.SolrZkClient Using default ZkACLProvider
   [junit4]   2> 2970695 INFO  (TEST-TestReqParamsAPI.test-seed#[E226DD9A39E9295A]) [n:127.0.0.1:33611_bk_ioe%2Fp    ] o.a.s.c.c.ConnectionManager Waiting for client to connect to ZooKeeper
   [junit4]   2> 2970696 INFO  (zkCallback-3013-thread-1-processing-n:127.0.0.1:33611_bk_ioe%2Fp) [n:127.0.0.1:33611_bk_ioe%2Fp    ] o.a.s.c.c.ConnectionManager Watcher org.apache.solr.common.cloud.ConnectionManager@756dca63 name:ZooKeeperConnection Watcher:127.0.0.1:44470/solr got event WatchedEvent state:SyncConnected type:None path:null path:null type:None
   [junit4]   2> 2970696 INFO  (TEST-TestReqParamsAPI.test-seed#[E226DD9A39E9295A]) [n:127.0.0.1:33611_bk_ioe%2Fp    ] o.a.s.c.c.ConnectionManager Client is connected to ZooKeeper
   [junit4]   2> 2970698 INFO  (TEST-TestReqParamsAPI.test-seed#[E226DD9A39E9295A]) [n:127.0.0.1:33611_bk_ioe%2Fp    ] o.a.s.c.c.SolrZkClient makePath: /overseer/queue
   [junit4]   2> 2970701 INFO  (TEST-TestReqParamsAPI.test-seed#[E226DD9A39E9295A]) [n:127.0.0.1:33611_bk_ioe%2Fp    ] o.a.s.c.c.SolrZkClient makePath: /overseer/collection-queue-work
   [junit4]   2> 2970705 INFO  (TEST-TestReqParamsAPI.test-seed#[E226DD9A39E9295A]) [n:127.0.0.1:33611_bk_ioe%2Fp    ] o.a.s.c.c.SolrZkClient makePath: /overseer/collection-map-running
   [junit4]   2> 2970708 INFO  (TEST-TestReqParamsAPI.test-seed#[E226DD9A39E9295A]) [n:127.0.0.1:33611_bk_ioe%2Fp    ] o.a.s.c.c.SolrZkClient makePath: /overseer/collection-map-completed
   [junit4]   2> 2970711 INFO  (TEST-TestReqParamsAPI.test-seed#[E226DD9A39E9295A]) [n:127.0.0.1:33611_bk_ioe%2Fp    ] o.a.s.c.c.SolrZkClient makePath: /overseer/collection-map-failure
   [junit4]   2> 2970714 INFO  (TEST-TestReqParamsAPI.test-seed#[E226DD9A39E9295A]) [n:127.0.0.1:33611_bk_ioe%2Fp    ] o.a.s.c.c.SolrZkClient makePath: /live_nodes
   [junit4]   2> 2970716 INFO  (TEST-TestReqParamsAPI.test-seed#[E226DD9A39E9295A]) [n:127.0.0.1:33611_bk_ioe%2Fp    ] o.a.s.c.c.SolrZkClient makePath: /aliases.json
   [junit4]   2> 2970718 INFO  (TEST-TestReqParamsAPI.test-seed#[E226DD9A39E9295A]) [n:127.0.0.1:33611_bk_ioe%2Fp    ] o.a.s.c.c.SolrZkClient makePath: /clusterstate.json
   [junit4]   2> 2970720 INFO  (TEST-TestReqParamsAPI.test-seed#[E226DD9A39E9295A]) [n:127.0.0.1:33611_bk_ioe%2Fp    ] o.a.s.c.c.SolrZkClient makePath: /security.json
   [junit4]   2> 2970721 INFO  (TEST-TestReqParamsAPI.test-seed#[E226DD9A39E9295A]) [n:127.0.0.1:33611_bk_ioe%2Fp    ] o.a.s.c.c.ZkStateReader Updating cluster state from ZooKeeper... 
   [junit4]   2> 2970723 INFO  (TEST-TestReqParamsAPI.test-seed#[E226DD9A39E9295A]) [n:127.0.0.1:33611_bk_ioe%2Fp    ] o.a.s.c.c.ZkStateReader Updated live nodes from ZooKeeper... (0) -> (0)
   [junit4]   2> 2970726 INFO  (TEST-TestReqParamsAPI.test-seed#[E226DD9A39E9295A]) [n:127.0.0.1:33611_bk_ioe%2Fp    ] o.a.s.c.c.SolrZkClient makePath: /overseer_elect
   [junit4]   2> 2970728 INFO  (TEST-TestReqParamsAPI.test-seed#[E226DD9A39E9295A]) [n:127.0.0.1:33611_bk_ioe%2Fp    ] o.a.s.c.c.SolrZkClient makePath: /overseer_elect/election
   [junit4]   2> 2970730 INFO  (TEST-TestReqParamsAPI.test-seed#[E226DD9A39E9295A]) [n:127.0.0.1:33611_bk_ioe%2Fp    ] o.a.s.c.Overseer Overseer (id=null) closing
   [junit4]   2> 2970731 INFO  (TEST-TestReqParamsAPI.test-seed#[E226DD9A39E9295A]) [n:127.0.0.1:33611_bk_ioe%2Fp    ] o.a.s.c.LeaderElector Joined leadership election with path: /overseer_elect/election/95635776446201860-127.0.0.1:33611_bk_ioe%2Fp-n_0000000000
   [junit4]   2> 2970731 INFO  (TEST-TestReqParamsAPI.test-seed#[E226DD9A39E9295A]) [n:127.0.0.1:33611_bk_ioe%2Fp    ] o.a.s.c.OverseerElectionContext I am going to be the leader 127.0.0.1:33611_bk_ioe%2Fp
   [junit4]   2> 2970731 INFO  (TEST-TestReqParamsAPI.test-seed#[E226DD9A39E9295A]) [n:127.0.0.1:33611_bk_ioe%2Fp    ] o.a.s.c.c.SolrZkClient makePath: /overseer_elect/leader
   [junit4]   2> 2970734 INFO  (TEST-TestReqParamsAPI.test-seed#[E226DD9A39E9295A]) [n:127.0.0.1:33611_bk_ioe%2Fp    ] o.a.s.c.Overseer Overseer (id=95635776446201860-127.0.0.1:33611_bk_ioe%2Fp-n_0000000000) starting
   [junit4]   2> 2970738 INFO  (TEST-TestReqParamsAPI.test-seed#[E226DD9A39E9295A]) [n:127.0.0.1:33611_bk_ioe%2Fp    ] o.a.s.c.c.SolrZkClient makePath: /overseer/queue-work
   [junit4]   2> 2970749 INFO  (TEST-TestReqParamsAPI.test-seed#[E226DD9A39E9295A]) [n:127.0.0.1:33611_bk_ioe%2Fp    ] o.a.s.c.OverseerAutoReplicaFailoverThread Starting OverseerAutoReplicaFailoverThread autoReplicaFailoverWorkLoopDelay=10000 autoReplicaFailoverWaitAfterExpiration=30000 autoReplicaFailoverBadNodeExpiration=60000
   [junit4]   2> 2970750 INFO  (OverseerCollectionConfigSetProcessor-95635776446201860-127.0.0.1:33611_bk_ioe%2Fp-n_0000000000) [n:127.0.0.1:33611_bk_ioe%2Fp    ] o.a.s.c.OverseerTaskProcessor Process current queue of overseer operations
   [junit4]   2> 2970751 INFO  (TEST-TestReqParamsAPI.test-seed#[E226DD9A39E9295A]) [n:127.0.0.1:33611_bk_ioe%2Fp    ] o.a.s.c.ZkController Register node as live in ZooKeeper:/live_nodes/127.0.0.1:33611_bk_ioe%2Fp
   [junit4]   2> 2970751 INFO  (OverseerStateUpdate-95635776446201860-127.0.0.1:33611_bk_ioe%2Fp-n_0000000000) [n:127.0.0.1:33611_bk_ioe%2Fp    ] o.a.s.c.Overseer Starting to work on the main queue
   [junit4]   2> 2970752 INFO  (TEST-TestReqParamsAPI.test-seed#[E226DD9A39E9295A]) [n:127.0.0.1:33611_bk_ioe%2Fp    ] o.a.s.c.c.SolrZkClient makePath: /live_nodes/127.0.0.1:33611_bk_ioe%2Fp
   [junit4]   2> 2970754 INFO  (zkCallback-3013-thread-1-processing-n:127.0.0.1:33611_bk_ioe%2Fp) [n:127.0.0.1:33611_bk_ioe%2Fp    ] o.a.s.c.c.ZkStateReader A live node change: [WatchedEvent state:SyncConnected type:NodeChildrenChanged path:/live_nodes], has occurred - updating... (live nodes size: [0])
   [junit4]   2> 2970755 INFO  (OverseerStateUpdate-95635776446201860-127.0.0.1:33611_bk_ioe%2Fp-n_0000000000) [n:127.0.0.1:33611_bk_ioe%2Fp    ] o.a.s.c.c.ZkStateReader Updated live nodes from ZooKeeper... (0) -> (1)
   [junit4]   2> 2970755 INFO  (zkCallback-3013-thread-1-processing-n:127.0.0.1:33611_bk_ioe%2Fp) [n:127.0.0.1:33611_bk_ioe%2Fp    ] o.a.s.c.c.ZkStateReader Updated live nodes from ZooKeeper... (1) -> (1)
   [junit4]   2> 2970781 INFO  (TEST-TestReqParamsAPI.test-seed#[E226DD9A39E9295A]) [n:127.0.0.1:33611_bk_ioe%2Fp    ] o.a.s.c.CoreContainer Security conf doesn't exist. Skipping setup for authorization module.
   [junit4]   2> 2970781 INFO  (TEST-TestReqParamsAPI.test-seed#[E226DD9A39E9295A]) [n:127.0.0.1:33611_bk_ioe%2Fp    ] o.a.s.c.CoreContainer No authentication plugin used.
   [junit4]   2> 2970782 INFO  (TEST-TestReqParamsAPI.test-seed#[E226DD9A39E9295A]) [n:127.0.0.1:33611_bk_ioe%2Fp    ] o.a.s.c.CorePropertiesLocator Looking for core definitions underneath /export/home/jenkins/workspace/Lucene-Solr-6.x-Solaris/solr/build/solr-core/test/J0/temp/solr.handler.TestReqParamsAPI_E226DD9A39E9295A-001/control-001/cores
   [junit4]   2> 2970786 INFO  (TEST-TestReqParamsAPI.test-seed#[E226DD9A39E9295A]) [n:127.0.0.1:33611_bk_ioe%2Fp    ] o.a.s.c.CoreDescriptor Created CoreDescriptor: {name=collection1, config=solrconfig.xml, transient=false, schema=schema.xml, loadOnStartup=true, configSetProperties=configsetprops.json, collection=control_collection, coreNodeName=, dataDir=data/, shard=}
   [junit4]   2> 2970786 INFO  (TEST-TestReqParamsAPI.test-seed#[E226DD9A39E9295A]) [n:127.0.0.1:33611_bk_ioe%2Fp    ] o.a.s.c.CorePropertiesLocator Found core collection1 in /export/home/jenkins/workspace/Lucene-Solr-6.x-Solaris/solr/build/solr-core/test/J0/temp/solr.handler.TestReqParamsAPI_E226DD9A39E9295A-001/control-001/cores/collection1
   [junit4]   2> 2970786 INFO  (TEST-TestReqParamsAPI.test-seed#[E226DD9A39E9295A]) [n:127.0.0.1:33611_bk_ioe%2Fp    ] o.a.s.c.CorePropertiesLocator Found 1 core definitions
   [junit4]   2> 2970789 INFO  (TEST-TestReqParamsAPI.test-seed#[E226DD9A39E9295A]) [n:127.0.0.1:33611_bk_ioe%2Fp    ] o.a.s.s.SolrDispatchFilter user.dir=/export/home/jenkins/workspace/Lucene-Solr-6.x-Solaris/solr/build/solr-core/test/J0
   [junit4]   2> 2970789 INFO  (TEST-TestReqParamsAPI.test-seed#[E226DD9A39E9295A]) [n:127.0.0.1:33611_bk_ioe%2Fp    ] o.a.s.s.SolrDispatchFilter SolrDispatchFilter.init() done
   [junit4]   2> 2970790 INFO  (coreLoadExecutor-9438-thread-1-processing-n:127.0.0.1:33611_bk_ioe%2Fp) [n:127.0.0.1:33611_bk_ioe%2Fp c:control_collection   x:collection1] o.a.s.c.ZkController publishing state=down
   [junit4]   2> 2970790 INFO  (coreLoadExecutor-9438-thread-1-processing-n:127.0.0.1:33611_bk_ioe%2Fp) [n:127.0.0.1:33611_bk_ioe%2Fp c:control_collection   x:collection1] o.a.s.c.ZkController numShards not found on descriptor - reading it from system property
   [junit4]   2> 2970793 INFO  (OverseerStateUpdate-95635776446201860-127.0.0.1:33611_bk_ioe%2Fp-n_0000000000) [n:127.0.0.1:33611_bk_ioe%2Fp    ] o.a.s.c.Overseer processMessage: queueSize: 1, message = {
   [junit4]   2>   "core":"collection1",
   [junit4]   2>   "roles":null,
   [junit4]   2>   "base_url":"http://127.0.0.1:33611/bk_ioe/p",
   [junit4]   2>   "node_name":"127.0.0.1:33611_bk_ioe%2Fp",
   [junit4]   2>   "numShards":"1",
   [junit4]   2>   "state":"down",
   [junit4]   2>   "shard":null,
   [junit4]   2>   "collection":"control_collection",
   [junit4]   2>   "operation":"state"} current state version: 0
   [junit4]   2> 2970793 INFO  (coreLoadExecutor-9438-thread-1-processing-n:127.0.0.1:33611_bk_ioe%2Fp) [n:127.0.0.1:33611_bk_ioe%2Fp c:control_collection   x:collection1] o.a.s.c.ZkController look for our core node name
   [junit4]   2> 2970794 INFO  (OverseerStateUpdate-95635776446201860-127.0.0.1:33611_bk_ioe%2Fp-n_0000000000) [n:127.0.0.1:33611_bk_ioe%2Fp    ] o.a.s.c.o.ReplicaMutator Update state numShards=1 message={
   [junit4]   2>   "core":"collection1",
   [junit4]   2>   "roles":null,
   [junit4]   2>   "base_url":"http://127.0.0.1:33611/bk_ioe/p",
   [junit4]   2>   "node_name":"127.0.0.1:33611_bk_ioe%2Fp",
   [junit4]   2>   "numShards":"1",
   [junit4]   2>   "state":"down",
   [junit4]   2>   "shard":null,
   [junit4]   2>   "collection":"control_collection",
   [junit4]   2>   "operation":"state"}
   [junit4]   2> 2970795 INFO  (OverseerStateUpdate-95635776446201860-127.0.0.1:33611_bk_ioe%2Fp-n_0000000000) [n:127.0.0.1:33611_bk_ioe%2Fp    ] o.a.s.c.o.ClusterStateMutator building a new cName: control_collection
   [junit4]   2> 2970795 INFO  (OverseerStateUpdate-95635776446201860-127.0.0.1:33611_bk_ioe%2Fp-n_0000000000) [n:127.0.0.1:33611_bk_ioe%2Fp    ] o.a.s.c.o.ReplicaMutator Assigning new node to shard shard=shard1
   [junit4]   2> 2970798 INFO  (zkCallback-3013-thread-1-processing-n:127.0.0.1:33611_bk_ioe%2Fp) [n:127.0.0.1:33611_bk_ioe%2Fp    ] o.a.s.c.c.ZkStateReader A cluster state change: [WatchedEvent state:SyncConnected type:NodeDataChanged path:/clusterstate.json], has occurred - updating... (live nodes size: [1])
   [junit4]   2> 2971795 INFO  (coreLoadExecutor-9438-thread-1-processing-n:127.0.0.1:33611_bk_ioe%2Fp) [n:127.0.0.1:33611_bk_ioe%2Fp c:control_collection   x:collection1] o.a.s.c.ZkController waiting to find shard id in clusterstate for collection1
   [junit4]   2> 2971795 INFO  (coreLoadExecutor-9438-thread-1-processing-n:127.0.0.1:33611_bk_ioe%2Fp) [n:127.0.0.1:33611_bk_ioe%2Fp c:control_collection   x:collection1] o.a.s.c.ZkController Check for collection zkNode:control_collection
   [junit4]   2> 2971796 INFO  (coreLoadExecutor-9438-thread-1-processing-n:127.0.0.1:33611_bk_ioe%2Fp) [n:127.0.0.1:33611_bk_ioe%2Fp c:control_collection   x:collection1] o.a.s.c.ZkController Collection zkNode exists
   [junit4]   2> 2971796 INFO  (coreLoadExecutor-9438-thread-1-processing-n:127.0.0.1:33611_bk_ioe%2Fp) [n:127.0.0.1:33611_bk_ioe%2Fp c:control_collection   x:collection1] o.a.s.c.c.ZkStateReader Load collection config from: [/collections/control_collection]
   [junit4]   2> 2971797 INFO  (coreLoadExecutor-9438-thread-1-processing-n:127.0.0.1:33611_bk_ioe%2Fp) [n:127.0.0.1:33611_bk_ioe%2Fp c:control_collection   x:collection1] o.a.s.c.c.ZkStateReader path=[/collections/control_collection] [configName]=[conf1] specified config exists in ZooKeeper
   [junit4]   2> 2971798 INFO  (coreLoadExecutor-9438-thread-1-processing-n:127.0.0.1:33611_bk_ioe%2Fp) [n:127.0.0.1:33611_bk_ioe%2Fp c:control_collection   x:collection1] o.a.s.c.SolrResourceLoader new SolrResourceLoader for directory: '/export/home/jenkins/workspace/Lucene-Solr-6.x-Solaris/solr/build/solr-core/test/J0/temp/solr.handler.TestReqParamsAPI_E226DD9A39E9295A-001/control-001/cores/collection1'
   [junit4]   2> 2971798 INFO  (coreLoadExecutor-9438-thread-1-processing-n:127.0.0.1:33611_bk_ioe%2Fp) [n:127.0.0.1:33611_bk_ioe%2Fp c:control_collection   x:collection1] o.a.s.c.SolrResourceLoader JNDI not configured for solr (NoInitialContextEx)
   [junit4]   2> 2971798 INFO  (coreLoadExecutor-9438-thread-1-processing-n:127.0.0.1:33611_bk_ioe%2Fp) [n:127.0.0.1:33611_bk_ioe%2Fp c:control_collection   x:collection1] o.a.s.c.SolrResourceLoader solr home defaulted to 'solr/' (could not find system property or JNDI)
   [junit4]   2> 2971800 INFO  (coreLoadExecutor-9438-thread-1-processing-n:127.0.0.1:33611_bk_ioe%2Fp) [n:127.0.0.1:33611_bk_ioe%2Fp c:control_collection   x:collection1] o.a.s.c.Config loaded config solrconfig.xml with version 0 
   [junit4]   2> 2971806 INFO  (coreLoadExecutor-9438-thread-1-processing-n:127.0.0.1:33611_bk_ioe%2Fp) [n:127.0.0.1:33611_bk_ioe%2Fp c:control_collection   x:collection1] o.a.s.c.SolrConfig current version of requestparams : -1
   [junit4]   2> 2971809 WARN  (coreLoadExecutor-9438-thread-1-processing-n:127.0.0.1:33611_bk_ioe%2Fp) [n:127.0.0.1:33611_bk_ioe%2Fp c:control_collection   x:collection1] o.a.s.c.Config Beginning with Solr 5.5, <mergePolicy> is deprecated, use <mergePolicyFactory> instead.
   [junit4]   2> 2971810 INFO  (coreLoadExecutor-9438-thread-1-processing-n:127.0.0.1:33611_bk_ioe%2Fp) [n:127.0.0.1:33611_bk_ioe%2Fp c:control_collection   x:collection1] o.a.s.c.SolrConfig Using Lucene MatchVersion: 6.1.0
   [junit4]   2> 2971816 INFO  (coreLoadExecutor-9438-thread-1-processing-n:127.0.0.1:33611_bk_ioe%2Fp) [n:127.0.0.1:33611_bk_ioe%2Fp c:control_collection   x:collection1] o.a.s.c.SolrConfig Loaded SolrConfig: solrconfig.xml
   [junit4]   2> 2971822 INFO  (coreLoadExecutor-9438-thread-1-processing-n:127.0.0.1:33611_bk_ioe%2Fp) [n:127.0.0.1:33611_bk_ioe%2Fp c:control_collection   x:collection1] o.a.s.s.IndexSchema [collection1] Schema name=test
   [junit4]   2> 2971890 INFO  (coreLoadExecutor-9438-thread-1-processing-n:127.0.0.1:33611_bk_ioe%2Fp) [n:127.0.0.1:33611_bk_ioe%2Fp c:control_collection   x:collection1] o.a.s.s.OpenExchangeRatesOrgProvider Initialized with rates=open-exchange-rates.json, refreshInterval=1440.
   [junit4]   2> 2971896 INFO  (coreLoadExecutor-9438-thread-1-processing-n:127.0.0.1:33611_bk_ioe%2Fp) [n:127.0.0.1:33611_bk_ioe%2Fp c:control_collection   x:collection1] o.a.s.s.IndexSchema default search field in schema is text
   [junit4]   2> 2971897 INFO  (coreLoadExecutor-9438-thread-1-processing-n:127.0.0.1:33611_bk_ioe%2Fp) [n:127.0.0.1:33611_bk_ioe%2Fp c:control_collection   x:collection1] o.a.s.s.IndexSchema unique key field: id
   [junit4]   2> 2971910 INFO  (coreLoadExecutor-9438-thread-1-processing-n:127.0.0.1:33611_bk_ioe%2Fp) [n:127.0.0.1:33611_bk_ioe%2Fp c:control_collection   x:collection1] o.a.s.s.FileExchangeRateProvider Reloading exchange rates from file currency.xml
   [junit4]   2> 2971913 INFO  (coreLoadExecutor-9438-thread-1-processing-n:127.0.0.1:33611_bk_ioe%2Fp) [n:127.0.0.1:33611_bk_ioe%2Fp c:control_collection   x:collection1] o.a.s.s.FileExchangeRateProvider Reloading exchange rates from file currency.xml
   [junit4]   2> 2971915 INFO  (coreLoadExecutor-9438-thread-1-processing-n:127.0.0.1:33611_bk_ioe%2Fp) [n:127.0.0.1:33611_bk_ioe%2Fp c:control_collection   x:collection1] o.a.s.s.OpenExchangeRatesOrgProvider Reloading exchange rates from open-exchange-rates.json
   [junit4]   2> 2971916 INFO  (coreLoadExecutor-9438-thread-1-processing-n:127.0.0.1:33611_bk_ioe%2Fp) [n:127.0.0.1:33611_bk_ioe%2Fp c:control_collection   x:collection1] o.a.s.s.OpenExchangeRatesOrgProvider Reloading exchange rates from open-exchange-rates.json
   [junit4]   2> 2971918 INFO  (coreLoadExecutor-9438-thread-1-processing-n:127.0.0.1:33611_bk_ioe%2Fp) [n:127.0.0.1:33611_bk_ioe%2Fp c:control_collection   x:collection1] o.a.s.c.ConfigSetProperties Did not find ConfigSet properties, assuming default properties: Can't find resource 'configsetprops.json' in classpath or '/configs/conf1', cwd=/export/home/jenkins/workspace/Lucene-Solr-6.x-Solaris/solr/build/solr-core/test/J0
   [junit4]   2> 2971918 INFO  (coreLoadExecutor-9438-thread-1-processing-n:127.0.0.1:33611_bk_ioe%2Fp) [n:127.0.0.1:33611_bk_ioe%2Fp c:control_collection   x:collection1] o.a.s.c.CoreContainer Creating SolrCore 'collection1' using configuration from collection control_collection
   [junit4]   2> 2971919 INFO  (coreLoadExecutor-9438-thread-1-processing-n:127.0.0.1:33611_bk_ioe%2Fp) [n:127.0.0.1:33611_bk_ioe%2Fp c:control_collection s:shard1 r:core_node1 x:collection1] o.a.s.c.SolrCore org.apache.solr.core.MockDirectoryFactory
   [junit4]   2> 2971919 INFO  (coreLoadExecutor-9438-thread-1-processing-n:127.0.0.1:33611_bk_ioe%2Fp) [n:127.0.0.1:33611_bk_ioe%2Fp c:control_collection s:shard1 r:core_node1 x:collection1] o.a.s.c.SolrCore [[collection1] ] Opening new SolrCore at [/export/home/jenkins/workspace/Lucene-Solr-6.x-Solaris/solr/build/solr-core/test/J0/temp/solr.handler.TestReqParamsAPI_E226DD9A39E9295A-001/control-001/cores/collection1], dataDir=[/export/home/jenkins/workspace/Lucene-Solr-6.x-Solaris/solr/build/solr-core/test/J0/temp/solr.handler.TestReqParamsAPI_E226DD9A39E9295A-001/control-001/cores/collection1/data/]
   [junit4]   2> 2971919 INFO  (coreLoadExecutor-9438-thread-1-processing-n:127.0.0.1:33611_bk_ioe%2Fp) [n:127.0.0.1:33611_bk_ioe%2Fp c:control_collection s:shard1 r:core_node1 x:collection1] o.a.s.c.JmxMonitoredMap JMX monitoring is enabled. Adding Solr mbeans to JMX Server: com.sun.jmx.mbeanserver.JmxMBeanServer@5cf9aae
   [junit4]   2> 2971919 INFO  (coreLoadExecutor-9438-thread-1-processing-n:127.0.0.1:33611_bk_ioe%2Fp) [n:127.0.0.1:33611_bk_ioe%2Fp c:control_collection s:shard1 r:core_node1 x:collection1] o.a.s.c.CachingDirectoryFactory return new directory for /export/home/jenkins/workspace/Lucene-Solr-6.x-Solaris/solr/build/solr-core/test/J0/temp/solr.handler.TestReqParamsAPI_E226DD9A39E9295A-001/control-001/cores/collection1/data
   [junit4]   2> 2971919 INFO  (coreLoadExecutor-9438-thread-1-processing-n:127.0.0.1:33611_bk_ioe%2Fp) [n:127.0.0.1:33611_bk_ioe%2Fp c:control_collection s:shard1 r:core_node1 x:collection1] o.a.s.c.SolrCore New index directory detected: old=null new=/export/home/jenkins/workspace/Lucene-Solr-6.x-Solaris/solr/build/solr-core/test/J0/temp/solr.handler.TestReqParamsAPI_E226DD9A39E9295A-001/control-001/cores/collection1/data/index/
   [junit4]   2> 2971919 WARN  (coreLoadExecutor-9438-thread-1-processing-n:127.0.0.1:33611_bk_ioe%2Fp) [n:127.0.0.1:33611_bk_ioe%2Fp c:control_collection s:shard1 r:core_node1 x:collection1] o.a.s.c.SolrCore [collection1] Solr index directory '/export/home/jenkins/workspace/Lucene-Solr-6.x-Solaris/solr/build/solr-core/test/J0/temp/solr.handler.TestReqParamsAPI_E226DD9A39E9295A-001/control-001/cores/collection1/data/index' doesn't exist. Creating new index...
   [junit4]   2> 2971920 INFO  (coreLoadExecutor-9438-thread-1-processing-n:127.0.0.1:33611_bk_ioe%2Fp) [n:127.0.0.1:33611_bk_ioe%2Fp c:control_collection s:shard1 r:core_node1 x:collection1] o.a.s.c.CachingDirectoryFactory return new directory for /export/home/jenkins/workspace/Lucene-Solr-6.x-Solaris/solr/build/solr-core/test/J0/temp/solr.handler.TestReqParamsAPI_E226DD9A39E9295A-001/control-001/cores/collection1/data/index
   [junit4]   2> 2971920 INFO  (coreLoadExecutor-9438-thread-1-processing-n:127.0.0.1:33611_bk_ioe%2Fp) [n:127.0.0.1:33611_bk_ioe%2Fp c:control_collection s:shard1 r:core_node1 x:collection1] o.a.s.u.RandomMergePolicy RandomMergePolicy wrapping class org.apache.lucene.index.LogByteSizeMergePolicy: [LogByteSizeMergePolicy: minMergeSize=1677721, mergeFactor=50, maxMergeSize=2147483648, maxMergeSizeForForcedMerge=9223372036854775807, calibrateSizeByDeletes=false, maxMergeDocs=2147483647, maxCFSSegmentSizeMB=8.796093022207999E12, noCFSRatio=0.6987622931014779]
   [junit4]   2> 2971920 INFO  (coreLoadExecutor-9438-thread-1-processing-n:127.0.0.1:33611_bk_ioe%2Fp) [n:127.0.0.1:33611_bk_ioe%2Fp c:control_collection s:shard1 r:core_node1 x:collection1] o.a.s.c.SolrDeletionPolicy SolrDeletionPolicy.onCommit: commits: num=1
   [junit4]   2> 	commit{dir=MockDirectoryWrapper(RAMDirectory@11efcb54 lockFactory=org.apache.lucene.store.SingleInstanceLockFactory@5ad0013a),segFN=segments_1,generation=1}
   [junit4]   2> 2971920 INFO  (coreLoadExecutor-9438-thread-1-processing-n:127.0.0.1:33611_bk_ioe%2Fp) [n:127.0.0.1:33611_bk_ioe%2Fp c:control_collection s:shard1 r:core_node1 x:collection1] o.a.s.c.SolrDeletionPolicy newest commit generation = 1
   [junit4]   2> 2971920 INFO  (OldIndexDirectoryCleanupThreadForCore-collection1) [n:127.0.0.1:33611_bk_ioe%2Fp c:control_collection s:shard1 r:core_node1 x:collection1] o.a.s.c.SolrCore Looking for old index directories to cleanup for core collection1 in /export/home/jenkins/workspace/Lucene-Solr-6.x-Solaris/solr/build/solr-core/test/J0/temp/solr.handler.TestReqParamsAPI_E226DD9A39E9295A-001/control-001/cores/collection1/data/
   [junit4]   2> 2971921 WARN  (OldIndexDirectoryCleanupThreadForCore-collection1) [n:127.0.0.1:33611_bk_ioe%2Fp c:control_collection s:shard1 r:core_node1 x:collection1] o.a.s.c.DirectoryFactory /export/home/jenkins/workspace/Lucene-Solr-6.x-Solaris/solr/build/solr-core/test/J0/temp/solr.handler.TestReqParamsAPI_E226DD9A39E9295A-001/control-001/cores/collection1/data/ does not point to a valid data directory; skipping clean-up of old index directories.
   [junit4]   2> 2971923 INFO  (coreLoadExecutor-9438-thread-1-processing-n:127.0.0.1:33611_bk_ioe%2Fp) [n:127.0.0.1:33611_bk_ioe%2Fp c:control_collection s:shard1 r:core_node1 x:collection1] o.a.s.u.p.UpdateRequestProcessorChain creating updateRequestProcessorChain "nodistrib"
   [junit4]   2> 2971923 INFO  (coreLoadExecutor-9438-thread-1-processing-n:127.0.0.1:33611_bk_ioe%2Fp) [n:127.0.0.1:33611_bk_ioe%2Fp c:control_collection s:shard1 r:core_node1 x:collection1] o.a.s.u.p.UpdateRequestProcessorChain creating updateRequestProcessorChain "dedupe"
   [junit4]   2> 2971923 INFO  (coreLoadExecutor-9438-thread-1-processing-n:127.0.0.1:33611_bk_ioe%2Fp) [n:127.0.0.1:33611_bk_ioe%2Fp c:control_collection s:shard1 r:core_node1 x:collection1] o.a.s.u.p.UpdateRequestProcessorChain inserting DistributedUpdateProcessorFactory into updateRequestProcessorChain "dedupe"
   [junit4]   2> 2971923 INFO  (coreLoadExecutor-9438-thread-1-processing-n:127.0.0.1:33611_bk_ioe%2Fp) [n:127.0.0.1:33611_bk_ioe%2Fp c:control_collection s:shard1 r:core_node1 x:collection1] o.a.s.u.p.UpdateRequestProcessorChain creating updateRequestProcessorChain "stored_sig"
   [junit4]   2> 2971923 INFO  (coreLoadExecutor-9438-thread-1-processing-n:127.0.0.1:33611_bk_ioe%2Fp) [n:127.0.0.1:33611_bk_ioe%2Fp c:control_collection s:shard1 r:core_node1 x:collection1] o.a.s.u.p.UpdateRequestProcessorChain inserting DistributedUpdateProcessorFactory into updateRequestProcessorChain "stored_sig"
   [junit4]   2> 2971923 INFO  (coreLoadExecutor-9438-thread-1-processing-n:127.0.0.1:33611_bk_ioe%2Fp) [n:127.0.0.1:33611_bk_ioe%2Fp c:control_collection s:shard1 r:core_node1 x:collection1] o.a.s.u.p.UpdateRequestProcessorChain creating updateRequestProcessorChain "distrib-dup-test-chain-explicit"
   [junit4]   2> 2971923 INFO  (coreLoadExecutor-9438-thread-1-processing-n:127.0.0.1:33611_bk_ioe%2Fp) [n:127.0.0.1:33611_bk_ioe%2Fp c:control_collection s:shard1 r:core_node1 x:collection1] o.a.s.u.p.UpdateRequestProcessorChain creating updateRequestProcessorChain "distrib-dup-test-chain-implicit"
   [junit4]   2> 2971923 INFO  (coreLoadExecutor-9438-thread-1-processing-n:127.0.0.1:33611_bk_ioe%2Fp) [n:127.0.0.1:33611_bk_ioe%2Fp c:control_collection s:shard1 r:core_node1 x:collection1] o.a.s.u.p.UpdateRequestProcessorChain inserting DistributedUpdateProcessorFactory into updateRequestProcessorChain "distrib-dup-test-chain-implicit"
   [junit4]   2> 2971923 INFO  (coreLoadExecutor-9438-thread-1-processing-n:127.0.0.1:33611_bk_ioe%2Fp) [n:127.0.0.1:33611_bk_ioe%2Fp c:control_collection s:shard1 r:core_node1 x:collection1] o.a.s.c.SolrCore no updateRequestProcessorChain defined as default, creating implicit default
   [junit4]   2> 2971924 WARN  (coreLoadExecutor-9438-thread-1-processing-n:127.0.0.1:33611_bk_ioe%2Fp) [n:127.0.0.1:33611_bk_ioe%2Fp c:control_collection s:shard1 r:core_node1 x:collection1] o.a.s.c.RequestHandlers INVALID paramSet a in requestHandler {type = requestHandler,name = /dump,class = DumpRequestHandler,args = {defaults={a=A,b=B}}}
   [junit4]   2> 2971925 INFO  (coreLoadExecutor-9438-thread-1-processing-n:127.0.0.1:33611_bk_ioe%2Fp) [n:127.0.0.1:33611_bk_ioe%2Fp c:control_collection s:shard1 r:core_node1 x:collection1] o.a.s.h.l.XMLLoader xsltCacheLifetimeSeconds=60
   [junit4]   2> 2971926 INFO  (coreLoadExecutor-9438-thread-1-processing-n:127.0.0.1:33611_bk_ioe%2Fp) [n:127.0.0.1:33611_bk_ioe%2Fp c:control_collection s:shard1 r:core_node1 x:collection1] o.a.s.h.l.XMLLoader xsltCacheLifetimeSeconds=60
   [junit4]   2> 2971927 INFO  (coreLoadExecutor-9438-thread-1-processing-n:127.0.0.1:33611_bk_ioe%2Fp) [n:127.0.0.1:33611_bk_ioe%2Fp c:control_collection s:shard1 r:core_node1 x:collection1] o.a.s.h.l.XMLLoader xsltCacheLifetimeSeconds=60
   [junit4]   2> 2971929 INFO  (coreLoadExecutor-9438-thread-1-processing-n:127.0.0.1:33611_bk_ioe%2Fp) [n:127.0.0.1:33611_bk_ioe%2Fp c:control_collection s:shard1 r:core_node1 x:collection1] o.a.s.h.l.XMLLoader xsltCacheLifetimeSeconds=60
   [junit4]   2> 2971932 INFO  (coreLoadExecutor-9438-thread-1-processing-n:127.0.0.1:33611_bk_ioe%2Fp) [n:127.0.0.1:33611_bk_ioe%2Fp c:control_collection s:shard1 r:core_node1 x:collection1] o.a.s.c.RequestHandlers Registered paths: /admin/mbeans,standard,/dump,/update/csv,/sql,/update/json/docs,/admin/luke,/export,/admin/segments,/get,/admin/system,/replication,/admin/properties,/config,/stream,/schema,/admin/plugins,/admin/logging,/update/json,/admin/ping,/admin/threads,/update,/admin/file
   [junit4]   2> 2971932 INFO  (coreLoadExecutor-9438-thread-1-processing-n:127.0.0.1:33611_bk_ioe%2Fp) [n:127.0.0.1:33611_bk_ioe%2Fp c:control_collection s:shard1 r:core_node1 x:collection1] o.a.s.c.SolrCore Using default statsCache cache: org.apache.solr.search.stats.LocalStatsCache
   [junit4]   2> 2971932 INFO  (coreLoadExecutor-9438-thread-1-processing-n:127.0.0.1:33611_bk_ioe%2Fp) [n:127.0.0.1:33611_bk_ioe%2Fp c:control_collection s:shard1 r:core_node1 x:collection1] o.a.s.u.UpdateHandler Using UpdateLog implementation: org.apache.solr.update.UpdateLog
   [junit4]   2> 2971932 INFO  (coreLoadExecutor-9438-thread-1-processing-n:127.0.0.1:33611_bk_ioe%2Fp) [n:127.0.0.1:33611_bk_ioe%2Fp c:control_collection s:shard1 r:core_node1 x:collection1] o.a.s.u.UpdateLog Initializing UpdateLog: dataDir= defaultSyncLevel=FLUSH numRecordsToKeep=100 maxNumLogsToKeep=10 numVersionBuckets=65536
   [junit4]   2> 2971933 INFO  (coreLoadExecutor-9438-thread-1-processing-n:127.0.0.1:33611_bk_ioe%2Fp) [n:127.0.0.1:33611_bk_ioe%2Fp c:control_collection s:shard1 r:core_node1 x:collection1] o.a.s.u.CommitTracker Hard AutoCommit: disabled
   [junit4]   2> 2971933 INFO  (coreLoadExecutor-9438-thread-1-processing-n:127.0.0.1:33611_bk_ioe%2Fp) [n:127.0.0.1:33611_bk_ioe%2Fp c:control_collection s:shard1 r:core_node1 x:collection1] o.a.s.u.CommitTracker Soft AutoCommit: disabled
   [junit4]   2> 2971933 INFO  (coreLoadExecutor-9438-thread-1-processing-n:127.0.0.1:33611_bk_ioe%2Fp) [n:127.0.0.1:33611_bk_ioe%2Fp c:control_collection s:shard1 r:core_node1 x:collection1] o.a.s.u.RandomMergePolicy RandomMergePolicy wrapping class org.apache.lucene.index.LogDocMergePolicy: [LogDocMergePolicy: minMergeSize=1000, mergeFactor=44, maxMergeSize=9223372036854775807, maxMergeSizeForForcedMerge=9223372036854775807, calibrateSizeByDeletes=true, maxMergeDocs=2147483647, maxCFSSegmentSizeMB=8.796093022207999E12, noCFSRatio=0.2086499542897655]
   [junit4]   2> 2971933 INFO  (coreLoadExecutor-9438-thread-1-processing-n:127.0.0.1:33611_bk_ioe%2Fp) [n:127.0.0.1:33611_bk_ioe%2Fp c:control_collection s:shard1 r:core_node1 x:collection1] o.a.s.c.SolrDeletionPolicy SolrDeletionPolicy.onInit: commits: num=1
   [junit4]   2> 	commit{dir=MockDirectoryWrapper(RAMDirectory@11efcb54 lockFactory=org.apache.lucene.store.SingleInstanceLockFactory@5ad0013a),segFN=segments_1,generation=1}
   [junit4]   2> 2971933 INFO  (coreLoadExecutor-9438-thread-1-processing-n:127.0.0.1:33611_bk_ioe%2Fp) [n:127.0.0.1:33611_bk_ioe%2Fp c:control_collection s:shard1 r:core_node1 x:collection1] o.a.s.c.SolrDeletionPolicy newest commit generation = 1
   [junit4]   2> 2971934 INFO  (coreLoadExecutor-9438-thread-1-processing-n:127.0.0.1:33611_bk_ioe%2Fp) [n:127.0.0.1:33611_bk_ioe%2Fp c:control_collection s:shard1 r:core_node1 x:collection1] o.a.s.s.SolrIndexSearcher Opening [Searcher@4620d7f8[collection1] main]
   [junit4]   2> 2971934 INFO  (coreLoadExecutor-9438-thread-1-processing-n:127.0.0.1:33611_bk_ioe%2Fp) [n:127.0.0.1:33611_bk_ioe%2Fp c:control_collection s:shard1 r:core_node1 x:collection1] o.a.s.c.c.ZkStateReader Load collection config from: [/collections/control_collection]
   [junit4]   2> 2971935 INFO  (coreLoadExecutor-9438-thread-1-processing-n:127.0.0.1:33611_bk_ioe%2Fp) [n:127.0.0.1:33611_bk_ioe%2Fp c:control_collection s:shard1 r:core_node1 x:collection1] o.a.s.c.c.ZkStateReader path=[/collections/control_collection] [configName]=[conf1] specified config exists in ZooKeeper
   [junit4]   2> 2971935 INFO  (coreLoadExecutor-9438-thread-1-processing-n:127.0.0.1:33611_bk_ioe%2Fp) [n:127.0.0.1:33611_bk_ioe%2Fp c:control_collection s:shard1 r:core_node1 x:collection1] o.a.s.r.ManagedResourceStorage Setting up ZooKeeper-based storage for the RestManager with znodeBase: /configs/conf1
   [junit4]   2> 2971935 INFO  (coreLoadExecutor-9438-thread-1-processing-n:127.0.0.1:33611_bk_ioe%2Fp) [n:127.0.0.1:33611_bk_ioe%2Fp c:control_collection s:shard1 r:core_node1 x:collection1] o.a.s.r.ManagedResourceStorage Configured ZooKeeperStorageIO with znodeBase: /configs/conf1
   [junit4]   2> 2971935 INFO  (coreLoadExecutor-9438-thread-1-processing-n:127.0.0.1:33611_bk_ioe%2Fp) [n:127.0.0.1:33611_bk_ioe%2Fp c:control_collection s:shard1 r:core_node1 x:collection1] o.a.s.r.RestManager Initializing RestManager with initArgs: {}
   [junit4]   2> 2971935 INFO  (coreLoadExecutor-9438-thread-1-processing-n:127.0.0.1:33611_bk_ioe%2Fp) [n:127.0.0.1:33611_bk_ioe%2Fp c:control_collection s:shard1 r:core_node1 x:collection1] o.a.s.r.ManagedResourceStorage Reading _rest_managed.json using ZooKeeperStorageIO:path=/configs/conf1
   [junit4]   2> 2971936 INFO  (coreLoadExecutor-9438-thread-1-processing-n:127.0.0.1:33611_bk_ioe%2Fp) [n:127.0.0.1:33611_bk_ioe%2Fp c:control_collection s:shard1 r:core_node1 x:collection1] o.a.s.r.ManagedResourceStorage No data found for znode /configs/conf1/_rest_managed.json
   [junit4]   2> 2971937 INFO  (coreLoadExecutor-9438-thread-1-processing-n:127.0.0.1:33611_bk_ioe%2Fp) [n:127.0.0.1:33611_bk_ioe%2Fp c:control_collection s:shard1 r:core_node1 x:collection1] o.a.s.r.ManagedResourceStorage Loaded null at path _rest_managed.json using ZooKeeperStorageIO:path=/configs/conf1
   [junit4]   2> 2971937 INFO  (coreLoadExecutor-9438-thread-1-processing-n:127.0.0.1:33611_bk_ioe%2Fp) [n:127.0.0.1:33611_bk_ioe%2Fp c:control_collection s:shard1 r:core_node1 x:collection1] o.a.s.r.RestManager Initializing 0 registered ManagedResources
   [junit4]   2> 2971937 INFO  (coreLoadExecutor-9438-thread-1-processing-n:127.0.0.1:33611_bk_ioe%2Fp) [n:127.0.0.1:33611_bk_ioe%2Fp c:control_collection s:shard1 r:core_node1 x:collection1] o.a.s.h.ReplicationHandler Commits will be reserved for  10000
   [junit4]   2> 2971937 INFO  (searcherExecutor-9439-thread-1-processing-n:127.0.0.1:33611_bk_ioe%2Fp x:collection1 s:shard1 c:control_collection r:core_node1) [n:127.0.0.1:33611_bk_ioe%2Fp c:control_collection s:shard1 r:core_node1 x:collection1] o.a.s.c.SolrCore [collection1] Registered new searcher Searcher@4620d7f8[collection1] main{ExitableDirectoryReader(UninvertingDirectoryReader())}
   [junit4]   2> 2971937 INFO  (coreLoadExecutor-9438-thread-1-processing-n:127.0.0.1:33611_bk_ioe%2Fp) [n:127.0.0.1:33611_bk_ioe%2Fp c:control_collection s:shard1 r:core_node1 x:collection1] o.a.s.u.UpdateLog Looking up max value of version field to seed version buckets
   [junit4]   2> 2971938 INFO  (coreLoadExecutor-9438-thread-1-processing-n:127.0.0.1:33611_bk_ioe%2Fp) [n:127.0.0.1:33611_bk_ioe%2Fp c:control_collection s:shard1 r:core_node1 x:collection1] o.a.s.u.VersionInfo Refreshing highest value of _version_ for 65536 version buckets from index
   [junit4]   2> 2971938 INFO  (coreLoadExecutor-9438-thread-1-processing-n:127.0.0.1:33611_bk_ioe%2Fp) [n:127.0.0.1:33611_bk_ioe%2Fp c:control_collection s:shard1 r:core_node1 x:collection1] o.a.s.u.VersionInfo No terms found for _version_, cannot seed version bucket highest value from index
   [junit4]   2> 2971938 INFO  (coreLoadExecutor-9438-thread-1-processing-n:127.0.0.1:33611_bk_ioe%2Fp) [n:127.0.0.1:33611_bk_ioe%2Fp c:control_collection s:shard1 r:core_node1 x:collection1] o.a.s.u.UpdateLog Could not find max version in index or recent updates, using new clock 1530172425241624576
   [junit4]   2> 2971939 INFO  (coreLoadExecutor-9438-thread-1-processing-n:127.0.0.1:33611_bk_ioe%2Fp) [n:127.0.0.1:33611_bk_ioe%2Fp c:control_collection s:shard1 r:core_node1 x:collection1] o.a.s.u.UpdateLog Took 1.0ms to seed version buckets with highest version 1530172425241624576
   [junit4]   2> 2971940 INFO  (coreLoadExecutor-9438-thread-1-processing-n:127.0.0.1:33611_bk_ioe%2Fp) [n:127.0.0.1:33611_bk_ioe%2Fp c:control_collection s:shard1 r:core_node1 x:collection1] o.a.s.c.ZkController watch zkdir /configs/conf1
   [junit4]   2> 2971941 INFO  (coreLoadExecutor-9438-thread-1-processing-n:127.0.0.1:33611_bk_ioe%2Fp) [n:127.0.0.1:33611_bk_ioe%2Fp c:control_collection s:shard1 r:core_node1 x:collection1] o.a.s.c.CoreContainer registering core: collection1
   [junit4]   2> 2971941 INFO  (coreZkRegister-9432-thread-1-processing-n:127.0.0.1:33611_bk_ioe%2Fp x:collection1 s:shard1 c:control_collection r:core_node1) [n:127.0.0.1:33611_bk_ioe%2Fp c:control_collection s:shard1 r:core_node1 x:collection1] o.a.s.c.ZkController Register replica - core:collection1 address:http://127.0.0.1:33611/bk_ioe/p collection:control_collection shard:shard1
   [junit4]   2> 2971943 INFO  (coreZkRegister-9432-thread-1-processing-n:127.0.0.1:33611_bk_ioe%2Fp x:collection1 s:shard1 c:control_collection r:core_node1) [n:127.0.0.1:33611_bk_ioe%2Fp c:control_collection s:shard1 r:core_node1 x:collection1] o.a.s.c.c.SolrZkClient makePath: /collections/control_collection/leader_elect/shard1/election
   [junit4]   2> 2971948 INFO  (coreZkRegister-9432-thread-1-processing-n:127.0.0.1:33611_bk_ioe%2Fp x:collection1 s:shard1 c:control_collection r:core_node1) [n:127.0.0.1:33611_bk_ioe%2Fp c:control_collection s:shard1 r:core_node1 x:collection1] o.a.s.c.LeaderElector Joined leadership election with path: /collections/control_collection/leader_elect/shard1/election/95635776446201860-core_node1-n_0000000000
   [junit4]   2> 2971949 INFO  (coreZkRegister-9432-thread-1-processing-n:127.0.0.1:33611_bk_ioe%2Fp x:collection1 s:shard1 c:control_collection r:core_node1) [n:127.0.0.1:33611_bk_ioe%2Fp c:control_collection s:shard1 r:core_node1 x:collection1] o.a.s.c.ShardLeaderElectionContext Running the leader process for shard=shard1 and weAreReplacement=false and leaderVoteWait=10000
   [junit4]   2> 2971952 INFO  (coreZkRegister-9432-thread-1-processing-n:127.0.0.1:33611_bk_ioe%2Fp x:collection1 s:shard1 c:control_collection r:core_node1) [n:127.0.0.1:33611_bk_ioe%2Fp c:control_collection s:shard1 r:core_node1 x:collection1] o.a.s.c.ShardLeaderElectionContext Enough replicas found to continue.
   [junit4]   2> 2971952 INFO  (coreZkRegister-9432-thread-1-processing-n:127.0.0.1:33611_bk_ioe%2Fp x:collection1 s:shard1 c:control_collection r:core_node1) [n:127.0.0.1:33611_bk_ioe%2Fp c:control_collection s:shard1 r:core_node1 x:collection1] o.a.s.c.ShardLeaderElectionContext I may be the new leader - try and sync
   [junit4]   2> 2971952 INFO  (coreZkRegister-9432-thread-1-processing-n:127.0.0.1:33611_bk_ioe%2Fp x:collection1 s:shard1 c:control_collection r:core_node1) [n:127.0.0.1:33611_bk_ioe%2Fp c:control_collection s:shard1 r:core_node1 x:collection1] o.a.s.c.SyncStrategy Sync replicas to http://127.0.0.1:33611/bk_ioe/p/collection1/
   [junit4]   2> 2971952 INFO  (coreZkRegister-9432-thread-1-processing-n:127.0.0.1:33611_bk_ioe%2Fp x:collection1 s:shard1 c:control_collection r:core_node1) [n:127.0.0.1:33611_bk_ioe%2Fp c:control_collection s:shard1 r:core_node1 x:collection1] o.a.s.c.SyncStrategy Sync Success - now sync replicas to me
   [junit4]   2> 2971952 INFO  (coreZkRegister-9432-thread-1-processing-n:127.0.0.1:33611_bk_ioe%2Fp x:collection1 s:shard1 c:control_collection r:core_node1) [n:127.0.0.1:33611_bk_ioe%2Fp c:control_collection s:shard1 r:core_node1 x:collection1] o.a.s.c.SyncStrategy http://127.0.0.1:33611/bk_ioe/p/collection1/ has no replicas
   [junit4]   2> 2971953 INFO  (OverseerStateUpdate-95635776446201860-127.0.0.1:33611_bk_ioe%2Fp-n_0000000000) [n:127.0.0.1:33611_bk_ioe%2Fp    ] o.a.s.c.Overseer processMessage: queueSize: 1, message = {
   [junit4]   2>   "operation":"leader",
   [junit4]   2>   "shard":"shard1",
   [junit4]   2>   "collection":"control_collection"} current state version: 1
   [junit4]   2> 2971954 INFO  (coreZkRegister-9432-thread-1-processing-n:127.0.0.1:33611_bk_ioe%2Fp x:collection1 s:shard1 c:control_collection r:core_node1) [n:127.0.0.1:33611_bk_ioe%2Fp c:control_collection s:shard1 r:core_node1 x:collection1] o.a.s.c.c.SolrZkClient makePath: /collections/control_collection/leaders/shard1
   [junit4]   2> 2971958 INFO  (coreZkRegister-9432-thread-1-processing-n:127.0.0.1:33611_bk_ioe%2Fp x:collection1 s:shard1 c:control_collection r:core_node1) [n:127.0.0.1:33611_bk_ioe%2Fp c:control_collection s:shard1 r:core_node1 x:collection1] o.a.s.c.ShardLeaderElectionContextBase Creating leader registration node /collections/control_collection/leaders/shard1/leader after winning as /collections/control_collection/leader_elect/shard1/election/95635776446201860-core_node1-n_0000000000
   [junit4]   2> 2971961 INFO  (coreZkRegister-9432-thread-1-processing-n:127.0.0.1:33611_bk_ioe%2Fp x:collection1 s:shard1 c:control_collection r:core_node1) [n:127.0.0.1:33611_bk_ioe%2Fp c:control_collection s:shard1 r:core_node1 x:collection1] o.a.s.c.ShardLeaderElectionContext I am the new leader: http://127.0.0.1:33611/bk_ioe/p/collection1/ shard1
   [junit4]   2> 2971963 INFO  (OverseerStateUpdate-95635776446201860-127.0.0.1:33611_bk_ioe%2Fp-n_0000000000) [n:127.0.0.1:33611_bk_ioe%2Fp    ] o.a.s.c.Overseer processMessage: queueSize: 1, message = {
   [junit4]   2>   "operation":"leader",
   [junit4]   2>   "shard":"shard1",
   [junit4]   2>   "collection":"control_collection",
   [junit4]   2>   "base_url":"http://127.0.0.1:33611/bk_ioe/p",
   [junit4]   2>   "core":"collection1",
   [junit4]   2>   "state":"active"} current state version: 1
   [junit4]   2> 2972067 INFO  (zkCallback-3013-thread-1-processing-n:127.0.0.1:33611_bk_ioe%2Fp) [n:127.0.0.1:33611_bk_ioe%2Fp    ] o.a.s.c.c.ZkStateReader A cluster state change: [WatchedEvent state:SyncConnected type:NodeDataChanged path:/clusterstate.json], has occurred - updating... (live nodes size: [1])
   [junit4]   2> 2972113 INFO  (coreZkRegister-9432-thread-1-processing-n:127.0.0.1:33611_bk_ioe%2Fp x:collection1 s:shard1 c:control_collection r:core_node1) [n:127.0.0.1:33611_bk_ioe%2Fp c:control_collection s:shard1 r:core_node1 x:collection1] o.a.s.c.ZkController We are http://127.0.0.1:33611/bk_ioe/p/collection1/ and leader is http://127.0.0.1:33611/bk_ioe/p/collection1/
   [junit4]   2> 2972113 INFO  (coreZkRegister-9432-thread-1-processing-n:127.0.0.1:33611_bk_ioe%2Fp x:collection1 s:shard1 c:control_collection r:core_node1) [n:127.0.0.1:33611_bk_ioe%2Fp c:control_collection s:shard1 r:core_node1 x:collection1] o.a.s.c.ZkController No LogReplay needed for core=collection1 baseURL=http://127.0.0.1:33611/bk_ioe/p
   [junit4]   2> 2972113 INFO  (coreZkRegister-9432-thread-1-processing-n:127.0.0.1:33611_bk_ioe%2Fp x:collection1 s:shard1 c:control_collection r:core_node1) [n:127.0.0.1:33611_bk_ioe%2Fp c:control_collection s:shard1 r:core_node1 x:collection1] o.a.s.c.ZkController I am the leader, no recovery necessary
   [junit4]   2> 2972113 INFO  (coreZkRegister-9432-thread-1-processing-n:127.0.0.1:33611_bk_ioe%2Fp x:collection1 s:shard1 c:control_collection r:core_node1) [n:127.0.0.1:33611_bk_ioe%2Fp c:control_collection s:shard1 r:core_node1 x:collection1] o.a.s.c.ZkController publishing state=active
   [junit4]   2> 2972114 INFO  (coreZkRegister-9432-thread-1-processing-n:127.0.0.1:33611_bk_ioe%2Fp x:collection1 s:shard1 c:control_collection r:core_node1) [n:127.0.0.1:33611_bk_ioe%2Fp c:control_collection s:shard1 r:core_node1 x:collection1] o.a.s.c.ZkController numShards not found on descriptor - reading it from system property
   [junit4]   2> 2972117 INFO  (OverseerStateUpdate-95635776446201860-127.0.0.1:33611_bk_ioe%2Fp-n_0000000000) [n:127.0.0.1:33611_bk_ioe%2Fp    ] o.a.s.c.Overseer processMessage: queueSize: 1, message = {
   [junit4]   2>   "core":"collection1",
   [junit4]   2>   "core_node_name":"core_node1",
   [junit4]   2>   "roles":null,
   [junit4]   2>   "base_url":"http://127.0.0.1:33611/bk_ioe/p",
   [junit4]   2>   "node_name":"127.0.0.1:33611_bk_ioe%2Fp",
   [junit4]   2>   "numShards":"1",
   [junit4]   2>   "state":"active",
   [junit4]   2>   "shard":"shard1",
   [junit4]   2>   "collection":"control_collection",
   [junit4]   2>   "operation":"state"} current state version: 2
   [junit4]   2> 2972117 INFO  (OverseerStateUpdate-95635776446201860-127.0.0.1:33611_bk_ioe%2Fp-n_0000000000) [n:127.0.0.1:33611_bk_ioe%2Fp    ] o.a.s.c.o.ReplicaMutator Update state numShards=1 message={
   [junit4]   2>   "core":"collection1",
   [junit4]   2>   "core_node_name":"core_node1",
   [junit4]   2>   "roles":null,
   [junit4]   2>   "base_url":"http://127.0.0.1:33611/bk_ioe/p",
   [junit4]   2>   "node_name":"127.0.0.1:33611_bk_ioe%2Fp",
   [junit4]   2>   "numShards":"1",
   [junit4]   2>   "state":"active",
   [junit4]   2>   "shard":"shard1",
   [junit4]   2>   "collection":"control_collection",
   [junit4]   2>   "operation":"state"}
   [junit4]   2> 2972228 INFO  (zkCallback-3013-thread-1-processing-n:127.0.0.1:33611_bk_ioe%2Fp) [n:127.0.0.1:33611_bk_ioe%2Fp    ] o.a.s.c.c.ZkStateReader A cluster state change: [WatchedEvent state:SyncConnected type:NodeDataChanged path:/clusterstate.json], has occurred - updating... (live nodes size: [1])
   [junit4]   2> 2972299 INFO  (TEST-TestReqParamsAPI.test-seed#[E226DD9A39E9295A]) [    ] o.a.s.c.c.SolrZkClient Using default ZkCredentialsProvider
   [junit4]   2> 2972300 INFO  (TEST-TestReqParamsAPI.test-seed#[E226DD9A39E9295A]) [    ] o.a.s.c.c.ConnectionManager Waiting for client to connect to ZooKeeper
   [junit4]   2> 2972302 INFO  (zkCallback-3015-thread-1) [    ] o.a.s.c.c.ConnectionManager Watcher org.apache.solr.common.cloud.ConnectionManager@6783a9cd name:ZooKeeperConnection Watcher:127.0.0.1:44470/solr got event WatchedEvent state:SyncConnected type:None path:null path:null type:None
   [junit4]   2> 2972302 INFO  (TEST-TestReqParamsAPI.test-seed#[E226DD9A39E9295A]) [    ] o.a.s.c.c.ConnectionManager Client is connected to ZooKeeper
   [junit4]   2> 2972302 INFO  (TEST-TestReqParamsAPI.test-seed#[E226DD9A39E9295A]) [    ] o.a.s.c.c.SolrZkClient Using default ZkACLProvider
   [junit4]   2> 2972302 INFO  (TEST-TestReqParamsAPI.test-seed#[E226DD9A39E9295A]) [    ] o.a.s.c.c.ZkStateReader Updating cluster state from ZooKeeper... 
   [junit4]   2> 2972305 INFO  (TEST-TestReqParamsAPI.test-seed#[E226DD9A39E9295A]) [    ] o.a.s.c.c.ZkStateReader Updated live nodes from ZooKeeper... (0) -> (1)
   [junit4]   2> 2972306 INFO  (TEST-TestReqParamsAPI.test-seed#[E226DD9A39E9295A]) [    ] o.a.s.c.ChaosMonkey monkey: init - expire sessions:false cause connection loss:false
   [junit4]   2> 2972594 INFO  (TEST-TestReqParamsAPI.test-seed#[E226DD9A39E9295A]) [    ] o.a.s.SolrTestCaseJ4 Writing core.properties file to /export/home/jenkins/workspace/Lucene-Solr-6.x-Solaris/solr/build/solr-core/test/J0/temp/solr.handler.TestReqParamsAPI_E226DD9A39E9295A-001/shard-1-001/cores/collection1
   [junit4]   2> 2972595 INFO  (TEST-TestReqParamsAPI.test-seed#[E226DD9A39E9295A]) [    ] o.a.s.c.AbstractFullDistribZkTestBase create jetty 1 in directory /export/home/jenkins/workspace/Lucene-Solr-6.x-Solaris/solr/build/solr-core/test/J0/temp/solr.handler.TestReqParamsAPI_E226DD9A39E9295A-001/shard-1-001
   [junit4]   2> 2972596 INFO  (TEST-TestReqParamsAPI.test-seed#[E226DD9A39E9295A]) [    ] o.e.j.s.Server jetty-9.3.8.v20160314
   [junit4]   2> 2972598 INFO  (TEST-TestReqParamsAPI.test-seed#[E226DD9A39E9295A]) [    ] o.e.j.s.h.ContextHandler Started o.e.j.s.ServletContextHandler@540de7a6{/bk_ioe/p,null,AVAILABLE}
   [junit4]   2> 2972599 INFO  (TEST-TestReqParamsAPI.test-seed#[E226DD9A39E9295A]) [    ] o.e.j.s.ServerConnector Started ServerConnector@cd53fc0{HTTP/1.1,[http/1.1]}{127.0.0.1:58745}
   [junit4]   2> 2972599 INFO  (TEST-TestReqParamsAPI.test-seed#[E226DD9A39E9295A]) [    ] o.e.j.s.Server Started @2977120ms
   [junit4]   2> 2972599 INFO  (TEST-TestReqParamsAPI.test-seed#[E226DD9A39E9295A]) [    ] o.a.s.c.s.e.JettySolrRunner Jetty properties: {solr.data.dir=/export/home/jenkins/workspace/Lucene-Solr-6.x-Solaris/solr/build/solr-core/test/J0/temp/solr.handler.TestReqParamsAPI_E226DD9A39E9295A-001/tempDir-001/jetty1, solrconfig=solrconfig.xml, hostContext=/bk_ioe/p, hostPort=58745, coreRootDirectory=/export/home/jenkins/workspace/Lucene-Solr-6.x-Solaris/solr/build/solr-core/test/J0/../../../../../../../../../../export/home/jenkins/workspace/Lucene-Solr-6.x-Solaris/solr/build/solr-core/test/J0/temp/solr.handler.TestReqParamsAPI_E226DD9A39E9295A-001/shard-1-001/cores}
   [junit4]   2> 2972600 INFO  (TEST-TestReqParamsAPI.test-seed#[E226DD9A39E9295A]) [    ] o.a.s.s.SolrDispatchFilter SolrDispatchFilter.init(): sun.misc.Launcher$AppClassLoader@6d06d69c
   [junit4]   2> 2972600 INFO  (TEST-TestReqParamsAPI.test-seed#[E226DD9A39E9295A]) [    ] o.a.s.c.SolrResourceLoader new SolrResourceLoader for directory: '/export/home/jenkins/workspace/Lucene-Solr-6.x-Solaris/solr/build/solr-core/test/J0/temp/solr.handler.TestReqParamsAPI_E226DD9A39E9295A-001/shard-1-001'
   [junit4]   2> 2972600 INFO  (TEST-TestReqParamsAPI.test-seed#[E226DD9A39E9295A]) [    ] o.a.s.c.SolrResourceLoader JNDI not configured for solr (NoInitialContextEx)
   [junit4]   2> 2972601 INFO  (TEST-TestReqParamsAPI.test-seed#[E226DD9A39E9295A]) [    ] o.a.s.c.SolrResourceLoader solr home defaulted to 'solr/' (could not find system property or JNDI)
   [junit4]   2> 2972601 INFO  (TEST-TestReqParamsAPI.test-seed#[E226DD9A39E9295A]) [    ] o.a.s.c.c.SolrZkClient Using default ZkCredentialsProvider
   [junit4]   2> 2972601 INFO  (TEST-TestReqParamsAPI.test-seed#[E226DD9A39E9295A]) [    ] o.a.s.c.c.ConnectionManager Waiting for client to connect to ZooKeeper
   [junit4]   2> 2972603 INFO  (zkCallback-3016-thread-1) [    ] o.a.s.c.c.ConnectionManager Watcher org.apache.solr.common.cloud.ConnectionManager@707a72a3 name:ZooKeeperConnection Watcher:127.0.0.1:44470/solr got event WatchedEvent state:SyncConnected type:None path:null path:null type:None
   [junit4]   2> 2972603 INFO  (TEST-TestReqParamsAPI.test-seed#[E226DD9A39E9295A]) [    ] o.a.s.c.c.ConnectionManager Client is connected to ZooKeeper
   [junit4]   2> 2972603 INFO  (TEST-TestReqParamsAPI.test-seed#[E226DD9A39E9295A]) [    ] o.a.s.c.c.SolrZkClient Using default ZkACLProvider
   [junit4]   2> 2972605 INFO  (TEST-TestReqParamsAPI.test-seed#[E226DD9A39E9295A]) [    ] o.a.s.s.SolrDispatchFilter Loading solr.xml from SolrHome (not found in ZooKeeper)
   [junit4]   2> 2972605 INFO  (TEST-TestReqParamsAPI.test-seed#[E226DD9A39E9295A]) [    ] o.a.s.c.SolrXmlConfig Loading container configuration from /export/home/jenkins/workspace/Lucene-Solr-6.x-Solaris/solr/build/solr-core/test/J0/temp/solr.handler.TestReqParamsAPI_E226DD9A39E9295A-001/shard-1-001/solr.xml
   [junit4]   2> 2972608 INFO  (TEST-TestReqParamsAPI.test-seed#[E226DD9A39E9295A]) [    ] o.a.s.c.CorePropertiesLocator Config-defined core root directory: /export/home/jenkins/workspace/Lucene-Solr-6.x-Solaris/solr/build/solr-core/test/J0/../../../../../../../../../../export/home/jenkins/workspace/Lucene-Solr-6.x-Solaris/solr/build/solr-core/test/J0/temp/solr.handler.TestReqParamsAPI_E226DD9A39E9295A-001/shard-1-001/cores
   [junit4]   2> 2972608 INFO  (TEST-TestReqParamsAPI.test-seed#[E226DD9A39E9295A]) [    ] o.a.s.c.CoreContainer New CoreContainer 2104242420
   [junit4]   2> 2972608 INFO  (TEST-TestReqParamsAPI.test-seed#[E226DD9A39E9295A]) [    ] o.a.s.c.CoreContainer Loading cores into CoreContainer [instanceDir=/export/home/jenkins/workspace/Lucene-Solr-6.x-Solaris/solr/build/solr-core/test/J0/temp/solr.handler.TestReqParamsAPI_E226DD9A39E9295A-001/shard-1-001]
   [junit4]   2> 2972609 WARN  (TEST-TestReqParamsAPI.test-seed#[E226DD9A39E9295A]) [    ] o.a.s.c.CoreContainer Couldn't add files from /export/home/jenkins/workspace/Lucene-Solr-6.x-Solaris/solr/build/solr-core/test/J0/temp/solr.handler.TestReqParamsAPI_E226DD9A39E9295A-001/shard-1-001/lib to classpath: /export/home/jenkins/workspace/Lucene-Solr-6.x-Solaris/solr/build/solr-core/test/J0/temp/solr.handler.TestReqParamsAPI_E226DD9A39E9295A-001/shard-1-001/lib
   [junit4]   2> 2972609 INFO  (TEST-TestReqParamsAPI.test-seed#[E226DD9A39E9295A]) [    ] o.a.s.h.c.HttpShardHandlerFactory created with socketTimeout : 90000,urlScheme : ,connTimeout : 15000,maxConnectionsPerHost : 20,maxConnections : 10000,corePoolSize : 0,maximumPoolSize : 2147483647,maxThreadIdleTime : 5,sizeOfQueue : -1,fairnessPolicy : false,useRetries : false,
   [junit4]   2> 2972610 INFO  (TEST-TestReqParamsAPI.test-seed#[E226DD9A39E9295A]) [    ] o.a.s.u.UpdateShardHandler Creating UpdateShardHandler HTTP client with params: socketTimeout=340000&connTimeout=45000&retry=true
   [junit4]   2> 2972611 INFO  (TEST-TestReqParamsAPI.test-seed#[E226DD9A39E9295A]) [    ] o.a.s.l.LogWatcher SLF4J impl is org.slf4j.impl.Log4jLoggerFactory
   [junit4]   2> 2972611 INFO  (TEST-TestReqParamsAPI.test-seed#[E226DD9A39E9295A]) [    ] o.a.s.l.LogWatcher Registering Log Listener [Log4j (org.slf4j.impl.Log4jLoggerFactory)]
   [junit4]   2> 2972611 INFO  (TEST-TestReqParamsAPI.test-seed#[E226DD9A39E9295A]) [    ] o.a.s.c.ZkContainer Zookeeper client=127.0.0.1:44470/solr
   [junit4]   2> 2972611 INFO  (TEST-TestReqParamsAPI.test-seed#[E226DD9A39E9295A]) [    ] o.a.s.c.ZkController zkHost includes chroot
   [junit4]   2> 2972611 INFO  (TEST-TestReqParamsAPI.test-seed#[E226DD9A39E9295A]) [    ] o.a.s.c.c.SolrZkClient Using default ZkCredentialsProvider
   [junit4]   2> 2972611 INFO  (TEST-TestReqParamsAPI.test-seed#[E226DD9A39E9295A]) [    ] o.a.s.c.c.ConnectionManager Waiting for client to connect to ZooKeeper
   [junit4]   2> 2972613 INFO  (zkCallback-3019-thread-1) [    ] o.a.s.c.c.ConnectionManager Watcher org.apache.solr.common.cloud.ConnectionManager@15fd3a78 name:ZooKeeperConnection Watcher:127.0.0.1:44470 got event WatchedEvent state:SyncConnected type:None path:null path:null type:None
   [junit4]   2> 2972613 INFO  (TEST-TestReqParamsAPI.test-seed#[E226DD9A39E9295A]) [    ] o.a.s.c.c.ConnectionManager Client is connected to ZooKeeper
   [junit4]   2> 2972614 INFO  (TEST-TestReqParamsAPI.test-seed#[E226DD9A39E9295A]) [    ] o.a.s.c.c.SolrZkClient Using default ZkACLProvider
   [junit4]   2> 2972616 INFO  (TEST-TestReqParamsAPI.test-seed#[E226DD9A39E9295A]) [n:127.0.0.1:58745_bk_ioe%2Fp    ] o.a.s.c.c.ConnectionManager Waiting for client to connect to ZooKeeper
   [junit4]   2> 2972617 INFO  (zkCallback-3020-thread-1-processing-n:127.0.0.1:58745_bk_ioe%2Fp) [n:127.0.0.1:58745_bk_ioe%2Fp    ] o.a.s.c.c.ConnectionManager Watcher org.apache.solr.common.cloud.ConnectionManager@5f776519 name:ZooKeeperConnection Watcher:127.0.0.1:44470/solr got event WatchedEvent state:SyncConnected type:None path:null path:null type:None
   [junit4]   2> 2972617 INFO  (TEST-TestReqParamsAPI.test-seed#[E226DD9A39E9295A]) [n:127.0.0.1:58745_bk_ioe%2Fp    ] o.a.s.c.c.ConnectionManager Client is connected to ZooKeeper
   [junit4]   2> 2972630 INFO  (TEST-TestReqParamsAPI.test-seed#[E226DD9A39E9295A]) [n:127.0.0.1:58745_bk_ioe%2Fp    ] o.a.s.c.c.ZkStateReader Updating cluster state from ZooKeeper... 
   [junit4]   2> 2972632 INFO  (TEST-TestReqParamsAPI.test-seed#[E226DD9A39E9295A]) [n:127.0.0.1:58745_bk_ioe%2Fp    ] o.a.s.c.c.ZkStateReader Updated live nodes from ZooKeeper... (0) -> (1)
   [junit4]   2> 2972637 INFO  (TEST-TestReqParamsAPI.test-seed#[E226DD9A39E9295A]) [n:127.0.0.1:58745_bk_ioe%2Fp    ] o.a.s.c.Overseer Overseer (id=null) closing
   [junit4]   2> 2972638 INFO  (TEST-TestReqParamsAPI.test-seed#[E226DD9A39E9295A]) [n:127.0.0.1:58745_bk_ioe%2Fp    ] o.a.s.c.LeaderElector Joined leadership election with path: /overseer_elect/election/95635776446201864-127.0.0.1:58745_bk_ioe%2Fp-n_0000000001
   [junit4]   2> 2972639 INFO  (TEST-TestReqParamsAPI.test-seed#[E226DD9A39E9295A]) [n:127.0.0.1:58745_bk_ioe%2Fp    ] o.a.s.c.LeaderElector Watching path /overseer_elect/election/95635776446201860-127.0.0.1:33611_bk_ioe%2Fp-n_0000000000 to know if I could be the leader
   [junit4]   2> 2972640 INFO  (TEST-TestReqParamsAPI.test-seed#[E226DD9A39E9295A]) [n:127.0.0.1:58745_bk_ioe%2Fp    ] o.a.s.c.ZkController Publish node=127.0.0.1:58745_bk_ioe%2Fp as DOWN
   [junit4]   2> 2972643 INFO  (OverseerStateUpdate-95635776446201860-127.0.0.1:33611_bk_ioe%2Fp-n_0000000000) [n:127.0.0.1:33611_bk_ioe%2Fp    ] o.a.s.c.Overseer processMessage: queueSize: 1, message = {
   [junit4]   2>   "operation":"downnode",
   [junit4]   2>   "node_name":"127.0.0.1:58745_bk_ioe%2Fp"} current state version: 3
   [junit4]   2> 2972643 INFO  (OverseerStateUpdate-95635776446201860-127.0.0.1:33611_bk_ioe%2Fp-n_0000000000) [n:127.0.0.1:33611_bk_ioe%2Fp    ] o.a.s.c.o.NodeMutator DownNode state invoked for node: 127.0.0.1:58745_bk_ioe%2Fp
   [junit4]   2> 2972749 INFO  (zkCallback-3013-thread-1-processing-n:127.0.0.1:33611_bk_ioe%2Fp) [n:127.0.0.1:33611_bk_ioe%2Fp    ] o.a.s.c.c.ZkStateReader A cluster state change: [WatchedEvent state:SyncConnected type:NodeDataChanged path:/clusterstate.json], has occurred - updating... (live nodes size: [1])
   [junit4]   2> 2972749 INFO  (zkCallback-3020-thread-1-processing-n:127.0.0.1:58745_bk_ioe%2Fp) [n:127.0.0.1:58745_bk_ioe%2Fp    ] o.a.s.c.c.ZkStateReader A cluster state change: [WatchedEvent state:SyncConnected type:NodeDataChanged path:/clusterstate.json], has occurred - updating... (live nodes size: [1])
   [junit4]   2> 2972749 INFO  (zkCallback-3015-thread-1) [    ] o.a.s.c.c.ZkStateReader A cluster state change: [WatchedEvent state:SyncConnected type:NodeDataChanged path:/clusterstate.json], has occurred - updating... (live nodes size: [1])
   [junit4]   2> 2973643 INFO  (TEST-TestReqParamsAPI.test-seed#[E226DD9A39E9295A]) [n:127.0.0.1:58745_bk_ioe%2Fp    ] o.a.s.c.ZkController Register node as live in ZooKeeper:/live_nodes/127.0.0.1:58745_bk_ioe%2Fp
   [junit4]   2> 2973645 INFO  (TEST-TestReqParamsAPI.test-seed#[E226DD9A39E9295A]) [n:127.0.0.1:58745_bk_ioe%2Fp    ] o.a.s.c.c.SolrZkClient makePath: /live_nodes/127.0.0.1:58745_bk_ioe%2Fp
   [junit4]   2> 2973647 INFO  (zkCallback-3013-thread-1-processing-n:127.0.0.1:33611_bk_ioe%2Fp) [n:127.0.0.1:33611_bk_ioe%2Fp    ] o.a.s.c.c.ZkStateReader A live node change: [WatchedEvent state:SyncConnected type:NodeChildrenChanged path:/live_nodes], has occurred - updating... (live nodes size: [1])
   [junit4]   2> 2973647 INFO  (zkCallback-3015-thread-1) [    ] o.a.s.c.c.ZkStateReader A live node change: [WatchedEvent state:SyncConnected type:NodeChildrenChanged path:/live_nodes], has occurred - updating... (live nodes size: [1])
   [junit4]   2> 2973647 INFO  (zkCallback-3020-thread-1-processing-n:127.0.0.1:58745_bk_ioe%2Fp) [n:127.0.0.1:58745_bk_ioe%2Fp    ] o.a.s.c.c.ZkStateReader A live node change: [WatchedEvent state:SyncConnected type:NodeChildrenChanged path:/live_nodes], has occurred - updating... (live nodes size: [1])
   [junit4]   2> 2973647 INFO  (zkCallback-3015-thread-1) [    ] o.a.s.c.c.ZkStateReader Updated live nodes from ZooKeeper... (1) -> (2)
   [junit4]   2> 2973648 INFO  (zkCallback-3013-thread-1-processing-n:127.0.0.1:33611_bk_ioe%2Fp) [n:127.0.0.1:33611_bk_ioe%2Fp    ] o.a.s.c.c.ZkStateReader Updated live nodes from ZooKeeper... (1) -> (2)
   [junit4]   2> 2973648 INFO  (zkCallback-3020-thread-1-processing-n:127.0.0.1:58745_bk_ioe%2Fp) [n:127.0.0.1:58745_bk_ioe%2Fp    ] o.a.s.c.c.ZkStateReader Updated live nodes from ZooKeeper... (1) -> (2)
   [junit4]   2> 2973663 INFO  (TEST-TestReqParamsAPI.test-seed#[E226DD9A39E9295A]) [n:127.0.0.1:58745_bk_ioe%2Fp    ] o.a.s.c.CoreContainer Security conf doesn't exist. Skipping setup for authorization module.
   [junit4]   2> 2973664 INFO  (TEST-TestReqParamsAPI.test-seed#[E226DD9A39E9295A]) [n:127.0.0.1:58745_bk_ioe%2Fp    ] o.a.s.c.CoreContainer No authentication plugin used.
   [junit4]   2> 2973667 INFO  (TEST-TestReqParamsAPI.test-seed#[E226DD9A39E9295A]) [n:127.0.0.1:58745_bk_ioe%2Fp    ] o.a.s.c.CorePropertiesLocator Looking for core definitions underneath /export/home/jenkins/workspace/Lucene-Solr-6.x-Solaris/solr/build/solr-core/test/J0/../../../../../../../../../../export/home/jenkins/workspace/Lucene-Solr-6.x-Solaris/solr/build/solr-core/test/J0/temp/solr.handler.TestReqParamsAPI_E226DD9A39E9295A-001/shard-1-001/cores
   [junit4]   2> 2973669 INFO  (TEST-TestReqParamsAPI.test-seed#[E226DD9A39E9295A]) [n:127.0.0.1:58745_bk_ioe%2Fp    ] o.a.s.c.CoreDescriptor Created CoreDescriptor: {name=collection1, config=solrconfig.xml, transient=false, schema=schema.xml, loadOnStartup=true, configSetProperties=configsetprops.json, collection=collection1, coreNodeName=, dataDir=data/, shard=}
   [junit4]   2> 2973670 INFO  (TEST-TestReqParamsAPI.test-seed#[E226DD9A39E9295A]) [n:127.0.0.1:58745_bk_ioe%2Fp    ] o.a.s.c.CorePropertiesLocator Found core collection1 in /export/home/jenkins/workspace/Lucene-Solr-6.x-Solaris/solr/build/solr-core/test/J0/../../../../../../../../../../export/home/jenkins/workspace/Lucene-Solr-6.x-Solaris/solr/build/solr-core/test/J0/temp/solr.handler.TestReqParamsAPI_E226DD9A39E9295A-001/shard-1-001/cores/collection1
   [junit4]   2> 2973670 INFO  (TEST-TestReqParamsAPI.test-seed#[E226DD9A39E9295A]) [n:127.0.0.1:58745_bk_ioe%2Fp    ] o.a.s.c.CorePropertiesLocator Found 1 core definitions
   [junit4]   2> 2973672 INFO  (TEST-TestReqParamsAPI.test-seed#[E226DD9A39E9295A]) [n:127.0.0.1:58745_bk_ioe%2Fp    ] o.a.s.s.SolrDispatchFilter user.dir=/export/home/jenkins/workspace/Lucene-Solr-6.x-Solaris/solr/build/solr-core/test/J0
   [junit4]   2> 2973672 INFO  (TEST-TestReqParamsAPI.test-seed#[E226DD9A39E9295A]) [n:127.0.0.1:58745_bk_ioe%2Fp    ] o.a.s.s.SolrDispatchFilter SolrDispatchFilter.init() done
   [junit4]   2> 2973678 INFO  (coreLoadExecutor-9449-thread-1-processing-n:127.0.0.1:58745_bk_ioe%2Fp) [n:127.0.0.1:58745_bk_ioe%2Fp c:collection1   x:collection1] o.a.s.c.ZkController publishing state=down
   [junit4]   2> 2973679 INFO  (coreLoadExecutor-9449-thread-1-processing-n:127.0.0.1:58745_bk_ioe%2Fp) [n:127.0.0.1:58745_bk_ioe%2Fp c:collection1   x:collection1] o.a.s.c.ZkController numShards not found on descriptor - reading it from system property
   [junit4]   2> 2973681 INFO  (coreLoadExecutor-9449-thread-1-processing-n:127.0.0.1:58745_bk_ioe%2Fp) [n:127.0.0.1:58745_bk_ioe%2Fp c:collection1   x:collection1] o.a.s.c.ZkController look for our core node name
   [junit4]   2> 2973681 INFO  (OverseerStateUpdate-95635776446201860-127.0.0.1:33611_bk_ioe%2Fp-n_0000000000) [n:127.0.0.1:33611_bk_ioe%2Fp    ] o.a.s.c.Overseer processMessage: queueSize: 1, message = {
   [junit4]   2>   "core":"collection1",
   [junit4]   2>   "roles":null,
   [junit4]   2>   "base_url":"http://127.0.0.1:58745/bk_ioe/p",
   [junit4]   2>   "node_name":"127.0.0.1:58745_bk_ioe%2Fp",
   [junit4]   2>   "numShards":"2",
   [junit4]   2>   "state":"down",
   [junit4]   2>   "shard":null,
   [junit4]   2>   "collection":"collection1",
   [junit4]   2>   "operation":"state"} current state version: 4
   [junit4]   2> 2973682 INFO  (OverseerStateUpdate-95635776446201860-127.0.0.1:33611_bk_ioe%2Fp-n_0000000000) [n:127.0.0.1:33611_bk_ioe%2Fp    ] o.a.s.c.o.ReplicaMutator Update state numShards=2 message={
   [junit4]   2>   "core":"collection1",
   [junit4]   2>   "roles":null,
   [junit4]   2>   "base_url":"http://127.0.0.1:58745/bk_ioe/p",
   [junit4]   2>   "node_name":"127.0.0.1:58745_bk_ioe%2Fp",
   [junit4]   2>   "numShards":"2",
   [junit4]   2>   "state":"down",
   [junit4]   2>   "shard":null,
   [junit4]   2>   "collection":"collection1",
   [junit4]   2>   "operation":"state"}
   [junit4]   2> 2973682 INFO  (OverseerStateUpdate-95635776446201860-127.0.0.1:33611_bk_ioe%2Fp-n_0000000000) [n:127.0.0.1:33611_bk_ioe%2Fp    ] o.a.s.c.o.ClusterStateMutator building a new cName: collection1
   [junit4]   2> 2973682 INFO  (OverseerStateUpdate-95635776446201860-127.0.0.1:33611_bk_ioe%2Fp-n_0000000000) [n:127.0.0.1:33611_bk_ioe%2Fp    ] o.a.s.c.o.ReplicaMutator Assigning new node to shard shard=shard2
   [junit4]   2> 2973788 INFO  (zkCallback-3015-thread-1) [    ] o.a.s.c.c.ZkStateReader A cluster state change: [WatchedEvent state:SyncConnected type:NodeDataChanged path:/clusterstate.json], has occurred - updating... (live nodes size: [2])
   [junit4]   2> 2973788 INFO  (zkCallback-3020-thread-1-processing-n:127.0.0.1:58745_bk_ioe%2Fp) [n:127.0.0.1:58745_bk_ioe%2Fp    ] o.a.s.c.c.ZkStateReader A cluster state change: [WatchedEvent state:SyncConnected type:NodeDataChanged path:/clusterstate.json], has occurred - updating... (live nodes size: [2])
   [junit4]   2> 2973788 INFO  (zkCallback-3013-thread-1-processing-n:127.0.0.1:33611_bk_ioe%2Fp) [n:127.0.0.1:33611_bk_ioe%2Fp    ] o.a.s.c.c.ZkStateReader A cluster state change: [WatchedEvent state:SyncConnected type:NodeDataChanged path:/clusterstate.json], has occurred - updating... (live nodes size: [2])
   [junit4]   2> 2974687 INFO  (coreLoadExecutor-9449-thread-1-processing-n:127.0.0.1:58745_bk_ioe%2Fp) [n:127.0.0.1:58745_bk_ioe%2Fp c:collection1   x:collection1] o.a.s.c.ZkController waiting to find shard id in clusterstate for collection1
   [junit4]   2> 2974687 INFO  (coreLoadExecutor-9449-thread-1-processing-n:127.0.0.1:58745_bk_ioe%2Fp) [n:127.0.0.1:58745_bk_ioe%2Fp c:collection1   x:collection1] o.a.s.c.ZkController Check for collection zkNode:collection1
   [junit4]   2> 2974687 INFO  (coreLoadExecutor-9449-thread-1-processing-n:127.0.0.1:58745_bk_ioe%2Fp) [n:127.0.0.1:58745_bk_ioe%2Fp c:collection1   x:collection1] o.a.s.c.ZkController Collection zkNode exists
   [junit4]   2> 2974687 INFO  (coreLoadExecutor-9449-thread-1-processing-n:127.0.0.1:58745_bk_ioe%2Fp) [n:127.0.0.1:58745_bk_ioe%2Fp c:collection1   x:collection1] o.a.s.c.c.ZkStateReader Load collection config from: [/collections/collection1]
   [junit4]   2> 2974689 INFO  (coreLoadExecutor-9449-thread-1-processing-n:127.0.0.1:58745_bk_ioe%2Fp) [n:127.0.0.1:58745_bk_ioe%2Fp c:collection1   x:collection1] o.a.s.c.c.ZkStateReader path=[/collections/collection1] [configName]=[conf1] specified config exists in ZooKeeper
   [junit4]   2> 2974689 INFO  (coreLoadExecutor-9449-thread-1-processing-n:127.0.0.1:58745_bk_ioe%2Fp) [n:127.0.0.1:58745_bk_ioe%2Fp c:collection1   x:collection1] o.a.s.c.SolrResourceLoader new SolrResourceLoader for directory: '/export/home/jenkins/workspace/Lucene-Solr-6.x-Solaris/solr/build/solr-core/test/J0/temp/solr.handler.TestReqParamsAPI_E226DD9A39E9295A-001/shard-1-001/cores/collection1'
   [junit4]   2> 2974689 INFO  (coreLoadExecutor-9449-thread-1-processing-n:127.0.0.1:58745_bk_ioe%2Fp) [n:127.0.0.1:58745_bk_ioe%2Fp c:collection1   x:collection1] o.a.s.c.SolrResourceLoader JNDI not configured for solr (NoInitialContextEx)
   [junit4]   2> 2974689 INFO  (coreLoadExecutor-9449-thread-1-processing-n:127.0.0.1:58745_bk_ioe%2Fp) [n:127.0.0.1:58745_bk_ioe%2Fp c:collection1   x:collection1] o.a.s.c.SolrResourceLoader solr home defaulted to 'solr/' (could not find system property or JNDI)
   [junit4]   2> 2974692 INFO  (coreLoadExecutor-9449-thread-1-processing-n:127.0.0.1:58745_bk_ioe%2Fp) [n:127.0.0.1:58745_bk_ioe%2Fp c:collection1   x:collection1] o.a.s.c.Config loaded config solrconfig.xml with version 0 
   [junit4]   2> 2974699 INFO  (coreLoadExecutor-9449-thread-1-processing-n:127.0.0.1:58745_bk_ioe%2Fp) [n:127.0.0.1:58745_bk_ioe%2Fp c:collection1   x:collection1] o.a.s.c.SolrConfig current version of requestparams : -1
   [junit4]   2> 2974701 WARN  (coreLoadExecutor-9449-thread-1-processing-n:127.0.0.1:58745_bk_ioe%2Fp) [n:127.0.0.1:58745_bk_ioe%2Fp c:collection1   x:collection1] o.a.s.c.Config Beginning with Solr 5.5, <mergePolicy> is deprecated, use <mergePolicyFactory> instead.
   [junit4]   2> 2974702 INFO  (coreLoadExecutor-9449-thread-1-processing-n:127.0.0.1:58745_bk_ioe%2Fp) [n:127.0.0.1:58745_bk_ioe%2Fp c:collection1   x:collection1] o.a.s.c.SolrConfig Using Lucene MatchVersion: 6.1.0
   [junit4]   2> 2974707 INFO  (coreLoadExecutor-9449-thread-1-processing-n:127.0.0.1:58745_bk_ioe%2Fp) [n:127.0.0.1:58745_bk_ioe%2Fp c:collection1   x:collection1] o.a.s.c.SolrConfig Loaded SolrConfig: solrconfig.xml
   [junit4]   2> 2974714 INFO  (coreLoadExecutor-9449-thread-1-processing-n:127.0.0.1:58745_bk_ioe%2Fp) [n:127.0.0.1:58745_bk_ioe%2Fp c:collection1   x:collection1] o.a.s.s.IndexSchema [collection1] Schema name=test
   [junit4]   2> 2974774 INFO  (coreLoadExecutor-9449-thread-1-processing-n:127.0.0.1:58745_bk_ioe%2Fp) [n:127.0.0.1:58745_bk_ioe%2Fp c:collection1   x:collection1] o.a.s.s.OpenExchangeRatesOrgProvider Initialized with rates=open-exchange-rates.json, refreshInterval=1440.
   [junit4]   2> 2974782 INFO  (coreLoadExecutor-9449-thread-1-processing-n:127.0.0.1:58745_bk_ioe%2Fp) [n:127.0.0.1:58745_bk_ioe%2Fp c:collection1   x:collection1] o.a.s.s.IndexSchema default search field in schema is text
   [junit4]   2> 2974783 INFO  (coreLoadExecutor-9449-thread-1-processing-n:127.0.0.1:58745_bk_ioe%2Fp) [n:127.0.0.1:58745_bk_ioe%2Fp c:collection1   x:collection1] o.a.s.s.IndexSchema unique key field: id
   [junit4]   2> 2974797 INFO  (coreLoadExecutor-9449-thread-1-processing-n:127.0.0.1:58745_bk_ioe%2Fp) [n:127.0.0.1:58745_bk_ioe%2Fp c:collection1   x:collection1] o.a.s.s.FileExchangeRateProvider Reloading exchange rates from file currency.xml
   [junit4]   2> 2974799 INFO  (coreLoadExecutor-9449-thread-1-processing-n:127.0.0.1:58745_bk_ioe%2Fp) [n:127.0.0.1:58745_bk_ioe%2Fp c:collection1   x:collection1] o.a.s.s.FileExchangeRateProvider Reloading exchange rates from file currency.xml
   [junit4]   2> 2974802 INFO  (coreLoadExecutor-9449-thread-1-processing-n:127.0.0.1:58745_bk_ioe%2Fp) [n:127.0.0.1:58745_bk_ioe%2Fp c:collection1   x:collection1] o.a.s.s.OpenExchangeRatesOrgProvider Reloading exchange rates from open-exchange-rates.json
   [junit4]   2> 2974803 INFO  (coreLoadExecutor-9449-thread-1-processing-n:127.0.0.1:58745_bk_ioe%2Fp) [n:127.0.0.1:58745_bk_ioe%2Fp c:collection1   x:collection1] o.a.s.s.OpenExchangeRatesOrgProvider Reloading exchange rates from open-exchange-rates.json
   [junit4]   2> 2974807 INFO  (coreLoadExecutor-9449-thread-1-processing-n:127.0.0.1:58745_bk_ioe%2Fp) [n:127.0.0.1:58745_bk_ioe%2Fp c:collection1   x:collection1] o.a.s.c.ConfigSetProperties Did not find ConfigSet properties, assuming default properties: Can't find resource 'configsetprops.json' in classpath or '/configs/conf1', cwd=/export/home/jenkins/workspace/Lucene-Solr-6.x-Solaris/solr/build/solr-core/test/J0
   [junit4]   2> 2974807 INFO  (coreLoadExecutor-9449-thread-1-processing-n:127.0.0.1:58745_bk_ioe%2Fp) [n:127.0.0.1:58745_bk_ioe%2Fp c:collection1   x:collection1] o.a.s.c.CoreContainer Creating SolrCore 'collection1' using configuration from collection collection1
   [junit4]   2> 2974807 INFO  (coreLoadExecutor-9449-thr

[...truncated too long message...]


   [junit4]   2> NOTE: reproduce with: ant test  -Dtestcase=TestReqParamsAPI -Dtests.method=test -Dtests.seed=E226DD9A39E9295A -Dtests.slow=true -Dtests.locale=ja-JP-u-ca-japanese-x-lvariant-JP -Dtests.timezone=Asia/Tbilisi -Dtests.asserts=true -Dtests.file.encoding=ISO-8859-1
   [junit4] FAILURE 30.1s J0 | TestReqParamsAPI.test <<<
   [junit4]    > Throwable #1: java.lang.AssertionError: Could not get expected value  'null' for path 'response/params/y/p' full output: {
   [junit4]    >   "responseHeader":{
   [junit4]    >     "status":0,
   [junit4]    >     "QTime":0},
   [junit4]    >   "response":{
   [junit4]    >     "znodeVersion":4,
   [junit4]    >     "params":{
   [junit4]    >       "x":{
   [junit4]    >         "a":"A val",
   [junit4]    >         "b":"B val",
   [junit4]    >         "_appends_":{"add":"first"},
   [junit4]    >         "_invariants_":{"fixed":"f"},
   [junit4]    >         "":{"v":1}},
   [junit4]    >       "y":{
   [junit4]    >         "p":"P val",
   [junit4]    >         "q":"Q val",
   [junit4]    >         "":{"v":2}}}}}
   [junit4]    > 	at __randomizedtesting.SeedInfo.seed([E226DD9A39E9295A:6A72E240971544A2]:0)
   [junit4]    > 	at org.apache.solr.core.TestSolrConfigHandler.testForResponseElement(TestSolrConfigHandler.java:458)
   [junit4]    > 	at org.apache.solr.handler.TestReqParamsAPI.testReqParams(TestReqParamsAPI.java:264)
   [junit4]    > 	at org.apache.solr.handler.TestReqParamsAPI.test(TestReqParamsAPI.java:67)
   [junit4]    > 	at org.apache.solr.BaseDistributedSearchTestCase$ShardsRepeatRule$ShardsFixedStatement.callStatement(BaseDistributedSearchTestCase.java:996)
   [junit4]    > 	at org.apache.solr.BaseDistributedSearchTestCase$ShardsRepeatRule$ShardsStatement.evaluate(BaseDistributedSearchTestCase.java:971)
   [junit4]    > 	at java.lang.Thread.run(Thread.java:745)
   [junit4]   2> 2999984 INFO  (SUITE-TestReqParamsAPI-seed#[E226DD9A39E9295A]-worker) [    ] o.a.s.SolrTestCaseJ4 ###deleteCore
   [junit4]   2> NOTE: leaving temporary files on disk at: /export/home/jenkins/workspace/Lucene-Solr-6.x-Solaris/solr/build/solr-core/test/J0/temp/solr.handler.TestReqParamsAPI_E226DD9A39E9295A-001
   [junit4]   2> Mar 29, 2016 9:16:09 PM com.carrotsearch.randomizedtesting.ThreadLeakControl checkThreadLeaks
   [junit4]   2> WARNING: Will linger awaiting termination of 2 leaked thread(s).
   [junit4]   2> NOTE: test params are: codec=Asserting(Lucene60), sim=ClassicSimilarity, locale=ja-JP-u-ca-japanese-x-lvariant-JP, timezone=Asia/Tbilisi
   [junit4]   2> NOTE: SunOS 5.11 amd64/Oracle Corporation 1.8.0_72 (64-bit)/cpus=3,threads=1,free=142236864,total=532676608
   [junit4]   2> NOTE: All tests run in this JVM: [SystemInfoHandlerTest, DocumentAnalysisRequestHandlerTest, TestGeoJSONResponseWriter, ClassificationUpdateProcessorFactoryTest, TestFileDictionaryLookup, StatelessScriptUpdateProcessorFactoryTest, ParsingFieldUpdateProcessorsTest, TestHighFrequencyDictionaryFactory, ShardRoutingTest, TestFieldCollectionResource, TestFastLRUCache, TestPartialUpdateDeduplication, TestLuceneMatchVersion, TestDistributedSearch, TestSweetSpotSimilarityFactory, DOMUtilTest, LeaderFailoverAfterPartitionTest, DistributedQueryComponentOptimizationTest, ClusterStateTest, TestAnalyzeInfixSuggestions, TestSolrDeletionPolicy1, TimeZoneUtilsTest, TestDocSet, ForceLeaderTest, StandardRequestHandlerTest, TestLMDirichletSimilarityFactory, MultiThreadedOCPTest, TestComponentsName, PeerSyncTest, TestHashPartitioner, TestLazyCores, SortSpecParsingTest, TestManagedStopFilterFactory, CdcrUpdateLogTest, RemoteQueryErrorTest, OverseerTaskQueueTest, TestStressUserVersions, ClusterStateUpdateTest, SecurityConfHandlerTest, HdfsDirectoryTest, PrimUtilsTest, AddBlockUpdateTest, DeleteReplicaTest, AddSchemaFieldsUpdateProcessorFactoryTest, MBeansHandlerTest, TestCloudInspectUtil, XsltUpdateRequestHandlerTest, TestArbitraryIndexDir, IndexSchemaTest, TestManagedResourceStorage, DistributedDebugComponentTest, TestImplicitCoreProperties, URLClassifyProcessorTest, TestRuleBasedAuthorizationPlugin, CollectionStateFormat2Test, TestStressReorder, PathHierarchyTokenizerFactoryTest, TestLRUCache, TestObjectReleaseTracker, TestMinMaxOnMultiValuedField, SimpleFacetsTest, JSONWriterTest, TestGroupingSearch, TestNamedUpdateProcessors, TestXmlQParser, TestSmileRequest, ChaosMonkeyNothingIsSafeTest, TestIBSimilarityFactory, DeleteInactiveReplicaTest, DocExpirationUpdateProcessorFactoryTest, TestHdfsUpdateLog, TestSolrConfigHandler, BlockJoinFacetDistribTest, QueryResultKeyTest, RequiredFieldsTest, OverseerTest, TestHashQParserPlugin, DistributedFacetPivotLargeTest, UUIDFieldTest, TestFieldTypeCollectionResource, TestPseudoReturnFields, TestEmbeddedSolrServerConstructors, AnalysisAfterCoreReloadTest, SchemaVersionSpecificBehaviorTest, TestChildDocTransformer, TestReplicaProperties, TestDynamicFieldCollectionResource, TestTolerantSearch, TestComplexPhraseQParserPlugin, ReturnFieldsTest, TestSchemaSimilarityResource, TestPivotHelperCode, JsonLoaderTest, TestDistribIDF, TestFieldSortValues, DocValuesTest, TestCopyFieldCollectionResource, SSLMigrationTest, DistributedQueueTest, MoreLikeThisHandlerTest, SoftAutoCommitTest, FastVectorHighlighterTest, TestDownShardTolerantSearch, LeaderInitiatedRecoveryOnShardRestartTest, TestMiniSolrCloudCluster, SpatialFilterTest, TestHighlightDedupGrouping, TestBulkSchemaAPI, HighlighterTest, TestReplicationHandlerBackup, CollectionsAPIAsyncDistributedZkTest, TestBulkSchemaConcurrent, QueryEqualityTest, ConnectionManagerTest, TestElisionMultitermQuery, TestWordDelimiterFilterFactory, UUIDUpdateProcessorFallbackTest, DistributedFacetPivotSmallAdvancedTest, TestQueryWrapperFilter, IndexBasedSpellCheckerTest, TermsComponentTest, TestRawTransformer, BlockDirectoryTest, TlogReplayBufferedWhileIndexingTest, TestSolrConfigHandlerCloud, TestFaceting, TestReplicationHandler, SOLR749Test, TestRestoreCore, CloudExitableDirectoryReaderTest, LeaderElectionTest, CachingDirectoryFactoryTest, ResponseHeaderTest, HLLUtilTest, SampleTest, TestBlobHandler, TestCryptoKeys, TestExtendedDismaxParser, TestAuthorizationFramework, SimplePostToolTest, BasicDistributedZkTest, UnloadDistributedZkTest, BasicZkTest, RecoveryZkTest, TestRandomDVFaceting, AutoCommitTest, DistributedSpellCheckComponentTest, ZkControllerTest, TestRealTimeGet, HardAutoCommitTest, TestCoreContainer, SolrCoreTest, QueryElevationComponentTest, ConvertedLegacyTest, TestSort, TestFunctionQuery, BasicFunctionalityTest, DirectUpdateHandlerTest, TestIndexSearcher, DistributedQueryElevationComponentTest, SuggesterFSTTest, SolrRequestParserTest, TestFoldingMultitermQuery, SuggesterTest, TestTrie, TestCSVLoader, PolyFieldTest, TestUpdate, TestAtomicUpdateErrorCases, TestRemoteStreaming, DebugComponentTest, DisMaxRequestHandlerTest, TestQueryTypes, PrimitiveFieldTypeTest, XmlUpdateRequestHandlerTest, DocumentBuilderTest, TermVectorComponentTest, TestSolrQueryParser, TestJmxIntegration, UniqFieldsUpdateProcessorFactoryTest, BinaryUpdateRequestHandlerTest, PingRequestHandlerTest, UpdateParamsTest, AlternateDirectoryTest, TestSolrIndexConfig, TestQuerySenderNoQuery, CopyFieldTest, ResponseLogComponentTest, SolrIndexConfigTest, MultiTermTest, TestSearchPerf, TestConfig, ExternalFileFieldSortTest, TestPostingsSolrHighlighter, DirectSolrConnectionTest, SpellPossibilityIteratorTest, TestCharFilters, TestCodecSupport, TestDFRSimilarityFactory, TestLMJelinekMercerSimilarityFactory, TestJmxMonitoredMap, ScriptEngineTest, RAMDirectoryFactoryTest, TestUtils, TestDocumentBuilder, SliceStateTest, CircularListTest, DistributedIntervalFacetingTest, CdcrReplicationDistributedZkTest, CdcrReplicationHandlerTest, CdcrRequestHandlerTest, CollectionReloadTest, CollectionTooManyReplicasTest, DeleteStatusTest, DistribDocExpirationUpdateProcessorTest, DistributedVersionInfoTest, OverseerStatusTest, RestartWhileUpdatingTest, ShardSplitTest, TestCollectionAPI, TestConfigSetsAPIExclusivity, TestLeaderElectionZkExpiry, TestMiniSolrCloudClusterBase, TestRandomRequestDistribution, TestRequestForwarding, TestRequestStatusCollectionAPI, TestSizeLimitedDistributedMap, VMParamsZkACLAndCredentialsProvidersTest, HdfsBasicDistributedZkTest, HdfsChaosMonkeyNothingIsSafeTest, HdfsChaosMonkeySafeLeaderTest, HdfsNNFailoverTest, TestClusterStateMutator, ZkStateWriterTest, RuleEngineTest, DirectoryFactoryTest, ExitableDirectoryReaderTest, TestConfigSetImmutable, TestConfigSetProperties, TestConfigSets, TestInitParams, TestNRTOpen, TestReloadAndDeleteDocs, TestSolrDynamicMBean, TestSolrXml, RequestLoggingTest, TestReqParamsAPI]
   [junit4] Completed [495/585 (1!)] on J0 in 30.60s, 1 test, 1 failure <<< FAILURES!

[...truncated 275 lines...]
BUILD FAILED
/export/home/jenkins/workspace/Lucene-Solr-6.x-Solaris/build.xml:740: The following error occurred while executing this line:
/export/home/jenkins/workspace/Lucene-Solr-6.x-Solaris/build.xml:684: The following error occurred while executing this line:
/export/home/jenkins/workspace/Lucene-Solr-6.x-Solaris/build.xml:59: The following error occurred while executing this line:
/export/home/jenkins/workspace/Lucene-Solr-6.x-Solaris/solr/build.xml:233: The following error occurred while executing this line:
/export/home/jenkins/workspace/Lucene-Solr-6.x-Solaris/solr/common-build.xml:529: The following error occurred while executing this line:
/export/home/jenkins/workspace/Lucene-Solr-6.x-Solaris/lucene/common-build.xml:1457: The following error occurred while executing this line:
/export/home/jenkins/workspace/Lucene-Solr-6.x-Solaris/lucene/common-build.xml:1014: There were test failures: 585 suites (10 ignored), 2364 tests, 1 failure, 86 ignored (70 assumptions) [seed: E226DD9A39E9295A]

Total time: 75 minutes 18 seconds
Build step 'Invoke Ant' marked build as failure
Archiving artifacts
[WARNINGS] Skipping publisher since build result is FAILURE
Recording test results
Email was triggered for: Failure - Any
Sending email for trigger: Failure - Any



Mime
View raw message