lucene-dev mailing list archives

Site index · List index
Message view « Date » · « Thread »
Top « Date » · « Thread »
From Policeman Jenkins Server <jenk...@thetaphi.de>
Subject [JENKINS] Lucene-Solr-6.x-Linux (64bit/jdk1.8.0_72) - Build # 282 - Still Failing!
Date Mon, 28 Mar 2016 23:16:41 GMT
Build: http://jenkins.thetaphi.de/job/Lucene-Solr-6.x-Linux/282/
Java: 64bit/jdk1.8.0_72 -XX:-UseCompressedOops -XX:+UseParallelGC

1 tests failed.
FAILED:  org.apache.lucene.spatial.geopoint.search.TestLegacyGeoPointQuery.testSamePointManyTimes

Error Message:
Java heap space

Stack Trace:
java.lang.OutOfMemoryError: Java heap space
	at __randomizedtesting.SeedInfo.seed([FCABE501292E96FA:40AE5CB3DDEBCF62]:0)
	at org.apache.lucene.spatial.geopoint.search.GeoPointNumericTermsEnum.relateAndRecurse(GeoPointNumericTermsEnum.java:97)
	at org.apache.lucene.spatial.geopoint.search.GeoPointNumericTermsEnum.computeRange(GeoPointNumericTermsEnum.java:69)
	at org.apache.lucene.spatial.geopoint.search.GeoPointNumericTermsEnum.relateAndRecurse(GeoPointNumericTermsEnum.java:100)
	at org.apache.lucene.spatial.geopoint.search.GeoPointNumericTermsEnum.computeRange(GeoPointNumericTermsEnum.java:70)
	at org.apache.lucene.spatial.geopoint.search.GeoPointNumericTermsEnum.relateAndRecurse(GeoPointNumericTermsEnum.java:100)
	at org.apache.lucene.spatial.geopoint.search.GeoPointNumericTermsEnum.computeRange(GeoPointNumericTermsEnum.java:69)
	at org.apache.lucene.spatial.geopoint.search.GeoPointNumericTermsEnum.relateAndRecurse(GeoPointNumericTermsEnum.java:100)
	at org.apache.lucene.spatial.geopoint.search.GeoPointNumericTermsEnum.computeRange(GeoPointNumericTermsEnum.java:69)
	at org.apache.lucene.spatial.geopoint.search.GeoPointNumericTermsEnum.relateAndRecurse(GeoPointNumericTermsEnum.java:100)
	at org.apache.lucene.spatial.geopoint.search.GeoPointNumericTermsEnum.computeRange(GeoPointNumericTermsEnum.java:69)
	at org.apache.lucene.spatial.geopoint.search.GeoPointNumericTermsEnum.relateAndRecurse(GeoPointNumericTermsEnum.java:100)
	at org.apache.lucene.spatial.geopoint.search.GeoPointNumericTermsEnum.computeRange(GeoPointNumericTermsEnum.java:69)
	at org.apache.lucene.spatial.geopoint.search.GeoPointNumericTermsEnum.relateAndRecurse(GeoPointNumericTermsEnum.java:100)
	at org.apache.lucene.spatial.geopoint.search.GeoPointNumericTermsEnum.computeRange(GeoPointNumericTermsEnum.java:69)
	at org.apache.lucene.spatial.geopoint.search.GeoPointNumericTermsEnum.relateAndRecurse(GeoPointNumericTermsEnum.java:100)
	at org.apache.lucene.spatial.geopoint.search.GeoPointNumericTermsEnum.computeRange(GeoPointNumericTermsEnum.java:69)
	at org.apache.lucene.spatial.geopoint.search.GeoPointNumericTermsEnum.relateAndRecurse(GeoPointNumericTermsEnum.java:100)
	at org.apache.lucene.spatial.geopoint.search.GeoPointNumericTermsEnum.computeRange(GeoPointNumericTermsEnum.java:70)
	at org.apache.lucene.spatial.geopoint.search.GeoPointNumericTermsEnum.relateAndRecurse(GeoPointNumericTermsEnum.java:100)
	at org.apache.lucene.spatial.geopoint.search.GeoPointNumericTermsEnum.computeRange(GeoPointNumericTermsEnum.java:69)
	at org.apache.lucene.spatial.geopoint.search.GeoPointNumericTermsEnum.relateAndRecurse(GeoPointNumericTermsEnum.java:100)
	at org.apache.lucene.spatial.geopoint.search.GeoPointNumericTermsEnum.computeRange(GeoPointNumericTermsEnum.java:70)
	at org.apache.lucene.spatial.geopoint.search.GeoPointNumericTermsEnum.relateAndRecurse(GeoPointNumericTermsEnum.java:100)
	at org.apache.lucene.spatial.geopoint.search.GeoPointNumericTermsEnum.computeRange(GeoPointNumericTermsEnum.java:70)
	at org.apache.lucene.spatial.geopoint.search.GeoPointNumericTermsEnum.relateAndRecurse(GeoPointNumericTermsEnum.java:100)
	at org.apache.lucene.spatial.geopoint.search.GeoPointNumericTermsEnum.computeRange(GeoPointNumericTermsEnum.java:69)
	at org.apache.lucene.spatial.geopoint.search.GeoPointNumericTermsEnum.relateAndRecurse(GeoPointNumericTermsEnum.java:100)
	at org.apache.lucene.spatial.geopoint.search.GeoPointNumericTermsEnum.computeRange(GeoPointNumericTermsEnum.java:69)
	at org.apache.lucene.spatial.geopoint.search.GeoPointNumericTermsEnum.relateAndRecurse(GeoPointNumericTermsEnum.java:100)
	at org.apache.lucene.spatial.geopoint.search.GeoPointNumericTermsEnum.computeRange(GeoPointNumericTermsEnum.java:69)
	at org.apache.lucene.spatial.geopoint.search.GeoPointNumericTermsEnum.relateAndRecurse(GeoPointNumericTermsEnum.java:100)
	at org.apache.lucene.spatial.geopoint.search.GeoPointNumericTermsEnum.computeRange(GeoPointNumericTermsEnum.java:70)




Build Log:
[...truncated 8814 lines...]
   [junit4] Suite: org.apache.lucene.spatial.geopoint.search.TestLegacyGeoPointQuery
   [junit4] IGNOR/A 0.01s J1 | TestLegacyGeoPointQuery.testRandomBig
   [junit4]    > Assumption #1: 'nightly' test group is disabled (@Nightly())
   [junit4] IGNOR/A 0.00s J1 | TestLegacyGeoPointQuery.testRandomDistanceHuge
   [junit4]    > Assumption #1: legacy encoding is too slow/hangs on this test
   [junit4] IGNOR/A 0.00s J1 | TestLegacyGeoPointQuery.testRandomDistance
   [junit4]    > Assumption #1: legacy encoding is too slow/hangs on this test
   [junit4]   2> NOTE: reproduce with: ant test  -Dtestcase=TestLegacyGeoPointQuery -Dtests.method=testSamePointManyTimes
-Dtests.seed=FCABE501292E96FA -Dtests.multiplier=3 -Dtests.slow=true -Dtests.locale=sr-RS
-Dtests.timezone=America/Anchorage -Dtests.asserts=true -Dtests.file.encoding=ISO-8859-1
   [junit4] ERROR   65.4s J1 | TestLegacyGeoPointQuery.testSamePointManyTimes <<<
   [junit4]    > Throwable #1: java.lang.OutOfMemoryError: Java heap space
   [junit4]    > 	at __randomizedtesting.SeedInfo.seed([FCABE501292E96FA:40AE5CB3DDEBCF62]:0)
   [junit4]    > 	at org.apache.lucene.spatial.geopoint.search.GeoPointNumericTermsEnum.relateAndRecurse(GeoPointNumericTermsEnum.java:97)
   [junit4]    > 	at org.apache.lucene.spatial.geopoint.search.GeoPointNumericTermsEnum.computeRange(GeoPointNumericTermsEnum.java:69)
   [junit4]    > 	at org.apache.lucene.spatial.geopoint.search.GeoPointNumericTermsEnum.relateAndRecurse(GeoPointNumericTermsEnum.java:100)
   [junit4]    > 	at org.apache.lucene.spatial.geopoint.search.GeoPointNumericTermsEnum.computeRange(GeoPointNumericTermsEnum.java:70)
   [junit4]    > 	at org.apache.lucene.spatial.geopoint.search.GeoPointNumericTermsEnum.relateAndRecurse(GeoPointNumericTermsEnum.java:100)
   [junit4]    > 	at org.apache.lucene.spatial.geopoint.search.GeoPointNumericTermsEnum.computeRange(GeoPointNumericTermsEnum.java:69)
   [junit4]    > 	at org.apache.lucene.spatial.geopoint.search.GeoPointNumericTermsEnum.relateAndRecurse(GeoPointNumericTermsEnum.java:100)
   [junit4]    > 	at org.apache.lucene.spatial.geopoint.search.GeoPointNumericTermsEnum.computeRange(GeoPointNumericTermsEnum.java:69)
   [junit4]    > 	at org.apache.lucene.spatial.geopoint.search.GeoPointNumericTermsEnum.relateAndRecurse(GeoPointNumericTermsEnum.java:100)
   [junit4]    > 	at org.apache.lucene.spatial.geopoint.search.GeoPointNumericTermsEnum.computeRange(GeoPointNumericTermsEnum.java:69)
   [junit4]    > 	at org.apache.lucene.spatial.geopoint.search.GeoPointNumericTermsEnum.relateAndRecurse(GeoPointNumericTermsEnum.java:100)
   [junit4]    > 	at org.apache.lucene.spatial.geopoint.search.GeoPointNumericTermsEnum.computeRange(GeoPointNumericTermsEnum.java:69)
   [junit4]    > 	at org.apache.lucene.spatial.geopoint.search.GeoPointNumericTermsEnum.relateAndRecurse(GeoPointNumericTermsEnum.java:100)
   [junit4]    > 	at org.apache.lucene.spatial.geopoint.search.GeoPointNumericTermsEnum.computeRange(GeoPointNumericTermsEnum.java:69)
   [junit4]    > 	at org.apache.lucene.spatial.geopoint.search.GeoPointNumericTermsEnum.relateAndRecurse(GeoPointNumericTermsEnum.java:100)
   [junit4]    > 	at org.apache.lucene.spatial.geopoint.search.GeoPointNumericTermsEnum.computeRange(GeoPointNumericTermsEnum.java:69)
   [junit4]    > 	at org.apache.lucene.spatial.geopoint.search.GeoPointNumericTermsEnum.relateAndRecurse(GeoPointNumericTermsEnum.java:100)
   [junit4]    > 	at org.apache.lucene.spatial.geopoint.search.GeoPointNumericTermsEnum.computeRange(GeoPointNumericTermsEnum.java:70)
   [junit4]    > 	at org.apache.lucene.spatial.geopoint.search.GeoPointNumericTermsEnum.relateAndRecurse(GeoPointNumericTermsEnum.java:100)
   [junit4]    > 	at org.apache.lucene.spatial.geopoint.search.GeoPointNumericTermsEnum.computeRange(GeoPointNumericTermsEnum.java:69)
   [junit4]    > 	at org.apache.lucene.spatial.geopoint.search.GeoPointNumericTermsEnum.relateAndRecurse(GeoPointNumericTermsEnum.java:100)
   [junit4]    > 	at org.apache.lucene.spatial.geopoint.search.GeoPointNumericTermsEnum.computeRange(GeoPointNumericTermsEnum.java:70)
   [junit4]    > 	at org.apache.lucene.spatial.geopoint.search.GeoPointNumericTermsEnum.relateAndRecurse(GeoPointNumericTermsEnum.java:100)
   [junit4]    > 	at org.apache.lucene.spatial.geopoint.search.GeoPointNumericTermsEnum.computeRange(GeoPointNumericTermsEnum.java:70)
   [junit4]    > 	at org.apache.lucene.spatial.geopoint.search.GeoPointNumericTermsEnum.relateAndRecurse(GeoPointNumericTermsEnum.java:100)
   [junit4]    > 	at org.apache.lucene.spatial.geopoint.search.GeoPointNumericTermsEnum.computeRange(GeoPointNumericTermsEnum.java:69)
   [junit4]    > 	at org.apache.lucene.spatial.geopoint.search.GeoPointNumericTermsEnum.relateAndRecurse(GeoPointNumericTermsEnum.java:100)
   [junit4]    > 	at org.apache.lucene.spatial.geopoint.search.GeoPointNumericTermsEnum.computeRange(GeoPointNumericTermsEnum.java:69)
   [junit4]    > 	at org.apache.lucene.spatial.geopoint.search.GeoPointNumericTermsEnum.relateAndRecurse(GeoPointNumericTermsEnum.java:100)
   [junit4]    > 	at org.apache.lucene.spatial.geopoint.search.GeoPointNumericTermsEnum.computeRange(GeoPointNumericTermsEnum.java:69)
   [junit4]    > 	at org.apache.lucene.spatial.geopoint.search.GeoPointNumericTermsEnum.relateAndRecurse(GeoPointNumericTermsEnum.java:100)
   [junit4]    > 	at org.apache.lucene.spatial.geopoint.search.GeoPointNumericTermsEnum.computeRange(GeoPointNumericTermsEnum.java:70)
   [junit4]   2> NOTE: test params are: codec=Asserting(Lucene60), sim=ClassicSimilarity,
locale=sr-RS, timezone=America/Anchorage
   [junit4]   2> NOTE: Linux 4.2.0-34-generic amd64/Oracle Corporation 1.8.0_72 (64-bit)/cpus=12,threads=1,free=259358616,total=272105472
   [junit4]   2> NOTE: All tests run in this JVM: [TestLegacyGeoPointQuery]
   [junit4] Completed [3/3 (1!)] on J1 in 552.09s, 42 tests, 1 error, 3 skipped <<<
FAILURES!

[...truncated 1 lines...]
   [junit4] JVM J1: stdout was not empty, see: /home/jenkins/workspace/Lucene-Solr-6.x-Linux/lucene/build/spatial/test/temp/junit4-J1-20160328_230724_720.sysout
   [junit4] >>> JVM J1 emitted unexpected output (verbatim) ----
   [junit4] java.lang.OutOfMemoryError: Java heap space
   [junit4] Dumping heap to /home/jenkins/workspace/Lucene-Solr-6.x-Linux/heapdumps/java_pid13199.hprof
...
   [junit4] Heap dump file created [480750363 bytes in 2.740 secs]
   [junit4] <<< JVM J1: EOF ----

[...truncated 10 lines...]
BUILD FAILED
/home/jenkins/workspace/Lucene-Solr-6.x-Linux/build.xml:740: The following error occurred
while executing this line:
/home/jenkins/workspace/Lucene-Solr-6.x-Linux/build.xml:684: The following error occurred
while executing this line:
/home/jenkins/workspace/Lucene-Solr-6.x-Linux/build.xml:59: The following error occurred while
executing this line:
/home/jenkins/workspace/Lucene-Solr-6.x-Linux/lucene/build.xml:476: The following error occurred
while executing this line:
/home/jenkins/workspace/Lucene-Solr-6.x-Linux/lucene/common-build.xml:2187: The following
error occurred while executing this line:
/home/jenkins/workspace/Lucene-Solr-6.x-Linux/lucene/module-build.xml:58: The following error
occurred while executing this line:
/home/jenkins/workspace/Lucene-Solr-6.x-Linux/lucene/common-build.xml:1457: The following
error occurred while executing this line:
/home/jenkins/workspace/Lucene-Solr-6.x-Linux/lucene/common-build.xml:1014: There were test
failures: 3 suites, 95 tests, 1 error, 5 ignored (5 assumptions) [seed: FCABE501292E96FA]

Total time: 27 minutes 31 seconds
Build step 'Invoke Ant' marked build as failure
Archiving artifacts
[WARNINGS] Skipping publisher since build result is FAILURE
Recording test results
Email was triggered for: Failure - Any
Sending email for trigger: Failure - Any



Mime
View raw message