lucene-dev mailing list archives

Site index · List index
Message view « Date » · « Thread »
Top « Date » · « Thread »
From Apache Jenkins Server <jenk...@builds.apache.org>
Subject [JENKINS] Lucene-Solr-Tests-master - Build # 1031 - Still Failing
Date Mon, 21 Mar 2016 21:00:01 GMT
Build: https://builds.apache.org/job/Lucene-Solr-Tests-master/1031/

1 tests failed.
FAILED:  org.apache.solr.handler.TestReqParamsAPI.test

Error Message:
Could not get expected value  'CY val' for path 'response/params/y/c' full output: {   "responseHeader":{     "status":0,     "QTime":0},   "response":{     "znodeVersion":0,     "params":{"x":{         "a":"A val",         "b":"B val",         "":{"v":0}}}}}

Stack Trace:
java.lang.AssertionError: Could not get expected value  'CY val' for path 'response/params/y/c' full output: {
  "responseHeader":{
    "status":0,
    "QTime":0},
  "response":{
    "znodeVersion":0,
    "params":{"x":{
        "a":"A val",
        "b":"B val",
        "":{"v":0}}}}}
	at __randomizedtesting.SeedInfo.seed([221F7F820664862D:AA4B4058A898EBD5]:0)
	at org.junit.Assert.fail(Assert.java:93)
	at org.junit.Assert.assertTrue(Assert.java:43)
	at org.apache.solr.core.TestSolrConfigHandler.testForResponseElement(TestSolrConfigHandler.java:458)
	at org.apache.solr.handler.TestReqParamsAPI.testReqParams(TestReqParamsAPI.java:165)
	at org.apache.solr.handler.TestReqParamsAPI.test(TestReqParamsAPI.java:67)
	at sun.reflect.NativeMethodAccessorImpl.invoke0(Native Method)
	at sun.reflect.NativeMethodAccessorImpl.invoke(NativeMethodAccessorImpl.java:62)
	at sun.reflect.DelegatingMethodAccessorImpl.invoke(DelegatingMethodAccessorImpl.java:43)
	at java.lang.reflect.Method.invoke(Method.java:498)
	at com.carrotsearch.randomizedtesting.RandomizedRunner.invoke(RandomizedRunner.java:1764)
	at com.carrotsearch.randomizedtesting.RandomizedRunner$8.evaluate(RandomizedRunner.java:871)
	at com.carrotsearch.randomizedtesting.RandomizedRunner$9.evaluate(RandomizedRunner.java:907)
	at com.carrotsearch.randomizedtesting.RandomizedRunner$10.evaluate(RandomizedRunner.java:921)
	at org.apache.solr.BaseDistributedSearchTestCase$ShardsRepeatRule$ShardsFixedStatement.callStatement(BaseDistributedSearchTestCase.java:996)
	at org.apache.solr.BaseDistributedSearchTestCase$ShardsRepeatRule$ShardsStatement.evaluate(BaseDistributedSearchTestCase.java:971)
	at com.carrotsearch.randomizedtesting.rules.SystemPropertiesRestoreRule$1.evaluate(SystemPropertiesRestoreRule.java:57)
	at org.apache.lucene.util.TestRuleSetupTeardownChained$1.evaluate(TestRuleSetupTeardownChained.java:49)
	at org.apache.lucene.util.AbstractBeforeAfterRule$1.evaluate(AbstractBeforeAfterRule.java:45)
	at org.apache.lucene.util.TestRuleThreadAndTestName$1.evaluate(TestRuleThreadAndTestName.java:48)
	at org.apache.lucene.util.TestRuleIgnoreAfterMaxFailures$1.evaluate(TestRuleIgnoreAfterMaxFailures.java:64)
	at org.apache.lucene.util.TestRuleMarkFailure$1.evaluate(TestRuleMarkFailure.java:47)
	at com.carrotsearch.randomizedtesting.rules.StatementAdapter.evaluate(StatementAdapter.java:36)
	at com.carrotsearch.randomizedtesting.ThreadLeakControl$StatementRunner.run(ThreadLeakControl.java:367)
	at com.carrotsearch.randomizedtesting.ThreadLeakControl.forkTimeoutingTask(ThreadLeakControl.java:809)
	at com.carrotsearch.randomizedtesting.ThreadLeakControl$3.evaluate(ThreadLeakControl.java:460)
	at com.carrotsearch.randomizedtesting.RandomizedRunner.runSingleTest(RandomizedRunner.java:880)
	at com.carrotsearch.randomizedtesting.RandomizedRunner$5.evaluate(RandomizedRunner.java:781)
	at com.carrotsearch.randomizedtesting.RandomizedRunner$6.evaluate(RandomizedRunner.java:816)
	at com.carrotsearch.randomizedtesting.RandomizedRunner$7.evaluate(RandomizedRunner.java:827)
	at com.carrotsearch.randomizedtesting.rules.StatementAdapter.evaluate(StatementAdapter.java:36)
	at com.carrotsearch.randomizedtesting.rules.SystemPropertiesRestoreRule$1.evaluate(SystemPropertiesRestoreRule.java:57)
	at org.apache.lucene.util.AbstractBeforeAfterRule$1.evaluate(AbstractBeforeAfterRule.java:45)
	at com.carrotsearch.randomizedtesting.rules.StatementAdapter.evaluate(StatementAdapter.java:36)
	at org.apache.lucene.util.TestRuleStoreClassName$1.evaluate(TestRuleStoreClassName.java:41)
	at com.carrotsearch.randomizedtesting.rules.NoShadowingOrOverridesOnMethodsRule$1.evaluate(NoShadowingOrOverridesOnMethodsRule.java:40)
	at com.carrotsearch.randomizedtesting.rules.NoShadowingOrOverridesOnMethodsRule$1.evaluate(NoShadowingOrOverridesOnMethodsRule.java:40)
	at com.carrotsearch.randomizedtesting.rules.StatementAdapter.evaluate(StatementAdapter.java:36)
	at com.carrotsearch.randomizedtesting.rules.StatementAdapter.evaluate(StatementAdapter.java:36)
	at com.carrotsearch.randomizedtesting.rules.StatementAdapter.evaluate(StatementAdapter.java:36)
	at org.apache.lucene.util.TestRuleAssertionsRequired$1.evaluate(TestRuleAssertionsRequired.java:53)
	at org.apache.lucene.util.TestRuleMarkFailure$1.evaluate(TestRuleMarkFailure.java:47)
	at org.apache.lucene.util.TestRuleIgnoreAfterMaxFailures$1.evaluate(TestRuleIgnoreAfterMaxFailures.java:64)
	at org.apache.lucene.util.TestRuleIgnoreTestSuites$1.evaluate(TestRuleIgnoreTestSuites.java:54)
	at com.carrotsearch.randomizedtesting.rules.StatementAdapter.evaluate(StatementAdapter.java:36)
	at com.carrotsearch.randomizedtesting.ThreadLeakControl$StatementRunner.run(ThreadLeakControl.java:367)
	at java.lang.Thread.run(Thread.java:745)




Build Log:
[...truncated 12168 lines...]
   [junit4] Suite: org.apache.solr.handler.TestReqParamsAPI
   [junit4]   2> Creating dataDir: /x1/jenkins/jenkins-slave/workspace/Lucene-Solr-Tests-master/solr/build/solr-core/test/J1/temp/solr.handler.TestReqParamsAPI_221F7F820664862D-001/init-core-data-001
   [junit4]   2> 1854388 INFO  (SUITE-TestReqParamsAPI-seed#[221F7F820664862D]-worker) [    ] o.a.s.SolrTestCaseJ4 Randomized ssl (true) and clientAuth (false)
   [junit4]   2> 1854388 INFO  (SUITE-TestReqParamsAPI-seed#[221F7F820664862D]-worker) [    ] o.a.s.BaseDistributedSearchTestCase Setting hostContext system property: /nocna/
   [junit4]   2> 1854391 INFO  (TEST-TestReqParamsAPI.test-seed#[221F7F820664862D]) [    ] o.a.s.c.ZkTestServer STARTING ZK TEST SERVER
   [junit4]   2> 1854391 INFO  (Thread-6903) [    ] o.a.s.c.ZkTestServer client port:0.0.0.0/0.0.0.0:0
   [junit4]   2> 1854391 INFO  (Thread-6903) [    ] o.a.s.c.ZkTestServer Starting server
   [junit4]   2> 1854491 INFO  (TEST-TestReqParamsAPI.test-seed#[221F7F820664862D]) [    ] o.a.s.c.ZkTestServer start zk server on port:40744
   [junit4]   2> 1854491 INFO  (TEST-TestReqParamsAPI.test-seed#[221F7F820664862D]) [    ] o.a.s.c.c.SolrZkClient Using default ZkCredentialsProvider
   [junit4]   2> 1854492 INFO  (TEST-TestReqParamsAPI.test-seed#[221F7F820664862D]) [    ] o.a.s.c.c.ConnectionManager Waiting for client to connect to ZooKeeper
   [junit4]   2> 1854494 INFO  (zkCallback-1880-thread-1) [    ] o.a.s.c.c.ConnectionManager Watcher org.apache.solr.common.cloud.ConnectionManager@5e2f6d49 name:ZooKeeperConnection Watcher:127.0.0.1:40744 got event WatchedEvent state:SyncConnected type:None path:null path:null type:None
   [junit4]   2> 1854494 INFO  (TEST-TestReqParamsAPI.test-seed#[221F7F820664862D]) [    ] o.a.s.c.c.ConnectionManager Client is connected to ZooKeeper
   [junit4]   2> 1854494 INFO  (TEST-TestReqParamsAPI.test-seed#[221F7F820664862D]) [    ] o.a.s.c.c.SolrZkClient Using default ZkACLProvider
   [junit4]   2> 1854494 INFO  (TEST-TestReqParamsAPI.test-seed#[221F7F820664862D]) [    ] o.a.s.c.c.SolrZkClient makePath: /solr
   [junit4]   2> 1854496 INFO  (TEST-TestReqParamsAPI.test-seed#[221F7F820664862D]) [    ] o.a.s.c.c.SolrZkClient Using default ZkCredentialsProvider
   [junit4]   2> 1854497 INFO  (TEST-TestReqParamsAPI.test-seed#[221F7F820664862D]) [    ] o.a.s.c.c.ConnectionManager Waiting for client to connect to ZooKeeper
   [junit4]   2> 1854497 INFO  (zkCallback-1881-thread-1) [    ] o.a.s.c.c.ConnectionManager Watcher org.apache.solr.common.cloud.ConnectionManager@22a54a79 name:ZooKeeperConnection Watcher:127.0.0.1:40744/solr got event WatchedEvent state:SyncConnected type:None path:null path:null type:None
   [junit4]   2> 1854497 INFO  (TEST-TestReqParamsAPI.test-seed#[221F7F820664862D]) [    ] o.a.s.c.c.ConnectionManager Client is connected to ZooKeeper
   [junit4]   2> 1854498 INFO  (TEST-TestReqParamsAPI.test-seed#[221F7F820664862D]) [    ] o.a.s.c.c.SolrZkClient Using default ZkACLProvider
   [junit4]   2> 1854498 INFO  (TEST-TestReqParamsAPI.test-seed#[221F7F820664862D]) [    ] o.a.s.c.c.SolrZkClient makePath: /collections/collection1
   [junit4]   2> 1854499 INFO  (TEST-TestReqParamsAPI.test-seed#[221F7F820664862D]) [    ] o.a.s.c.c.SolrZkClient makePath: /collections/collection1/shards
   [junit4]   2> 1854500 INFO  (TEST-TestReqParamsAPI.test-seed#[221F7F820664862D]) [    ] o.a.s.c.c.SolrZkClient makePath: /collections/control_collection
   [junit4]   2> 1854501 INFO  (TEST-TestReqParamsAPI.test-seed#[221F7F820664862D]) [    ] o.a.s.c.c.SolrZkClient makePath: /collections/control_collection/shards
   [junit4]   2> 1854503 INFO  (TEST-TestReqParamsAPI.test-seed#[221F7F820664862D]) [    ] o.a.s.c.AbstractZkTestCase put /x1/jenkins/jenkins-slave/workspace/Lucene-Solr-Tests-master/solr/core/src/test-files/solr/collection1/conf/solrconfig-tlog.xml to /configs/conf1/solrconfig.xml
   [junit4]   2> 1854503 INFO  (TEST-TestReqParamsAPI.test-seed#[221F7F820664862D]) [    ] o.a.s.c.c.SolrZkClient makePath: /configs/conf1/solrconfig.xml
   [junit4]   2> 1854505 INFO  (TEST-TestReqParamsAPI.test-seed#[221F7F820664862D]) [    ] o.a.s.c.AbstractZkTestCase put /x1/jenkins/jenkins-slave/workspace/Lucene-Solr-Tests-master/solr/core/src/test-files/solr/collection1/conf/schema.xml to /configs/conf1/schema.xml
   [junit4]   2> 1854505 INFO  (TEST-TestReqParamsAPI.test-seed#[221F7F820664862D]) [    ] o.a.s.c.c.SolrZkClient makePath: /configs/conf1/schema.xml
   [junit4]   2> 1854506 INFO  (TEST-TestReqParamsAPI.test-seed#[221F7F820664862D]) [    ] o.a.s.c.AbstractZkTestCase put /x1/jenkins/jenkins-slave/workspace/Lucene-Solr-Tests-master/solr/core/src/test-files/solr/collection1/conf/solrconfig.snippet.randomindexconfig.xml to /configs/conf1/solrconfig.snippet.randomindexconfig.xml
   [junit4]   2> 1854506 INFO  (TEST-TestReqParamsAPI.test-seed#[221F7F820664862D]) [    ] o.a.s.c.c.SolrZkClient makePath: /configs/conf1/solrconfig.snippet.randomindexconfig.xml
   [junit4]   2> 1854508 INFO  (TEST-TestReqParamsAPI.test-seed#[221F7F820664862D]) [    ] o.a.s.c.AbstractZkTestCase put /x1/jenkins/jenkins-slave/workspace/Lucene-Solr-Tests-master/solr/core/src/test-files/solr/collection1/conf/stopwords.txt to /configs/conf1/stopwords.txt
   [junit4]   2> 1854508 INFO  (TEST-TestReqParamsAPI.test-seed#[221F7F820664862D]) [    ] o.a.s.c.c.SolrZkClient makePath: /configs/conf1/stopwords.txt
   [junit4]   2> 1854509 INFO  (TEST-TestReqParamsAPI.test-seed#[221F7F820664862D]) [    ] o.a.s.c.AbstractZkTestCase put /x1/jenkins/jenkins-slave/workspace/Lucene-Solr-Tests-master/solr/core/src/test-files/solr/collection1/conf/protwords.txt to /configs/conf1/protwords.txt
   [junit4]   2> 1854509 INFO  (TEST-TestReqParamsAPI.test-seed#[221F7F820664862D]) [    ] o.a.s.c.c.SolrZkClient makePath: /configs/conf1/protwords.txt
   [junit4]   2> 1854511 INFO  (TEST-TestReqParamsAPI.test-seed#[221F7F820664862D]) [    ] o.a.s.c.AbstractZkTestCase put /x1/jenkins/jenkins-slave/workspace/Lucene-Solr-Tests-master/solr/core/src/test-files/solr/collection1/conf/currency.xml to /configs/conf1/currency.xml
   [junit4]   2> 1854511 INFO  (TEST-TestReqParamsAPI.test-seed#[221F7F820664862D]) [    ] o.a.s.c.c.SolrZkClient makePath: /configs/conf1/currency.xml
   [junit4]   2> 1854512 INFO  (TEST-TestReqParamsAPI.test-seed#[221F7F820664862D]) [    ] o.a.s.c.AbstractZkTestCase put /x1/jenkins/jenkins-slave/workspace/Lucene-Solr-Tests-master/solr/core/src/test-files/solr/collection1/conf/enumsConfig.xml to /configs/conf1/enumsConfig.xml
   [junit4]   2> 1854512 INFO  (TEST-TestReqParamsAPI.test-seed#[221F7F820664862D]) [    ] o.a.s.c.c.SolrZkClient makePath: /configs/conf1/enumsConfig.xml
   [junit4]   2> 1854513 INFO  (TEST-TestReqParamsAPI.test-seed#[221F7F820664862D]) [    ] o.a.s.c.AbstractZkTestCase put /x1/jenkins/jenkins-slave/workspace/Lucene-Solr-Tests-master/solr/core/src/test-files/solr/collection1/conf/open-exchange-rates.json to /configs/conf1/open-exchange-rates.json
   [junit4]   2> 1854514 INFO  (TEST-TestReqParamsAPI.test-seed#[221F7F820664862D]) [    ] o.a.s.c.c.SolrZkClient makePath: /configs/conf1/open-exchange-rates.json
   [junit4]   2> 1854515 INFO  (TEST-TestReqParamsAPI.test-seed#[221F7F820664862D]) [    ] o.a.s.c.AbstractZkTestCase put /x1/jenkins/jenkins-slave/workspace/Lucene-Solr-Tests-master/solr/core/src/test-files/solr/collection1/conf/mapping-ISOLatin1Accent.txt to /configs/conf1/mapping-ISOLatin1Accent.txt
   [junit4]   2> 1854515 INFO  (TEST-TestReqParamsAPI.test-seed#[221F7F820664862D]) [    ] o.a.s.c.c.SolrZkClient makePath: /configs/conf1/mapping-ISOLatin1Accent.txt
   [junit4]   2> 1854516 INFO  (TEST-TestReqParamsAPI.test-seed#[221F7F820664862D]) [    ] o.a.s.c.AbstractZkTestCase put /x1/jenkins/jenkins-slave/workspace/Lucene-Solr-Tests-master/solr/core/src/test-files/solr/collection1/conf/old_synonyms.txt to /configs/conf1/old_synonyms.txt
   [junit4]   2> 1854516 INFO  (TEST-TestReqParamsAPI.test-seed#[221F7F820664862D]) [    ] o.a.s.c.c.SolrZkClient makePath: /configs/conf1/old_synonyms.txt
   [junit4]   2> 1854518 INFO  (TEST-TestReqParamsAPI.test-seed#[221F7F820664862D]) [    ] o.a.s.c.AbstractZkTestCase put /x1/jenkins/jenkins-slave/workspace/Lucene-Solr-Tests-master/solr/core/src/test-files/solr/collection1/conf/synonyms.txt to /configs/conf1/synonyms.txt
   [junit4]   2> 1854518 INFO  (TEST-TestReqParamsAPI.test-seed#[221F7F820664862D]) [    ] o.a.s.c.c.SolrZkClient makePath: /configs/conf1/synonyms.txt
   [junit4]   2> 1854519 INFO  (TEST-TestReqParamsAPI.test-seed#[221F7F820664862D]) [    ] o.a.s.c.c.SolrZkClient Using default ZkCredentialsProvider
   [junit4]   2> 1854520 INFO  (TEST-TestReqParamsAPI.test-seed#[221F7F820664862D]) [    ] o.a.s.c.c.ConnectionManager Waiting for client to connect to ZooKeeper
   [junit4]   2> 1854520 INFO  (zkCallback-1882-thread-1) [    ] o.a.s.c.c.ConnectionManager Watcher org.apache.solr.common.cloud.ConnectionManager@27888a4 name:ZooKeeperConnection Watcher:127.0.0.1:40744/solr got event WatchedEvent state:SyncConnected type:None path:null path:null type:None
   [junit4]   2> 1854521 INFO  (TEST-TestReqParamsAPI.test-seed#[221F7F820664862D]) [    ] o.a.s.c.c.ConnectionManager Client is connected to ZooKeeper
   [junit4]   2> 1854521 INFO  (TEST-TestReqParamsAPI.test-seed#[221F7F820664862D]) [    ] o.a.s.c.c.SolrZkClient Using default ZkACLProvider
   [junit4]   2> 1854607 INFO  (TEST-TestReqParamsAPI.test-seed#[221F7F820664862D]) [    ] o.a.s.SolrTestCaseJ4 Writing core.properties file to /x1/jenkins/jenkins-slave/workspace/Lucene-Solr-Tests-master/solr/build/solr-core/test/J1/temp/solr.handler.TestReqParamsAPI_221F7F820664862D-001/control-001/cores/collection1
   [junit4]   2> 1854609 INFO  (TEST-TestReqParamsAPI.test-seed#[221F7F820664862D]) [    ] o.e.j.s.Server jetty-9.3.8.v20160314
   [junit4]   2> 1854610 INFO  (TEST-TestReqParamsAPI.test-seed#[221F7F820664862D]) [    ] o.e.j.s.h.ContextHandler Started o.e.j.s.ServletContextHandler@1be23a6d{/nocna,null,AVAILABLE}
   [junit4]   2> 1854611 INFO  (TEST-TestReqParamsAPI.test-seed#[221F7F820664862D]) [    ] o.e.j.u.s.SslContextFactory x509=X509@61520282(solrtest,h=[],w=[]) for SslContextFactory@601bfc8b(file:///x1/jenkins/jenkins-slave/workspace/Lucene-Solr-Tests-master/solr/server/etc/test/solrtest.keystore,file:///x1/jenkins/jenkins-slave/workspace/Lucene-Solr-Tests-master/solr/server/etc/test/solrtest.keystore)
   [junit4]   2> 1854614 INFO  (TEST-TestReqParamsAPI.test-seed#[221F7F820664862D]) [    ] o.e.j.s.ServerConnector Started ServerConnector@17aba19f{SSL,[ssl, http/1.1]}{127.0.0.1:?????}
   [junit4]   2> 1854615 INFO  (TEST-TestReqParamsAPI.test-seed#[221F7F820664862D]) [    ] o.e.j.s.Server Started @???????ms
   [junit4]   2> 1854615 INFO  (TEST-TestReqParamsAPI.test-seed#[221F7F820664862D]) [    ] o.a.s.c.s.e.JettySolrRunner Jetty properties: {solr.data.dir=/x1/jenkins/jenkins-slave/workspace/Lucene-Solr-Tests-master/solr/build/solr-core/test/J1/temp/solr.handler.TestReqParamsAPI_221F7F820664862D-001/tempDir-001/control/data, hostContext=/nocna, hostPort=57118, coreRootDirectory=/x1/jenkins/jenkins-slave/workspace/Lucene-Solr-Tests-master/solr/build/solr-core/test/J1/../../../../../../../../../../x1/jenkins/jenkins-slave/workspace/Lucene-Solr-Tests-master/solr/build/solr-core/test/J1/temp/solr.handler.TestReqParamsAPI_221F7F820664862D-001/control-001/cores}
   [junit4]   2> 1854615 INFO  (TEST-TestReqParamsAPI.test-seed#[221F7F820664862D]) [    ] o.a.s.s.SolrDispatchFilter SolrDispatchFilter.init(): sun.misc.Launcher$AppClassLoader@73d16e93
   [junit4]   2> 1854615 INFO  (TEST-TestReqParamsAPI.test-seed#[221F7F820664862D]) [    ] o.a.s.c.SolrResourceLoader new SolrResourceLoader for directory: '/x1/jenkins/jenkins-slave/workspace/Lucene-Solr-Tests-master/solr/build/solr-core/test/J1/temp/solr.handler.TestReqParamsAPI_221F7F820664862D-001/control-001'
   [junit4]   2> 1854616 INFO  (TEST-TestReqParamsAPI.test-seed#[221F7F820664862D]) [    ] o.a.s.c.SolrResourceLoader JNDI not configured for solr (NoInitialContextEx)
   [junit4]   2> 1854616 INFO  (TEST-TestReqParamsAPI.test-seed#[221F7F820664862D]) [    ] o.a.s.c.SolrResourceLoader solr home defaulted to 'solr/' (could not find system property or JNDI)
   [junit4]   2> 1854616 INFO  (TEST-TestReqParamsAPI.test-seed#[221F7F820664862D]) [    ] o.a.s.c.c.SolrZkClient Using default ZkCredentialsProvider
   [junit4]   2> 1854616 INFO  (TEST-TestReqParamsAPI.test-seed#[221F7F820664862D]) [    ] o.a.s.c.c.ConnectionManager Waiting for client to connect to ZooKeeper
   [junit4]   2> 1854617 INFO  (zkCallback-1883-thread-1) [    ] o.a.s.c.c.ConnectionManager Watcher org.apache.solr.common.cloud.ConnectionManager@1ecd510d name:ZooKeeperConnection Watcher:127.0.0.1:40744/solr got event WatchedEvent state:SyncConnected type:None path:null path:null type:None
   [junit4]   2> 1854617 INFO  (TEST-TestReqParamsAPI.test-seed#[221F7F820664862D]) [    ] o.a.s.c.c.ConnectionManager Client is connected to ZooKeeper
   [junit4]   2> 1854618 INFO  (TEST-TestReqParamsAPI.test-seed#[221F7F820664862D]) [    ] o.a.s.c.c.SolrZkClient Using default ZkACLProvider
   [junit4]   2> 1854619 INFO  (TEST-TestReqParamsAPI.test-seed#[221F7F820664862D]) [    ] o.a.s.s.SolrDispatchFilter Loading solr.xml from SolrHome (not found in ZooKeeper)
   [junit4]   2> 1854619 INFO  (TEST-TestReqParamsAPI.test-seed#[221F7F820664862D]) [    ] o.a.s.c.SolrXmlConfig Loading container configuration from /x1/jenkins/jenkins-slave/workspace/Lucene-Solr-Tests-master/solr/build/solr-core/test/J1/temp/solr.handler.TestReqParamsAPI_221F7F820664862D-001/control-001/solr.xml
   [junit4]   2> 1854623 INFO  (TEST-TestReqParamsAPI.test-seed#[221F7F820664862D]) [    ] o.a.s.c.CorePropertiesLocator Config-defined core root directory: /x1/jenkins/jenkins-slave/workspace/Lucene-Solr-Tests-master/solr/build/solr-core/test/J1/../../../../../../../../../../x1/jenkins/jenkins-slave/workspace/Lucene-Solr-Tests-master/solr/build/solr-core/test/J1/temp/solr.handler.TestReqParamsAPI_221F7F820664862D-001/control-001/cores
   [junit4]   2> 1854623 INFO  (TEST-TestReqParamsAPI.test-seed#[221F7F820664862D]) [    ] o.a.s.c.CoreContainer New CoreContainer 9136255
   [junit4]   2> 1854623 INFO  (TEST-TestReqParamsAPI.test-seed#[221F7F820664862D]) [    ] o.a.s.c.CoreContainer Loading cores into CoreContainer [instanceDir=/x1/jenkins/jenkins-slave/workspace/Lucene-Solr-Tests-master/solr/build/solr-core/test/J1/temp/solr.handler.TestReqParamsAPI_221F7F820664862D-001/control-001]
   [junit4]   2> 1854624 WARN  (TEST-TestReqParamsAPI.test-seed#[221F7F820664862D]) [    ] o.a.s.c.CoreContainer Couldn't add files from /x1/jenkins/jenkins-slave/workspace/Lucene-Solr-Tests-master/solr/build/solr-core/test/J1/temp/solr.handler.TestReqParamsAPI_221F7F820664862D-001/control-001/lib to classpath: /x1/jenkins/jenkins-slave/workspace/Lucene-Solr-Tests-master/solr/build/solr-core/test/J1/temp/solr.handler.TestReqParamsAPI_221F7F820664862D-001/control-001/lib
   [junit4]   2> 1854624 INFO  (TEST-TestReqParamsAPI.test-seed#[221F7F820664862D]) [    ] o.a.s.h.c.HttpShardHandlerFactory created with socketTimeout : 90000,urlScheme : ,connTimeout : 15000,maxConnectionsPerHost : 20,maxConnections : 10000,corePoolSize : 0,maximumPoolSize : 2147483647,maxThreadIdleTime : 5,sizeOfQueue : -1,fairnessPolicy : false,useRetries : false,
   [junit4]   2> 1854626 INFO  (TEST-TestReqParamsAPI.test-seed#[221F7F820664862D]) [    ] o.a.s.u.UpdateShardHandler Creating UpdateShardHandler HTTP client with params: socketTimeout=340000&connTimeout=45000&retry=true
   [junit4]   2> 1854627 INFO  (TEST-TestReqParamsAPI.test-seed#[221F7F820664862D]) [    ] o.a.s.l.LogWatcher SLF4J impl is org.slf4j.impl.Log4jLoggerFactory
   [junit4]   2> 1854627 INFO  (TEST-TestReqParamsAPI.test-seed#[221F7F820664862D]) [    ] o.a.s.l.LogWatcher Registering Log Listener [Log4j (org.slf4j.impl.Log4jLoggerFactory)]
   [junit4]   2> 1854627 INFO  (TEST-TestReqParamsAPI.test-seed#[221F7F820664862D]) [    ] o.a.s.c.ZkContainer Zookeeper client=127.0.0.1:40744/solr
   [junit4]   2> 1854627 INFO  (TEST-TestReqParamsAPI.test-seed#[221F7F820664862D]) [    ] o.a.s.c.ZkController zkHost includes chroot
   [junit4]   2> 1854627 INFO  (TEST-TestReqParamsAPI.test-seed#[221F7F820664862D]) [    ] o.a.s.c.c.SolrZkClient Using default ZkCredentialsProvider
   [junit4]   2> 1854627 INFO  (TEST-TestReqParamsAPI.test-seed#[221F7F820664862D]) [    ] o.a.s.c.c.ConnectionManager Waiting for client to connect to ZooKeeper
   [junit4]   2> 1854628 INFO  (zkCallback-1886-thread-1) [    ] o.a.s.c.c.ConnectionManager Watcher org.apache.solr.common.cloud.ConnectionManager@5658b4e8 name:ZooKeeperConnection Watcher:127.0.0.1:40744 got event WatchedEvent state:SyncConnected type:None path:null path:null type:None
   [junit4]   2> 1854628 INFO  (TEST-TestReqParamsAPI.test-seed#[221F7F820664862D]) [    ] o.a.s.c.c.ConnectionManager Client is connected to ZooKeeper
   [junit4]   2> 1854629 INFO  (TEST-TestReqParamsAPI.test-seed#[221F7F820664862D]) [    ] o.a.s.c.c.SolrZkClient Using default ZkACLProvider
   [junit4]   2> 1854630 INFO  (TEST-TestReqParamsAPI.test-seed#[221F7F820664862D]) [n:127.0.0.1:57118_nocna    ] o.a.s.c.c.ConnectionManager Waiting for client to connect to ZooKeeper
   [junit4]   2> 1854630 INFO  (zkCallback-1887-thread-1-processing-n:127.0.0.1:57118_nocna) [n:127.0.0.1:57118_nocna    ] o.a.s.c.c.ConnectionManager Watcher org.apache.solr.common.cloud.ConnectionManager@1b19c47d name:ZooKeeperConnection Watcher:127.0.0.1:40744/solr got event WatchedEvent state:SyncConnected type:None path:null path:null type:None
   [junit4]   2> 1854631 INFO  (TEST-TestReqParamsAPI.test-seed#[221F7F820664862D]) [n:127.0.0.1:57118_nocna    ] o.a.s.c.c.ConnectionManager Client is connected to ZooKeeper
   [junit4]   2> 1854631 INFO  (TEST-TestReqParamsAPI.test-seed#[221F7F820664862D]) [n:127.0.0.1:57118_nocna    ] o.a.s.c.c.SolrZkClient makePath: /overseer/queue
   [junit4]   2> 1854633 INFO  (TEST-TestReqParamsAPI.test-seed#[221F7F820664862D]) [n:127.0.0.1:57118_nocna    ] o.a.s.c.c.SolrZkClient makePath: /overseer/collection-queue-work
   [junit4]   2> 1854635 INFO  (TEST-TestReqParamsAPI.test-seed#[221F7F820664862D]) [n:127.0.0.1:57118_nocna    ] o.a.s.c.c.SolrZkClient makePath: /overseer/collection-map-running
   [junit4]   2> 1854636 INFO  (TEST-TestReqParamsAPI.test-seed#[221F7F820664862D]) [n:127.0.0.1:57118_nocna    ] o.a.s.c.c.SolrZkClient makePath: /overseer/collection-map-completed
   [junit4]   2> 1854638 INFO  (TEST-TestReqParamsAPI.test-seed#[221F7F820664862D]) [n:127.0.0.1:57118_nocna    ] o.a.s.c.c.SolrZkClient makePath: /overseer/collection-map-failure
   [junit4]   2> 1854640 INFO  (TEST-TestReqParamsAPI.test-seed#[221F7F820664862D]) [n:127.0.0.1:57118_nocna    ] o.a.s.c.c.SolrZkClient makePath: /live_nodes
   [junit4]   2> 1854641 INFO  (TEST-TestReqParamsAPI.test-seed#[221F7F820664862D]) [n:127.0.0.1:57118_nocna    ] o.a.s.c.c.SolrZkClient makePath: /aliases.json
   [junit4]   2> 1854642 INFO  (TEST-TestReqParamsAPI.test-seed#[221F7F820664862D]) [n:127.0.0.1:57118_nocna    ] o.a.s.c.c.SolrZkClient makePath: /clusterstate.json
   [junit4]   2> 1854643 INFO  (TEST-TestReqParamsAPI.test-seed#[221F7F820664862D]) [n:127.0.0.1:57118_nocna    ] o.a.s.c.c.SolrZkClient makePath: /security.json
   [junit4]   2> 1854643 INFO  (TEST-TestReqParamsAPI.test-seed#[221F7F820664862D]) [n:127.0.0.1:57118_nocna    ] o.a.s.c.c.ZkStateReader Updating cluster state from ZooKeeper... 
   [junit4]   2> 1854644 INFO  (TEST-TestReqParamsAPI.test-seed#[221F7F820664862D]) [n:127.0.0.1:57118_nocna    ] o.a.s.c.c.ZkStateReader Updated live nodes from ZooKeeper... (0) -> (0)
   [junit4]   2> 1854646 INFO  (TEST-TestReqParamsAPI.test-seed#[221F7F820664862D]) [n:127.0.0.1:57118_nocna    ] o.a.s.c.c.SolrZkClient makePath: /overseer_elect
   [junit4]   2> 1854647 INFO  (TEST-TestReqParamsAPI.test-seed#[221F7F820664862D]) [n:127.0.0.1:57118_nocna    ] o.a.s.c.c.SolrZkClient makePath: /overseer_elect/election
   [junit4]   2> 1854648 INFO  (TEST-TestReqParamsAPI.test-seed#[221F7F820664862D]) [n:127.0.0.1:57118_nocna    ] o.a.s.c.Overseer Overseer (id=null) closing
   [junit4]   2> 1854648 INFO  (TEST-TestReqParamsAPI.test-seed#[221F7F820664862D]) [n:127.0.0.1:57118_nocna    ] o.a.s.c.LeaderElector Joined leadership election with path: /overseer_elect/election/95590391498932229-127.0.0.1:57118_nocna-n_0000000000
   [junit4]   2> 1854648 INFO  (TEST-TestReqParamsAPI.test-seed#[221F7F820664862D]) [n:127.0.0.1:57118_nocna    ] o.a.s.c.OverseerElectionContext I am going to be the leader 127.0.0.1:57118_nocna
   [junit4]   2> 1854648 INFO  (TEST-TestReqParamsAPI.test-seed#[221F7F820664862D]) [n:127.0.0.1:57118_nocna    ] o.a.s.c.c.SolrZkClient makePath: /overseer_elect/leader
   [junit4]   2> 1854649 INFO  (TEST-TestReqParamsAPI.test-seed#[221F7F820664862D]) [n:127.0.0.1:57118_nocna    ] o.a.s.c.Overseer Overseer (id=95590391498932229-127.0.0.1:57118_nocna-n_0000000000) starting
   [junit4]   2> 1854651 INFO  (TEST-TestReqParamsAPI.test-seed#[221F7F820664862D]) [n:127.0.0.1:57118_nocna    ] o.a.s.c.c.SolrZkClient makePath: /overseer/queue-work
   [junit4]   2> 1854655 INFO  (TEST-TestReqParamsAPI.test-seed#[221F7F820664862D]) [n:127.0.0.1:57118_nocna    ] o.a.s.c.OverseerAutoReplicaFailoverThread Starting OverseerAutoReplicaFailoverThread autoReplicaFailoverWorkLoopDelay=10000 autoReplicaFailoverWaitAfterExpiration=30000 autoReplicaFailoverBadNodeExpiration=60000
   [junit4]   2> 1854656 INFO  (OverseerCollectionConfigSetProcessor-95590391498932229-127.0.0.1:57118_nocna-n_0000000000) [n:127.0.0.1:57118_nocna    ] o.a.s.c.OverseerTaskProcessor Process current queue of overseer operations
   [junit4]   2> 1854656 INFO  (OverseerStateUpdate-95590391498932229-127.0.0.1:57118_nocna-n_0000000000) [n:127.0.0.1:57118_nocna    ] o.a.s.c.Overseer Starting to work on the main queue
   [junit4]   2> 1854656 INFO  (TEST-TestReqParamsAPI.test-seed#[221F7F820664862D]) [n:127.0.0.1:57118_nocna    ] o.a.s.c.ZkController Register node as live in ZooKeeper:/live_nodes/127.0.0.1:57118_nocna
   [junit4]   2> 1854656 INFO  (TEST-TestReqParamsAPI.test-seed#[221F7F820664862D]) [n:127.0.0.1:57118_nocna    ] o.a.s.c.c.SolrZkClient makePath: /live_nodes/127.0.0.1:57118_nocna
   [junit4]   2> 1854658 INFO  (OverseerStateUpdate-95590391498932229-127.0.0.1:57118_nocna-n_0000000000) [n:127.0.0.1:57118_nocna    ] o.a.s.c.c.ZkStateReader Updated live nodes from ZooKeeper... (0) -> (0)
   [junit4]   2> 1854658 INFO  (zkCallback-1887-thread-1-processing-n:127.0.0.1:57118_nocna) [n:127.0.0.1:57118_nocna    ] o.a.s.c.c.ZkStateReader A live node change: [WatchedEvent state:SyncConnected type:NodeChildrenChanged path:/live_nodes], has occurred - updating... (live nodes size: [0])
   [junit4]   2> 1854658 INFO  (zkCallback-1887-thread-1-processing-n:127.0.0.1:57118_nocna) [n:127.0.0.1:57118_nocna    ] o.a.s.c.c.ZkStateReader Updated live nodes from ZooKeeper... (0) -> (1)
   [junit4]   2> 1854666 INFO  (TEST-TestReqParamsAPI.test-seed#[221F7F820664862D]) [n:127.0.0.1:57118_nocna    ] o.a.s.c.CoreContainer Security conf doesn't exist. Skipping setup for authorization module.
   [junit4]   2> 1854666 INFO  (TEST-TestReqParamsAPI.test-seed#[221F7F820664862D]) [n:127.0.0.1:57118_nocna    ] o.a.s.c.CoreContainer No authentication plugin used.
   [junit4]   2> 1854666 INFO  (TEST-TestReqParamsAPI.test-seed#[221F7F820664862D]) [n:127.0.0.1:57118_nocna    ] o.a.s.c.CorePropertiesLocator Looking for core definitions underneath /x1/jenkins/jenkins-slave/workspace/Lucene-Solr-Tests-master/solr/build/solr-core/test/J1/../../../../../../../../../../x1/jenkins/jenkins-slave/workspace/Lucene-Solr-Tests-master/solr/build/solr-core/test/J1/temp/solr.handler.TestReqParamsAPI_221F7F820664862D-001/control-001/cores
   [junit4]   2> 1854667 INFO  (TEST-TestReqParamsAPI.test-seed#[221F7F820664862D]) [n:127.0.0.1:57118_nocna    ] o.a.s.c.CoreDescriptor Created CoreDescriptor: {name=collection1, config=solrconfig.xml, transient=false, schema=schema.xml, loadOnStartup=true, configSetProperties=configsetprops.json, collection=control_collection, coreNodeName=, dataDir=data/, shard=}
   [junit4]   2> 1854667 INFO  (TEST-TestReqParamsAPI.test-seed#[221F7F820664862D]) [n:127.0.0.1:57118_nocna    ] o.a.s.c.CorePropertiesLocator Found core collection1 in /x1/jenkins/jenkins-slave/workspace/Lucene-Solr-Tests-master/solr/build/solr-core/test/J1/../../../../../../../../../../x1/jenkins/jenkins-slave/workspace/Lucene-Solr-Tests-master/solr/build/solr-core/test/J1/temp/solr.handler.TestReqParamsAPI_221F7F820664862D-001/control-001/cores/collection1
   [junit4]   2> 1854667 INFO  (TEST-TestReqParamsAPI.test-seed#[221F7F820664862D]) [n:127.0.0.1:57118_nocna    ] o.a.s.c.CorePropertiesLocator Found 1 core definitions
   [junit4]   2> 1854669 INFO  (TEST-TestReqParamsAPI.test-seed#[221F7F820664862D]) [n:127.0.0.1:57118_nocna    ] o.a.s.s.SolrDispatchFilter user.dir=/x1/jenkins/jenkins-slave/workspace/Lucene-Solr-Tests-master/solr/build/solr-core/test/J1
   [junit4]   2> 1854669 INFO  (TEST-TestReqParamsAPI.test-seed#[221F7F820664862D]) [n:127.0.0.1:57118_nocna    ] o.a.s.s.SolrDispatchFilter SolrDispatchFilter.init() done
   [junit4]   2> 1854670 INFO  (coreLoadExecutor-5154-thread-1-processing-n:127.0.0.1:57118_nocna) [n:127.0.0.1:57118_nocna c:control_collection   x:collection1] o.a.s.c.ZkController publishing state=down
   [junit4]   2> 1854670 INFO  (coreLoadExecutor-5154-thread-1-processing-n:127.0.0.1:57118_nocna) [n:127.0.0.1:57118_nocna c:control_collection   x:collection1] o.a.s.c.ZkController numShards not found on descriptor - reading it from system property
   [junit4]   2> 1854671 INFO  (OverseerStateUpdate-95590391498932229-127.0.0.1:57118_nocna-n_0000000000) [n:127.0.0.1:57118_nocna    ] o.a.s.c.Overseer processMessage: queueSize: 1, message = {
   [junit4]   2>   "core":"collection1",
   [junit4]   2>   "roles":null,
   [junit4]   2>   "base_url":"https://127.0.0.1:57118/nocna",
   [junit4]   2>   "node_name":"127.0.0.1:57118_nocna",
   [junit4]   2>   "numShards":"1",
   [junit4]   2>   "state":"down",
   [junit4]   2>   "shard":null,
   [junit4]   2>   "collection":"control_collection",
   [junit4]   2>   "operation":"state"} current state version: 0
   [junit4]   2> 1854672 INFO  (coreLoadExecutor-5154-thread-1-processing-n:127.0.0.1:57118_nocna) [n:127.0.0.1:57118_nocna c:control_collection   x:collection1] o.a.s.c.ZkController look for our core node name
   [junit4]   2> 1854672 INFO  (OverseerStateUpdate-95590391498932229-127.0.0.1:57118_nocna-n_0000000000) [n:127.0.0.1:57118_nocna    ] o.a.s.c.o.ReplicaMutator Update state numShards=1 message={
   [junit4]   2>   "core":"collection1",
   [junit4]   2>   "roles":null,
   [junit4]   2>   "base_url":"https://127.0.0.1:57118/nocna",
   [junit4]   2>   "node_name":"127.0.0.1:57118_nocna",
   [junit4]   2>   "numShards":"1",
   [junit4]   2>   "state":"down",
   [junit4]   2>   "shard":null,
   [junit4]   2>   "collection":"control_collection",
   [junit4]   2>   "operation":"state"}
   [junit4]   2> 1854672 INFO  (OverseerStateUpdate-95590391498932229-127.0.0.1:57118_nocna-n_0000000000) [n:127.0.0.1:57118_nocna    ] o.a.s.c.o.ClusterStateMutator building a new cName: control_collection
   [junit4]   2> 1854673 INFO  (OverseerStateUpdate-95590391498932229-127.0.0.1:57118_nocna-n_0000000000) [n:127.0.0.1:57118_nocna    ] o.a.s.c.o.ReplicaMutator Assigning new node to shard shard=shard1
   [junit4]   2> 1854674 INFO  (zkCallback-1887-thread-1-processing-n:127.0.0.1:57118_nocna) [n:127.0.0.1:57118_nocna    ] o.a.s.c.c.ZkStateReader A cluster state change: [WatchedEvent state:SyncConnected type:NodeDataChanged path:/clusterstate.json], has occurred - updating... (live nodes size: [1])
   [junit4]   2> 1855672 INFO  (coreLoadExecutor-5154-thread-1-processing-n:127.0.0.1:57118_nocna) [n:127.0.0.1:57118_nocna c:control_collection   x:collection1] o.a.s.c.ZkController waiting to find shard id in clusterstate for collection1
   [junit4]   2> 1855672 INFO  (coreLoadExecutor-5154-thread-1-processing-n:127.0.0.1:57118_nocna) [n:127.0.0.1:57118_nocna c:control_collection   x:collection1] o.a.s.c.ZkController Check for collection zkNode:control_collection
   [junit4]   2> 1855673 INFO  (coreLoadExecutor-5154-thread-1-processing-n:127.0.0.1:57118_nocna) [n:127.0.0.1:57118_nocna c:control_collection   x:collection1] o.a.s.c.ZkController Collection zkNode exists
   [junit4]   2> 1855673 INFO  (coreLoadExecutor-5154-thread-1-processing-n:127.0.0.1:57118_nocna) [n:127.0.0.1:57118_nocna c:control_collection   x:collection1] o.a.s.c.c.ZkStateReader Load collection config from: [/collections/control_collection]
   [junit4]   2> 1855673 INFO  (coreLoadExecutor-5154-thread-1-processing-n:127.0.0.1:57118_nocna) [n:127.0.0.1:57118_nocna c:control_collection   x:collection1] o.a.s.c.c.ZkStateReader path=[/collections/control_collection] [configName]=[conf1] specified config exists in ZooKeeper
   [junit4]   2> 1855674 INFO  (coreLoadExecutor-5154-thread-1-processing-n:127.0.0.1:57118_nocna) [n:127.0.0.1:57118_nocna c:control_collection   x:collection1] o.a.s.c.SolrResourceLoader new SolrResourceLoader for directory: '/x1/jenkins/jenkins-slave/workspace/Lucene-Solr-Tests-master/solr/build/solr-core/test/J1/temp/solr.handler.TestReqParamsAPI_221F7F820664862D-001/control-001/cores/collection1'
   [junit4]   2> 1855674 INFO  (coreLoadExecutor-5154-thread-1-processing-n:127.0.0.1:57118_nocna) [n:127.0.0.1:57118_nocna c:control_collection   x:collection1] o.a.s.c.SolrResourceLoader JNDI not configured for solr (NoInitialContextEx)
   [junit4]   2> 1855674 INFO  (coreLoadExecutor-5154-thread-1-processing-n:127.0.0.1:57118_nocna) [n:127.0.0.1:57118_nocna c:control_collection   x:collection1] o.a.s.c.SolrResourceLoader solr home defaulted to 'solr/' (could not find system property or JNDI)
   [junit4]   2> 1855675 INFO  (coreLoadExecutor-5154-thread-1-processing-n:127.0.0.1:57118_nocna) [n:127.0.0.1:57118_nocna c:control_collection   x:collection1] o.a.s.c.Config loaded config solrconfig.xml with version 0 
   [junit4]   2> 1855679 INFO  (coreLoadExecutor-5154-thread-1-processing-n:127.0.0.1:57118_nocna) [n:127.0.0.1:57118_nocna c:control_collection   x:collection1] o.a.s.c.SolrConfig current version of requestparams : -1
   [junit4]   2> 1855683 INFO  (coreLoadExecutor-5154-thread-1-processing-n:127.0.0.1:57118_nocna) [n:127.0.0.1:57118_nocna c:control_collection   x:collection1] o.a.s.c.SolrConfig Using Lucene MatchVersion: 7.0.0
   [junit4]   2> 1855692 INFO  (coreLoadExecutor-5154-thread-1-processing-n:127.0.0.1:57118_nocna) [n:127.0.0.1:57118_nocna c:control_collection   x:collection1] o.a.s.c.SolrConfig Loaded SolrConfig: solrconfig.xml
   [junit4]   2> 1855697 INFO  (coreLoadExecutor-5154-thread-1-processing-n:127.0.0.1:57118_nocna) [n:127.0.0.1:57118_nocna c:control_collection   x:collection1] o.a.s.s.IndexSchema [collection1] Schema name=test
   [junit4]   2> 1855781 INFO  (coreLoadExecutor-5154-thread-1-processing-n:127.0.0.1:57118_nocna) [n:127.0.0.1:57118_nocna c:control_collection   x:collection1] o.a.s.s.OpenExchangeRatesOrgProvider Initialized with rates=open-exchange-rates.json, refreshInterval=1440.
   [junit4]   2> 1855786 INFO  (coreLoadExecutor-5154-thread-1-processing-n:127.0.0.1:57118_nocna) [n:127.0.0.1:57118_nocna c:control_collection   x:collection1] o.a.s.s.IndexSchema default search field in schema is text
   [junit4]   2> 1855787 INFO  (coreLoadExecutor-5154-thread-1-processing-n:127.0.0.1:57118_nocna) [n:127.0.0.1:57118_nocna c:control_collection   x:collection1] o.a.s.s.IndexSchema unique key field: id
   [junit4]   2> 1855794 INFO  (coreLoadExecutor-5154-thread-1-processing-n:127.0.0.1:57118_nocna) [n:127.0.0.1:57118_nocna c:control_collection   x:collection1] o.a.s.s.FileExchangeRateProvider Reloading exchange rates from file currency.xml
   [junit4]   2> 1855796 INFO  (coreLoadExecutor-5154-thread-1-processing-n:127.0.0.1:57118_nocna) [n:127.0.0.1:57118_nocna c:control_collection   x:collection1] o.a.s.s.FileExchangeRateProvider Reloading exchange rates from file currency.xml
   [junit4]   2> 1855798 INFO  (coreLoadExecutor-5154-thread-1-processing-n:127.0.0.1:57118_nocna) [n:127.0.0.1:57118_nocna c:control_collection   x:collection1] o.a.s.s.OpenExchangeRatesOrgProvider Reloading exchange rates from open-exchange-rates.json
   [junit4]   2> 1855798 INFO  (coreLoadExecutor-5154-thread-1-processing-n:127.0.0.1:57118_nocna) [n:127.0.0.1:57118_nocna c:control_collection   x:collection1] o.a.s.s.OpenExchangeRatesOrgProvider Reloading exchange rates from open-exchange-rates.json
   [junit4]   2> 1855800 INFO  (coreLoadExecutor-5154-thread-1-processing-n:127.0.0.1:57118_nocna) [n:127.0.0.1:57118_nocna c:control_collection   x:collection1] o.a.s.c.ConfigSetProperties Did not find ConfigSet properties, assuming default properties: Can't find resource 'configsetprops.json' in classpath or '/configs/conf1', cwd=/x1/jenkins/jenkins-slave/workspace/Lucene-Solr-Tests-master/solr/build/solr-core/test/J1
   [junit4]   2> 1855800 INFO  (coreLoadExecutor-5154-thread-1-processing-n:127.0.0.1:57118_nocna) [n:127.0.0.1:57118_nocna c:control_collection   x:collection1] o.a.s.c.CoreContainer Creating SolrCore 'collection1' using configuration from collection control_collection
   [junit4]   2> 1855800 INFO  (coreLoadExecutor-5154-thread-1-processing-n:127.0.0.1:57118_nocna) [n:127.0.0.1:57118_nocna c:control_collection s:shard1 r:core_node1 x:collection1] o.a.s.c.SolrCore org.apache.solr.core.MockDirectoryFactory
   [junit4]   2> 1855800 INFO  (coreLoadExecutor-5154-thread-1-processing-n:127.0.0.1:57118_nocna) [n:127.0.0.1:57118_nocna c:control_collection s:shard1 r:core_node1 x:collection1] o.a.s.c.SolrCore [[collection1] ] Opening new SolrCore at [/x1/jenkins/jenkins-slave/workspace/Lucene-Solr-Tests-master/solr/build/solr-core/test/J1/temp/solr.handler.TestReqParamsAPI_221F7F820664862D-001/control-001/cores/collection1], dataDir=[/x1/jenkins/jenkins-slave/workspace/Lucene-Solr-Tests-master/solr/build/solr-core/test/J1/../../../../../../../../../../x1/jenkins/jenkins-slave/workspace/Lucene-Solr-Tests-master/solr/build/solr-core/test/J1/temp/solr.handler.TestReqParamsAPI_221F7F820664862D-001/control-001/cores/collection1/data/]
   [junit4]   2> 1855800 INFO  (coreLoadExecutor-5154-thread-1-processing-n:127.0.0.1:57118_nocna) [n:127.0.0.1:57118_nocna c:control_collection s:shard1 r:core_node1 x:collection1] o.a.s.c.JmxMonitoredMap JMX monitoring is enabled. Adding Solr mbeans to JMX Server: com.sun.jmx.mbeanserver.JmxMBeanServer@5283e973
   [junit4]   2> 1855801 INFO  (coreLoadExecutor-5154-thread-1-processing-n:127.0.0.1:57118_nocna) [n:127.0.0.1:57118_nocna c:control_collection s:shard1 r:core_node1 x:collection1] o.a.s.c.CachingDirectoryFactory return new directory for /x1/jenkins/jenkins-slave/workspace/Lucene-Solr-Tests-master/solr/build/solr-core/test/J1/../../../../../../../../../../x1/jenkins/jenkins-slave/workspace/Lucene-Solr-Tests-master/solr/build/solr-core/test/J1/temp/solr.handler.TestReqParamsAPI_221F7F820664862D-001/control-001/cores/collection1/data
   [junit4]   2> 1855801 INFO  (coreLoadExecutor-5154-thread-1-processing-n:127.0.0.1:57118_nocna) [n:127.0.0.1:57118_nocna c:control_collection s:shard1 r:core_node1 x:collection1] o.a.s.c.SolrCore New index directory detected: old=null new=/x1/jenkins/jenkins-slave/workspace/Lucene-Solr-Tests-master/solr/build/solr-core/test/J1/../../../../../../../../../../x1/jenkins/jenkins-slave/workspace/Lucene-Solr-Tests-master/solr/build/solr-core/test/J1/temp/solr.handler.TestReqParamsAPI_221F7F820664862D-001/control-001/cores/collection1/data/index/
   [junit4]   2> 1855801 WARN  (coreLoadExecutor-5154-thread-1-processing-n:127.0.0.1:57118_nocna) [n:127.0.0.1:57118_nocna c:control_collection s:shard1 r:core_node1 x:collection1] o.a.s.c.SolrCore [collection1] Solr index directory '/x1/jenkins/jenkins-slave/workspace/Lucene-Solr-Tests-master/solr/build/solr-core/test/J1/../../../../../../../../../../x1/jenkins/jenkins-slave/workspace/Lucene-Solr-Tests-master/solr/build/solr-core/test/J1/temp/solr.handler.TestReqParamsAPI_221F7F820664862D-001/control-001/cores/collection1/data/index' doesn't exist. Creating new index...
   [junit4]   2> 1855801 INFO  (coreLoadExecutor-5154-thread-1-processing-n:127.0.0.1:57118_nocna) [n:127.0.0.1:57118_nocna c:control_collection s:shard1 r:core_node1 x:collection1] o.a.s.c.CachingDirectoryFactory return new directory for /x1/jenkins/jenkins-slave/workspace/Lucene-Solr-Tests-master/solr/build/solr-core/test/J1/../../../../../../../../../../x1/jenkins/jenkins-slave/workspace/Lucene-Solr-Tests-master/solr/build/solr-core/test/J1/temp/solr.handler.TestReqParamsAPI_221F7F820664862D-001/control-001/cores/collection1/data/index
   [junit4]   2> 1855801 INFO  (coreLoadExecutor-5154-thread-1-processing-n:127.0.0.1:57118_nocna) [n:127.0.0.1:57118_nocna c:control_collection s:shard1 r:core_node1 x:collection1] o.a.s.u.RandomMergePolicy RandomMergePolicy wrapping class org.apache.lucene.index.TieredMergePolicy: [TieredMergePolicy: maxMergeAtOnce=30, maxMergeAtOnceExplicit=25, maxMergedSegmentMB=8.2216796875, floorSegmentMB=1.111328125, forceMergeDeletesPctAllowed=29.542610510481655, segmentsPerTier=49.0, maxCFSSegmentSizeMB=8.796093022207999E12, noCFSRatio=0.2260678168301576
   [junit4]   2> 1855802 INFO  (coreLoadExecutor-5154-thread-1-processing-n:127.0.0.1:57118_nocna) [n:127.0.0.1:57118_nocna c:control_collection s:shard1 r:core_node1 x:collection1] o.a.s.c.SolrDeletionPolicy SolrDeletionPolicy.onCommit: commits: num=1
   [junit4]   2> 	commit{dir=MockDirectoryWrapper(RAMDirectory@7c69938c lockFactory=org.apache.lucene.store.SingleInstanceLockFactory@17210758),segFN=segments_1,generation=1}
   [junit4]   2> 1855802 INFO  (coreLoadExecutor-5154-thread-1-processing-n:127.0.0.1:57118_nocna) [n:127.0.0.1:57118_nocna c:control_collection s:shard1 r:core_node1 x:collection1] o.a.s.c.SolrDeletionPolicy newest commit generation = 1
   [junit4]   2> 1855802 INFO  (OldIndexDirectoryCleanupThreadForCore-collection1) [n:127.0.0.1:57118_nocna c:control_collection s:shard1 r:core_node1 x:collection1] o.a.s.c.SolrCore Looking for old index directories to cleanup for core collection1 in /x1/jenkins/jenkins-slave/workspace/Lucene-Solr-Tests-master/solr/build/solr-core/test/J1/../../../../../../../../../../x1/jenkins/jenkins-slave/workspace/Lucene-Solr-Tests-master/solr/build/solr-core/test/J1/temp/solr.handler.TestReqParamsAPI_221F7F820664862D-001/control-001/cores/collection1/data/
   [junit4]   2> 1855802 WARN  (OldIndexDirectoryCleanupThreadForCore-collection1) [n:127.0.0.1:57118_nocna c:control_collection s:shard1 r:core_node1 x:collection1] o.a.s.c.DirectoryFactory /x1/jenkins/jenkins-slave/workspace/Lucene-Solr-Tests-master/solr/build/solr-core/test/J1/../../../../../../../../../../x1/jenkins/jenkins-slave/workspace/Lucene-Solr-Tests-master/solr/build/solr-core/test/J1/temp/solr.handler.TestReqParamsAPI_221F7F820664862D-001/control-001/cores/collection1/data/ does not point to a valid data directory; skipping clean-up of old index directories.
   [junit4]   2> 1855805 INFO  (coreLoadExecutor-5154-thread-1-processing-n:127.0.0.1:57118_nocna) [n:127.0.0.1:57118_nocna c:control_collection s:shard1 r:core_node1 x:collection1] o.a.s.u.p.UpdateRequestProcessorChain creating updateRequestProcessorChain "nodistrib"
   [junit4]   2> 1855805 INFO  (coreLoadExecutor-5154-thread-1-processing-n:127.0.0.1:57118_nocna) [n:127.0.0.1:57118_nocna c:control_collection s:shard1 r:core_node1 x:collection1] o.a.s.u.p.UpdateRequestProcessorChain creating updateRequestProcessorChain "dedupe"
   [junit4]   2> 1855805 INFO  (coreLoadExecutor-5154-thread-1-processing-n:127.0.0.1:57118_nocna) [n:127.0.0.1:57118_nocna c:control_collection s:shard1 r:core_node1 x:collection1] o.a.s.u.p.UpdateRequestProcessorChain inserting DistributedUpdateProcessorFactory into updateRequestProcessorChain "dedupe"
   [junit4]   2> 1855805 INFO  (coreLoadExecutor-5154-thread-1-processing-n:127.0.0.1:57118_nocna) [n:127.0.0.1:57118_nocna c:control_collection s:shard1 r:core_node1 x:collection1] o.a.s.u.p.UpdateRequestProcessorChain creating updateRequestProcessorChain "stored_sig"
   [junit4]   2> 1855805 INFO  (coreLoadExecutor-5154-thread-1-processing-n:127.0.0.1:57118_nocna) [n:127.0.0.1:57118_nocna c:control_collection s:shard1 r:core_node1 x:collection1] o.a.s.u.p.UpdateRequestProcessorChain inserting DistributedUpdateProcessorFactory into updateRequestProcessorChain "stored_sig"
   [junit4]   2> 1855805 INFO  (coreLoadExecutor-5154-thread-1-processing-n:127.0.0.1:57118_nocna) [n:127.0.0.1:57118_nocna c:control_collection s:shard1 r:core_node1 x:collection1] o.a.s.u.p.UpdateRequestProcessorChain creating updateRequestProcessorChain "distrib-dup-test-chain-explicit"
   [junit4]   2> 1855805 INFO  (coreLoadExecutor-5154-thread-1-processing-n:127.0.0.1:57118_nocna) [n:127.0.0.1:57118_nocna c:control_collection s:shard1 r:core_node1 x:collection1] o.a.s.u.p.UpdateRequestProcessorChain creating updateRequestProcessorChain "distrib-dup-test-chain-implicit"
   [junit4]   2> 1855805 INFO  (coreLoadExecutor-5154-thread-1-processing-n:127.0.0.1:57118_nocna) [n:127.0.0.1:57118_nocna c:control_collection s:shard1 r:core_node1 x:collection1] o.a.s.u.p.UpdateRequestProcessorChain inserting DistributedUpdateProcessorFactory into updateRequestProcessorChain "distrib-dup-test-chain-implicit"
   [junit4]   2> 1855805 INFO  (coreLoadExecutor-5154-thread-1-processing-n:127.0.0.1:57118_nocna) [n:127.0.0.1:57118_nocna c:control_collection s:shard1 r:core_node1 x:collection1] o.a.s.c.SolrCore no updateRequestProcessorChain defined as default, creating implicit default
   [junit4]   2> 1855806 WARN  (coreLoadExecutor-5154-thread-1-processing-n:127.0.0.1:57118_nocna) [n:127.0.0.1:57118_nocna c:control_collection s:shard1 r:core_node1 x:collection1] o.a.s.c.RequestHandlers INVALID paramSet a in requestHandler {type = requestHandler,name = /dump,class = DumpRequestHandler,args = {defaults={a=A,b=B}}}
   [junit4]   2> 1855807 INFO  (coreLoadExecutor-5154-thread-1-processing-n:127.0.0.1:57118_nocna) [n:127.0.0.1:57118_nocna c:control_collection s:shard1 r:core_node1 x:collection1] o.a.s.h.l.XMLLoader xsltCacheLifetimeSeconds=60
   [junit4]   2> 1855808 INFO  (coreLoadExecutor-5154-thread-1-processing-n:127.0.0.1:57118_nocna) [n:127.0.0.1:57118_nocna c:control_collection s:shard1 r:core_node1 x:collection1] o.a.s.h.l.XMLLoader xsltCacheLifetimeSeconds=60
   [junit4]   2> 1855808 INFO  (coreLoadExecutor-5154-thread-1-processing-n:127.0.0.1:57118_nocna) [n:127.0.0.1:57118_nocna c:control_collection s:shard1 r:core_node1 x:collection1] o.a.s.h.l.XMLLoader xsltCacheLifetimeSeconds=60
   [junit4]   2> 1855809 INFO  (coreLoadExecutor-5154-thread-1-processing-n:127.0.0.1:57118_nocna) [n:127.0.0.1:57118_nocna c:control_collection s:shard1 r:core_node1 x:collection1] o.a.s.h.l.XMLLoader xsltCacheLifetimeSeconds=60
   [junit4]   2> 1855812 INFO  (coreLoadExecutor-5154-thread-1-processing-n:127.0.0.1:57118_nocna) [n:127.0.0.1:57118_nocna c:control_collection s:shard1 r:core_node1 x:collection1] o.a.s.c.RequestHandlers Registered paths: /admin/mbeans,standard,/dump,/update/csv,/sql,/update/json/docs,/admin/luke,/export,/admin/segments,/get,/admin/system,/replication,/admin/properties,/config,/stream,/schema,/admin/plugins,/admin/logging,/update/json,/admin/ping,/admin/threads,/update,/admin/file
   [junit4]   2> 1855812 INFO  (coreLoadExecutor-5154-thread-1-processing-n:127.0.0.1:57118_nocna) [n:127.0.0.1:57118_nocna c:control_collection s:shard1 r:core_node1 x:collection1] o.a.s.c.SolrCore Using default statsCache cache: org.apache.solr.search.stats.LocalStatsCache
   [junit4]   2> 1855812 INFO  (coreLoadExecutor-5154-thread-1-processing-n:127.0.0.1:57118_nocna) [n:127.0.0.1:57118_nocna c:control_collection s:shard1 r:core_node1 x:collection1] o.a.s.u.UpdateHandler Using UpdateLog implementation: org.apache.solr.update.UpdateLog
   [junit4]   2> 1855812 INFO  (coreLoadExecutor-5154-thread-1-processing-n:127.0.0.1:57118_nocna) [n:127.0.0.1:57118_nocna c:control_collection s:shard1 r:core_node1 x:collection1] o.a.s.u.UpdateLog Initializing UpdateLog: dataDir= defaultSyncLevel=FLUSH numRecordsToKeep=100 maxNumLogsToKeep=10 numVersionBuckets=65536
   [junit4]   2> 1855813 INFO  (coreLoadExecutor-5154-thread-1-processing-n:127.0.0.1:57118_nocna) [n:127.0.0.1:57118_nocna c:control_collection s:shard1 r:core_node1 x:collection1] o.a.s.u.CommitTracker Hard AutoCommit: disabled
   [junit4]   2> 1855813 INFO  (coreLoadExecutor-5154-thread-1-processing-n:127.0.0.1:57118_nocna) [n:127.0.0.1:57118_nocna c:control_collection s:shard1 r:core_node1 x:collection1] o.a.s.u.CommitTracker Soft AutoCommit: disabled
   [junit4]   2> 1855814 INFO  (coreLoadExecutor-5154-thread-1-processing-n:127.0.0.1:57118_nocna) [n:127.0.0.1:57118_nocna c:control_collection s:shard1 r:core_node1 x:collection1] o.a.s.u.RandomMergePolicy RandomMergePolicy wrapping class org.apache.lucene.index.LogDocMergePolicy: [LogDocMergePolicy: minMergeSize=1000, mergeFactor=21, maxMergeSize=9223372036854775807, maxMergeSizeForForcedMerge=9223372036854775807, calibrateSizeByDeletes=false, maxMergeDocs=2147483647, maxCFSSegmentSizeMB=8.796093022207999E12, noCFSRatio=0.835225377723834]
   [junit4]   2> 1855814 INFO  (coreLoadExecutor-5154-thread-1-processing-n:127.0.0.1:57118_nocna) [n:127.0.0.1:57118_nocna c:control_collection s:shard1 r:core_node1 x:collection1] o.a.s.c.SolrDeletionPolicy SolrDeletionPolicy.onInit: commits: num=1
   [junit4]   2> 	commit{dir=MockDirectoryWrapper(RAMDirectory@7c69938c lockFactory=org.apache.lucene.store.SingleInstanceLockFactory@17210758),segFN=segments_1,generation=1}
   [junit4]   2> 1855814 INFO  (coreLoadExecutor-5154-thread-1-processing-n:127.0.0.1:57118_nocna) [n:127.0.0.1:57118_nocna c:control_collection s:shard1 r:core_node1 x:collection1] o.a.s.c.SolrDeletionPolicy newest commit generation = 1
   [junit4]   2> 1855814 INFO  (coreLoadExecutor-5154-thread-1-processing-n:127.0.0.1:57118_nocna) [n:127.0.0.1:57118_nocna c:control_collection s:shard1 r:core_node1 x:collection1] o.a.s.s.SolrIndexSearcher Opening [Searcher@5c5e4707[collection1] main]
   [junit4]   2> 1855814 INFO  (coreLoadExecutor-5154-thread-1-processing-n:127.0.0.1:57118_nocna) [n:127.0.0.1:57118_nocna c:control_collection s:shard1 r:core_node1 x:collection1] o.a.s.c.c.ZkStateReader Load collection config from: [/collections/control_collection]
   [junit4]   2> 1855815 INFO  (coreLoadExecutor-5154-thread-1-processing-n:127.0.0.1:57118_nocna) [n:127.0.0.1:57118_nocna c:control_collection s:shard1 r:core_node1 x:collection1] o.a.s.c.c.ZkStateReader path=[/collections/control_collection] [configName]=[conf1] specified config exists in ZooKeeper
   [junit4]   2> 1855815 INFO  (coreLoadExecutor-5154-thread-1-processing-n:127.0.0.1:57118_nocna) [n:127.0.0.1:57118_nocna c:control_collection s:shard1 r:core_node1 x:collection1] o.a.s.r.ManagedResourceStorage Setting up ZooKeeper-based storage for the RestManager with znodeBase: /configs/conf1
   [junit4]   2> 1855815 INFO  (coreLoadExecutor-5154-thread-1-processing-n:127.0.0.1:57118_nocna) [n:127.0.0.1:57118_nocna c:control_collection s:shard1 r:core_node1 x:collection1] o.a.s.r.ManagedResourceStorage Configured ZooKeeperStorageIO with znodeBase: /configs/conf1
   [junit4]   2> 1855815 INFO  (coreLoadExecutor-5154-thread-1-processing-n:127.0.0.1:57118_nocna) [n:127.0.0.1:57118_nocna c:control_collection s:shard1 r:core_node1 x:collection1] o.a.s.r.RestManager Initializing RestManager with initArgs: {}
   [junit4]   2> 1855815 INFO  (coreLoadExecutor-5154-thread-1-processing-n:127.0.0.1:57118_nocna) [n:127.0.0.1:57118_nocna c:control_collection s:shard1 r:core_node1 x:collection1] o.a.s.r.ManagedResourceStorage Reading _rest_managed.json using ZooKeeperStorageIO:path=/configs/conf1
   [junit4]   2> 1855816 INFO  (coreLoadExecutor-5154-thread-1-processing-n:127.0.0.1:57118_nocna) [n:127.0.0.1:57118_nocna c:control_collection s:shard1 r:core_node1 x:collection1] o.a.s.r.ManagedResourceStorage No data found for znode /configs/conf1/_rest_managed.json
   [junit4]   2> 1855816 INFO  (coreLoadExecutor-5154-thread-1-processing-n:127.0.0.1:57118_nocna) [n:127.0.0.1:57118_nocna c:control_collection s:shard1 r:core_node1 x:collection1] o.a.s.r.ManagedResourceStorage Loaded null at path _rest_managed.json using ZooKeeperStorageIO:path=/configs/conf1
   [junit4]   2> 1855816 INFO  (coreLoadExecutor-5154-thread-1-processing-n:127.0.0.1:57118_nocna) [n:127.0.0.1:57118_nocna c:control_collection s:shard1 r:core_node1 x:collection1] o.a.s.r.RestManager Initializing 0 registered ManagedResources
   [junit4]   2> 1855816 INFO  (coreLoadExecutor-5154-thread-1-processing-n:127.0.0.1:57118_nocna) [n:127.0.0.1:57118_nocna c:control_collection s:shard1 r:core_node1 x:collection1] o.a.s.h.ReplicationHandler Commits will be reserved for  10000
   [junit4]   2> 1855817 INFO  (searcherExecutor-5155-thread-1-processing-n:127.0.0.1:57118_nocna x:collection1 s:shard1 c:control_collection r:core_node1) [n:127.0.0.1:57118_nocna c:control_collection s:shard1 r:core_node1 x:collection1] o.a.s.c.SolrCore [collection1] Registered new searcher Searcher@5c5e4707[collection1] main{ExitableDirectoryReader(UninvertingDirectoryReader())}
   [junit4]   2> 1855817 INFO  (coreLoadExecutor-5154-thread-1-processing-n:127.0.0.1:57118_nocna) [n:127.0.0.1:57118_nocna c:control_collection s:shard1 r:core_node1 x:collection1] o.a.s.u.UpdateLog Looking up max value of version field to seed version buckets
   [junit4]   2> 1855817 INFO  (coreLoadExecutor-5154-thread-1-processing-n:127.0.0.1:57118_nocna) [n:127.0.0.1:57118_nocna c:control_collection s:shard1 r:core_node1 x:collection1] o.a.s.u.VersionInfo Refreshing highest value of _version_ for 65536 version buckets from index
   [junit4]   2> 1855817 INFO  (coreLoadExecutor-5154-thread-1-processing-n:127.0.0.1:57118_nocna) [n:127.0.0.1:57118_nocna c:control_collection s:shard1 r:core_node1 x:collection1] o.a.s.u.VersionInfo No terms found for _version_, cannot seed version bucket highest value from index
   [junit4]   2> 1855817 INFO  (coreLoadExecutor-5154-thread-1-processing-n:127.0.0.1:57118_nocna) [n:127.0.0.1:57118_nocna c:control_collection s:shard1 r:core_node1 x:collection1] o.a.s.u.UpdateLog Could not find max version in index or recent updates, using new clock 1529446265477136384
   [junit4]   2> 1855819 INFO  (coreLoadExecutor-5154-thread-1-processing-n:127.0.0.1:57118_nocna) [n:127.0.0.1:57118_nocna c:control_collection s:shard1 r:core_node1 x:collection1] o.a.s.u.UpdateLog Took 1.0ms to seed version buckets with highest version 1529446265477136384
   [junit4]   2> 1855819 INFO  (coreLoadExecutor-5154-thread-1-processing-n:127.0.0.1:57118_nocna) [n:127.0.0.1:57118_nocna c:control_collection s:shard1 r:core_node1 x:collection1] o.a.s.c.ZkController watch zkdir /configs/conf1
   [junit4]   2> 1855819 INFO  (coreLoadExecutor-5154-thread-1-processing-n:127.0.0.1:57118_nocna) [n:127.0.0.1:57118_nocna c:control_collection s:shard1 r:core_node1 x:collection1] o.a.s.c.CoreContainer registering core: collection1
   [junit4]   2> 1855819 INFO  (coreZkRegister-5148-thread-1-processing-n:127.0.0.1:57118_nocna x:collection1 s:shard1 c:control_collection r:core_node1) [n:127.0.0.1:57118_nocna c:control_collection s:shard1 r:core_node1 x:collection1] o.a.s.c.ZkController Register replica - core:collection1 address:https://127.0.0.1:57118/nocna collection:control_collection shard:shard1
   [junit4]   2> 1855820 INFO  (coreZkRegister-5148-thread-1-processing-n:127.0.0.1:57118_nocna x:collection1 s:shard1 c:control_collection r:core_node1) [n:127.0.0.1:57118_nocna c:control_collection s:shard1 r:core_node1 x:collection1] o.a.s.c.c.SolrZkClient makePath: /collections/control_collection/leader_elect/shard1/election
   [junit4]   2> 1855823 INFO  (coreZkRegister-5148-thread-1-processing-n:127.0.0.1:57118_nocna x:collection1 s:shard1 c:control_collection r:core_node1) [n:127.0.0.1:57118_nocna c:control_collection s:shard1 r:core_node1 x:collection1] o.a.s.c.LeaderElector Joined leadership election with path: /collections/control_collection/leader_elect/shard1/election/95590391498932229-core_node1-n_0000000000
   [junit4]   2> 1855823 INFO  (coreZkRegister-5148-thread-1-processing-n:127.0.0.1:57118_nocna x:collection1 s:shard1 c:control_collection r:core_node1) [n:127.0.0.1:57118_nocna c:control_collection s:shard1 r:core_node1 x:collection1] o.a.s.c.ShardLeaderElectionContext Running the leader process for shard=shard1 and weAreReplacement=false and leaderVoteWait=10000
   [junit4]   2> 1855825 INFO  (coreZkRegister-5148-thread-1-processing-n:127.0.0.1:57118_nocna x:collection1 s:shard1 c:control_collection r:core_node1) [n:127.0.0.1:57118_nocna c:control_collection s:shard1 r:core_node1 x:collection1] o.a.s.c.ShardLeaderElectionContext Enough replicas found to continue.
   [junit4]   2> 1855825 INFO  (coreZkRegister-5148-thread-1-processing-n:127.0.0.1:57118_nocna x:collection1 s:shard1 c:control_collection r:core_node1) [n:127.0.0.1:57118_nocna c:control_collection s:shard1 r:core_node1 x:collection1] o.a.s.c.ShardLeaderElectionContext I may be the new leader - try and sync
   [junit4]   2> 1855825 INFO  (coreZkRegister-5148-thread-1-processing-n:127.0.0.1:57118_nocna x:collection1 s:shard1 c:control_collection r:core_node1) [n:127.0.0.1:57118_nocna c:control_collection s:shard1 r:core_node1 x:collection1] o.a.s.c.SyncStrategy Sync replicas to https://127.0.0.1:57118/nocna/collection1/
   [junit4]   2> 1855825 INFO  (coreZkRegister-5148-thread-1-processing-n:127.0.0.1:57118_nocna x:collection1 s:shard1 c:control_collection r:core_node1) [n:127.0.0.1:57118_nocna c:control_collection s:shard1 r:core_node1 x:collection1] o.a.s.c.SyncStrategy Sync Success - now sync replicas to me
   [junit4]   2> 1855825 INFO  (OverseerStateUpdate-95590391498932229-127.0.0.1:57118_nocna-n_0000000000) [n:127.0.0.1:57118_nocna    ] o.a.s.c.Overseer processMessage: queueSize: 1, message = {
   [junit4]   2>   "operation":"leader",
   [junit4]   2>   "shard":"shard1",
   [junit4]   2>   "collection":"control_collection"} current state version: 1
   [junit4]   2> 1855825 INFO  (coreZkRegister-5148-thread-1-processing-n:127.0.0.1:57118_nocna x:collection1 s:shard1 c:control_collection r:core_node1) [n:127.0.0.1:57118_nocna c:control_collection s:shard1 r:core_node1 x:collection1] o.a.s.c.SyncStrategy https://127.0.0.1:57118/nocna/collection1/ has no replicas
   [junit4]   2> 1855826 INFO  (coreZkRegister-5148-thread-1-processing-n:127.0.0.1:57118_nocna x:collection1 s:shard1 c:control_collection r:core_node1) [n:127.0.0.1:57118_nocna c:control_collection s:shard1 r:core_node1 x:collection1] o.a.s.c.c.SolrZkClient makePath: /collections/control_collection/leaders/shard1
   [junit4]   2> 1855828 INFO  (coreZkRegister-5148-thread-1-processing-n:127.0.0.1:57118_nocna x:collection1 s:shard1 c:control_collection r:core_node1) [n:127.0.0.1:57118_nocna c:control_collection s:shard1 r:core_node1 x:collection1] o.a.s.c.ShardLeaderElectionContextBase Creating leader registration node /collections/control_collection/leaders/shard1/leader after winning as /collections/control_collection/leader_elect/shard1/election/95590391498932229-core_node1-n_0000000000
   [junit4]   2> 1855830 INFO  (coreZkRegister-5148-thread-1-processing-n:127.0.0.1:57118_nocna x:collection1 s:shard1 c:control_collection r:core_node1) [n:127.0.0.1:57118_nocna c:control_collection s:shard1 r:core_node1 x:collection1] o.a.s.c.ShardLeaderElectionContext I am the new leader: https://127.0.0.1:57118/nocna/collection1/ shard1
   [junit4]   2> 1855830 INFO  (OverseerStateUpdate-95590391498932229-127.0.0.1:57118_nocna-n_0000000000) [n:127.0.0.1:57118_nocna    ] o.a.s.c.Overseer processMessage: queueSize: 1, message = {
   [junit4]   2>   "operation":"leader",
   [junit4]   2>   "shard":"shard1",
   [junit4]   2>   "collection":"control_collection",
   [junit4]   2>   "base_url":"https://127.0.0.1:57118/nocna",
   [junit4]   2>   "core":"collection1",
   [junit4]   2>   "state":"active"} current state version: 1
   [junit4]   2> 1855932 INFO  (zkCallback-1887-thread-1-processing-n:127.0.0.1:57118_nocna) [n:127.0.0.1:57118_nocna    ] o.a.s.c.c.ZkStateReader A cluster state change: [WatchedEvent state:SyncConnected type:NodeDataChanged path:/clusterstate.json], has occurred - updating... (live nodes size: [1])
   [junit4]   2> 1855981 INFO  (coreZkRegister-5148-thread-1-processing-n:127.0.0.1:57118_nocna x:collection1 s:shard1 c:control_collection r:core_node1) [n:127.0.0.1:57118_nocna c:control_collection s:shard1 r:core_node1 x:collection1] o.a.s.c.ZkController We are https://127.0.0.1:57118/nocna/collection1/ and leader is https://127.0.0.1:57118/nocna/collection1/
   [junit4]   2> 1855981 INFO  (coreZkRegister-5148-thread-1-processing-n:127.0.0.1:57118_nocna x:collection1 s:shard1 c:control_collection r:core_node1) [n:127.0.0.1:57118_nocna c:control_collection s:shard1 r:core_node1 x:collection1] o.a.s.c.ZkController No LogReplay needed for core=collection1 baseURL=https://127.0.0.1:57118/nocna
   [junit4]   2> 1855981 INFO  (coreZkRegister-5148-thread-1-processing-n:127.0.0.1:57118_nocna x:collection1 s:shard1 c:control_collection r:core_node1) [n:127.0.0.1:57118_nocna c:control_collection s:shard1 r:core_node1 x:collection1] o.a.s.c.ZkController I am the leader, no recovery necessary
   [junit4]   2> 1855981 INFO  (coreZkRegister-5148-thread-1-processing-n:127.0.0.1:57118_nocna x:collection1 s:shard1 c:control_collection r:core_node1) [n:127.0.0.1:57118_nocna c:control_collection s:shard1 r:core_node1 x:collection1] o.a.s.c.ZkController publishing state=active
   [junit4]   2> 1855981 INFO  (coreZkRegister-5148-thread-1-processing-n:127.0.0.1:57118_nocna x:collection1 s:shard1 c:control_collection r:core_node1) [n:127.0.0.1:57118_nocna c:control_collection s:shard1 r:core_node1 x:collection1] o.a.s.c.ZkController numShards not found on descriptor - reading it from system property
   [junit4]   2> 1855982 INFO  (OverseerStateUpdate-95590391498932229-127.0.0.1:57118_nocna-n_0000000000) [n:127.0.0.1:57118_nocna    ] o.a.s.c.Overseer processMessage: queueSize: 1, message = {
   [junit4]   2>   "core":"collection1",
   [junit4]   2>   "core_node_name":"core_node1",
   [junit4]   2>   "roles":null,
   [junit4]   2>   "base_url":"https://127.0.0.1:57118/nocna",
   [junit4]   2>   "node_name":"127.0.0.1:57118_nocna",
   [junit4]   2>   "numShards":"1",
   [junit4]   2>   "state":"active",
   [junit4]   2>   "shard":"shard1",
   [junit4]   2>   "collection":"control_collection",
   [junit4]   2>   "operation":"state"} current state version: 2
   [junit4]   2> 1855983 INFO  (OverseerStateUpdate-95590391498932229-127.0.0.1:57118_nocna-n_0000000000) [n:127.0.0.1:57118_nocna    ] o.a.s.c.o.ReplicaMutator Update state numShards=1 message={
   [junit4]   2>   "core":"collection1",
   [junit4]   2>   "core_node_name":"core_node1",
   [junit4]   2>   "roles":null,
   [junit4]   2>   "base_url":"https://127.0.0.1:57118/nocna",
   [junit4]   2>   "node_name":"127.0.0.1:57118_nocna",
   [junit4]   2>   "numShards":"1",
   [junit4]   2>   "state":"active",
   [junit4]   2>   "shard":"shard1",
   [junit4]   2>   "collection":"control_collection",
   [junit4]   2>   "operation":"state"}
   [junit4]   2> 1856085 INFO  (zkCallback-1887-thread-1-processing-n:127.0.0.1:57118_nocna) [n:127.0.0.1:57118_nocna    ] o.a.s.c.c.ZkStateReader A cluster state change: [WatchedEvent state:SyncConnected type:NodeDataChanged path:/clusterstate.json], has occurred - updating... (live nodes size: [1])
   [junit4]   2> 1856172 INFO  (TEST-TestReqParamsAPI.test-seed#[221F7F820664862D]) [    ] o.a.s.c.c.SolrZkClient Using default ZkCredentialsProvider
   [junit4]   2> 1856172 INFO  (TEST-TestReqParamsAPI.test-seed#[221F7F820664862D]) [    ] o.a.s.c.c.ConnectionManager Waiting for client to connect to ZooKeeper
   [junit4]   2> 1856173 INFO  (zkCallback-1889-thread-1) [    ] o.a.s.c.c.ConnectionManager Watcher org.apache.solr.common.cloud.ConnectionManager@1538ffa2 name:ZooKeeperConnection Watcher:127.0.0.1:40744/solr got event WatchedEvent state:SyncConnected type:None path:null path:null type:None
   [junit4]   2> 1856174 INFO  (TEST-TestReqParamsAPI.test-seed#[221F7F820664862D]) [    ] o.a.s.c.c.ConnectionManager Client is connected to ZooKeeper
   [junit4]   2> 1856174 INFO  (TEST-TestReqParamsAPI.test-seed#[221F7F820664862D]) [    ] o.a.s.c.c.SolrZkClient Using default ZkACLProvider
   [junit4]   2> 1856174 INFO  (TEST-TestReqParamsAPI.test-seed#[221F7F820664862D]) [    ] o.a.s.c.c.ZkStateReader Updating cluster state from ZooKeeper... 
   [junit4]   2> 1856175 INFO  (TEST-TestReqParamsAPI.test-seed#[221F7F820664862D]) [    ] o.a.s.c.c.ZkStateReader Updated live nodes from ZooKeeper... (0) -> (1)
   [junit4]   2> 1856176 INFO  (TEST-TestReqParamsAPI.test-seed#[221F7F820664862D]) [    ] o.a.s.c.ChaosMonkey monkey: init - expire sessions:false cause connection loss:false
   [junit4]   2> 1856264 INFO  (TEST-TestReqParamsAPI.test-seed#[221F7F820664862D]) [    ] o.a.s.SolrTestCaseJ4 Writing core.properties file to /x1/jenkins/jenkins-slave/workspace/Lucene-Solr-Tests-master/solr/build/solr-core/test/J1/temp/solr.handler.TestReqParamsAPI_221F7F820664862D-001/shard-1-001/cores/collection1
   [junit4]   2> 1856265 INFO  (TEST-TestReqParamsAPI.test-seed#[221F7F820664862D]) [    ] o.a.s.c.AbstractFullDistribZkTestBase create jetty 1 in directory /x1/jenkins/jenkins-slave/workspace/Lucene-Solr-Tests-master/solr/build/solr-core/test/J1/temp/solr.handler.TestReqParamsAPI_221F7F820664862D-001/shard-1-001
   [junit4]   2> 1856266 INFO  (TEST-TestReqParamsAPI.test-seed#[221F7F820664862D]) [    ] o.e.j.s.Server jetty-9.3.8.v20160314
   [junit4]   2> 1856267 INFO  (TEST-TestReqParamsAPI.test-seed#[221F7F820664862D]) [    ] o.e.j.s.h.ContextHandler Started o.e.j.s.ServletContextHandler@2f91a0c3{/nocna,null,AVAILABLE}
   [junit4]   2> 1856268 INFO  (TEST-TestReqParamsAPI.test-seed#[221F7F820664862D]) [    ] o.e.j.u.s.SslContextFactory x509=X509@f24372e(solrtest,h=[],w=[]) for SslContextFactory@334f64fb(file:///x1/jenkins/jenkins-slave/workspace/Lucene-Solr-Tests-master/solr/server/etc/test/solrtest.keystore,file:///x1/jenkins/jenkins-slave/workspace/Lucene-Solr-Tests-master/solr/server/etc/test/solrtest.keystore)
   [junit4]   2> 1856270 INFO  (TEST-TestReqParamsAPI.test-seed#[221F7F820664862D]) [    ] o.e.j.s.ServerConnector Started ServerConnector@20410d11{SSL,[ssl, http/1.1]}{127.0.0.1:?????}
   [junit4]   2> 1856270 INFO  (TEST-TestReqParamsAPI.test-seed#[221F7F820664862D]) [    ] o.e.j.s.Server Started @???????ms
   [junit4]   2> 1856270 INFO  (TEST-TestReqParamsAPI.test-seed#[221F7F820664862D]) [    ] o.a.s.c.s.e.JettySolrRunner Jetty properties: {solr.data.dir=/x1/jenkins/jenkins-slave/workspace/Lucene-Solr-Tests-master/solr/build/solr-core/test/J1/temp/solr.handler.TestReqParamsAPI_221F7F820664862D-001/tempDir-001/jetty1, solrconfig=solrconfig.xml, hostContext=/nocna, hostPort=38651, coreRootDirectory=/x1/jenkins/jenkins-slave/workspace/Lucene-Solr-Tests-master/solr/build/solr-core/test/J1/../../../../../../../../../../x1/jenkins/jenkins-slave/workspace/Lucene-Solr-Tests-master/solr/build/solr-core/test/J1/temp/solr.handler.TestReqParamsAPI_221F7F820664862D-001/shard-1-001/cores}
   [junit4]   2> 1856271 INFO  (TEST-TestReqParamsAPI.test-seed#[221F7F820664862D]) [    ] o.a.s.s.SolrDispatchFilter SolrDispatchFilter.init(): sun.misc.Launcher$AppClassLoader@73d16e93
   [junit4]   2> 1856271 INFO  (TEST-TestReqParamsAPI.test-seed#[221F7F820664862D]) [    ] o.a.s.c.SolrResourceLoader new SolrResourceLoader for directory: '/x1/jenkins/jenkins-slave/workspace/Lucene-Solr-Tests-master/solr/build/solr-core/test/J1/temp/solr.handler.TestReqParamsAPI_221F7F820664862D-001/shard-1-001'
   [junit4]   2> 1856271 INFO  (TEST-TestReqParamsAPI.test-seed#[221F7F820664862D]) [    ] o.a.s.c.SolrResourceLoader JNDI not configured for solr (NoInitialContextEx)
   [junit4]   2> 1856271 INFO  (TEST-TestReqParamsAPI.test-seed#[221F7F820664862D]) [    ] o.a.s.c.SolrResourceLoader solr home defaulted to 'solr/' (could not find system property or JNDI)
   [junit4]   2> 1856271 INFO  (TEST-TestReqParamsAPI.test-seed#[221F7F820664862D]) [    ] o.a.s.c.c.SolrZkClient Using default ZkCredentialsProvider
   [junit4]   2> 1856272 INFO  (TEST-TestReqParamsAPI.test-seed#[221F7F820664862D]) [    ] o.a.s.c.c.ConnectionManager Waiting for client to connect to ZooKeeper
   [junit4]   2> 1856272 INFO  (zkCallback-1890-thread-1) [    ] o.a.s.c.c.ConnectionManager Watcher org.apache.solr.common.cloud.ConnectionManager@1f263958 name:ZooKeeperConnection Watcher:127.0.0.1:40744/solr got event WatchedEvent state:SyncConnected type:None path:null path:null type:None
   [junit4]   2> 1856273 INFO  (TEST-TestReqParamsAPI.test-seed#[221F7F820664862D]) [    ] o.a.s.c.c.ConnectionManager Client is connected to ZooKeeper
   [junit4]   2> 1856273 INFO  (TEST-TestReqParamsAPI.test-seed#[221F7F820664862D]) [    ] o.a.s.c.c.SolrZkClient Using default ZkACLProvider
   [junit4]   2> 1856273 INFO  (TEST-TestReqParamsAPI.test-seed#[221F7F820664862D]) [    ] o.a.s.s.SolrDispatchFilter Loading solr.xml from SolrHome (not found in ZooKeeper)
   [junit4]   2> 1856274 INFO  (TEST-TestReqParamsAPI.test-seed#[221F7F820664862D]) [    ] o.a.s.c.SolrXmlConfig Loading container configuration from /x1/jenkins/jenkins-slave/workspace/Lucene-Solr-Tests-master/solr/build/solr-core/test/J1/temp/solr.handler.TestReqParamsAPI_221F7F820664862D-001/shard-1-001/solr.xml
   [junit4]   2> 1856278 INFO  (TEST-TestReqParamsAPI.test-seed#[221F7F820664862D]) [    ] o.a.s.c.CorePropertiesLocator Config-defined core root directory: /x1/jenkins/jenkins-slave/workspace/Lucene-Solr-Tests-master/solr/build/solr-core/test/J1/../../../../../../../../../../x1/jenkins/jenkins-slave/workspace/Lucene-Solr-Tests-master/solr/build/solr-core/test/J1/temp/solr.handler.TestReqParamsAPI_221F7F820664862D-001/shard-1-001/cores
   [junit4]   2> 1856278 INFO  (TEST-TestReqParamsAPI.test-seed#[221F7F820664862D]) [    ] o.a.s.c.CoreContainer New CoreContainer 924968975
   [junit4]   2> 1856278 INFO  (TEST-TestReqParamsAPI.test-seed#[221F7F820664862D]) [    ] o.a.s.c.CoreContainer Loading cores into CoreContainer [instanceDir=/x1/jenkins/jenkins-slave/workspace/Lucene-Solr-Tests-master/solr/build/solr-core/test/J1/temp/solr.handler.TestReqParamsAPI_221F7F820664862D-001/shard-1-001]
   [junit4]   2> 1856278 WARN  (TEST-TestReqParamsAPI.test-seed#[221F7F820664862D]) [    ] o.a.s.c.CoreContainer Couldn't add files from /x1/jenkins/jenkins-slave/workspace/Lucene-Solr-Tests-master/solr/build/solr-core/test/J1/temp/solr.handler.TestReqParamsAPI_221F7F820664862D-001/shard-1-001/lib to classpath: /x1/jenkins/jenkins-slave/workspace/Lucene-Solr-Tests-master/solr/build/solr-core/test/J1/temp/solr.handler.TestReqParamsAPI_221F7F820664862D-001/shard-1-001/lib
   [junit4]   2> 1856279 INFO  (TEST-TestReqParamsAPI.test-seed#[221F7F820664862D]) [    ] o.a.s.h.c.HttpShardHandlerFactory created with socketTimeout : 90000,urlScheme : ,connTimeout : 15000,maxConnectionsPerHost : 20,maxConnections : 10000,corePoolSize : 0,maximumPoolSize : 2147483647,maxThreadIdleTime : 5,sizeOfQueue : -1,fairnessPolicy : false,useRetries : false,
   [junit4]   2> 1856281 INFO  (TEST-TestReqParamsAPI.test-seed#[221F7F820664862D]) [    ] o.a.s.u.UpdateShardHandler Creating UpdateShardHandler HTTP client with params: socketTimeout=340000&connTimeout=45000&retry=true
   [junit4]   2> 1856282 INFO  (TEST-TestReqParamsAPI.test-seed#[221F7F820664862D]) [    ] o.a.s.l.LogWatcher SLF4J impl is org.slf4j.impl.Log4jLoggerFactory
   [junit4]   2> 1856282 INFO  (TEST-TestReqParamsAPI.test-seed#[221F7F820664862D]) [    ] o.a.s.l.LogWatcher Registering Log Listener [Log4j (org.slf4j.impl.Log4jLoggerFactory)]
   [junit4]   2> 1856282 INFO  (TEST-TestReqParamsAPI.test-seed#[221F7F820664862D]) [    ] o.a.s.c.ZkContainer Zookeeper client=127.0.0.1:40744/solr
   [junit4]   2> 1856282 INFO  (TEST-TestReqParamsAPI.test-seed#[221F7F820664862D]) [    ] o.a.s.c.ZkController zkHost includes chroot
   [junit4]   2> 1856282 INFO  (TEST-TestReqParamsAPI.test-seed#[221F7F820664862D]) [    ] o.a.s.c.c.SolrZkClient Using default ZkCredentialsProvider
   [junit4]   2> 1856282 INFO  (TEST-TestReqParamsAPI.test-seed#[221F7F820664862D]) [    ] o.a.s.c.c.ConnectionManager Waiting for client to connect to ZooKeeper
   [junit4]   2> 1856283 INFO  (zkCallback-1893-thread-1) [    ] o.a.s.c.c.ConnectionManager Watcher org.apache.solr.common.cloud.ConnectionManager@1e162aba name:ZooKeeperConnection Watcher:127.0.0.1:40744 got event WatchedEvent state:SyncConnected type:None path:null path:null type:None
   [junit4]   2> 1856283 INFO  (TEST-TestReqParamsAPI.test-seed#[221F7F820664862D]) [    ] o.a.s.c.c.ConnectionManager Client is connected to ZooKeeper
   [junit4]   2> 1856284 INFO  (TEST-TestReqParamsAPI.test-seed#[221F7F820664862D]) [    ] o.a.s.c.c.SolrZkClient Using default ZkACLProvider
   [junit4]   2> 1856285 INFO  (TEST-TestReqParamsAPI.test-seed#[221F7F820664862D]) [n:127.0.0.1:38651_nocna    ] o.a.s.c.c.ConnectionManager Waiting for client to connect to ZooKeeper
   [junit4]   2> 1856285 INFO  (zkCallback-1894-thread-1-processing-n:127.0.0.1:38651_nocna) [n:127.0.0.1:38651_nocna    ] o.a.s.c.c.ConnectionManager Watcher org.apache.solr.common.cloud.ConnectionManager@56a5048c name:ZooKeeperConnection Watcher:127.0.0.1:40744/solr got event WatchedEvent state:SyncConnected type:None path:null path:null type:None
   [junit4]   2> 1856286 INFO  (TEST-TestReqParamsAPI.test-seed#[221F7F820664862D]) [n:127.0.0.1:38651_nocna    ] o.a.s.c.c.ConnectionManager Client is connected to ZooKeeper
   [junit4]   2> 1856291 INFO  (TEST-TestReqParamsAPI.test-seed#[221F7F820664862D]) [n:127.0.0.1:38651_nocna    ] o.a.s.c.c.ZkStateReader Updating cluster state from ZooKeeper... 
   [junit4]   2> 1856292 INFO  (TEST-TestReqParamsAPI.test-seed#[221F7F820664862D]) [n:127.0.0.1:38651_nocna    ] o.a.s.c.c.ZkStateReader Updated live nodes from ZooKeeper... (0) -> (1)
   [junit4]   2> 1856294 INFO  (TEST-TestReqParamsAPI.test-seed#[221F7F820664862D]) [n:127.0.0.1:38651_nocna    ] o.a.s.c.Overseer Overseer (id=null) closing
   [junit4]   2> 1856295 INFO  (TEST-TestReqParamsAPI.test-seed#[221F7F820664862D]) [n:127.0.0.1:38651_nocna    ] o.a.s.c.LeaderElector Joined leadership election with path: /overseer_elect/election/95590391498932233-127.0.0.1:38651_nocna-n_0000000001
   [junit4]   2> 1856295 INFO  (TEST-TestReqParamsAPI.test-seed#[221F7F820664862D]) [n:127.0.0.1:38651_nocna    ] o.a.s.c.LeaderElector Watching path /overseer_elect/election/95590391498932229-127.0.0.1:57118_nocna-n_0000000000 to know if I could be the leader
   [junit4]   2> 1856295 INFO  (TEST-TestReqParamsAPI.test-seed#[221F7F820664862D]) [n:127.0.0.1:38651_nocna    ] o.a.s.c.ZkController Publish node=127.0.0.1:38651_nocna as DOWN
   [junit4]   2> 1856297 INFO  (OverseerStateUpdate-95590391498932229-127.0.0.1:57118_nocna-n_0000000000) [n:127.0.0.1:57118_nocna    ] o.a.s.c.Overseer processMessage: queueSize: 1, message = {
   [junit4]   2>   "operation":"downnode",
   [junit4]   2>   "node_name":"127.0.0.1:38651_nocna"} current state version: 3
   [junit4]   2> 1856297 INFO  (OverseerStateUpdate-95590391498932229-127.0.0.1:57118_nocna-n_0000000000) [n:127.0.0.1:57118_nocna    ] o.a.s.c.o.NodeMutator DownNode state invoked for node: 127.0.0.1:38651_nocna
   [junit4]   2> 1856399 INFO  (zkCallback-1887-thread-1-processing-n:127.0.0.1:57118_nocna) [n:127.0.0.1:57118_nocna    ] o.a.s.c.c.ZkStateReader A cluster state change: [WatchedEvent state:SyncConnected type:NodeDataChanged path:/clusterstate.json], has occurred - updating... (live nodes size: [1])
   [junit4]   2> 1856399 INFO  (zkCallback-1889-thread-1) [    ] o.a.s.c.c.ZkStateReader A cluster state change: [WatchedEvent state:SyncConnected type:NodeDataChanged path:/clusterstate.json], has occurred - updating... (live nodes size: [1])
   [junit4]   2> 1856399 INFO  (zkCallback-1894-thread-1-processing-n:127.0.0.1:38651_nocna) [n:127.0.0.1:38651_nocna    ] o.a.s.c.c.ZkStateReader A cluster state change: [WatchedEvent state:SyncConnected type:NodeDataChanged path:/clusterstate.json], has occurred - updating... (live nodes size: [1])
   [junit4]   2> 1857297 INFO  (TEST-TestReqParamsAPI.test-seed#[221F7F820664862D]) [n:127.0.0.1:38651_nocna    ] o.a.s.c.ZkController Register node as live in ZooKeeper:/live_nodes/127.0.0.1:38651_nocna
   [junit4]   2> 1857298 INFO  (TEST-TestReqParamsAPI.test-seed#[221F7F820664862D]) [n:127.0.0.1:38651_nocna    ] o.a.s.c.c.SolrZkClient makePath: /live_nodes/127.0.0.1:38651_nocna
   [junit4]   2> 1857299 INFO  (zkCallback-1887-thread-1-processing-n:127.0.0.1:57118_nocna) [n:127.0.0.1:57118_nocna    ] o.a.s.c.c.ZkStateReader A live node change: [WatchedEvent state:SyncConnected type:NodeChildrenChanged path:/live_nodes], has occurred - updating... (live nodes size: [1])
   [junit4]   2> 1857299 INFO  (zkCallback-1889-thread-1) [    ] o.a.s.c.c.ZkStateReader A live node change: [WatchedEvent state:SyncConnected type:NodeChildrenChanged path:/live_nodes], has occurred - updating... (live nodes size: [1])
   [junit4]   2> 1857299 INFO  (zkCallback-1894-thread-1-processing-n:127.0.0.1:38651_nocna) [n:127.0.0.1:38651_nocna    ] o.a.s.c.c.ZkStateReader A live node change: [WatchedEvent state:SyncConnected type:NodeChildrenChanged path:/live_nodes], has occurred - updating... (live nodes size: [1])
   [junit4]   2> 1857300 INFO  (zkCallback-1889-thread-1) [    ] o.a.s.c.c.ZkStateReader Updated live nodes from ZooKeeper... (1) -> (2)
   [junit4]   2> 1857300 INFO  (zkCallback-1887-thread-1-processing-n:127.0.0.1:57118_nocna) [n:127.0.0.1:57118_nocna    ] o.a.s.c.c.ZkStateReader Updated live nodes from ZooKeeper... (1) -> (2)
   [junit4]   2> 1857300 INFO  (zkCallback-1894-thread-1-processing-n:127.0.0.1:38651_nocna) [n:127.0.0.1:38651_nocna    ] o.a.s.c.c.ZkStateReader Updated live nodes from ZooKeeper... (1) -> (2)
   [junit4]   2> 1857308 INFO  (TEST-TestReqParamsAPI.test-seed#[221F7F820664862D]) [n:127.0.0.1:38651_nocna    ] o.a.s.c.CoreContainer Security conf doesn't exist. Skipping setup for authorization module.
   [junit4]   2> 1857308 INFO  (TEST-TestReqParamsAPI.test-seed#[221F7F820664862D]) [n:127.0.0.1:38651_nocna    ] o.a.s.c.CoreContainer No authentication plugin used.
   [junit4]   2> 1857309 INFO  (TEST-TestReqParamsAPI.test-seed#[221F7F820664862D]) [n:127.0.0.1:38651_nocna    ] o.a.s.c.CorePropertiesLocator Looking for core definitions underneath /x1/jenkins/jenkins-slave/workspace/Lucene-Solr-Tests-master/solr/build/solr-core/test/J1/../../../../../../../../../../x1/jenkins/jenkins-slave/workspace/Lucene-Solr-Tests-master/solr/build/solr-core/test/J1/temp/solr.handler.TestReqParamsAPI_221F7F820664862D-001/shard-1-001/cores
   [junit4]   2> 1857310 INFO  (TEST-TestReqParamsAPI.test-seed#[221F7F820664862D]) [n:127.0.0.1:38651_nocna    ] o.a.s.c.CoreDescriptor Created CoreDescriptor: {name=collection1, config=solrconfig.xml, transient=false, schema=schema.xml, loadOnStartup=true, configSetProperties=configsetprops.json, collection=collection1, coreNodeName=, dataDir=data/, shard=}
   [junit4]   2> 1857310 INFO  (TEST-TestReqParamsAPI.test-seed#[221F7F820664862D]) [n:127.0.0.1:38651_nocna    ] o.a.s.c.CorePropertiesLocator Found core collection1 in /x1/jenkins/jenkins-slave/workspace/Lucene-Solr-Tests-master/solr/build/solr-core/test/J1/../../../../../../../../../../x1/jenkins/jenkins-slave/workspace/Lucene-Solr-Tests-master/solr/build/solr-core/test/J1/temp/solr.handler.TestReqParamsAPI_221F7F820664862D-001/shard-1-001/cores/collection1
   [junit4]   2> 1857310 INFO  (TEST-TestReqParamsAPI.test-seed#[221F7F820664862D]) [n:127.0.0.1:38651_nocna    ] o.a.s.c.CorePropertiesLocator Found 1 core definitions
   [junit4]   2> 1857311 INFO  (TEST-TestReqParamsAPI.test-seed#[221F7F820664862D]) [n:127.0.0.1:38651_nocna    ] o.a.s.s.SolrDispatchFilter user.dir=/x1/jenkins/jenkins-slave/workspace/Lucene-Solr-Tests-master/solr/build/solr-core/test/J1
   [junit4]   2> 1857311 INFO  (coreLoadExecutor-5165-thread-1-processing-n:127.0.0.1:38651_nocna) [n:127.0.0.1:38651_nocna c:collection1   x:collection1] o.a.s.c.ZkController publishing state=down
   [junit4]   2> 1857311 INFO  (TEST-TestReqParamsAPI.test-seed#[221F7F820664862D]) [n:127.0.0.1:38651_nocna    ] o.a.s.s.SolrDispatchFilter SolrDispatchFilter.init() done
   [junit4]   2> 1857311 INFO  (coreLoadExecutor-5165-thread-1-processing-n:127.0.0.1:38651_nocna) [n:127.0.0.1:38651_nocna c:collection1   x:collection1] o.a.s.c.ZkController numShards not found on descriptor - reading it from system property
   [junit4]   2> 1857312 INFO  (OverseerStateUpdate-95590391498932229-127.0.0.1:57118_nocna-n_0000000000) [n:127.0.0.1:57118_nocna    ] o.a.s.c.Overseer processMessage: queueSize: 1, message = {
   [junit4]   2>   "core":"collection1",
   [junit4]   2>   "roles":null,
   [junit4]   2>   "base_url":"https://127.0.0.1:38651/nocna",
   [junit4]   2>   "node_name":"127.0.0.1:38651_nocna",
   [junit4]   2>   "numShards":"2",
   [junit4]   2>   "state":"down",
   [junit4]   2>   "shard":null,
   [junit4]   2>   "collection":"collection1",
   [junit4]   2>   "operation":"state"} current state version: 4
   [junit4]   2> 1857312 INFO  (coreLoadExecutor-5165-thread-1-processing-n:127.0.0.1:38651_nocna) [n:127.0.0.1:38651_nocna c:collection1   x:collection1] o.a.s.c.ZkController look for our core node name
   [junit4]   2> 1857313 INFO  (OverseerStateUpdate-95590391498932229-127.0.0.1:57118_nocna-n_0000000000) [n:127.0.0.1:57118_nocna    ] o.a.s.c.o.ReplicaMutator Update state numShards=2 message={
   [junit4]   2>   "core":"collection1",
   [junit4]   2>   "roles":null,
   [junit4]   2>   "base_url":"https://127.0.0.1:38651/nocna",
   [junit4]   2>   "node_name":"127.0.0.1:38651_nocna",
   [junit4]   2>   "numShards":"2",
   [junit4]   2>   "state":"down",
   [junit4]   2>   "shard":null,
   [junit4]   2>   "collection":"collection1",
   [junit4]   2>   "operation":"state"}
   [junit4]   2> 1857313 INFO  (OverseerStateUpdate-95590391498932229-127.0.0.1:57118_nocna-n_0000000000) [n:127.0.0.1:57118_nocna    ] o.a.s.c.o.ClusterStateMutator building a new cName: collection1
   [junit4]   2> 1857313 INFO  (OverseerStateUpdate-95590391498932229-127.0.0.1:57118_nocna-n_0000000000) [n:127.0.0.1:57118_nocna    ] o.a.s.c.o.ReplicaMutator Assigning new node to shard shard=shard2
   [junit4]   2> 1857415 INFO  (zkCallback-1887-thread-1-processing-n:127.0.0.1:57118_nocna) [n:127.0.0.1:57118_nocna    ] o.a.s.c.c.ZkStateReader A cluster state change: [WatchedEvent state:SyncConnected type:NodeDataChanged path:/clusterstate.json], has occurred - updating... (live nodes size: [2])
   [junit4]   2> 1857415 INFO  (zkCallback-1894-thread-1-processing-n:127.0.0.1:38651_nocna) [n:127.0.0.1:38651_nocna    ] o.a.s.c.c.ZkStateReader A cluster state change: [WatchedEvent state:SyncConnected type:NodeDataChanged path:/clusterstate.json], has occurred - updating... (live nodes size: [2])
   [junit4]   2> 1857415 INFO  (zkCallback-1889-thread-1) [    ] o.a.s.c.c.ZkStateReader A cluster state change: [WatchedEvent state:SyncConnected type:NodeDataChanged path:/clusterstate.json], has occurred - updating... (live nodes size: [2])
   [junit4]   2> 1858313 INFO  (coreLoadExecutor-5165-thread-1-processing-n:127.0.0.1:38651_nocna) [n:127.0.0.1:38651_nocna c:collection1   x:collection1] o.a.s.c.ZkController waiting to find shard id in clusterstate for collection1
   [junit4]   2> 1858313 INFO  (coreLoadExecutor-5165-thread-1-processing-n:127.0.0.1:38651_nocna) [n:127.0.0.1:38651_nocna c:collection1   x:collection1] o.a.s.c.ZkController Check for collection zkNode:collection1
   [junit4]   2> 1858314 INFO  (coreLoadExecutor-5165-thread-1-processing-n:127.0.0.1:38651_nocna) [n:127.0.0.1:38651_nocna c:collection1   x:collection1] o.a.s.c.ZkController Collection zkNode exists
   [junit4]   2> 1858314 INFO  (coreLoadExecutor-5165-thread-1-processing-n:127.0.0.1:38651_nocna) [n:127.0.0.1:38651_nocna c:collection1   x:collection1] o.a.s.c.c.ZkStateReader Load collection config from: [/collections/collection1]
   [junit4]   2> 1858315 INFO  (coreLoadExecutor-5165-thread-1-processing-n:127.0.0.1:38651_nocna) [n:127.0.0.1:38651_nocna c:collection1   x:collection1] o.a.s.c.c.ZkStateReader path=[/collections/collection1] [configName]=[conf1] specified config exists in ZooKeeper
   [junit4]   2> 1858315 INFO  (coreLoadExecutor-5165-thread-1-processing-n:127.0.0.1:38651_nocna) [n:127.0.0.1:38651_nocna c:collection1   x:collection1] o.a.s.c.SolrResourceLoader new SolrResourceLoader for directory: '/x1/jenkins/jenkins-slave/workspace/Lucene-Solr-Tests-master/solr/build/solr-core/test/J1/temp/solr.handler.TestReqParamsAPI_221F7F820664862D-001/shard-1-001/cores/collection1'
   [junit4]   2> 1858315 INFO  (coreLoadExecutor-5165-thread-1-processing-n:127.0.0.1:38651_nocna) [n:127.0.0.1:38651_nocna c:collection1   x:collection1] o.a.s.c.SolrResourceLoader JNDI not configured for solr (NoInitialContextEx)
   [junit4]   2> 1858315 INFO  (coreLoadExecutor-5165-thread-1-processing-n:127.0.0.1:38651_nocna) [n:127.0.0.1:38651_nocna c:collection1   x:collection1] o.a.s.c.SolrResourceLoader solr home defaulted to 'solr/' (could not find system property or JNDI)
   [junit4]   2> 1858317 INFO  (coreLoadExecutor-5165-thread-1-processing-n:127.0.0.1:38651_nocna) [n:127.0.0.1:38651_nocna c:collection1   x:collection1] o.a.s.c.Config loaded config solrconfig.xml with version 0 
   [junit4]   2> 1858321 INFO  (coreLoadExecutor-5165-thread-1-processing-n:127.0.0.1:38651_nocna) [n:127.0.0.1:38651_nocna c:collection1   x:collection1] o.a.s.c.SolrConfig current version of requestparams : -1
   [junit4]   2> 1858324 INFO  (coreLoadExecutor-5165-thread-1-processing-n:127.0.0.1:38651_nocna) [n:127.0.0.1:38651_nocna c:collection1   x:collection1] o.a.s.c.SolrConfig Using Lucene MatchVersion: 7.0.0
   [junit4]   2> 1858340 INFO  (coreLoadExecutor-5165-thread-1-processing-n:127.0.0.1:38651_nocna) [n:127.0.0.1:38651_nocna c:collection1   x:collection1] o.a.s.c.SolrConfig Loaded SolrConfig: solrconfig.xml
   [junit4]   2> 1858346 INFO  (coreLoadExecutor-5165-thread-1-processing-n:127.0.0.1:38651_nocna) [n:127.0.0.1:38651_nocna c:collection1   x:collection1] o.a.s.s.IndexSchema [collection1] Schema name=test
   [junit4]   2> 1858418 INFO  (coreLoadExecutor-5165-thread-1-processing-n:127.0.0.1:38651_nocna) [n:127.0.0.1:38651_nocna c:collection1   x:collection1] o.a.s.s.OpenExchangeRatesOrgProvider Initialized with rates=open-exchange-rates.json, refreshInterval=1440.
   [junit4]   2> 1858423 INFO  (coreLoadExecutor-5165-thread-1-processing-n:127.0.0.1:38651_nocna) [n:127.0.0.1:38651_nocna c:collection1   x:collection1] o.a.s.s.IndexSchema default search field in schema is text
   [junit4]   2> 1858424 INFO  (coreLoadExecutor-5165-thread-1-processing-n:127.0.0.1:38651_nocna) [n:127.0.0.1:38651_nocna c:collection1   x:collection1] o.a.s.s.IndexSchema unique key field: id
   [junit4]   2> 1858430 INFO  (coreLoadExecutor-5165-thread-1-processing-n:127.0.0.1:38651_nocna) [n:127.0.0.1:38651_nocna c:collection1   x:collection1] o.a.s.s.FileExchangeRateProvider Reloading exchange rates from file currency.xml
   [junit4]   2> 1858443 INFO  (coreLoadExecutor-5165-thread-1-processing-n:127.0.0.1:38651_nocna) [n:127.0.0.1:38651_nocna c:collection1   x:collection1] o.a.s.s.FileExchangeRateProvider Reloading exchange rates from file currency.xml
   [junit4]   2> 1858446 INFO  (coreLoadExecutor-5165-thread-1-processing-n:127.0.0.1:38651_nocna) [n:127.0.0.1:38651_nocna c:collection1   x:collection1] o.a.s.s.OpenExchangeRatesOrgProvider Reloading exchange rates from open-exchange-rates.json
   [junit4]   2> 1858446 INFO  (coreLoadExecutor-5165-thread-1-processing-n:127.0.0.1:38651_nocna) [n:127.0.0.1:38651_nocna c:collection1   x:collection1] o.a.s.s.OpenExchangeRatesOrgProvider Reloading exchange rates from open-exchange-rates.json
   [junit4]   2> 1858448 INFO  (coreLoadExecutor-5165-thread-1-processing-n:127.0.0.1:38651_nocna) [n:127.0.0.1:38651_nocna c:collection1   x:collection1] o.a.s.c.ConfigSetProperties Did not find ConfigSet properties, assu

[...truncated too long message...]

cute(SolrZkClient.java:241)
   [junit4]   2> 	at org.apache.solr.common.cloud.ZkCmdExecutor.retryOperation(ZkCmdExecutor.java:60)
   [junit4]   2> 	at org.apache.solr.common.cloud.SolrZkClient.delete(SolrZkClient.java:241)
   [junit4]   2> 	at org.apache.solr.cloud.ElectionContext.cancelElection(ElectionContext.java:86)
   [junit4]   2> 	at org.apache.solr.cloud.ShardLeaderElectionContextBase.cancelElection(ElectionContext.java:143)
   [junit4]   2> 	at org.apache.solr.cloud.ShardLeaderElectionContext.cancelElection(ElectionContext.java:279)
   [junit4]   2> 	at org.apache.solr.cloud.ShardLeaderElectionContext.runLeaderProcess(ElectionContext.java:455)
   [junit4]   2> 	at org.apache.solr.cloud.LeaderElector.runIamLeaderProcess(LeaderElector.java:170)
   [junit4]   2> 	at org.apache.solr.cloud.LeaderElector.checkIfIamLeader(LeaderElector.java:135)
   [junit4]   2> 	at org.apache.solr.cloud.LeaderElector.access$200(LeaderElector.java:56)
   [junit4]   2> 	at org.apache.solr.cloud.LeaderElector$ElectionWatcher.process(LeaderElector.java:348)
   [junit4]   2> 	at org.apache.solr.common.cloud.SolrZkClient$3.lambda$process$0(SolrZkClient.java:266)
   [junit4]   2> 	at java.util.concurrent.Executors$RunnableAdapter.call(Executors.java:511)
   [junit4]   2> 	at java.util.concurrent.FutureTask.run(FutureTask.java:266)
   [junit4]   2> 	at org.apache.solr.common.util.ExecutorUtil$MDCAwareThreadPoolExecutor.lambda$execute$0(ExecutorUtil.java:229)
   [junit4]   2> 	at java.util.concurrent.ThreadPoolExecutor.runWorker(ThreadPoolExecutor.java:1142)
   [junit4]   2> 	at java.util.concurrent.ThreadPoolExecutor$Worker.run(ThreadPoolExecutor.java:617)
   [junit4]   2> 	at java.lang.Thread.run(Thread.java:745)
   [junit4]   2> 1884394 INFO  (TEST-TestReqParamsAPI.test-seed#[221F7F820664862D]) [    ] o.e.j.s.ServerConnector Stopped ServerConnector@70dd4e8f{SSL,[ssl, http/1.1]}{127.0.0.1:?}
   [junit4]   2> 1884394 INFO  (TEST-TestReqParamsAPI.test-seed#[221F7F820664862D]) [    ] o.e.j.s.h.ContextHandler Stopped o.e.j.s.ServletContextHandler@2c69d5f8{/nocna,null,UNAVAILABLE}
   [junit4]   2> 1884396 INFO  (TEST-TestReqParamsAPI.test-seed#[221F7F820664862D]) [    ] o.a.s.c.ZkTestServer connecting to 127.0.0.1:40744 40744
   [junit4]   2> 1884555 INFO  (Thread-6903) [    ] o.a.s.c.ZkTestServer connecting to 127.0.0.1:40744 40744
   [junit4]   2> 1884555 WARN  (Thread-6903) [    ] o.a.s.c.ZkTestServer Watch limit violations: 
   [junit4]   2> Maximum concurrent create/delete watches above limit:
   [junit4]   2> 
   [junit4]   2> 	25	/solr/configs/conf1
   [junit4]   2> 	6	/solr/aliases.json
   [junit4]   2> 	5	/solr/security.json
   [junit4]   2> 
   [junit4]   2> Maximum concurrent data watches above limit:
   [junit4]   2> 
   [junit4]   2> 	6	/solr/clusterstate.json
   [junit4]   2> 
   [junit4]   2> Maximum concurrent children watches above limit:
   [junit4]   2> 
   [junit4]   2> 	6	/solr/live_nodes
   [junit4]   2> 	6	/solr/collections
   [junit4]   2> 	4	/solr/overseer/queue
   [junit4]   2> 	4	/solr/overseer/collection-queue-work
   [junit4]   2> 
   [junit4]   2> NOTE: reproduce with: ant test  -Dtestcase=TestReqParamsAPI -Dtests.method=test -Dtests.seed=221F7F820664862D -Dtests.multiplier=2 -Dtests.slow=true -Dtests.locale=hi-IN -Dtests.timezone=EET -Dtests.asserts=true -Dtests.file.encoding=US-ASCII
   [junit4] FAILURE 30.2s J1 | TestReqParamsAPI.test <<<
   [junit4]    > Throwable #1: java.lang.AssertionError: Could not get expected value  'CY val' for path 'response/params/y/c' full output: {
   [junit4]    >   "responseHeader":{
   [junit4]    >     "status":0,
   [junit4]    >     "QTime":0},
   [junit4]    >   "response":{
   [junit4]    >     "znodeVersion":0,
   [junit4]    >     "params":{"x":{
   [junit4]    >         "a":"A val",
   [junit4]    >         "b":"B val",
   [junit4]    >         "":{"v":0}}}}}
   [junit4]    > 	at __randomizedtesting.SeedInfo.seed([221F7F820664862D:AA4B4058A898EBD5]:0)
   [junit4]    > 	at org.apache.solr.core.TestSolrConfigHandler.testForResponseElement(TestSolrConfigHandler.java:458)
   [junit4]    > 	at org.apache.solr.handler.TestReqParamsAPI.testReqParams(TestReqParamsAPI.java:165)
   [junit4]    > 	at org.apache.solr.handler.TestReqParamsAPI.test(TestReqParamsAPI.java:67)
   [junit4]    > 	at org.apache.solr.BaseDistributedSearchTestCase$ShardsRepeatRule$ShardsFixedStatement.callStatement(BaseDistributedSearchTestCase.java:996)
   [junit4]    > 	at org.apache.solr.BaseDistributedSearchTestCase$ShardsRepeatRule$ShardsStatement.evaluate(BaseDistributedSearchTestCase.java:971)
   [junit4]    > 	at java.lang.Thread.run(Thread.java:745)
   [junit4]   2> 1884559 INFO  (SUITE-TestReqParamsAPI-seed#[221F7F820664862D]-worker) [    ] o.a.s.SolrTestCaseJ4 ###deleteCore
   [junit4]   2> NOTE: leaving temporary files on disk at: /x1/jenkins/jenkins-slave/workspace/Lucene-Solr-Tests-master/solr/build/solr-core/test/J1/temp/solr.handler.TestReqParamsAPI_221F7F820664862D-001
   [junit4]   2> Mar 21, 2016 8:54:10 PM com.carrotsearch.randomizedtesting.ThreadLeakControl checkThreadLeaks
   [junit4]   2> WARNING: Will linger awaiting termination of 1 leaked thread(s).
   [junit4]   2> NOTE: test params are: codec=CheapBastard, sim=RandomSimilarity(queryNorm=true,coord=crazy): {}, locale=hi-IN, timezone=EET
   [junit4]   2> NOTE: Linux 3.13.0-52-generic amd64/Oracle Corporation 1.8.0_74 (64-bit)/cpus=4,threads=1,free=131001896,total=529530880
   [junit4]   2> NOTE: All tests run in this JVM: [BufferStoreTest, TestHighFrequencyDictionaryFactory, TestLFUCache, TestRandomRequestDistribution, SpellCheckCollatorTest, SchemaVersionSpecificBehaviorTest, ChaosMonkeyNothingIsSafeTest, MigrateRouteKeyTest, SimplePostToolTest, TestDocumentBuilder, InfoHandlerTest, NumericFieldsTest, TestReRankQParserPlugin, TestPartialUpdateDeduplication, TimeZoneUtilsTest, TestCustomDocTransformer, PreAnalyzedUpdateProcessorTest, TestImplicitCoreProperties, DirectoryFactoryTest, HdfsThreadLeakTest, SolrIndexSplitterTest, CollectionReloadTest, TestManagedResource, DistributedSuggestComponentTest, FullHLLTest, TestAuthenticationFramework, ChangedSchemaMergeTest, ZkSolrClientTest, BlockJoinFacetRandomTest, TestBlendedInfixSuggestions, TestEmbeddedSolrServerConstructors, TestSimpleTrackingShardHandler, TestQuerySenderNoQuery, SpellCheckComponentTest, TestUseDocValuesAsStored, RankQueryTest, AsyncMigrateRouteKeyTest, TestJsonFacets, ConvertedLegacyTest, TestDefaultSearchFieldResource, AliasIntegrationTest, TestRequestForwarding, HdfsBasicDistributedZkTest, TestHdfsUpdateLog, JavabinLoaderTest, TestSolrDeletionPolicy2, AtomicUpdatesTest, TestUpdate, TestExactSharedStatsCache, SolrPluginUtilsTest, ConfigSetsAPITest, RollingRestartTest, TestWordDelimiterFilterFactory, BasicAuthIntegrationTest, OverseerStatusTest, TestIntervalFaceting, DistributedIntervalFacetingTest, TestReplicationHandlerBackup, SparseHLLTest, TestLeaderElectionZkExpiry, OverriddenZkACLAndCredentialsProvidersTest, MultiTermTest, TestSQLHandler, SolrIndexConfigTest, TestSolrQueryParserDefaultOperatorResource, ZkStateReaderTest, TermVectorComponentTest, AnalyticsQueryTest, ChaosMonkeySafeLeaderTest, HighlighterTest, CloudMLTQParserTest, SolrCmdDistributorTest, ShardRoutingTest, LoggingHandlerTest, DeleteInactiveReplicaTest, CollectionsAPIDistributedZkTest, MoreLikeThisHandlerTest, TestCloudPivotFacet, DocValuesTest, CheckHdfsIndexTest, NotRequiredUniqueKeyTest, MBeansHandlerTest, TestSolrConfigHandler, TestHashPartitioner, AddBlockUpdateTest, DataDrivenBlockJoinTest, RuleEngineTest, RemoteQueryErrorTest, SolrInfoMBeanTest, TestPKIAuthenticationPlugin, DocExpirationUpdateProcessorFactoryTest, TestBinaryResponseWriter, TestBulkSchemaAPI, XsltUpdateRequestHandlerTest, IndexBasedSpellCheckerTest, TestQueryTypes, TestOmitPositions, TermsComponentTest, FieldAnalysisRequestHandlerTest, IndexSchemaRuntimeFieldTest, ReturnFieldsTest, QueryParsingTest, BinaryUpdateRequestHandlerTest, BadComponentTest, MinimalSchemaTest, DirectSolrConnectionTest, TestCharFilters, TestDFRSimilarityFactory, TestLMJelinekMercerSimilarityFactory, TestFastWriter, OpenExchangeRatesOrgProviderTest, TestSystemIdResolver, ClusterStateTest, TestLRUCache, CircularListTest, TestRTGBase, TestCrossCoreJoin, AssignTest, AsyncCallRequestStatusResponseTest, CollectionStateFormat2Test, ConnectionManagerTest, DeleteLastCustomShardedReplicaTest, DeleteShardTest, DistributedQueueTest, HttpPartitionTest, TestDistribDocBasedVersion, TestMiniSolrCloudClusterBase, TestSizeLimitedDistributedMap, TriLevelCompositeIdRoutingTest, HdfsRecoverLeaseTest, TestReqParamsAPI]
   [junit4] Completed [489/581 (1!)] on J1 in 30.95s, 1 test, 1 failure <<< FAILURES!

[...truncated 282 lines...]
BUILD FAILED
/x1/jenkins/jenkins-slave/workspace/Lucene-Solr-Tests-master/build.xml:740: The following error occurred while executing this line:
/x1/jenkins/jenkins-slave/workspace/Lucene-Solr-Tests-master/build.xml:684: The following error occurred while executing this line:
/x1/jenkins/jenkins-slave/workspace/Lucene-Solr-Tests-master/build.xml:59: The following error occurred while executing this line:
/x1/jenkins/jenkins-slave/workspace/Lucene-Solr-Tests-master/solr/build.xml:233: The following error occurred while executing this line:
/x1/jenkins/jenkins-slave/workspace/Lucene-Solr-Tests-master/solr/common-build.xml:529: The following error occurred while executing this line:
/x1/jenkins/jenkins-slave/workspace/Lucene-Solr-Tests-master/lucene/common-build.xml:1457: The following error occurred while executing this line:
/x1/jenkins/jenkins-slave/workspace/Lucene-Solr-Tests-master/lucene/common-build.xml:1014: There were test failures: 581 suites (10 ignored), 2324 tests, 1 failure, 86 ignored (70 assumptions) [seed: 221F7F820664862D]

Total time: 59 minutes 34 seconds
Build step 'Invoke Ant' marked build as failure
Archiving artifacts
Recording test results
Email was triggered for: Failure - Any
Sending email for trigger: Failure - Any



Mime
View raw message