lucene-dev mailing list archives

Site index · List index
Message view « Date » · « Thread »
Top « Date » · « Thread »
From Apache Jenkins Server <jenk...@builds.apache.org>
Subject [JENKINS] Lucene-Solr-Tests-6.x - Build # 1 - Failure
Date Thu, 03 Mar 2016 13:43:38 GMT
Build: https://builds.apache.org/job/Lucene-Solr-Tests-6.x/1/

1 tests failed.
FAILED:  org.apache.lucene.index.TestBackwardsCompatibility.testAllVersionsTested

Error Message:
Extra backcompat test files:   5.5.0-cfs 

Stack Trace:
java.lang.AssertionError: Extra backcompat test files:
  5.5.0-cfs

	at __randomizedtesting.SeedInfo.seed([E2310480BE8BFD4C:F2EEEBC00A1CEB60]:0)
	at org.junit.Assert.fail(Assert.java:93)
	at org.apache.lucene.index.TestBackwardsCompatibility.testAllVersionsTested(TestBackwardsCompatibility.java:495)
	at sun.reflect.NativeMethodAccessorImpl.invoke0(Native Method)
	at sun.reflect.NativeMethodAccessorImpl.invoke(NativeMethodAccessorImpl.java:62)
	at sun.reflect.DelegatingMethodAccessorImpl.invoke(DelegatingMethodAccessorImpl.java:43)
	at java.lang.reflect.Method.invoke(Method.java:497)
	at com.carrotsearch.randomizedtesting.RandomizedRunner.invoke(RandomizedRunner.java:1764)
	at com.carrotsearch.randomizedtesting.RandomizedRunner$8.evaluate(RandomizedRunner.java:871)
	at com.carrotsearch.randomizedtesting.RandomizedRunner$9.evaluate(RandomizedRunner.java:907)
	at com.carrotsearch.randomizedtesting.RandomizedRunner$10.evaluate(RandomizedRunner.java:921)
	at org.apache.lucene.util.TestRuleSetupTeardownChained$1.evaluate(TestRuleSetupTeardownChained.java:49)
	at org.apache.lucene.util.AbstractBeforeAfterRule$1.evaluate(AbstractBeforeAfterRule.java:45)
	at org.apache.lucene.util.TestRuleThreadAndTestName$1.evaluate(TestRuleThreadAndTestName.java:48)
	at org.apache.lucene.util.TestRuleIgnoreAfterMaxFailures$1.evaluate(TestRuleIgnoreAfterMaxFailures.java:64)
	at org.apache.lucene.util.TestRuleMarkFailure$1.evaluate(TestRuleMarkFailure.java:47)
	at com.carrotsearch.randomizedtesting.rules.StatementAdapter.evaluate(StatementAdapter.java:36)
	at com.carrotsearch.randomizedtesting.ThreadLeakControl$StatementRunner.run(ThreadLeakControl.java:367)
	at com.carrotsearch.randomizedtesting.ThreadLeakControl.forkTimeoutingTask(ThreadLeakControl.java:809)
	at com.carrotsearch.randomizedtesting.ThreadLeakControl$3.evaluate(ThreadLeakControl.java:460)
	at com.carrotsearch.randomizedtesting.RandomizedRunner.runSingleTest(RandomizedRunner.java:880)
	at com.carrotsearch.randomizedtesting.RandomizedRunner$5.evaluate(RandomizedRunner.java:781)
	at com.carrotsearch.randomizedtesting.RandomizedRunner$6.evaluate(RandomizedRunner.java:816)
	at com.carrotsearch.randomizedtesting.RandomizedRunner$7.evaluate(RandomizedRunner.java:827)
	at org.apache.lucene.util.AbstractBeforeAfterRule$1.evaluate(AbstractBeforeAfterRule.java:45)
	at com.carrotsearch.randomizedtesting.rules.StatementAdapter.evaluate(StatementAdapter.java:36)
	at org.apache.lucene.util.TestRuleStoreClassName$1.evaluate(TestRuleStoreClassName.java:41)
	at com.carrotsearch.randomizedtesting.rules.NoShadowingOrOverridesOnMethodsRule$1.evaluate(NoShadowingOrOverridesOnMethodsRule.java:40)
	at com.carrotsearch.randomizedtesting.rules.NoShadowingOrOverridesOnMethodsRule$1.evaluate(NoShadowingOrOverridesOnMethodsRule.java:40)
	at com.carrotsearch.randomizedtesting.rules.StatementAdapter.evaluate(StatementAdapter.java:36)
	at com.carrotsearch.randomizedtesting.rules.StatementAdapter.evaluate(StatementAdapter.java:36)
	at com.carrotsearch.randomizedtesting.rules.StatementAdapter.evaluate(StatementAdapter.java:36)
	at org.apache.lucene.util.TestRuleAssertionsRequired$1.evaluate(TestRuleAssertionsRequired.java:53)
	at org.apache.lucene.util.TestRuleMarkFailure$1.evaluate(TestRuleMarkFailure.java:47)
	at org.apache.lucene.util.TestRuleIgnoreAfterMaxFailures$1.evaluate(TestRuleIgnoreAfterMaxFailures.java:64)
	at org.apache.lucene.util.TestRuleIgnoreTestSuites$1.evaluate(TestRuleIgnoreTestSuites.java:54)
	at com.carrotsearch.randomizedtesting.rules.StatementAdapter.evaluate(StatementAdapter.java:36)
	at com.carrotsearch.randomizedtesting.ThreadLeakControl$StatementRunner.run(ThreadLeakControl.java:367)
	at java.lang.Thread.run(Thread.java:745)




Build Log:
[...truncated 4238 lines...]
   [junit4] Suite: org.apache.lucene.index.TestBackwardsCompatibility
   [junit4] IGNOR/A 0.03s J2 | TestBackwardsCompatibility.testCreateSingleSegmentCFS
   [junit4]    > Assumption #1: backcompat creation tests must be run with -Dtests.bwcdir=/path/to/write/indexes
   [junit4] IGNOR/A 0.01s J2 | TestBackwardsCompatibility.testCreateNoCFS
   [junit4]    > Assumption #1: backcompat creation tests must be run with -Dtests.bwcdir=/path/to/write/indexes
   [junit4] IGNOR/A 0.01s J2 | TestBackwardsCompatibility.testCreateMoreTermsIndex
   [junit4]    > Assumption #1: backcompat creation tests must be run with -Dtests.bwcdir=/path/to/write/indexes
   [junit4] IGNOR/A 0.00s J2 | TestBackwardsCompatibility.testCreateSingleSegmentNoCFS
   [junit4]    > Assumption #1: backcompat creation tests must be run with -Dtests.bwcdir=/path/to/write/indexes
   [junit4] IGNOR/A 0.00s J2 | TestBackwardsCompatibility.testCreateIndexWithDocValuesUpdates
   [junit4]    > Assumption #1: backcompat creation tests must be run with -Dtests.bwcdir=/path/to/write/indexes
   [junit4] IGNOR/A 0.01s J2 | TestBackwardsCompatibility.testCreateCFS
   [junit4]    > Assumption #1: backcompat creation tests must be run with -Dtests.bwcdir=/path/to/write/indexes
   [junit4]   2> NOTE: reproduce with: ant test  -Dtestcase=TestBackwardsCompatibility
-Dtests.method=testAllVersionsTested -Dtests.seed=E2310480BE8BFD4C -Dtests.multiplier=2 -Dtests.slow=true
-Dtests.locale=es -Dtests.timezone=CST -Dtests.asserts=true -Dtests.file.encoding=UTF-8
   [junit4] FAILURE 0.01s J2 | TestBackwardsCompatibility.testAllVersionsTested <<<
   [junit4]    > Throwable #1: java.lang.AssertionError: Extra backcompat test files:
   [junit4]    >   5.5.0-cfs
   [junit4]    > 	at __randomizedtesting.SeedInfo.seed([E2310480BE8BFD4C:F2EEEBC00A1CEB60]:0)
   [junit4]    > 	at org.apache.lucene.index.TestBackwardsCompatibility.testAllVersionsTested(TestBackwardsCompatibility.java:495)
   [junit4]    > 	at java.lang.Thread.run(Thread.java:745)
   [junit4]   2> NOTE: leaving temporary files on disk at: /x1/jenkins/jenkins-slave/workspace/Lucene-Solr-Tests-6.x/lucene/build/backward-codecs/test/J2/temp/lucene.index.TestBackwardsCompatibility_E2310480BE8BFD4C-001
   [junit4]   2> NOTE: test params are: codec=Asserting(Lucene60): {content6=PostingsFormat(name=LuceneVarGapFixedInterval),
content5=PostingsFormat(name=Memory doPackFST= false), content4=PostingsFormat(name=LuceneFixedGap),
trieInt=PostingsFormat(name=LuceneVarGapFixedInterval), content3=PostingsFormat(name=MockRandom),
content2=PostingsFormat(name=LuceneVarGapFixedInterval), fieā±·ld=PostingsFormat(name=LuceneVarGapFixedInterval),
utf8=PostingsFormat(name=LuceneVarGapFixedInterval), trieLong=PostingsFormat(name=Memory doPackFST=
false), id=PostingsFormat(name=LuceneFixedGap), content=PostingsFormat(name=LuceneVarGapFixedInterval),
autf8=PostingsFormat(name=Memory doPackFST= false)}, docValues:{ndv2=DocValuesFormat(name=SimpleText),
ndv1=DocValuesFormat(name=Memory), dvBytesSortedFixed=DocValuesFormat(name=Asserting), dvBytesStraightVar=DocValuesFormat(name=Asserting),
dvShort=DocValuesFormat(name=Asserting), dvBytesStraightFixed=DocValuesFormat(name=Memory),
dvLong=DocValuesFormat(name=Asserting), dvInt=DocValuesFormat(name=Memory), dvBytesSortedVar=DocValuesFormat(name=Memory),
dvSortedSet=DocValuesFormat(name=Lucene54), bdv2=DocValuesFormat(name=SimpleText), bdv2_c=DocValuesFormat(name=Asserting),
dvDouble=DocValuesFormat(name=Lucene54), dvFloat=DocValuesFormat(name=Asserting), bdv1=DocValuesFormat(name=Memory),
bdv1_c=DocValuesFormat(name=Memory), dvPacked=DocValuesFormat(name=Asserting), dvByte=DocValuesFormat(name=Asserting),
ndv1_c=DocValuesFormat(name=Memory), dvBytesDerefVar=DocValuesFormat(name=SimpleText), ndv2_c=DocValuesFormat(name=Asserting),
dvSortedNumeric=DocValuesFormat(name=Asserting), dvBytesDerefFixed=DocValuesFormat(name=Lucene54)},
maxPointsInLeafNode=389, maxMBSortInHeap=6.682051938822751, sim=ClassicSimilarity, locale=es,
timezone=CST
   [junit4]   2> NOTE: Linux 3.13.0-52-generic amd64/Oracle Corporation 1.8.0_66 (64-bit)/cpus=4,threads=1,free=220720072,total=282591232
   [junit4]   2> NOTE: All tests run in this JVM: [TestMaxPositionInOldIndex, TestBackwardsCompatibility]
   [junit4] Completed [3/4 (1!)] on J2 in 33.12s, 27 tests, 1 failure, 6 skipped <<<
FAILURES!

[...truncated 20 lines...]
BUILD FAILED
/x1/jenkins/jenkins-slave/workspace/Lucene-Solr-Tests-6.x/build.xml:740: The following error
occurred while executing this line:
/x1/jenkins/jenkins-slave/workspace/Lucene-Solr-Tests-6.x/build.xml:684: The following error
occurred while executing this line:
/x1/jenkins/jenkins-slave/workspace/Lucene-Solr-Tests-6.x/build.xml:59: The following error
occurred while executing this line:
/x1/jenkins/jenkins-slave/workspace/Lucene-Solr-Tests-6.x/lucene/build.xml:476: The following
error occurred while executing this line:
/x1/jenkins/jenkins-slave/workspace/Lucene-Solr-Tests-6.x/lucene/common-build.xml:2187: The
following error occurred while executing this line:
/x1/jenkins/jenkins-slave/workspace/Lucene-Solr-Tests-6.x/lucene/module-build.xml:58: The
following error occurred while executing this line:
/x1/jenkins/jenkins-slave/workspace/Lucene-Solr-Tests-6.x/lucene/common-build.xml:1457: The
following error occurred while executing this line:
/x1/jenkins/jenkins-slave/workspace/Lucene-Solr-Tests-6.x/lucene/common-build.xml:1014: There
were test failures: 4 suites, 152 tests, 1 failure, 11 ignored (11 assumptions) [seed: E2310480BE8BFD4C]

Total time: 15 minutes 55 seconds
Build step 'Invoke Ant' marked build as failure
Archiving artifacts
No prior successful build to compare, so performing full copy of artifacts
Recording test results
Email was triggered for: Failure - Any
Sending email for trigger: Failure - Any



Mime
View raw message