lucene-dev mailing list archives

Site index · List index
Message view « Date » · « Thread »
Top « Date » · « Thread »
From Policeman Jenkins Server <jenk...@thetaphi.de>
Subject [JENKINS] Lucene-Solr-master-Solaris (64bit/jdk1.8.0) - Build # 487 - Failure!
Date Tue, 29 Mar 2016 20:05:44 GMT
Build: http://jenkins.thetaphi.de/job/Lucene-Solr-master-Solaris/487/
Java: 64bit/jdk1.8.0 -XX:+UseCompressedOops -XX:+UseSerialGC

3 tests failed.
FAILED:  junit.framework.TestSuite.org.apache.solr.core.TestLazyCores

Error Message:
ObjectTracker found 4 object(s) that were not released!!! [MDCAwareThreadPoolExecutor, SolrCore, MockDirectoryWrapper, MockDirectoryWrapper]

Stack Trace:
java.lang.AssertionError: ObjectTracker found 4 object(s) that were not released!!! [MDCAwareThreadPoolExecutor, SolrCore, MockDirectoryWrapper, MockDirectoryWrapper]
	at __randomizedtesting.SeedInfo.seed([54EB7CD0CE80B83D]:0)
	at org.junit.Assert.fail(Assert.java:93)
	at org.junit.Assert.assertTrue(Assert.java:43)
	at org.junit.Assert.assertNull(Assert.java:551)
	at org.apache.solr.SolrTestCaseJ4.afterClass(SolrTestCaseJ4.java:238)
	at sun.reflect.GeneratedMethodAccessor22.invoke(Unknown Source)
	at sun.reflect.DelegatingMethodAccessorImpl.invoke(DelegatingMethodAccessorImpl.java:43)
	at java.lang.reflect.Method.invoke(Method.java:498)
	at com.carrotsearch.randomizedtesting.RandomizedRunner.invoke(RandomizedRunner.java:1764)
	at com.carrotsearch.randomizedtesting.RandomizedRunner$7.evaluate(RandomizedRunner.java:834)
	at com.carrotsearch.randomizedtesting.rules.StatementAdapter.evaluate(StatementAdapter.java:36)
	at com.carrotsearch.randomizedtesting.rules.SystemPropertiesRestoreRule$1.evaluate(SystemPropertiesRestoreRule.java:57)
	at org.apache.lucene.util.AbstractBeforeAfterRule$1.evaluate(AbstractBeforeAfterRule.java:45)
	at com.carrotsearch.randomizedtesting.rules.StatementAdapter.evaluate(StatementAdapter.java:36)
	at org.apache.lucene.util.TestRuleStoreClassName$1.evaluate(TestRuleStoreClassName.java:41)
	at com.carrotsearch.randomizedtesting.rules.NoShadowingOrOverridesOnMethodsRule$1.evaluate(NoShadowingOrOverridesOnMethodsRule.java:40)
	at com.carrotsearch.randomizedtesting.rules.NoShadowingOrOverridesOnMethodsRule$1.evaluate(NoShadowingOrOverridesOnMethodsRule.java:40)
	at com.carrotsearch.randomizedtesting.rules.StatementAdapter.evaluate(StatementAdapter.java:36)
	at com.carrotsearch.randomizedtesting.rules.StatementAdapter.evaluate(StatementAdapter.java:36)
	at com.carrotsearch.randomizedtesting.rules.StatementAdapter.evaluate(StatementAdapter.java:36)
	at org.apache.lucene.util.TestRuleAssertionsRequired$1.evaluate(TestRuleAssertionsRequired.java:53)
	at org.apache.lucene.util.TestRuleMarkFailure$1.evaluate(TestRuleMarkFailure.java:47)
	at org.apache.lucene.util.TestRuleIgnoreAfterMaxFailures$1.evaluate(TestRuleIgnoreAfterMaxFailures.java:64)
	at org.apache.lucene.util.TestRuleIgnoreTestSuites$1.evaluate(TestRuleIgnoreTestSuites.java:54)
	at com.carrotsearch.randomizedtesting.rules.StatementAdapter.evaluate(StatementAdapter.java:36)
	at com.carrotsearch.randomizedtesting.ThreadLeakControl$StatementRunner.run(ThreadLeakControl.java:367)
	at java.lang.Thread.run(Thread.java:745)


FAILED:  junit.framework.TestSuite.org.apache.solr.core.TestLazyCores

Error Message:
1 thread leaked from SUITE scope at org.apache.solr.core.TestLazyCores:     1) Thread[id=16643, name=searcherExecutor-7334-thread-1, state=WAITING, group=TGRP-TestLazyCores]         at sun.misc.Unsafe.park(Native Method)         at java.util.concurrent.locks.LockSupport.park(LockSupport.java:175)         at java.util.concurrent.locks.AbstractQueuedSynchronizer$ConditionObject.await(AbstractQueuedSynchronizer.java:2039)         at java.util.concurrent.LinkedBlockingQueue.take(LinkedBlockingQueue.java:442)         at java.util.concurrent.ThreadPoolExecutor.getTask(ThreadPoolExecutor.java:1067)         at java.util.concurrent.ThreadPoolExecutor.runWorker(ThreadPoolExecutor.java:1127)         at java.util.concurrent.ThreadPoolExecutor$Worker.run(ThreadPoolExecutor.java:617)         at java.lang.Thread.run(Thread.java:745)

Stack Trace:
com.carrotsearch.randomizedtesting.ThreadLeakError: 1 thread leaked from SUITE scope at org.apache.solr.core.TestLazyCores: 
   1) Thread[id=16643, name=searcherExecutor-7334-thread-1, state=WAITING, group=TGRP-TestLazyCores]
        at sun.misc.Unsafe.park(Native Method)
        at java.util.concurrent.locks.LockSupport.park(LockSupport.java:175)
        at java.util.concurrent.locks.AbstractQueuedSynchronizer$ConditionObject.await(AbstractQueuedSynchronizer.java:2039)
        at java.util.concurrent.LinkedBlockingQueue.take(LinkedBlockingQueue.java:442)
        at java.util.concurrent.ThreadPoolExecutor.getTask(ThreadPoolExecutor.java:1067)
        at java.util.concurrent.ThreadPoolExecutor.runWorker(ThreadPoolExecutor.java:1127)
        at java.util.concurrent.ThreadPoolExecutor$Worker.run(ThreadPoolExecutor.java:617)
        at java.lang.Thread.run(Thread.java:745)
	at __randomizedtesting.SeedInfo.seed([54EB7CD0CE80B83D]:0)


FAILED:  junit.framework.TestSuite.org.apache.solr.core.TestLazyCores

Error Message:
There are still zombie threads that couldn't be terminated:    1) Thread[id=16643, name=searcherExecutor-7334-thread-1, state=WAITING, group=TGRP-TestLazyCores]         at sun.misc.Unsafe.park(Native Method)         at java.util.concurrent.locks.LockSupport.park(LockSupport.java:175)         at java.util.concurrent.locks.AbstractQueuedSynchronizer$ConditionObject.await(AbstractQueuedSynchronizer.java:2039)         at java.util.concurrent.LinkedBlockingQueue.take(LinkedBlockingQueue.java:442)         at java.util.concurrent.ThreadPoolExecutor.getTask(ThreadPoolExecutor.java:1067)         at java.util.concurrent.ThreadPoolExecutor.runWorker(ThreadPoolExecutor.java:1127)         at java.util.concurrent.ThreadPoolExecutor$Worker.run(ThreadPoolExecutor.java:617)         at java.lang.Thread.run(Thread.java:745)

Stack Trace:
com.carrotsearch.randomizedtesting.ThreadLeakError: There are still zombie threads that couldn't be terminated:
   1) Thread[id=16643, name=searcherExecutor-7334-thread-1, state=WAITING, group=TGRP-TestLazyCores]
        at sun.misc.Unsafe.park(Native Method)
        at java.util.concurrent.locks.LockSupport.park(LockSupport.java:175)
        at java.util.concurrent.locks.AbstractQueuedSynchronizer$ConditionObject.await(AbstractQueuedSynchronizer.java:2039)
        at java.util.concurrent.LinkedBlockingQueue.take(LinkedBlockingQueue.java:442)
        at java.util.concurrent.ThreadPoolExecutor.getTask(ThreadPoolExecutor.java:1067)
        at java.util.concurrent.ThreadPoolExecutor.runWorker(ThreadPoolExecutor.java:1127)
        at java.util.concurrent.ThreadPoolExecutor$Worker.run(ThreadPoolExecutor.java:617)
        at java.lang.Thread.run(Thread.java:745)
	at __randomizedtesting.SeedInfo.seed([54EB7CD0CE80B83D]:0)




Build Log:
[...truncated 11827 lines...]
   [junit4] Suite: org.apache.solr.core.TestLazyCores
   [junit4]   2> Creating dataDir: /export/home/jenkins/workspace/Lucene-Solr-master-Solaris/solr/build/solr-core/test/J1/temp/solr.core.TestLazyCores_54EB7CD0CE80B83D-001/init-core-data-001
   [junit4]   2> 2105135 INFO  (SUITE-TestLazyCores-seed#[54EB7CD0CE80B83D]-worker) [    ] o.a.s.SolrTestCaseJ4 Randomized ssl (false) and clientAuth (false)
   [junit4]   2> 2105138 INFO  (TEST-TestLazyCores.testBadConfigsGenerateErrors-seed#[54EB7CD0CE80B83D]) [    ] o.a.s.SolrTestCaseJ4 ###Starting testBadConfigsGenerateErrors
   [junit4]   2> 2105152 INFO  (TEST-TestLazyCores.testBadConfigsGenerateErrors-seed#[54EB7CD0CE80B83D]) [    ] o.a.s.c.SolrResourceLoader new SolrResourceLoader for directory: '/export/home/jenkins/workspace/Lucene-Solr-master-Solaris/solr/build/solr-core/test/J1/temp/solr.core.TestLazyCores_54EB7CD0CE80B83D-001/tempDir-001'
   [junit4]   2> 2105152 INFO  (TEST-TestLazyCores.testBadConfigsGenerateErrors-seed#[54EB7CD0CE80B83D]) [    ] o.a.s.c.SolrResourceLoader JNDI not configured for solr (NoInitialContextEx)
   [junit4]   2> 2105152 INFO  (TEST-TestLazyCores.testBadConfigsGenerateErrors-seed#[54EB7CD0CE80B83D]) [    ] o.a.s.c.SolrResourceLoader solr home defaulted to 'solr/' (could not find system property or JNDI)
   [junit4]   2> 2105156 INFO  (TEST-TestLazyCores.testBadConfigsGenerateErrors-seed#[54EB7CD0CE80B83D]) [    ] o.a.s.c.CorePropertiesLocator Config-defined core root directory: /export/home/jenkins/workspace/Lucene-Solr-master-Solaris/solr/build/solr-core/test/J1/temp/solr.core.TestLazyCores_54EB7CD0CE80B83D-001/tempDir-001
   [junit4]   2> 2105156 INFO  (TEST-TestLazyCores.testBadConfigsGenerateErrors-seed#[54EB7CD0CE80B83D]) [    ] o.a.s.c.CoreContainer New CoreContainer 717650947
   [junit4]   2> 2105156 INFO  (TEST-TestLazyCores.testBadConfigsGenerateErrors-seed#[54EB7CD0CE80B83D]) [    ] o.a.s.c.CoreContainer Loading cores into CoreContainer [instanceDir=/export/home/jenkins/workspace/Lucene-Solr-master-Solaris/solr/build/solr-core/test/J1/temp/solr.core.TestLazyCores_54EB7CD0CE80B83D-001/tempDir-001]
   [junit4]   2> 2105156 WARN  (TEST-TestLazyCores.testBadConfigsGenerateErrors-seed#[54EB7CD0CE80B83D]) [    ] o.a.s.c.CoreContainer Couldn't add files from /export/home/jenkins/workspace/Lucene-Solr-master-Solaris/solr/build/solr-core/test/J1/temp/solr.core.TestLazyCores_54EB7CD0CE80B83D-001/tempDir-001/lib to classpath: /export/home/jenkins/workspace/Lucene-Solr-master-Solaris/solr/build/solr-core/test/J1/temp/solr.core.TestLazyCores_54EB7CD0CE80B83D-001/tempDir-001/lib
   [junit4]   2> 2105156 INFO  (TEST-TestLazyCores.testBadConfigsGenerateErrors-seed#[54EB7CD0CE80B83D]) [    ] o.a.s.h.c.HttpShardHandlerFactory created with socketTimeout : 600000,connTimeout : 60000,maxConnectionsPerHost : 20,maxConnections : 10000,corePoolSize : 0,maximumPoolSize : 2147483647,maxThreadIdleTime : 5,sizeOfQueue : -1,fairnessPolicy : false,useRetries : false,
   [junit4]   2> 2105157 INFO  (TEST-TestLazyCores.testBadConfigsGenerateErrors-seed#[54EB7CD0CE80B83D]) [    ] o.a.s.u.UpdateShardHandler Creating UpdateShardHandler HTTP client with params: socketTimeout=600000&connTimeout=60000&retry=true
   [junit4]   2> 2105158 INFO  (TEST-TestLazyCores.testBadConfigsGenerateErrors-seed#[54EB7CD0CE80B83D]) [    ] o.a.s.l.LogWatcher SLF4J impl is org.slf4j.impl.Log4jLoggerFactory
   [junit4]   2> 2105158 INFO  (TEST-TestLazyCores.testBadConfigsGenerateErrors-seed#[54EB7CD0CE80B83D]) [    ] o.a.s.l.LogWatcher Registering Log Listener [Log4j (org.slf4j.impl.Log4jLoggerFactory)]
   [junit4]   2> 2105158 INFO  (TEST-TestLazyCores.testBadConfigsGenerateErrors-seed#[54EB7CD0CE80B83D]) [    ] o.a.s.c.CoreContainer Security conf doesn't exist. Skipping setup for authorization module.
   [junit4]   2> 2105158 INFO  (TEST-TestLazyCores.testBadConfigsGenerateErrors-seed#[54EB7CD0CE80B83D]) [    ] o.a.s.c.CoreContainer No authentication plugin used.
   [junit4]   2> 2105160 INFO  (TEST-TestLazyCores.testBadConfigsGenerateErrors-seed#[54EB7CD0CE80B83D]) [    ] o.a.s.c.CorePropertiesLocator Looking for core definitions underneath /export/home/jenkins/workspace/Lucene-Solr-master-Solaris/solr/build/solr-core/test/J1/temp/solr.core.TestLazyCores_54EB7CD0CE80B83D-001/tempDir-001
   [junit4]   2> 2105161 INFO  (TEST-TestLazyCores.testBadConfigsGenerateErrors-seed#[54EB7CD0CE80B83D]) [    ] o.a.s.c.CoreDescriptor Created CoreDescriptor: {name=core1, config=solrconfig.xml, loadOnStartup=true, schema=schema.xml, configSetProperties=configsetprops.json, transient=false, dataDir=data/}
   [junit4]   2> 2105162 INFO  (TEST-TestLazyCores.testBadConfigsGenerateErrors-seed#[54EB7CD0CE80B83D]) [    ] o.a.s.c.CorePropertiesLocator Found core core1 in /export/home/jenkins/workspace/Lucene-Solr-master-Solaris/solr/build/solr-core/test/J1/temp/solr.core.TestLazyCores_54EB7CD0CE80B83D-001/tempDir-001/core1
   [junit4]   2> 2105162 INFO  (TEST-TestLazyCores.testBadConfigsGenerateErrors-seed#[54EB7CD0CE80B83D]) [    ] o.a.s.c.CoreDescriptor Created CoreDescriptor: {name=core2, config=solrconfig.xml, loadOnStartup=true, schema=schema.xml, configSetProperties=configsetprops.json, transient=false, dataDir=data/}
   [junit4]   2> 2105162 INFO  (TEST-TestLazyCores.testBadConfigsGenerateErrors-seed#[54EB7CD0CE80B83D]) [    ] o.a.s.c.CorePropertiesLocator Found core core2 in /export/home/jenkins/workspace/Lucene-Solr-master-Solaris/solr/build/solr-core/test/J1/temp/solr.core.TestLazyCores_54EB7CD0CE80B83D-001/tempDir-001/core2
   [junit4]   2> 2105163 INFO  (TEST-TestLazyCores.testBadConfigsGenerateErrors-seed#[54EB7CD0CE80B83D]) [    ] o.a.s.c.CoreDescriptor Created CoreDescriptor: {name=badConfig1, config=solrconfig.xml, loadOnStartup=true, schema=schema.xml, configSetProperties=configsetprops.json, transient=true, dataDir=data/}
   [junit4]   2> 2105163 INFO  (TEST-TestLazyCores.testBadConfigsGenerateErrors-seed#[54EB7CD0CE80B83D]) [    ] o.a.s.c.CorePropertiesLocator Found core badConfig1 in /export/home/jenkins/workspace/Lucene-Solr-master-Solaris/solr/build/solr-core/test/J1/temp/solr.core.TestLazyCores_54EB7CD0CE80B83D-001/tempDir-001/badConfig1
   [junit4]   2> 2105163 INFO  (TEST-TestLazyCores.testBadConfigsGenerateErrors-seed#[54EB7CD0CE80B83D]) [    ] o.a.s.c.CoreDescriptor Created CoreDescriptor: {name=badSchema2, config=solrconfig.xml, loadOnStartup=true, schema=schema.xml, configSetProperties=configsetprops.json, transient=true, dataDir=data/}
   [junit4]   2> 2105163 INFO  (TEST-TestLazyCores.testBadConfigsGenerateErrors-seed#[54EB7CD0CE80B83D]) [    ] o.a.s.c.CorePropertiesLocator Found core badSchema2 in /export/home/jenkins/workspace/Lucene-Solr-master-Solaris/solr/build/solr-core/test/J1/temp/solr.core.TestLazyCores_54EB7CD0CE80B83D-001/tempDir-001/badSchema2
   [junit4]   2> 2105164 INFO  (TEST-TestLazyCores.testBadConfigsGenerateErrors-seed#[54EB7CD0CE80B83D]) [    ] o.a.s.c.CoreDescriptor Created CoreDescriptor: {name=badConfig2, config=solrconfig.xml, loadOnStartup=true, schema=schema.xml, configSetProperties=configsetprops.json, transient=true, dataDir=data/}
   [junit4]   2> 2105164 INFO  (TEST-TestLazyCores.testBadConfigsGenerateErrors-seed#[54EB7CD0CE80B83D]) [    ] o.a.s.c.CorePropertiesLocator Found core badConfig2 in /export/home/jenkins/workspace/Lucene-Solr-master-Solaris/solr/build/solr-core/test/J1/temp/solr.core.TestLazyCores_54EB7CD0CE80B83D-001/tempDir-001/badConfig2
   [junit4]   2> 2105165 INFO  (TEST-TestLazyCores.testBadConfigsGenerateErrors-seed#[54EB7CD0CE80B83D]) [    ] o.a.s.c.CoreDescriptor Created CoreDescriptor: {name=badSchema1, config=solrconfig.xml, loadOnStartup=true, schema=schema.xml, configSetProperties=configsetprops.json, transient=true, dataDir=data/}
   [junit4]   2> 2105165 INFO  (TEST-TestLazyCores.testBadConfigsGenerateErrors-seed#[54EB7CD0CE80B83D]) [    ] o.a.s.c.CorePropertiesLocator Found core badSchema1 in /export/home/jenkins/workspace/Lucene-Solr-master-Solaris/solr/build/solr-core/test/J1/temp/solr.core.TestLazyCores_54EB7CD0CE80B83D-001/tempDir-001/badSchema1
   [junit4]   2> 2105165 INFO  (TEST-TestLazyCores.testBadConfigsGenerateErrors-seed#[54EB7CD0CE80B83D]) [    ] o.a.s.c.CorePropertiesLocator Found 6 core definitions
   [junit4]   2> 2105166 INFO  (coreLoadExecutor-7143-thread-1) [    ] o.a.s.c.SolrResourceLoader new SolrResourceLoader for directory: '/export/home/jenkins/workspace/Lucene-Solr-master-Solaris/solr/build/solr-core/test/J1/temp/solr.core.TestLazyCores_54EB7CD0CE80B83D-001/tempDir-001/core1'
   [junit4]   2> 2105166 INFO  (coreLoadExecutor-7143-thread-1) [    ] o.a.s.c.SolrResourceLoader JNDI not configured for solr (NoInitialContextEx)
   [junit4]   2> 2105166 INFO  (coreLoadExecutor-7143-thread-1) [    ] o.a.s.c.SolrResourceLoader solr home defaulted to 'solr/' (could not find system property or JNDI)
   [junit4]   2> 2105172 INFO  (coreLoadExecutor-7143-thread-1) [    ] o.a.s.c.SolrConfig current version of requestparams : -1
   [junit4]   2> 2105174 WARN  (coreLoadExecutor-7143-thread-1) [    ] o.a.s.c.Config Beginning with Solr 5.5, <mergePolicy> is deprecated, use <mergePolicyFactory> instead.
   [junit4]   2> 2105174 INFO  (coreLoadExecutor-7143-thread-1) [    ] o.a.s.c.SolrConfig Using Lucene MatchVersion: 7.0.0
   [junit4]   2> 2105191 INFO  (coreLoadExecutor-7143-thread-1) [    ] o.a.s.c.SolrConfig Loaded SolrConfig: solrconfig.xml
   [junit4]   2> 2105193 INFO  (coreLoadExecutor-7143-thread-1) [    ] o.a.s.s.IndexSchema [core1] Schema name=tiny
   [junit4]   2> 2105193 INFO  (coreLoadExecutor-7143-thread-3) [    ] o.a.s.c.SolrResourceLoader new SolrResourceLoader for directory: '/export/home/jenkins/workspace/Lucene-Solr-master-Solaris/solr/build/solr-core/test/J1/temp/solr.core.TestLazyCores_54EB7CD0CE80B83D-001/tempDir-001/badConfig1'
   [junit4]   2> 2105193 INFO  (coreLoadExecutor-7143-thread-3) [    ] o.a.s.c.SolrResourceLoader JNDI not configured for solr (NoInitialContextEx)
   [junit4]   2> 2105193 INFO  (coreLoadExecutor-7143-thread-3) [    ] o.a.s.c.SolrResourceLoader solr home defaulted to 'solr/' (could not find system property or JNDI)
   [junit4]   2> 2105193 INFO  (coreLoadExecutor-7143-thread-2) [    ] o.a.s.c.SolrResourceLoader new SolrResourceLoader for directory: '/export/home/jenkins/workspace/Lucene-Solr-master-Solaris/solr/build/solr-core/test/J1/temp/solr.core.TestLazyCores_54EB7CD0CE80B83D-001/tempDir-001/core2'
   [junit4]   2> 2105194 INFO  (coreLoadExecutor-7143-thread-2) [    ] o.a.s.c.SolrResourceLoader JNDI not configured for solr (NoInitialContextEx)
   [junit4]   2> 2105194 INFO  (coreLoadExecutor-7143-thread-2) [    ] o.a.s.c.SolrResourceLoader solr home defaulted to 'solr/' (could not find system property or JNDI)
   [junit4]   2> 2105195 INFO  (coreLoadExecutor-7143-thread-1) [    ] o.a.s.s.IndexSchema unique key field: id
   [junit4]   2> 2105201 INFO  (coreLoadExecutor-7143-thread-1) [    ] o.a.s.c.ConfigSetProperties Did not find ConfigSet properties, assuming default properties: Can't find resource 'configsetprops.json' in classpath or '/export/home/jenkins/workspace/Lucene-Solr-master-Solaris/solr/build/solr-core/test/J1/temp/solr.core.TestLazyCores_54EB7CD0CE80B83D-001/tempDir-001/core1'
   [junit4]   2> 2105201 INFO  (coreLoadExecutor-7143-thread-1) [    ] o.a.s.c.CoreContainer Creating SolrCore 'core1' using configuration from instancedir /export/home/jenkins/workspace/Lucene-Solr-master-Solaris/solr/build/solr-core/test/J1/temp/solr.core.TestLazyCores_54EB7CD0CE80B83D-001/tempDir-001/core1
   [junit4]   2> 2105201 INFO  (coreLoadExecutor-7143-thread-1) [    x:core1] o.a.s.c.SolrCore org.apache.solr.core.MockDirectoryFactory
   [junit4]   2> 2105201 INFO  (coreLoadExecutor-7143-thread-1) [    x:core1] o.a.s.c.SolrCore [[core1] ] Opening new SolrCore at [/export/home/jenkins/workspace/Lucene-Solr-master-Solaris/solr/build/solr-core/test/J1/temp/solr.core.TestLazyCores_54EB7CD0CE80B83D-001/tempDir-001/core1], dataDir=[/export/home/jenkins/workspace/Lucene-Solr-master-Solaris/solr/build/solr-core/test/J1/temp/solr.core.TestLazyCores_54EB7CD0CE80B83D-001/tempDir-001/core1/data/]
   [junit4]   2> 2105202 INFO  (coreLoadExecutor-7143-thread-1) [    x:core1] o.a.s.c.SolrCore JMX monitoring not detected for core: core1
   [junit4]   2> 2105202 INFO  (coreLoadExecutor-7143-thread-1) [    x:core1] o.a.s.c.CachingDirectoryFactory return new directory for /export/home/jenkins/workspace/Lucene-Solr-master-Solaris/solr/build/solr-core/test/J1/temp/solr.core.TestLazyCores_54EB7CD0CE80B83D-001/tempDir-001/core1/data
   [junit4]   2> 2105202 INFO  (coreLoadExecutor-7143-thread-1) [    x:core1] o.a.s.c.SolrCore New index directory detected: old=null new=/export/home/jenkins/workspace/Lucene-Solr-master-Solaris/solr/build/solr-core/test/J1/temp/solr.core.TestLazyCores_54EB7CD0CE80B83D-001/tempDir-001/core1/data/index/
   [junit4]   2> 2105202 WARN  (coreLoadExecutor-7143-thread-1) [    x:core1] o.a.s.c.SolrCore [core1] Solr index directory '/export/home/jenkins/workspace/Lucene-Solr-master-Solaris/solr/build/solr-core/test/J1/temp/solr.core.TestLazyCores_54EB7CD0CE80B83D-001/tempDir-001/core1/data/index' doesn't exist. Creating new index...
   [junit4]   2> 2105202 INFO  (coreLoadExecutor-7143-thread-1) [    x:core1] o.a.s.c.CachingDirectoryFactory return new directory for /export/home/jenkins/workspace/Lucene-Solr-master-Solaris/solr/build/solr-core/test/J1/temp/solr.core.TestLazyCores_54EB7CD0CE80B83D-001/tempDir-001/core1/data/index
   [junit4]   2> 2105203 INFO  (coreLoadExecutor-7143-thread-1) [    x:core1] o.a.s.u.RandomMergePolicy RandomMergePolicy wrapping class org.apache.lucene.index.LogByteSizeMergePolicy: [LogByteSizeMergePolicy: minMergeSize=1677721, mergeFactor=27, maxMergeSize=2147483648, maxMergeSizeForForcedMerge=9223372036854775807, calibrateSizeByDeletes=true, maxMergeDocs=2147483647, maxCFSSegmentSizeMB=8.796093022207999E12, noCFSRatio=0.8775884652990303]
   [junit4]   2> 2105204 INFO  (coreLoadExecutor-7143-thread-1) [    x:core1] o.a.s.c.SolrDeletionPolicy SolrDeletionPolicy.onCommit: commits: num=1
   [junit4]   2> 	commit{dir=MockDirectoryWrapper(RAMDirectory@6f5fe678 lockFactory=org.apache.lucene.store.SingleInstanceLockFactory@4d576751),segFN=segments_1,generation=1}
   [junit4]   2> 2105204 INFO  (coreLoadExecutor-7143-thread-1) [    x:core1] o.a.s.c.SolrDeletionPolicy newest commit generation = 1
   [junit4]   2> 2105213 INFO  (coreLoadExecutor-7143-thread-3) [    ] o.a.s.c.Config Ignoring exception matching \QSAXParseException\E
   [junit4]   2> 2105213 ERROR (coreLoadExecutor-7143-thread-3) [    ] o.a.s.c.CoreContainer Error creating core [badConfig1]: Could not load conf for core badConfig1: Error loading solr config from /export/home/jenkins/workspace/Lucene-Solr-master-Solaris/solr/build/solr-core/test/J1/temp/solr.core.TestLazyCores_54EB7CD0CE80B83D-001/tempDir-001/badConfig1/conf/solrconfig.xml
   [junit4]   2> org.apache.solr.common.SolrException: Could not load conf for core badConfig1: Error loading solr config from /export/home/jenkins/workspace/Lucene-Solr-master-Solaris/solr/build/solr-core/test/J1/temp/solr.core.TestLazyCores_54EB7CD0CE80B83D-001/tempDir-001/badConfig1/conf/solrconfig.xml
   [junit4]   2> 	at org.apache.solr.core.ConfigSetService.getConfig(ConfigSetService.java:86)
   [junit4]   2> 	at org.apache.solr.core.CoreContainer.create(CoreContainer.java:813)
   [junit4]   2> 	at org.apache.solr.core.CoreContainer.access$000(CoreContainer.java:88)
   [junit4]   2> 	at org.apache.solr.core.CoreContainer$1.call(CoreContainer.java:468)
   [junit4]   2> 	at org.apache.solr.core.CoreContainer$1.call(CoreContainer.java:459)
   [junit4]   2> 	at java.util.concurrent.FutureTask.run(FutureTask.java:266)
   [junit4]   2> 	at org.apache.solr.common.util.ExecutorUtil$MDCAwareThreadPoolExecutor.lambda$execute$0(ExecutorUtil.java:229)
   [junit4]   2> 	at java.util.concurrent.ThreadPoolExecutor.runWorker(ThreadPoolExecutor.java:1142)
   [junit4]   2> 	at java.util.concurrent.ThreadPoolExecutor$Worker.run(ThreadPoolExecutor.java:617)
   [junit4]   2> 	at java.lang.Thread.run(Thread.java:745)
   [junit4]   2> Caused by: org.apache.solr.common.SolrException: Error loading solr config from /export/home/jenkins/workspace/Lucene-Solr-master-Solaris/solr/build/solr-core/test/J1/temp/solr.core.TestLazyCores_54EB7CD0CE80B83D-001/tempDir-001/badConfig1/conf/solrconfig.xml
   [junit4]   2> 	at org.apache.solr.core.SolrConfig.readFromResourceLoader(SolrConfig.java:172)
   [junit4]   2> 	at org.apache.solr.core.ConfigSetService.createSolrConfig(ConfigSetService.java:98)
   [junit4]   2> 	at org.apache.solr.core.ConfigSetService.getConfig(ConfigSetService.java:78)
   [junit4]   2> 	... 9 more
   [junit4]   2> Caused by: org.apache.solr.common.SolrException: org.xml.sax.SAXParseException; systemId: solrres:/solrconfig.xml; lineNumber: 56; columnNumber: 5; O tipo de elemento reqsthalr" deve ser encerrado pela tag final correspondente "</reqsthalr>".
   [junit4]   2> 	at org.apache.solr.core.Config.<init>(Config.java:154)
   [junit4]   2> 	at org.apache.solr.core.Config.<init>(Config.java:90)
   [junit4]   2> 	at org.apache.solr.core.SolrConfig.<init>(SolrConfig.java:187)
   [junit4]   2> 	at org.apache.solr.core.SolrConfig.readFromResourceLoader(SolrConfig.java:164)
   [junit4]   2> 	... 11 more
   [junit4]   2> Caused by: org.xml.sax.SAXParseException; systemId: solrres:/solrconfig.xml; lineNumber: 56; columnNumber: 5; O tipo de elemento reqsthalr" deve ser encerrado pela tag final correspondente "</reqsthalr>".
   [junit4]   2> 	at com.sun.org.apache.xerces.internal.util.ErrorHandlerWrapper.createSAXParseException(ErrorHandlerWrapper.java:203)
   [junit4]   2> 	at com.sun.org.apache.xerces.internal.util.ErrorHandlerWrapper.fatalError(ErrorHandlerWrapper.java:177)
   [junit4]   2> 	at com.sun.org.apache.xerces.internal.impl.XMLErrorReporter.reportError(XMLErrorReporter.java:400)
   [junit4]   2> 	at com.sun.org.apache.xerces.internal.impl.XMLErrorReporter.reportError(XMLErrorReporter.java:327)
   [junit4]   2> 	at com.sun.org.apache.xerces.internal.impl.XMLScanner.reportFatalError(XMLScanner.java:1437)
   [junit4]   2> 	at com.sun.org.apache.xerces.internal.impl.XMLDocumentFragmentScannerImpl.scanEndElement(XMLDocumentFragmentScannerImpl.java:1750)
   [junit4]   2> 	at com.sun.org.apache.xerces.internal.impl.XMLDocumentFragmentScannerImpl$FragmentContentDriver.next(XMLDocumentFragmentScannerImpl.java:2970)
   [junit4]   2> 	at com.sun.org.apache.xerces.internal.impl.XMLDocumentScannerImpl.next(XMLDocumentScannerImpl.java:606)
   [junit4]   2> 	at com.sun.org.apache.xerces.internal.impl.XMLNSDocumentScannerImpl.next(XMLNSDocumentScannerImpl.java:118)
   [junit4]   2> 	at com.sun.org.apache.xerces.internal.impl.XMLDocumentFragmentScannerImpl.scanDocument(XMLDocumentFragmentScannerImpl.java:510)
   [junit4]   2> 	at com.sun.org.apache.xerces.internal.parsers.XML11Configuration.parse(XML11Configuration.java:848)
   [junit4]   2> 	at com.sun.org.apache.xerces.internal.parsers.XML11Configuration.parse(XML11Configuration.java:777)
   [junit4]   2> 	at com.sun.org.apache.xerces.internal.parsers.XMLParser.parse(XMLParser.java:141)
   [junit4]   2> 	at com.sun.org.apache.xerces.internal.parsers.DOMParser.parse(DOMParser.java:243)
   [junit4]   2> 	at com.sun.org.apache.xerces.internal.jaxp.DocumentBuilderImpl.parse(DocumentBuilderImpl.java:339)
   [junit4]   2> 	at org.apache.solr.core.Config.<init>(Config.java:143)
   [junit4]   2> 	... 14 more
   [junit4]   2> 2105214 INFO  (coreLoadExecutor-7143-thread-3) [    ] o.a.s.c.SolrResourceLoader new SolrResourceLoader for directory: '/export/home/jenkins/workspace/Lucene-Solr-master-Solaris/solr/build/solr-core/test/J1/temp/solr.core.TestLazyCores_54EB7CD0CE80B83D-001/tempDir-001/badSchema2'
   [junit4]   2> 2105214 INFO  (coreLoadExecutor-7143-thread-3) [    ] o.a.s.c.SolrResourceLoader JNDI not configured for solr (NoInitialContextEx)
   [junit4]   2> 2105214 INFO  (coreLoadExecutor-7143-thread-3) [    ] o.a.s.c.SolrResourceLoader solr home defaulted to 'solr/' (could not find system property or JNDI)
   [junit4]   2> 2105231 INFO  (coreLoadExecutor-7143-thread-3) [    ] o.a.s.c.SolrConfig current version of requestparams : -1
   [junit4]   2> 2105233 WARN  (coreLoadExecutor-7143-thread-3) [    ] o.a.s.c.Config Beginning with Solr 5.5, <mergePolicy> is deprecated, use <mergePolicyFactory> instead.
   [junit4]   2> 2105233 INFO  (coreLoadExecutor-7143-thread-3) [    ] o.a.s.c.SolrConfig Using Lucene MatchVersion: 7.0.0
   [junit4]   2> 2105236 INFO  (coreLoadExecutor-7143-thread-3) [    ] o.a.s.c.SolrConfig Loaded SolrConfig: solrconfig.xml
   [junit4]   2> 2105237 INFO  (coreLoadExecutor-7143-thread-2) [    ] o.a.s.c.SolrConfig current version of requestparams : -1
   [junit4]   2> 2105238 INFO  (coreLoadExecutor-7143-thread-3) [    ] o.a.s.c.Config Ignoring exception matching \QSAXParseException\E
   [junit4]   2> 2105238 ERROR (coreLoadExecutor-7143-thread-3) [    ] o.a.s.c.CoreContainer Error creating core [badSchema2]: Could not load conf for core badSchema2: Can't load schema /export/home/jenkins/workspace/Lucene-Solr-master-Solaris/solr/build/solr-core/test/J1/temp/solr.core.TestLazyCores_54EB7CD0CE80B83D-001/tempDir-001/badSchema2/conf/schema.xml: org.xml.sax.SAXParseException; systemId: solrres:/schema.xml; lineNumber: 35; columnNumber: 7; O tipo de elemento filedType" deve ser encerrado pela tag final correspondente "</filedType>".
   [junit4]   2> org.apache.solr.common.SolrException: Could not load conf for core badSchema2: Can't load schema /export/home/jenkins/workspace/Lucene-Solr-master-Solaris/solr/build/solr-core/test/J1/temp/solr.core.TestLazyCores_54EB7CD0CE80B83D-001/tempDir-001/badSchema2/conf/schema.xml: org.xml.sax.SAXParseException; systemId: solrres:/schema.xml; lineNumber: 35; columnNumber: 7; O tipo de elemento filedType" deve ser encerrado pela tag final correspondente "</filedType>".
   [junit4]   2> 	at org.apache.solr.core.ConfigSetService.getConfig(ConfigSetService.java:86)
   [junit4]   2> 	at org.apache.solr.core.CoreContainer.create(CoreContainer.java:813)
   [junit4]   2> 	at org.apache.solr.core.CoreContainer.access$000(CoreContainer.java:88)
   [junit4]   2> 	at org.apache.solr.core.CoreContainer$1.call(CoreContainer.java:468)
   [junit4]   2> 	at org.apache.solr.core.CoreContainer$1.call(CoreContainer.java:459)
   [junit4]   2> 	at java.util.concurrent.FutureTask.run(FutureTask.java:266)
   [junit4]   2> 	at org.apache.solr.common.util.ExecutorUtil$MDCAwareThreadPoolExecutor.lambda$execute$0(ExecutorUtil.java:229)
   [junit4]   2> 	at java.util.concurrent.ThreadPoolExecutor.runWorker(ThreadPoolExecutor.java:1142)
   [junit4]   2> 	at java.util.concurrent.ThreadPoolExecutor$Worker.run(ThreadPoolExecutor.java:617)
   [junit4]   2> 	at java.lang.Thread.run(Thread.java:745)
   [junit4]   2> Caused by: org.apache.solr.common.SolrException: Can't load schema /export/home/jenkins/workspace/Lucene-Solr-master-Solaris/solr/build/solr-core/test/J1/temp/solr.core.TestLazyCores_54EB7CD0CE80B83D-001/tempDir-001/badSchema2/conf/schema.xml: org.xml.sax.SAXParseException; systemId: solrres:/schema.xml; lineNumber: 35; columnNumber: 7; O tipo de elemento filedType" deve ser encerrado pela tag final correspondente "</filedType>".
   [junit4]   2> 	at org.apache.solr.schema.IndexSchema.readSchema(IndexSchema.java:580)
   [junit4]   2> 	at org.apache.solr.schema.IndexSchema.<init>(IndexSchema.java:163)
   [junit4]   2> 	at org.apache.solr.schema.IndexSchemaFactory.create(IndexSchemaFactory.java:56)
   [junit4]   2> 	at org.apache.solr.schema.IndexSchemaFactory.buildIndexSchema(IndexSchemaFactory.java:75)
   [junit4]   2> 	at org.apache.solr.core.ConfigSetService.createIndexSchema(ConfigSetService.java:108)
   [junit4]   2> 	at org.apache.solr.core.ConfigSetService.getConfig(ConfigSetService.java:79)
   [junit4]   2> 	... 9 more
   [junit4]   2> Caused by: org.apache.solr.common.SolrException: org.xml.sax.SAXParseException; systemId: solrres:/schema.xml; lineNumber: 35; columnNumber: 7; O tipo de elemento filedType" deve ser encerrado pela tag final correspondente "</filedType>".
   [junit4]   2> 	at org.apache.solr.core.Config.<init>(Config.java:154)
   [junit4]   2> 	at org.apache.solr.core.Config.<init>(Config.java:90)
   [junit4]   2> 	at org.apache.solr.schema.IndexSchema.readSchema(IndexSchema.java:440)
   [junit4]   2> 	... 14 more
   [junit4]   2> Caused by: org.xml.sax.SAXParseException; systemId: solrres:/schema.xml; lineNumber: 35; columnNumber: 7; O tipo de elemento filedType" deve ser encerrado pela tag final correspondente "</filedType>".
   [junit4]   2> 	at com.sun.org.apache.xerces.internal.util.ErrorHandlerWrapper.createSAXParseException(ErrorHandlerWrapper.java:203)
   [junit4]   2> 	at com.sun.org.apache.xerces.internal.util.ErrorHandlerWrapper.fatalError(ErrorHandlerWrapper.java:177)
   [junit4]   2> 	at com.sun.org.apache.xerces.internal.impl.XMLErrorReporter.reportError(XMLErrorReporter.java:400)
   [junit4]   2> 	at com.sun.org.apache.xerces.internal.impl.XMLErrorReporter.reportError(XMLErrorReporter.java:327)
   [junit4]   2> 	at com.sun.org.apache.xerces.internal.impl.XMLScanner.reportFatalError(XMLScanner.java:1437)
   [junit4]   2> 	at com.sun.org.apache.xerces.internal.impl.XMLDocumentFragmentScannerImpl.scanEndElement(XMLDocumentFragmentScannerImpl.java:1750)
   [junit4]   2> 	at com.sun.org.apache.xerces.internal.impl.XMLDocumentFragmentScannerImpl$FragmentContentDriver.next(XMLDocumentFragmentScannerImpl.java:2970)
   [junit4]   2> 	at com.sun.org.apache.xerces.internal.impl.XMLDocumentScannerImpl.next(XMLDocumentScannerImpl.java:606)
   [junit4]   2> 	at com.sun.org.apache.xerces.internal.impl.XMLNSDocumentScannerImpl.next(XMLNSDocumentScannerImpl.java:118)
   [junit4]   2> 	at com.sun.org.apache.xerces.internal.impl.XMLDocumentFragmentScannerImpl.scanDocument(XMLDocumentFragmentScannerImpl.java:510)
   [junit4]   2> 	at com.sun.org.apache.xerces.internal.parsers.XML11Configuration.parse(XML11Configuration.java:848)
   [junit4]   2> 	at com.sun.org.apache.xerces.internal.parsers.XML11Configuration.parse(XML11Configuration.java:777)
   [junit4]   2> 	at com.sun.org.apache.xerces.internal.parsers.XMLParser.parse(XMLParser.java:141)
   [junit4]   2> 	at com.sun.org.apache.xerces.internal.parsers.DOMParser.parse(DOMParser.java:243)
   [junit4]   2> 	at com.sun.org.apache.xerces.internal.jaxp.DocumentBuilderImpl.parse(DocumentBuilderImpl.java:339)
   [junit4]   2> 	at org.apache.solr.core.Config.<init>(Config.java:143)
   [junit4]   2> 	... 16 more
   [junit4]   2> 2105239 WARN  (coreLoadExecutor-7143-thread-2) [    ] o.a.s.c.Config Beginning with Solr 5.5, <mergePolicy> is deprecated, use <mergePolicyFactory> instead.
   [junit4]   2> 2105239 INFO  (coreLoadExecutor-7143-thread-2) [    ] o.a.s.c.SolrConfig Using Lucene MatchVersion: 7.0.0
   [junit4]   2> 2105239 INFO  (coreLoadExecutor-7143-thread-1) [    x:core1] o.a.s.c.SolrCore no updateRequestProcessorChain defined as default, creating implicit default
   [junit4]   2> 2105242 INFO  (coreLoadExecutor-7143-thread-2) [    ] o.a.s.c.SolrConfig Loaded SolrConfig: solrconfig.xml
   [junit4]   2> 2105242 INFO  (coreLoadExecutor-7143-thread-1) [    x:core1] o.a.s.h.l.XMLLoader xsltCacheLifetimeSeconds=60
   [junit4]   2> 2105244 INFO  (coreLoadExecutor-7143-thread-1) [    x:core1] o.a.s.h.l.XMLLoader xsltCacheLifetimeSeconds=60
   [junit4]   2> 2105244 INFO  (coreLoadExecutor-7143-thread-2) [    ] o.a.s.s.IndexSchema [core2] Schema name=tiny
   [junit4]   2> 2105245 INFO  (coreLoadExecutor-7143-thread-1) [    x:core1] o.a.s.h.l.XMLLoader xsltCacheLifetimeSeconds=60
   [junit4]   2> 2105246 INFO  (coreLoadExecutor-7143-thread-2) [    ] o.a.s.s.IndexSchema unique key field: id
   [junit4]   2> 2105252 INFO  (coreLoadExecutor-7143-thread-1) [    x:core1] o.a.s.h.l.XMLLoader xsltCacheLifetimeSeconds=60
   [junit4]   2> 2105253 INFO  (coreLoadExecutor-7143-thread-2) [    ] o.a.s.c.ConfigSetProperties Did not find ConfigSet properties, assuming default properties: Can't find resource 'configsetprops.json' in classpath or '/export/home/jenkins/workspace/Lucene-Solr-master-Solaris/solr/build/solr-core/test/J1/temp/solr.core.TestLazyCores_54EB7CD0CE80B83D-001/tempDir-001/core2'
   [junit4]   2> 2105253 INFO  (coreLoadExecutor-7143-thread-2) [    ] o.a.s.c.CoreContainer Creating SolrCore 'core2' using configuration from instancedir /export/home/jenkins/workspace/Lucene-Solr-master-Solaris/solr/build/solr-core/test/J1/temp/solr.core.TestLazyCores_54EB7CD0CE80B83D-001/tempDir-001/core2
   [junit4]   2> 2105253 INFO  (coreLoadExecutor-7143-thread-2) [    x:core2] o.a.s.c.SolrCore org.apache.solr.core.MockDirectoryFactory
   [junit4]   2> 2105253 INFO  (coreLoadExecutor-7143-thread-2) [    x:core2] o.a.s.c.SolrCore [[core2] ] Opening new SolrCore at [/export/home/jenkins/workspace/Lucene-Solr-master-Solaris/solr/build/solr-core/test/J1/temp/solr.core.TestLazyCores_54EB7CD0CE80B83D-001/tempDir-001/core2], dataDir=[/export/home/jenkins/workspace/Lucene-Solr-master-Solaris/solr/build/solr-core/test/J1/temp/solr.core.TestLazyCores_54EB7CD0CE80B83D-001/tempDir-001/core2/data/]
   [junit4]   2> 2105239 INFO  (coreLoadExecutor-7143-thread-3) [    ] o.a.s.c.SolrResourceLoader new SolrResourceLoader for directory: '/export/home/jenkins/workspace/Lucene-Solr-master-Solaris/solr/build/solr-core/test/J1/temp/solr.core.TestLazyCores_54EB7CD0CE80B83D-001/tempDir-001/badConfig2'
   [junit4]   2> 2105253 INFO  (coreLoadExecutor-7143-thread-2) [    x:core2] o.a.s.c.SolrCore JMX monitoring not detected for core: core2
   [junit4]   2> 2105254 INFO  (coreLoadExecutor-7143-thread-3) [    ] o.a.s.c.SolrResourceLoader JNDI not configured for solr (NoInitialContextEx)
   [junit4]   2> 2105254 INFO  (coreLoadExecutor-7143-thread-3) [    ] o.a.s.c.SolrResourceLoader solr home defaulted to 'solr/' (could not find system property or JNDI)
   [junit4]   2> 2105254 INFO  (coreLoadExecutor-7143-thread-2) [    x:core2] o.a.s.c.CachingDirectoryFactory return new directory for /export/home/jenkins/workspace/Lucene-Solr-master-Solaris/solr/build/solr-core/test/J1/temp/solr.core.TestLazyCores_54EB7CD0CE80B83D-001/tempDir-001/core2/data
   [junit4]   2> 2105254 INFO  (coreLoadExecutor-7143-thread-2) [    x:core2] o.a.s.c.SolrCore New index directory detected: old=null new=/export/home/jenkins/workspace/Lucene-Solr-master-Solaris/solr/build/solr-core/test/J1/temp/solr.core.TestLazyCores_54EB7CD0CE80B83D-001/tempDir-001/core2/data/index/
   [junit4]   2> 2105254 WARN  (coreLoadExecutor-7143-thread-2) [    x:core2] o.a.s.c.SolrCore [core2] Solr index directory '/export/home/jenkins/workspace/Lucene-Solr-master-Solaris/solr/build/solr-core/test/J1/temp/solr.core.TestLazyCores_54EB7CD0CE80B83D-001/tempDir-001/core2/data/index' doesn't exist. Creating new index...
   [junit4]   2> 2105254 INFO  (coreLoadExecutor-7143-thread-2) [    x:core2] o.a.s.c.CachingDirectoryFactory return new directory for /export/home/jenkins/workspace/Lucene-Solr-master-Solaris/solr/build/solr-core/test/J1/temp/solr.core.TestLazyCores_54EB7CD0CE80B83D-001/tempDir-001/core2/data/index
   [junit4]   2> 2105255 INFO  (coreLoadExecutor-7143-thread-2) [    x:core2] o.a.s.u.RandomMergePolicy RandomMergePolicy wrapping class org.apache.lucene.index.LogByteSizeMergePolicy: [LogByteSizeMergePolicy: minMergeSize=1677721, mergeFactor=27, maxMergeSize=2147483648, maxMergeSizeForForcedMerge=9223372036854775807, calibrateSizeByDeletes=true, maxMergeDocs=2147483647, maxCFSSegmentSizeMB=8.796093022207999E12, noCFSRatio=0.8775884652990303]
   [junit4]   2> 2105256 INFO  (coreLoadExecutor-7143-thread-2) [    x:core2] o.a.s.c.SolrDeletionPolicy SolrDeletionPolicy.onCommit: commits: num=1
   [junit4]   2> 	commit{dir=MockDirectoryWrapper(RAMDirectory@6cc19ebd lockFactory=org.apache.lucene.store.SingleInstanceLockFactory@5124edb0),segFN=segments_1,generation=1}
   [junit4]   2> 2105256 INFO  (coreLoadExecutor-7143-thread-2) [    x:core2] o.a.s.c.SolrDeletionPolicy newest commit generation = 1
   [junit4]   2> 2105256 INFO  (coreLoadExecutor-7143-thread-3) [    ] o.a.s.c.Config Ignoring exception matching \QSAXParseException\E
   [junit4]   2> 2105256 ERROR (coreLoadExecutor-7143-thread-3) [    ] o.a.s.c.CoreContainer Error creating core [badConfig2]: Could not load conf for core badConfig2: Error loading solr config from /export/home/jenkins/workspace/Lucene-Solr-master-Solaris/solr/build/solr-core/test/J1/temp/solr.core.TestLazyCores_54EB7CD0CE80B83D-001/tempDir-001/badConfig2/conf/solrconfig.xml
   [junit4]   2> org.apache.solr.common.SolrException: Could not load conf for core badConfig2: Error loading solr config from /export/home/jenkins/workspace/Lucene-Solr-master-Solaris/solr/build/solr-core/test/J1/temp/solr.core.TestLazyCores_54EB7CD0CE80B83D-001/tempDir-001/badConfig2/conf/solrconfig.xml
   [junit4]   2> 	at org.apache.solr.core.ConfigSetService.getConfig(ConfigSetService.java:86)
   [junit4]   2> 	at org.apache.solr.core.CoreContainer.create(CoreContainer.java:813)
   [junit4]   2> 	at org.apache.solr.core.CoreContainer.access$000(CoreContainer.java:88)
   [junit4]   2> 	at org.apache.solr.core.CoreContainer$1.call(CoreContainer.java:468)
   [junit4]   2> 	at org.apache.solr.core.CoreContainer$1.call(CoreContainer.java:459)
   [junit4]   2> 	at java.util.concurrent.FutureTask.run(FutureTask.java:266)
   [junit4]   2> 	at org.apache.solr.common.util.ExecutorUtil$MDCAwareThreadPoolExecutor.lambda$execute$0(ExecutorUtil.java:229)
   [junit4]   2> 	at java.util.concurrent.ThreadPoolExecutor.runWorker(ThreadPoolExecutor.java:1142)
   [junit4]   2> 	at java.util.concurrent.ThreadPoolExecutor$Worker.run(ThreadPoolExecutor.java:617)
   [junit4]   2> 	at java.lang.Thread.run(Thread.java:745)
   [junit4]   2> Caused by: org.apache.solr.common.SolrException: Error loading solr config from /export/home/jenkins/workspace/Lucene-Solr-master-Solaris/solr/build/solr-core/test/J1/temp/solr.core.TestLazyCores_54EB7CD0CE80B83D-001/tempDir-001/badConfig2/conf/solrconfig.xml
   [junit4]   2> 	at org.apache.solr.core.SolrConfig.readFromResourceLoader(SolrConfig.java:172)
   [junit4]   2> 	at org.apache.solr.core.ConfigSetService.createSolrConfig(ConfigSetService.java:98)
   [junit4]   2> 	at org.apache.solr.core.ConfigSetService.getConfig(ConfigSetService.java:78)
   [junit4]   2> 	... 9 more
   [junit4]   2> Caused by: org.apache.solr.common.SolrException: org.xml.sax.SAXParseException; systemId: solrres:/solrconfig.xml; lineNumber: 56; columnNumber: 5; O tipo de elemento reqsthalr" deve ser encerrado pela tag final correspondente "</reqsthalr>".
   [junit4]   2> 	at org.apache.solr.core.Config.<init>(Config.java:154)
   [junit4]   2> 	at org.apache.solr.core.Config.<init>(Config.java:90)
   [junit4]   2> 	at org.apache.solr.core.SolrConfig.<init>(SolrConfig.java:187)
   [junit4]   2> 	at org.apache.solr.core.SolrConfig.readFromResourceLoader(SolrConfig.java:164)
   [junit4]   2> 	... 11 more
   [junit4]   2> Caused by: org.xml.sax.SAXParseException; systemId: solrres:/solrconfig.xml; lineNumber: 56; columnNumber: 5; O tipo de elemento reqsthalr" deve ser encerrado pela tag final correspondente "</reqsthalr>".
   [junit4]   2> 	at com.sun.org.apache.xerces.internal.util.ErrorHandlerWrapper.createSAXParseException(ErrorHandlerWrapper.java:203)
   [junit4]   2> 	at com.sun.org.apache.xerces.internal.util.ErrorHandlerWrapper.fatalError(ErrorHandlerWrapper.java:177)
   [junit4]   2> 	at com.sun.org.apache.xerces.internal.impl.XMLErrorReporter.reportError(XMLErrorReporter.java:400)
   [junit4]   2> 	at com.sun.org.apache.xerces.internal.impl.XMLErrorReporter.reportError(XMLErrorReporter.java:327)
   [junit4]   2> 	at com.sun.org.apache.xerces.internal.impl.XMLScanner.reportFatalError(XMLScanner.java:1437)
   [junit4]   2> 	at com.sun.org.apache.xerces.internal.impl.XMLDocumentFragmentScannerImpl.scanEndElement(XMLDocumentFragmentScannerImpl.java:1750)
   [junit4]   2> 	at com.sun.org.apache.xerces.internal.impl.XMLDocumentFragmentScannerImpl$FragmentContentDriver.next(XMLDocumentFragmentScannerImpl.java:2970)
   [junit4]   2> 	at com.sun.org.apache.xerces.internal.impl.XMLDocumentScannerImpl.next(XMLDocumentScannerImpl.java:606)
   [junit4]   2> 	at com.sun.org.apache.xerces.internal.impl.XMLNSDocumentScannerImpl.next(XMLNSDocumentScannerImpl.java:118)
   [junit4]   2> 	at com.sun.org.apache.xerces.internal.impl.XMLDocumentFragmentScannerImpl.scanDocument(XMLDocumentFragmentScannerImpl.java:510)
   [junit4]   2> 	at com.sun.org.apache.xerces.internal.parsers.XML11Configuration.parse(XML11Configuration.java:848)
   [junit4]   2> 	at com.sun.org.apache.xerces.internal.parsers.XML11Configuration.parse(XML11Configuration.java:777)
   [junit4]   2> 	at com.sun.org.apache.xerces.internal.parsers.XMLParser.parse(XMLParser.java:141)
   [junit4]   2> 	at com.sun.org.apache.xerces.internal.parsers.DOMParser.parse(DOMParser.java:243)
   [junit4]   2> 	at com.sun.org.apache.xerces.internal.jaxp.DocumentBuilderImpl.parse(DocumentBuilderImpl.java:339)
   [junit4]   2> 	at org.apache.solr.core.Config.<init>(Config.java:143)
   [junit4]   2> 	... 14 more
   [junit4]   2> 2105256 INFO  (coreLoadExecutor-7143-thread-3) [    ] o.a.s.c.SolrResourceLoader new SolrResourceLoader for directory: '/export/home/jenkins/workspace/Lucene-Solr-master-Solaris/solr/build/solr-core/test/J1/temp/solr.core.TestLazyCores_54EB7CD0CE80B83D-001/tempDir-001/badSchema1'
   [junit4]   2> 2105257 INFO  (coreLoadExecutor-7143-thread-3) [    ] o.a.s.c.SolrResourceLoader JNDI not configured for solr (NoInitialContextEx)
   [junit4]   2> 2105257 INFO  (coreLoadExecutor-7143-thread-3) [    ] o.a.s.c.SolrResourceLoader solr home defaulted to 'solr/' (could not find system property or JNDI)
   [junit4]   2> 2105258 INFO  (coreLoadExecutor-7143-thread-2) [    x:core2] o.a.s.c.SolrCore no updateRequestProcessorChain defined as default, creating implicit default
   [junit4]   2> 2105261 INFO  (coreLoadExecutor-7143-thread-2) [    x:core2] o.a.s.h.l.XMLLoader xsltCacheLifetimeSeconds=60
   [junit4]   2> 2105262 INFO  (coreLoadExecutor-7143-thread-2) [    x:core2] o.a.s.h.l.XMLLoader xsltCacheLifetimeSeconds=60
   [junit4]   2> 2105253 INFO  (coreLoadExecutor-7143-thread-1) [    x:core1] o.a.s.c.RequestHandlers Registered paths: /admin/mbeans,/update/csv,/sql,/update/json/docs,/admin/luke,/export,/select,/admin/segments,/get,/admin/system,/replication,/admin/properties,/config,/stream,/schema,/admin/plugins,/admin/logging,/update/json,/admin/ping,/admin/threads,/update,/admin/file
   [junit4]   2> 2105263 INFO  (coreLoadExecutor-7143-thread-1) [    x:core1] o.a.s.c.SolrCore Using default statsCache cache: org.apache.solr.search.stats.LocalStatsCache
   [junit4]   2> 2105256 INFO  (OldIndexDirectoryCleanupThreadForCore-core2) [    x:core2] o.a.s.c.SolrCore Looking for old index directories to cleanup for core core2 in /export/home/jenkins/workspace/Lucene-Solr-master-Solaris/solr/build/solr-core/test/J1/temp/solr.core.TestLazyCores_54EB7CD0CE80B83D-001/tempDir-001/core2/data/
   [junit4]   2> 2105263 INFO  (coreLoadExecutor-7143-thread-2) [    x:core2] o.a.s.h.l.XMLLoader xsltCacheLifetimeSeconds=60
   [junit4]   2> 2105263 WARN  (OldIndexDirectoryCleanupThreadForCore-core2) [    x:core2] o.a.s.c.DirectoryFactory /export/home/jenkins/workspace/Lucene-Solr-master-Solaris/solr/build/solr-core/test/J1/temp/solr.core.TestLazyCores_54EB7CD0CE80B83D-001/tempDir-001/core2/data/ does not point to a valid data directory; skipping clean-up of old index directories.
   [junit4]   2> 2105264 INFO  (coreLoadExecutor-7143-thread-3) [    ] o.a.s.c.SolrConfig current version of requestparams : -1
   [junit4]   2> 2105264 INFO  (coreLoadExecutor-7143-thread-2) [    x:core2] o.a.s.h.l.XMLLoader xsltCacheLifetimeSeconds=60
   [junit4]   2> 2105265 WARN  (coreLoadExecutor-7143-thread-3) [    ] o.a.s.c.Config Beginning with Solr 5.5, <mergePolicy> is deprecated, use <mergePolicyFactory> instead.
   [junit4]   2> 2105266 INFO  (coreLoadExecutor-7143-thread-3) [    ] o.a.s.c.SolrConfig Using Lucene MatchVersion: 7.0.0
   [junit4]   2> 2105266 INFO  (coreLoadExecutor-7143-thread-2) [    x:core2] o.a.s.c.RequestHandlers Registered paths: /admin/mbeans,/update/csv,/sql,/update/json/docs,/admin/luke,/export,/select,/admin/segments,/get,/admin/system,/replication,/admin/properties,/config,/stream,/schema,/admin/plugins,/admin/logging,/update/json,/admin/ping,/admin/threads,/update,/admin/file
   [junit4]   2> 2105266 INFO  (coreLoadExecutor-7143-thread-2) [    x:core2] o.a.s.c.SolrCore Using default statsCache cache: org.apache.solr.search.stats.LocalStatsCache
   [junit4]   2> 2105266 INFO  (coreLoadExecutor-7143-thread-2) [    x:core2] o.a.s.u.CommitTracker Hard AutoCommit: disabled
   [junit4]   2> 2105266 INFO  (coreLoadExecutor-7143-thread-2) [    x:core2] o.a.s.u.CommitTracker Soft AutoCommit: disabled
   [junit4]   2> 2105267 INFO  (coreLoadExecutor-7143-thread-2) [    x:core2] o.a.s.u.RandomMergePolicy RandomMergePolicy wrapping class org.apache.lucene.index.LogByteSizeMergePolicy: [LogByteSizeMergePolicy: minMergeSize=1677721, mergeFactor=47, maxMergeSize=2147483648, maxMergeSizeForForcedMerge=9223372036854775807, calibrateSizeByDeletes=false, maxMergeDocs=2147483647, maxCFSSegmentSizeMB=8.796093022207999E12, noCFSRatio=0.21051915047716252]
   [junit4]   2> 2105267 INFO  (coreLoadExecutor-7143-thread-2) [    x:core2] o.a.s.c.SolrDeletionPolicy SolrDeletionPolicy.onInit: commits: num=1
   [junit4]   2> 	commit{dir=MockDirectoryWrapper(RAMDirectory@6cc19ebd lockFactory=org.apache.lucene.store.SingleInstanceLockFactory@5124edb0),segFN=segments_1,generation=1}
   [junit4]   2> 2105267 INFO  (coreLoadExecutor-7143-thread-2) [    x:core2] o.a.s.c.SolrDeletionPolicy newest commit generation = 1
   [junit4]   2> 2105267 INFO  (coreLoadExecutor-7143-thread-2) [    x:core2] o.a.s.s.SolrIndexSearcher Opening [Searcher@3c2c966[core2] main]
   [junit4]   2> 2105267 INFO  (coreLoadExecutor-7143-thread-2) [    x:core2] o.a.s.r.ManagedResourceStorage File-based storage initialized to use dir: /export/home/jenkins/workspace/Lucene-Solr-master-Solaris/solr/build/solr-core/test/J1/temp/solr.core.TestLazyCores_54EB7CD0CE80B83D-001/tempDir-001/core2/conf
   [junit4]   2> 2105267 INFO  (coreLoadExecutor-7143-thread-2) [    x:core2] o.a.s.r.RestManager Initializing RestManager with initArgs: {storageDir=/export/home/jenkins/workspace/Lucene-Solr-master-Solaris/solr/build/solr-core/test/J1/temp/solr.core.TestLazyCores_54EB7CD0CE80B83D-001/tempDir-001/core2/conf}
   [junit4]   2> 2105263 INFO  (coreLoadExecutor-7143-thread-1) [    x:core1] o.a.s.u.CommitTracker Hard AutoCommit: disabled
   [junit4]   2> 2105268 INFO  (coreLoadExecutor-7143-thread-2) [    x:core2] o.a.s.r.ManagedResourceStorage Reading _rest_managed.json using file:dir=/export/home/jenkins/workspace/Lucene-Solr-master-Solaris/solr/build/solr-core/test/J1/temp/solr.core.TestLazyCores_54EB7CD0CE80B83D-001/tempDir-001/core2/conf
   [junit4]   2> 2105268 INFO  (coreLoadExecutor-7143-thread-1) [    x:core1] o.a.s.u.CommitTracker Soft AutoCommit: disabled
   [junit4]   2> 2105269 INFO  (coreLoadExecutor-7143-thread-1) [    x:core1] o.a.s.u.RandomMergePolicy RandomMergePolicy wrapping class org.apache.lucene.index.LogByteSizeMergePolicy: [LogByteSizeMergePolicy: minMergeSize=1677721, mergeFactor=47, maxMergeSize=2147483648, maxMergeSizeForForcedMerge=9223372036854775807, calibrateSizeByDeletes=false, maxMergeDocs=2147483647, maxCFSSegmentSizeMB=8.796093022207999E12, noCFSRatio=0.21051915047716252]
   [junit4]   2> 2105269 INFO  (coreLoadExecutor-7143-thread-2) [    x:core2] o.a.s.r.RestManager Initializing 0 registered ManagedResources
   [junit4]   2> 2105269 INFO  (coreLoadExecutor-7143-thread-1) [    x:core1] o.a.s.c.SolrDeletionPolicy SolrDeletionPolicy.onInit: commits: num=1
   [junit4]   2> 	commit{dir=MockDirectoryWrapper(RAMDirectory@6f5fe678 lockFactory=org.apache.lucene.store.SingleInstanceLockFactory@4d576751),segFN=segments_1,generation=1}
   [junit4]   2> 2105269 INFO  (coreLoadExecutor-7143-thread-2) [    x:core2] o.a.s.h.ReplicationHandler Commits will be reserved for  10000
   [junit4]   2> 2105269 INFO  (coreLoadExecutor-7143-thread-1) [    x:core1] o.a.s.c.SolrDeletionPolicy newest commit generation = 1
   [junit4]   2> 2105269 INFO  (coreLoadExecutor-7143-thread-1) [    x:core1] o.a.s.s.SolrIndexSearcher Opening [Searcher@3deb0d18[core1] main]
   [junit4]   2> 2105269 INFO  (searcherExecutor-7146-thread-1-processing-x:core2) [    x:core2] o.a.s.c.SolrCore [core2] Registered new searcher Searcher@3c2c966[core2] main{ExitableDirectoryReader(UninvertingDirectoryReader())}
   [junit4]   2> 2105269 INFO  (coreLoadExecutor-7143-thread-2) [    x:core2] o.a.s.c.CoreContainer registering core: core2
   [junit4]   2> 2105269 INFO  (coreLoadExecutor-7143-thread-1) [    x:core1] o.a.s.r.ManagedResourceStorage File-based storage initialized to use dir: /export/home/jenkins/workspace/Lucene-Solr-master-Solaris/solr/build/solr-core/test/J1/temp/solr.core.TestLazyCores_54EB7CD0CE80B83D-001/tempDir-001/core1/conf
   [junit4]   2> 2105269 INFO  (coreLoadExecutor-7143-thread-1) [    x:core1] o.a.s.r.RestManager Initializing RestManager with initArgs: {storageDir=/export/home/jenkins/workspace/Lucene-Solr-master-Solaris/solr/build/solr-core/test/J1/temp/solr.core.TestLazyCores_54EB7CD0CE80B83D-001/tempDir-001/core1/conf}
   [junit4]   2> 2105270 INFO  (coreLoadExecutor-7143-thread-1) [    x:core1] o.a.s.r.ManagedResourceStorage Reading _rest_managed.json using file:dir=/export/home/jenkins/workspace/Lucene-Solr-master-Solaris/solr/build/solr-core/test/J1/temp/solr.core.TestLazyCores_54EB7CD0CE80B83D-001/tempDir-001/core1/conf
   [junit4]   2> 2105270 INFO  (coreLoadExecutor-7143-thread-1) [    x:core1] o.a.s.r.RestManager Initializing 0 registered ManagedResources
   [junit4]   2> 2105270 INFO  (coreLoadExecutor-7143-thread-1) [    x:core1] o.a.s.h.ReplicationHandler Commits will be reserved for  10000
   [junit4]   2> 2105270 INFO  (searcherExecutor-7144-thread-1-processing-x:core1) [    x:core1] o.a.s.c.SolrCore [core1] Registered new searcher Searcher@3deb0d18[core1] main{ExitableDirectoryReader(UninvertingDirectoryReader())}
   [junit4]   2> 2105270 INFO  (coreLoadExecutor-7143-thread-1) [    x:core1] o.a.s.c.CoreContainer registering core: core1
   [junit4]   2> 2105270 INFO  (OldIndexDirectoryCleanupThreadForCore-core1) [    x:core1] o.a.s.c.SolrCore Looking for old index directories to cleanup for core core1 in /export/home/jenkins/workspace/Lucene-Solr-master-Solaris/solr/build/solr-core/test/J1/temp/solr.core.TestLazyCores_54EB7CD0CE80B83D-001/tempDir-001/core1/data/
   [junit4]   2> 2105270 WARN  (OldIndexDirectoryCleanupThreadForCore-core1) [    x:core1] o.a.s.c.DirectoryFactory /export/home/jenkins/workspace/Lucene-Solr-master-Solaris/solr/build/solr-core/test/J1/temp/solr.core.TestLazyCores_54EB7CD0CE80B83D-001/tempDir-001/core1/data/ does not point to a valid data directory; skipping clean-up of old index directories.
   [junit4]   2> 2105273 INFO  (coreLoadExecutor-7143-thread-3) [    ] o.a.s.c.SolrConfig Loaded SolrConfig: solrconfig.xml
   [junit4]   2> 2105274 INFO  (coreLoadExecutor-7143-thread-3) [    ] o.a.s.c.Config Ignoring exception matching \QSAXParseException\E
   [junit4]   2> 2105275 ERROR (coreLoadExecutor-7143-thread-3) [    ] o.a.s.c.CoreContainer Error creating core [badSchema1]: Could not load conf for core badSchema1: Can't load schema /export/home/jenkins/workspace/Lucene-Solr-master-Solaris/solr/build/solr-core/test/J1/temp/solr.core.TestLazyCores_54EB7CD0CE80B83D-001/tempDir-001/badSchema1/conf/schema.xml: org.xml.sax.SAXParseException; systemId: solrres:/schema.xml; lineNumber: 35; columnNumber: 7; O tipo de elemento filedType" deve ser encerrado pela tag final correspondente "</filedType>".
   [junit4]   2> org.apache.solr.common.SolrException: Could not load conf for core badSchema1: Can't load schema /export/home/jenkins/workspace/Lucene-Solr-master-Solaris/solr/build/solr-core/test/J1/temp/solr.core.TestLazyCores_54EB7CD0CE80B83D-001/tempDir-001/badSchema1/conf/schema.xml: org.xml.sax.SAXParseException; systemId: solrres:/schema.xml; lineNumber: 35; columnNumber: 7; O tipo de elemento filedType" deve ser encerrado pela tag final correspondente "</filedType>".
   [junit4]   2> 	at org.apache.solr.core.ConfigSetService.getConfig(ConfigSetService.java:86)
   [junit4]   2> 	at org.apache.solr.core.CoreContainer.create(CoreContainer.java:813)
   [junit4]   2> 	at org.apache.solr.core.CoreContainer.access$000(CoreContainer.java:88)
   [junit4]   2> 	at org.apache.solr.core.CoreContainer$1.call(CoreContainer.java:468)
   [junit4]   2> 	at org.apache.solr.core.CoreContainer$1.call(CoreContainer.java:459)
   [junit4]   2> 	at java.util.concurrent.FutureTask.run(FutureTask.java:266)
   [junit4]   2> 	at org.apache.solr.common.util.ExecutorUtil$MDCAwareThreadPoolExecutor.lambda$execute$0(ExecutorUtil.java:229)
   [junit4]   2> 	at java.util.concurrent.ThreadPoolExecutor.runWorker(ThreadPoolExecutor.java:1142)
   [junit4]   2> 	at java.util.concurrent.ThreadPoolExecutor$Worker.run(ThreadPoolExecutor.java:617)
   [junit4]   2> 	at java.lang.Thread.run(Thread.java:745)
   [junit4]   2> Caused by: org.apache.solr.common.SolrException: Can't load schema /export/home/jenkins/workspace/Lucene-Solr-master-Solaris/solr/build/solr-core/test/J1/temp/solr.core.TestLazyCores_54EB7CD0CE80B83D-001/tempDir-001/badSchema1/conf/schema.xml: org.xml.sax.SAXParseException; systemId: solrres:/schema.xml; lineNumber: 35; columnNumber: 7; O tipo de elemento filedType" deve ser encerrado pela tag final correspondente "</filedType>".
   [junit4]   2> 	at org.apache.solr.schema.IndexSchema.readSchema(IndexSchema.java:580)
   [junit4]   2> 	at org.apache.solr.schema.IndexSchema.<init>(IndexSchema.java:163)
   [junit4]   2> 	at org.apache.solr.schema.IndexSchemaFactory.create(IndexSchemaFactory.java:56)
   [junit4]   2> 	at org.apache.solr.schema.IndexSchemaFactory.buildIndexSchema(IndexSchemaFactory.java:75)
   [junit4]   2> 	at org.apache.solr.core.ConfigSetService.createIndexSchema(ConfigSetService.java:108)
   [junit4]   2> 	at org.apache.solr.core.ConfigSetService.getConfig(ConfigSetService.java:79)
   [junit4]   2> 	... 9 more
   [junit4]   2> Caused by: org.apache.solr.common.SolrException: org.xml.sax.SAXParseException; systemId: solrres:/schema.xml; lineNumber: 35; columnNumber: 7; O tipo de elemento filedType" deve ser encerrado pela tag final correspondente "</filedType>".
   [junit4]   2> 	at org.apache.solr.core.Config.<init>(Config.java:154)
   [junit4]   2> 	at org.apache.solr.core.Config.<init>(Config.java:90)
   [junit4]   2> 	at org.apache.solr.schema.IndexSchema.readSchema(IndexSchema.java:440)
   [junit4]   2> 	... 14 more
   [junit4]   2> Caused by: org.xml.sax.SAXParseException; systemId: solrres:/schema.xml; lineNumber: 35; columnNumber: 7; O tipo de elemento filedType" deve ser encerrado pela tag final correspondente "</filedType>".
   [junit4]   2> 	at com.sun.org.apache.xerces.internal.util.ErrorHandlerWrapper.createSAXParseException(ErrorHandlerWrapper.java:203)
   [junit4]   2> 	at com.sun.org.apache.xerces.internal.util.ErrorHandlerWrapper.fatalError(ErrorHandlerWrapper.java:177)
   [junit4]   2> 	at com.sun.org.apache.xerces.internal.impl.XMLErrorReporter.reportError(XMLErrorReporter.java:400)
   [junit4]   2> 	at com.sun.org.apache.xerces.internal.impl.XMLErrorReporter.reportError(XMLErrorReporter.java:327)
   [junit4]   2> 	at com.sun.org.apache.xerces.internal.impl.XMLScanner.reportFatalError(XMLScanner.java:1437)
   [junit4]   2> 	at com.sun.org.apache.xerces.internal.impl.XMLDocumentFragmentScannerImpl.scanEndElement(XMLDocumentFragmentScannerImpl.java:1750)
   [junit4]   2> 	at com.sun.org.apache.xerces.internal.impl.XMLDocumentFragmentScannerImpl$FragmentContentDriver.next(XMLDocumentFragmentScannerImpl.java:2970)
   [junit4]   2> 	at com.sun.org.apache.xerces.internal.impl.XMLDocumentScannerImpl.next(XMLDocumentScannerImpl.java:606)
   [junit4]   2> 	at com.sun.org.apache.xerces.internal.impl.XMLNSDocumentScannerImpl.next(XMLNSDocumentScannerImpl.java:118)
   [junit4]   2> 	at com.sun.org.apache.xerces.internal.impl.XMLDocumentFragmentScannerImpl.scanDocument(XMLDocumentFragmentScannerImpl.java:510)
   [junit4]   2> 	at com.sun.org.apache.xerces.internal.parsers.XML11Configuration.parse(XML11Configuration.java:848)
   [junit4]   2> 	at com.sun.org.apache.xerces.internal.parsers.XML11Configuration.parse(XML11Configuration.java:777)
   [junit4]   2> 	at com.sun.org.apache.xerces.internal.parsers.XMLParser.parse(XMLParser.java:141)
   [junit4]   2> 	at com.sun.org.apache.xerces.internal.parsers.DOMParser.parse(DOMParser.java:243)
   [junit4]   2> 	at com.sun.org.apache.xerces.internal.jaxp.DocumentBuilderImpl.parse(DocumentBuilderImpl.java:339)
   [junit4]   2> 	at org.apache.solr.core.Config.<init>(Config.java:143)
   [junit4]   2> 	... 16 more
   [junit4]   2> 2105277 INFO  (TEST-TestLazyCores.testBadConfigsGenerateErrors-seed#[54EB7CD0CE80B83D]) [    ] o.a.s.u.DirectUpdateHandler2 start commit{,optimize=false,openSearcher=true,waitSearcher=true,expungeDeletes=false,softCommit=false,prepareCommit=false}
   [junit4]   2> 2105278 INFO  (TEST-TestLazyCores.testBadConfigsGenerateErrors-seed#[54EB7CD0CE80B83D]) [    ] o.a.s.c.SolrDeletionPolicy SolrDeletionPolicy.onCommit: commits: num=2
   [junit4]   2> 	commit{dir=MockDirectoryWrapper(RAMDirectory@6f5fe678 lockFactory=org.apache.lucene.store.SingleInstanceLockFactory@4d576751),segFN=segments_1,generation=1}
   [junit4]   2> 	commit{dir=MockDirectoryWrapper(RAMDirectory@6f5fe678 lockFactory=org.apache.lucene.store.SingleInstanceLockFactory@4d576751),segFN=segments_2,generation=2}
   [junit4]   2> 2105279 INFO  (TEST-TestLazyCores.testBadConfigsGenerateErrors-seed#[54EB7CD0CE80B83D]) [    ] o.a.s.c.SolrDeletionPolicy newest commit generation = 2
   [junit4]   2> 2105281 INFO  (TEST-TestLazyCores.testBadConfigsGenerateErrors-seed#[54EB7CD0CE80B83D]) [    ] o.a.s.s.SolrIndexSearcher Opening [Searcher@780bcc71[core1] main]
   [junit4]   2> 2105282 INFO  (TEST-TestLazyCores.testBadConfigsGenerateErrors-seed#[54EB7CD0CE80B83D]) [    ] o.a.s.u.DirectUpdateHandler2 end_commit_flush
   [junit4]   2> 2105282 INFO  (searcherExecutor-7144-thread-1) [    ] o.a.s.c.SolrCore [core1] Registered new searcher Searcher@780bcc71[core1] main{ExitableDirectoryReader(UninvertingDirectoryReader(Uninverting(_0(7.0.0):c7)))}
   [junit4]   2> 2105282 INFO  (TEST-TestLazyCores.testBadConfigsGenerateErrors-seed#[54EB7CD0CE80B83D]) [    ] o.a.s.c.S.Request [core1]  webapp=null path=null params={q={!prefix+f%3Dv_t}hel&wt=xml} hits=2 status=0 QTime=0
   [junit4]   2> 2105284 INFO  (TEST-TestLazyCores.testBadConfigsGenerateErrors-seed#[54EB7CD0CE80B83D]) [    ] o.a.s.c.S.Request [core1]  webapp=null path=null params={q={!raw+f%3Dv_t}hello&wt=xml} hits=2 status=0 QTime=0
   [junit4]   2> 2105285 INFO  (TEST-TestLazyCores.testBadConfigsGenerateErrors-seed#[54EB7CD0CE80B83D]) [    ] o.a.s.c.S.Request [core1]  webapp=null path=null params={q={!raw+f%3Dv_t}Hello&wt=xml} hits=0 status=0 QTime=0
   [junit4]   2> 2105285 INFO  (TEST-TestLazyCores.testBadConfigsGenerateErrors-seed#[54EB7CD0CE80B83D]) [    ] o.a.s.c.S.Request [core1]  webapp=null path=null params={q={!raw+f%3Dv_f}1.5&wt=xml} hits=0 status=0 QTime=0
   [junit4]   2> 2105297 INFO  (TEST-TestLazyCores.testBadConfigsGenerateErrors-seed#[54EB7CD0CE80B83D]) [    ] o.a.s.c.SolrResourceLoader new SolrResourceLoader for directory: '/export/home/jenkins/workspace/Lucene-Solr-master-Solaris/solr/build/solr-core/test/J1/temp/solr.core.TestLazyCores_54EB7CD0CE80B83D-001/tempDir-001/badConfig1'
   [junit4]   2> 2105297 INFO  (TEST-TestLazyCores.testBadConfigsGenerateErrors-seed#[54EB7CD0CE80B83D]) [    ] o.a.s.c.SolrResourceLoader JNDI not configured for solr (NoInitialContextEx)
   [junit4]   2> 2105297 INFO  (TEST-TestLazyCores.testBadConfigsGenerateErrors-seed#[54EB7CD0CE80B83D]) [    ] o.a.s.c.SolrResourceLoader solr home defaulted to 'solr/' (could not find system property or JNDI)
   [junit4]   2> 2105305 INFO  (TEST-TestLazyCores.testBadConfigsGenerateErrors-seed#[54EB7CD0CE80B83D]) [    ] o.a.s.c.SolrConfig current version of requestparams : -1
   [junit4]   2> 2105306 WARN  (TEST-TestLazyCores.testBadConfigsGenerateErrors-seed#[54EB7CD0CE80B83D]) [    ] o.a.s.c.Config Beginning with Solr 5.5, <mergePolicy> is deprecated, use <mergePolicyFactory> instead.
   [junit4]   2> 2105306 INFO  (TEST-TestLazyCores.testBadConfigsGenerateErrors-seed#[54EB7CD0CE80B83D]) [    ] o.a.s.c.SolrConfig Using Lucene MatchVersion: 7.0.0
   [junit4]   2> 2105320 INFO  (TEST-TestLazyCores.testBadConfigsGenerateErrors-seed#[54EB7CD0CE80B83D]) [    ] o.a.s.c.SolrConfig Loaded SolrConfig: solrconfig.xml
   [junit4]   2> 2105322 INFO  (TEST-TestLazyCores.testBadConfigsGenerateErrors-seed#[54EB7CD0CE80B83D]) [    ] o.a.s.s.IndexSchema [badConfig1] Schema name=tiny
   [junit4]   2> 2105325 INFO  (TEST-TestLazyCores.testBadConfigsGenerateErrors-seed#[54EB7CD0CE80B83D]) [    ] o.a.s.s.IndexSchema unique key field: id
   [junit4]   2> 2105326 INFO  (TEST-TestLazyCores.testBadConfigsGenerateErrors-seed#[54EB7CD0CE80B83D]) [    ] o.a.s.c.ConfigSetProperties Did not find ConfigSet properties, assuming default properties: Can't find resource 'configsetprops.json' in classpath or '/export/home/jenkins/workspace/Lucene-Solr-master-Solaris/solr/build/solr-core/test/J1/temp/solr.core.TestLazyCores_54EB7CD0CE80B83D-001/tempDir-001/badConfig1'
   [junit4]   2> 2105326 INFO  (TEST-TestLazyCores.testBadConfigsGenerateErrors-seed#[54EB7CD0CE80B83D]) [    ] o.a.s.c.CoreContainer Creating SolrCore 'badConfig1' using configuration from instancedir /export/home/jenkins/workspace/Lucene-Solr-master-Solaris/solr/build/solr-core/test/J1/temp/solr.core.TestLazyCores_54EB7CD0CE80B83D-001/tempDir-001/badConfig1
   [junit4]   2> 2105326 INFO  (TEST-TestLazyCores.testBadConfigsGenerateErrors-seed#[54EB7CD0CE80B83D]) [    x:badConfig1] o.a.s.c.SolrCore org.apache.solr.core.MockDirectoryFactory
   [junit4]   2> 2105326 INFO  (TEST-TestLazyCores.testBadConfigsGenerateErrors-seed#[54EB7CD0CE80B83D]) [    x:badConfig1] o.a.s.c.SolrCore [[badConfig1] ] Opening new SolrCore at [/export/home/jenkins/workspace/Lucene-Solr-master-Solaris/solr/build/solr-core/test/J1/temp/solr.core.TestLazyCores_54EB7CD0CE80B83D-001/tempDir-001/badConfig1], dataDir=[/export/home/jenkins/workspace/Lucene-Solr-master-Solaris/solr/build/solr-core/test/J1/temp/solr.core.TestLazyCores_54EB7CD0CE80B83D-001/tempDir-001/badConfig1/data/]
   [junit4]   2> 2105327 INFO  (TEST-TestLazyCores.testBadConfigsGenerateErrors-seed#[54EB7CD0CE80B83D]) [    x:badConfig1] o.a.s.c.SolrCore JMX monitoring not detected for core: badConfig1
   [junit4]   2> 2105328 INFO  (TEST-TestLazyCores.testBadConfigsGenerateErrors-seed#[54EB7CD0CE80B83D]) [    x:badConfig1] o.a.s.c.CachingDirectoryFactory return new directory for /export/home/jenkins/workspace/Lucene-Solr-master-Solaris/solr/build/solr-core/test/J1/temp/solr.core.TestLazyCores_54EB7CD0CE80B83D-001/tempDir-001/badConfig1/data
   [junit4]   2> 2105328 INFO  (TEST-TestLazyCores.testBadConfigsGenerateErrors-seed#[54EB7CD0CE80B83D]) [    x:badConfig1] o.a.s.c.SolrCore New index directory detected: old=null new=/export/home/jenkins/workspace/Lucene-Solr-master-Solaris/solr/build/solr-core/test/J1/temp/solr.core.TestLazyCores_54EB7CD0CE80B83D-001/tempDir-001/badConfig1/data/index/
   [junit4]   2> 2105328 WARN  (TEST-TestLazyCores.testBadConfigsGenerateErrors-seed#[54EB7CD0CE80B83D]) [    x:badConfig1] o.a.s.c.SolrCore [badConfig1] Solr index directory '/export/home/jenkins/workspace/Lucene-Solr-master-Solaris/solr/build/solr-core/test/J1/temp/solr.core.TestLazyCores_54EB7CD0CE80B83D-001/tempDir-001/badConfig1/data/index' doesn't exist. Creating new index...
   [junit4]   2> 2105329 INFO  (TEST-TestLazyCores.testBadConfigsGenerateErrors-seed#[54EB7CD0CE80B83D]) [    x:badConfig1] o.a.s.c.CachingDirectoryFactory return new directory for /export/home/jenkins/workspace/Lucene-Solr-master-Solaris/solr/build/solr-core/test/J1/temp/solr.core.TestLazyCores_54EB7CD0CE80B83D-001/tempDir-001/badConfig1/data/index
   [junit4]   2> 2105329 INFO  (TEST-TestLazyCores.testBadConfigsGenerateErrors-seed#[54EB7CD0CE80B83D]) [    x:badConfig1] o.a.s.u.RandomMergePolicy RandomMergePolicy wrapping class org.apache.lucene.index.TieredMergePolicy: [TieredMergePolicy: maxMergeAtOnce=49, maxMergeAtOnceExplicit=15, maxMergedSegmentMB=84.7197265625, floorSegmentMB=1.8203125, forceMergeDeletesPctAllowed=5.259876945762411, segmentsPerTier=16.0, maxCFSSegmentSizeMB=8.796093022207999E12, noCFSRatio=0.0
   [junit4]   2> 2105329 INFO  (TEST-TestLazyCores.testBadConfigsGenerateErrors-seed#[54EB7CD0CE80B83D]) [    x:badConfig1] o.a.s.c.SolrDeletionPolicy SolrDeletionPolicy.onCommit: commits: num=1
   [junit4]   2> 	commit{dir=MockDirectoryWrapper(RAMDirectory@563b4837 lockFactory=org.apache.lucene.store.SingleInstanceLockFactory@4131993f),segFN=segments_1,generation=1}
   [junit4]   2> 2105329 INFO  (TEST-TestLazyCores.testBadConfigsGenerateErrors-seed#[54EB7CD0CE80B83D]) [    x:badConfig1] o.a.s.c.SolrDeletionPolicy newest commit generation = 1
   [junit4]   2> 2105329 INFO  (OldIndexDirectoryCleanupThreadForCore-badConfig1) [    x:badConfig1] o.a.s.c.SolrCore Looking for old index directories to cleanup for core badConfig1 in /export/home/jenkins/workspace/Lucene-Solr-master-Solaris/solr/build/solr-core/test/J1/temp/solr.core.TestLazyCores_54EB7CD0CE80B83D-001/tempDir-001/badConfig1/data/
   [junit4]   2> 2105330 WARN  (OldIndexDirectoryCleanupThreadForCore-badConfig1) [    x:badConfig1] o.a.s.c.DirectoryFactory /export/home/jenkins/workspace/Lucene-Solr-master-Solaris/solr/build/solr-core/test/J1/temp/solr.core.TestLazyCores_54EB7CD0CE80B83D-001/tempDir-001/badConfig1/data/ does not point to a valid data directory; skipping clean-up of old index directories.
   [junit4]   2> 2105331 INFO  (TEST-TestLazyCores.testBadConfigsGenerateErrors-seed#[54EB7CD0CE80B83D]) [    x:badConfig1] o.a.s.c.SolrCore no updateRequestProcessorChain defined as default, creating implicit default
   [junit4]   2> 2105332 INFO  (TEST-TestLazyCores.testBadConfigsGenerateErrors-seed#[54EB7CD0CE80B83D]) [    x:badConfig1] o.a.s.h.l.XMLLoader xsltCacheLifetimeSeconds=60
   [junit4]   2> 2105333 INFO  (TEST-TestLazyCores.testBadConfigsGenerateErrors-seed#[54EB7CD0CE80B83D]) [    x:badConfig1] o.a.s.h.l.XMLLoader xsltCacheLifetimeSeconds=60
   [junit4]   2> 2105333 INFO  (TEST-TestLazyCores.testBadConfigsGenerateErrors-seed#[54EB7CD0CE80B83D]) [    x:badConfig1] o.a.s.h.l.XMLLoader xsltCacheLifetimeSeconds=60
   [junit4]   2> 2105334 INFO  (TEST-TestLazyCores.testBadConfigsGenerateErrors-seed#[54EB7CD0CE80B83D]) [    x:badConfig1] o.a.s.h.l.XMLLoader xsltCacheLifetimeSeconds=60
   [junit4]   2> 2105336 INFO  (TEST-TestLazyCores.testBadConfigsGenerateErrors-seed#[54EB7CD0CE80B83D]) [    x:badConfig1] o.a.s.c.RequestHandlers Registered paths: /admin/mbeans,/update/csv,/sql,/update/json/docs,/admin/luke,/export,/select,/admin/segments,/get,/admin/system,/replication,/admin/properties,/config,/stream,/schema,/admin/plugins,/admin/logging,/update/json,/admin/ping,/admin/threads,/update,/admin/file
   [junit4]   2> 2105336 INFO  (TEST-TestLazyCores.testBadConfigsGenerateErrors-seed#[54EB7CD0CE80B83D]) [    x:badConfig1] o.a.s.c.SolrCore Using default statsCache cache: org.apache.solr.search.stats.LocalStatsCache
   [junit4]   2> 2105336 INFO  (TEST-TestLazyCores.testBadConfigsGenerateErrors-seed#[54EB7CD0CE80B83D]) [    x:badConfig1] o.a.s.u.CommitTracker Hard AutoCommit: disabled
   [junit4]   2> 2105336 INFO  (TEST-TestLazyCores.testBadConfigsGenerateErrors-seed#[54EB7CD0CE80B83D]) [    x:badConfig1] o.a.s.u.CommitTracker Soft AutoCommit: disabled
   [junit4]   2> 2105336 INFO  (TEST-TestLazyCores.testBadConfigsGenerateErrors-seed#[54EB7CD0CE80B83D]) [    x:badConfig1] o.a.s.u.RandomMergePolicy RandomMergePolicy wrapping class org.apache.lucene.index.LogByteSizeMergePolicy: [LogByteSizeMergePolicy: minMergeSize=1677721, mergeFactor=10, maxMergeSize=2147483648, maxMergeSizeForForcedMerge=9223372036854775807, calibrateSizeByDeletes=true, maxMergeDocs=2147483647, maxCFSSegmentSizeMB=8.796093022207999E12, noCFSRatio=0.4283671246897538]
   [junit4]   2> 2105337 INFO  (TEST-TestLazyCores.testBadConfigsGenerateErrors-seed#[54EB7CD0CE80B83D]) [    x:badConfig1] o.a.s.c.SolrDeletionPolicy SolrDeletionPolicy.onInit: commits: num=1
   [junit4]   2> 	commit{dir=MockDirectoryWrapper(RAMDirectory@563b4837 lockFactory=org.apache.lucene.store.SingleInstanceLockFactory@4131993f),segFN=segments_1,generation=1}
   [junit4]   2> 2105337 INFO  (TEST-TestLazyCores.testBadConfigsGenerateErrors-seed#[54EB7CD0CE80B83D]) [    x:badConfig1] o.a.s.c.SolrDeletionPolicy newest commit generation = 1
   [junit4]   2> 2105337 INFO  (TEST-TestLazyCores.testBadConfigsGenerateErrors-seed#[54EB7CD0CE80B83D]) [    x:badConfig1] o.a.s.s.SolrIndexSearcher Opening [Searcher@70023182[badConfig1] main]
   [junit4]   2> 2105337 INFO  (TEST-TestLazyCores.testBadConfigsGenerateErrors-seed#[54EB7CD0CE80B83D]) [    x:badConfig1] o.a.s.r.ManagedResourceStorage File-based storage initialized to use dir: /export/home/jenkins/workspace/Lucene-Solr-master-Solaris/solr/build/solr-core/test/J1/temp/solr.core.TestLazyCores_54EB7CD0CE80B83D-001/tempDir-001/badConfig1/conf
   [junit4]   2> 2105337 INFO  (TEST-TestLazyCores.testBadConfigsGenerateErrors-seed#[54EB7CD0CE80B83D]) [    x:badConfig1] o.a.s.r.RestManager Initializing RestManager with initArgs: {storageDir=/export/home/jenkins/workspace/Lucene-Solr-master-Solaris/solr/build/solr-core/test/J1/temp/solr.core.TestLazyCores_54EB7CD0CE80B83D-001/tempDir-001/badConfig1/conf}
   [junit4]   2> 2105337 INFO  (TEST-TestLazyCores.testBadConfigsGenerateErrors-seed#[54EB7CD0CE80B83D]) [    x:badConfig1] o.a.s.r.ManagedResourceStorage Reading _rest_managed.json using file:dir=/export/home/jenkins/workspace/Lucene-Solr-master-Solaris/solr/build/solr-core/test/J1/temp/solr.core.TestLazyCores_54EB7CD0CE80B83D-001/tempDir-001/badConfig1/conf
   [junit4]   2> 2105337 INFO  (TEST-TestLazyCores.testBadConfigsGenerateErrors-seed#[54EB7CD0CE80B83D]) [    x:badConfig1] o.a.s.r.RestManager Initializing 0 registered ManagedResources
   [junit4]   2> 2105337 INFO  (TEST-TestLazyCores.testBadConfigsGenerateErrors-seed#[54EB7CD0CE80B83D]) [    x:badConfig1] o.a.s.h.ReplicationHandler Commits will be reserved for  10000
   [junit4]   2> 2105337 INFO  (searcherExecutor-7158-thread-1-processing-x:badConfig1) [    x:badConfig1] o.a.s.c.SolrCore [badConfig1] Registered new searcher Searcher@70023182[badConfig1] main{ExitableDirectoryReader(UninvertingDirectoryReader())}
   [junit4]   2> 2105338 INFO  (TEST-TestLazyCores.testBadConfigsGenerateErrors-seed#[54EB7CD0CE80B83D]) [    x:badConfig1] o.a.s.c.SolrCores Opening transient core badConfig1
   [junit4]   2> 2105338 INFO  (TEST-TestLazyCores.testBadConfigsGenerateErrors-seed#[54EB7CD0CE80B83D]) [    x:badConfig1] o.a.s.c.CoreContainer registering core: badConfig1
   [junit4]   2> 2105338 INFO  (TEST-TestLazyCores.testBadConfigsGenerateErrors-seed#[54EB7CD0CE80B83D]) [    x:badConfig1] o.a.s.c.SolrResourceLoader new SolrResourceLoader for directory: '/export/home/jenkins/workspace/Lucene-Solr-master-Solaris/solr/build/solr-core/test/J1/temp/solr.core.TestLazyCores_54EB7CD0CE80B83D-001/tempDir-001/badConfig2'
   [junit4]   2> 2105338 INFO  (TEST-TestLazyCores.testBadConfigsGenerateErrors-seed#[54EB7CD0CE80B83D]) [    x:badConfig1] o.a.s.c.SolrResourceLoader JNDI not configured for solr (NoInitialContextEx)
   [junit4]   2> 2105338 INFO  (TEST-TestLazyCores.testBadConfigsGenerateErrors-seed#[54EB7CD0CE80B83D]) [    x:badConfig1] o.a.s.c.SolrResourceLoader solr home defaulted to 'solr/' (could not find system property or JNDI)
   [junit4]   2> 2105344 INFO  (TEST-TestLazyCores.testBadConfigsGenerateErrors-seed#[54EB7CD0CE80B83D]) [    x:badConfig1] o.a.s.c.SolrConfig current version of requestparams : -1
   [junit4]   2> 2105345 WARN  (TEST-TestLazyCores.testBadConfigsGenerateErrors-seed#[54EB7CD0CE80B83D]) [    x:badConfig1] o.a.s.c.Config Beginning with Solr 5.5, <mergePolicy> is deprecated, use <mergePolicyFactory> instead.
   [junit4]   2> 2105345 INFO  (TEST-TestLazyCores.testBadConfigsGenerateErrors-seed#[54EB7CD0CE80B83D]) [    x:badConfig1] o.a.s.c.SolrConfig Using Lucene MatchVersion: 7.0.0
   [junit4]   2> 2105349 INFO  (TEST-TestLazyCores.testBadConfigsGenerateErrors-seed#[54EB7CD0CE80B83D]) [    x:badConfig1] o.a.s.c.SolrConfig Loaded SolrConfig: solrconfig.xml
   [junit4]   2> 2105351 INFO  (TEST-TestLazyCores.testBadConfigsGenerateErrors-seed#[54EB7CD0CE80B83D]) [    x:badConfig1] o.a.s.s.IndexSchema [badConfig2] Schema name=tiny
   [junit4]   2> 2105353 INFO  (TEST-TestLazyCores.testBadConfigsGenerateErrors-seed#[54EB7CD0CE80B83D]) [    x:badConfig1] o.a.s.s.IndexSchema unique key field: id
   [junit4]   2> 2105355 INFO  (TEST-TestLazyCores.testBadConfigsGenerateErrors-seed#[54EB7CD0CE80B83D]) [    x:badConfig1] o.a.s.c.ConfigSetProperties Did not find ConfigSet properties, assuming default properties: Can't find resource 'configsetprops.json' in classpath or '/export/home/jenkins/workspace/Lucene-Solr-master-Solaris/solr/build/solr-core/test/J1/temp/solr.core.TestLazyCores_54EB7CD0CE80B83D-001/tempDir-001/badConfig2'
   [junit4]   2> 2105355 INFO  (TEST-TestLazyCores.testBadConfigsGenerateErrors-seed#[54EB7CD0CE80B83D]) [    x:badConfig1] o.a.s.c.CoreContainer Creating SolrCore 'badConfig2' using configuration from instancedir /export/home/jenkins/workspace/Lucene-Solr-master-Solaris/solr/build/solr-core/test/J1/temp/solr.core.TestLazyCores_54EB7CD0CE80B83D-001/tempDir-001/badConfig2
   [junit4]   2> 2105355 INFO  (TEST-TestLazyCores.testBadConfigsGenerateErrors-seed#[54EB7CD0CE80B83D]) [    x:badConfig2] o.a.s.c.SolrCore org.apache.solr.core.MockDirectoryFactory
   [junit4]   2> 2105355 INFO  (TEST-TestLazyCores.testBadConfigsGenerateErrors-seed#[54EB7CD0CE80B83D]) [    x:badConfig2] o.a.s.c.SolrCore [[badConfig2] ] Opening new SolrCore at [/export/home/jenkins/workspace/Lucene-Solr-master-Solaris/solr/build/solr-core/test/J1/temp/solr.core.TestLazyCores_54EB7CD0CE80B83D-001/tempDir-001/badConfig2], dataDir=[/export/home/jenkins/workspace/Lucene-Solr-master-Solaris/solr/build/solr-core/test/J1/temp/solr.core.TestLazyCores_54EB7CD0CE80B83D-001/tempDir-001/badConfig2/data/]
   [junit4]   2> 2105355 INFO  (TEST-TestLazyCores.testBadConfigsGenerateErrors-seed#[54EB7CD0CE80B83D]) [    x:badConfig2] o.a.s.c.SolrCore JMX monitoring not detected for core: badConfig2
   [junit4]   2> 2105356 INFO  (TEST-TestLazyCores.testBadConfigsGenerateErrors-seed#[54EB7CD0CE80B83D]) [    x:badConfig2] o.a.s.c.CachingDirectoryFactory return new directory for /export/home/jenkins/workspace/Lucene-Solr-master-Solaris/solr/build/solr-core/test/J1/temp/solr.core.TestLazyCores_54EB7CD0CE80B83D-001/tempDir-001/badConfig2/data
   [junit4]   2> 2105356 INFO  (TEST-TestLazyCores.testBadConfigsGenerateErrors-seed#[54EB7CD0CE80B83D]) [    x:badConfig2] o.a.s.c.SolrCore New index directory detected: old=null new=/export/home/jenkins/workspace/Lucene-Solr-master-Solaris/solr/build/solr-core/test/J1/temp/solr.core.TestLazyCores_54EB7CD0CE80B83D-001/tempDir-001/badConfig2/data/index/
   [junit4]   2> 2105356 WARN  (TEST-TestLazyCores.testBadConfigsGenerateErrors-seed#[54EB7CD0CE80B83D]) [    x:badConfig2] o.a.s.c.SolrCore [badConfig2] Solr index directory '/export/home/jenkins/workspace/Lucene-Solr-master-Solaris/solr/build/solr-core/test/J1/temp/solr.core.TestLazyCores_54EB7CD0CE80B83D-001/tempDir-001/badConfig2/data/index' doesn't exist. Creating new index...
   [junit4]   2> 2105356 INFO  (TEST-TestLazyCores.testBadConfigsGenerateErrors-seed#[54EB7CD0CE80B83D]) [    x:badConfig2] o.a.s.c.CachingDirectoryFactory return new directory for /export/home/jenkins/workspace/Lucene-Solr-master-Solaris/solr/build/solr-core/test/J1/temp/solr.core.TestLazyCores_54EB7CD0CE80B83D-001/tempDir-001/badConfig2/data/index
   [junit4]   2> 2105357 INFO  (TEST-TestLazyCores.testBadConfigsGenerateErrors-seed#[54EB7CD0CE80B83D]) [    x:badConfig2] o.a.s.u.RandomMergePolicy RandomMergePolicy wrapping class org.apache.lucene.index.TieredMergePolicy: [TieredMergePolicy: maxMergeAtOnce=46, maxMergeAtOnceExplicit=40, maxMergedSegmentMB=6.03515625, floorSegmentMB=0.75, forceMergeDeletesPctAllowed=10.77841270806174, segmentsPerTier=42.0, maxCFSSegmentSizeMB=8.796093022207999E12, noCFSRatio=1.0
   [junit4]   2> 2105357 INFO  (TEST-TestLazyCores.testBadConfigsGenerateErrors-seed#[54EB7CD0CE80B83D]) [    x:badConfig2] o.a.s.c.SolrDeletionPolicy SolrDeletionPolicy.onCommit: commits: num=1
   [junit4]   2> 	commit{dir=MockDirectoryWrapper(RAMDirectory@7243fbd6 lockFactory=org.apache.lucene.store.SingleInstanceLockFactory@aea8fb7),segFN=segments_1,generation=1}
   [junit4]   2> 2105357 INFO  (TEST-TestLazyCores.testBadConfigsGenerateErrors-seed#[54EB7CD0CE80B83D]) [    x:badConfig2] o.a.s.c.SolrDeletionPolicy newest commit generation = 1
   [junit4]   2> 2105357 INFO  (OldIndexDirectoryCleanupThreadForCore-badConfig2) [    x:badConfig2] o.a.s.c.SolrCore Looking for old index directories to cleanup for core badConfig2 in /export/home/jenkins/workspace/Lucene-Solr-master-Solaris/solr/build/solr-core/test/J1/temp/solr.core.TestLazyCores_54EB7CD0CE80B83D-001/tempDir-001/badConfig2/data/
   [junit4]   2> 2105357 WARN  (OldIndexDirectoryCleanupThreadForCore-badConfig2) [    x:badConfig2] o.a.s.c.DirectoryFactory /export/home/jenkins/workspace/Lucene-Solr-master-Solaris/solr/build/solr-core/test/J1/temp/solr.core.TestLazyCores_54EB7CD0CE80B83D-001/tempDir-001/badConfig2/data/ does not point to a valid data directory; skipping clean-up of old index directories.
   [junit4]   2> 2105360 INFO  (TEST-TestLazyCores.testBadConfigsGenerateErrors-seed#[54EB7CD0CE80B83D]) [    x:badConfig2] o.a.s.c.SolrCore no updateRequestProcessorChain defined as default, creating implicit default
   [junit4]   2> 2105361 INFO  (TEST-TestLazyCores.testBadConfigsGenerateErrors-seed#[54EB7CD0CE80B83D]) [    x:badConfig2] o.a.s.h.l.XMLLoader xsltCacheLifetimeSeconds=60
   [junit4]   2> 2105362 INFO  (TEST-TestLazyCores.testBadConfigsGenerateErrors-seed#[54EB7CD0CE80B83D]) [    x:badConfig2] o.a.s.h.l.XMLLoader xsltCacheLifetimeSeconds=60
   [junit4]   2> 2105363 INFO  (TEST-TestLazyCores.testBadConfigsGenerateErrors-seed#[54EB7CD0CE80B83D]) [    x:badConfig2] o.a.s.h.l.XMLLoader xsltCacheLifetimeSeconds=60
   [junit4]   2> 2105364 INFO  (TEST-TestLazyCores.testBadConfigsGenerateErrors-seed#[54EB7CD0CE80B83D]) [    x:badConfig2] o.a.s.h.l.XMLLoader xsltCacheLifetimeSeconds=60
   [junit4]   2> 2105366 INFO  (TEST-TestLazyCores.testBadConfigsGenerateErrors-seed#[54EB7CD0CE80B83D]) [    x:badConfig2] o.a.s.c.RequestHandlers Registered paths: /admin/mbeans,/update/csv,/sql,/update/json/docs,/admin/luke,/export,/select,/admin/segments,/get,/admin/system,/replication,/admin/properties,/config,/stream,/schema,/admin/plugins,/admin/logging,/update/json,/admin/ping,/admin/threads,/update,/admin/file
   [junit4]   2> 2105366 INFO  (TEST-TestLazyCores.testBadConfigsGenerateErrors-seed#[54EB7CD0CE80B83D]) [    x:badConfig2] o.a.s.c.SolrCore Using default statsCache cache: org.apache.solr.search.stats.LocalStatsCache
   [junit4]   2> 2105366 INFO  (TEST-TestLazyCores.testBadConfigsGenerateErrors-seed#[54EB7CD0CE80B83D]) [    x:badConfig2] o.a.s.u.CommitTracker Hard AutoCommit: disabled
   [junit4]   2> 2105366 INFO  (TEST-TestLazyCores.testBadConfigsGenerateErrors-seed#[54EB7CD0CE80B83D]) [    x:badConfig2] o.a.s.u.CommitTracker Soft AutoCommit: disabled
   [junit4]   2> 2105366 INFO  (TEST-TestLazyCores.testBadConfigsGenerateErrors-seed#[54EB7CD0CE80B83D]) [    x:badConfig2] o.a.s.u.RandomMergePolicy RandomMergePolicy wrapping class org.apache.lucene.index.LogDocMergePolicy: [LogDocMergePolicy: minMergeSize=1000, mergeFactor=43, maxMergeSize=9223372036854775807, maxMergeSizeForForcedMerge=9223372036854775807, calibrateSizeByDeletes=false, maxMergeDocs=2147483647, maxCFSSegmentSizeMB=8.796093022207999E12, noCFSRatio=0.0]
   [junit4]   2> 2105366 INFO  (TEST-TestLazyCores.testBadConfigsGenerateErrors-seed#[54EB7CD0CE80B83D]) [    x:badConfig2] o.a.s.c.SolrDeletionPolicy SolrDeletionPolicy.onInit: commits: num=1
   [junit4]   2> 	commit{dir=MockDirectoryWrapper(RAMDirectory@7243fbd6 lockFactory=org.apache.lucene.store.SingleInstanceLockFactory@aea8fb7),segFN=segments_1,generation=1}
   [junit4]   2> 2105366 INFO  (TEST-TestLazyCores.testBadConfigsGenerateErrors-seed#[54EB7CD0CE80B83D]) [    x:badConfig2] o.a.s.c.SolrDeletionPolicy newest commit generation = 1
   [junit4]   2> 2105366 INFO  (TEST-TestLazyCores.testBadConfigsGenerateErrors-seed#[54EB7CD0CE80B83D]) [    x:badConfig2] o.a.s.s.SolrIndexSearcher Opening [Searcher@751dcf51[badConfig2] main]
   [junit4]   2> 2105367 INFO  (TEST-TestLazyCores.testBadConfigsGenerateErrors-seed#[54EB7CD0CE80B83D]) [    x:badConfig2] o.a.s.r.ManagedResourceStorage File-based storage initialized to use dir: /export/home/jenkins/workspace/Lucene-Solr-master-Solaris/solr/build/solr-core/test/J1/temp/solr.core.TestLazyCores_54EB7CD0CE80B83D-001/tempDir-001/badConfig2/conf
   [junit4]   2> 2105367 INFO  (TEST-TestLazyCores.testBadConfigsGenerateErrors-seed#[54EB7CD0CE80B83D]) [    x:badConfig2] o.a.s.r.RestManager Initializing RestManager with initArgs: {storageDir=/export/home/jenkins/workspace/Lucene-Solr-master-Solaris/solr/build/solr-core/test/J1/temp/solr.core.TestLazyCores_54EB7CD0CE80B83D-001/tempDir-001/badConfig2/conf}
   [junit4]   2> 2105367 INFO  (TEST-TestLazyCores.testBadConfigsGenerateErrors-seed#[54EB7CD0CE80B83D]) [    x:badConfig2] o.a.s.r.ManagedResourceStorage Reading _rest_managed.json using file:dir=/export/home/jenkins/workspace/Lucene-Solr-master-Solaris/solr/build/solr-core/test/J1/temp/solr.core.TestLazyCores_54EB7CD0CE80B83D-001/tempDir-001/badConfig2/conf
   [junit4]   2> 2105368 INFO  (TEST-TestLazyCores.testBadConfigsGenerateErrors-seed#[54EB7CD0CE80B83D]) [    x:badConfig2] o.a.s.r.RestManager Initializing 0 registered ManagedResources
   [junit4]   2> 2105368 INFO  (TEST-TestLazyCores.testBadConfigsGenerateErrors-seed#[54EB7CD0CE80B83D]) [    x:badConfig2] o.a.s.h.ReplicationHandler Commits will be reserved for  10000
   [junit4]   2> 2105368 INFO  (searcherExecutor-7162-thread-1-processing-x:badConfig2) [    x:badConfig2] o.a.s.c.SolrCore [badConfig2] Registered new searcher Searcher@751dcf51[badConfig2] main{ExitableDirectoryReader(UninvertingDirectoryReader())}
   [junit4]   2> 2105368 INFO  (TEST-TestLazyCores.testBadConfigsGenerateErrors-seed#[54EB7CD0CE80B83D]) [    x:badConfig2] o.a.s.c.SolrCores Opening transient core badConfig2
   [junit4]   2> 2105368 INFO  (TEST-TestLazyCores.testBadConfigsGenerateErrors-seed#[54EB7CD0CE80B83D]) [    x:badConfig2] o.a.s.c.CoreContainer registering core: badConfig2
   [junit4]   2> 2105368 INFO  (TEST-TestLazyCores.testBadConfigsGenerateErrors-seed#[54EB7CD0CE80B83D]) [    x:badConfig2] o.a.s.c.SolrResourceLoader new SolrResourceLoader for directory: '/export/home/jenkins/workspace/Lucene-Solr-master-Solaris/solr/build/solr-core/test/J1/temp/solr.core.TestLazyCores_54EB7CD0CE80B83D-001/tempDir-001/badSchema1'
   [junit4]   2> 2105369 INFO  (TEST-TestLazyCores.testBadConfigsGenerateErrors-seed#[54EB7CD0CE80B83D]) [    x:badConfig2] o.a.s.c.SolrResourceLoader JNDI not configured for solr (NoInitialContextEx)
   [junit4]   2> 2105369 INFO  (TEST-TestLazyCores.testBadConfigsGenerateErrors-seed#[54EB7CD0CE80B83D]) [    x:badConfig2] o.a.s.c.SolrResourceLoader solr home defaulted to 'solr/' (could not find system property or JNDI)
   [junit4]   2> 2105373 INFO  (TEST-TestLazyCores.testBadConfigsGenerateErrors-seed#[54EB7CD0CE80B83D]) [    x:badConfig2] o.a.s.c.SolrConfig current version of requestparams : -1
   [junit4]   2> 2105375 WARN  (TEST-TestLazyCores.testBadConfigsGenerateErrors-seed#[54EB7CD0CE80B83D]) [    x:badConfig2] o.a.s.c.Config Beginning with Solr 5.5, <mergePolicy> is deprecated, use <mergePolicyFactory> instead.
   [junit4]   2> 2105376 INFO  (TEST-TestLazyCores.testBadConfigsGenerateErrors-seed#[54EB7CD0CE80B83D]) [    x:badConfig2] o.a.s.c.SolrConfig Using Lucene MatchVersion: 7.0.0
   [junit4]   2> 2105379 INFO  (TEST-TestLazyCores.testBadConfigsGenerateErrors-seed#[54EB7CD0CE80B83D]) [    x:badConfig2] o.a.s.c.SolrConfig Loaded SolrConfig: solrconfig.xml
   [junit4]   2> 2105382 INFO  (TEST-TestLazyCores.testBadConfigsGenerateErrors-seed#[54EB7CD0CE80B83D]) [    x:badConfig2] o.a.s.s.IndexSchema [badSchema1] Schema name=tiny
   [junit4]   2> 2105385 INFO  (TEST-TestLazyCores.testBadConfigsGenerateErrors-seed#[54EB7CD0CE80B83D]) [    x:badConfig2] o.a.s.s.IndexSchema unique key field: id
   [junit4]   2> 2105386 INFO  (TEST-TestLazyCores.testBadConfigsGenerateErrors-seed#[54EB7CD0CE80B83D]) [    x:badConfig2] o.a.s.c.ConfigSetProperties Did not find ConfigSet properties, assuming default properties: Can't find resource 'configsetprops.json' in classpath or '/export/home/jenkins/workspace/Lucene-Solr-master-Solaris/solr/build/solr-core/test/J1/temp/solr.core.TestLazyCores_54EB7CD0CE80B83D-001/tempDir-001/badSchema1'
   [junit4]   2> 2105387 INFO  (TEST-TestLazyCores.testBadConfigsGenerateErrors-seed#[54EB7CD0CE80B83D]) [    x:badConfig2] o.a.s.c.CoreContainer Creating SolrCore 'badSchema1' using configuration from instancedir /export/home/jenkins/workspace/Lucene-Solr-master-Solaris/solr/build/solr-core/test/J1/temp/solr.core.TestLazyCores_54EB7CD0CE80B83D-001/tempDir-001/badSchema1
   [junit4]   2> 2105387 INFO  (TEST-TestLazyCores.testBadConfigsGenerateErrors-seed#[54EB7CD0CE80B83D]) [    x:badSchema1] o.a.s.c.SolrCore org.apache.solr.core.MockDirectoryFactory
   [junit4]   2> 2105389 INFO  (TEST-TestLazyCores.testBadConfigsGenerateErrors-seed#[54EB7CD0CE80B83D]) [    x:badSchema1] o.a.s.c.SolrCore [[badSchema1] ] Opening new SolrCore at [/export/home/jenkins/workspace/Lucene-Solr-master-Solaris/solr/build/solr-core/test/J1/temp/solr.core.TestLazyCores_54EB7CD0CE80B83D-001/tempDir-001/badSchema1], dataDir=[/export/home/jenkins/workspace/Lucene-Solr-master-Solaris/solr/build/solr-core/test/J1/temp/solr.core.TestLazyCores_54EB7CD0CE80B83D-001/tempDir-001/badSchema1/data/]
   [junit4]   2> 2105389 INFO  (TEST-TestLazyCores.testBadConfigsGenerateErrors-seed#[54EB7CD0CE80B83D]) [    x:badSchema1] o.a.s.c.SolrCore JMX monitoring not detected for core: badSchema1
   [junit4]   2> 2105389 INFO  (TEST-TestLazyCores.testBadConfigsGenerateErrors-seed#[54EB7CD0CE80B83D]) [    x:badSchema1] o.a.s.c.CachingDirectoryFactory return new directory for /export/home/jenkins/workspace/Lucene-Solr-master-Solaris/solr/build/solr-core/test/

[...truncated too long message...]

Cores]
   [junit4]   2> Mar 29, 2016 8:04:05 PM com.carrotsearch.randomizedtesting.ThreadLeakControl tryToInterruptAll
   [junit4]   2> SEVERE: There are still zombie threads that couldn't be terminated:
   [junit4]   2>    1) Thread[id=16643, name=searcherExecutor-7334-thread-1, state=WAITING, group=TGRP-TestLazyCores]
   [junit4]   2>         at sun.misc.Unsafe.park(Native Method)
   [junit4]   2>         at java.util.concurrent.locks.LockSupport.park(LockSupport.java:175)
   [junit4]   2>         at java.util.concurrent.locks.AbstractQueuedSynchronizer$ConditionObject.await(AbstractQueuedSynchronizer.java:2039)
   [junit4]   2>         at java.util.concurrent.LinkedBlockingQueue.take(LinkedBlockingQueue.java:442)
   [junit4]   2>         at java.util.concurrent.ThreadPoolExecutor.getTask(ThreadPoolExecutor.java:1067)
   [junit4]   2>         at java.util.concurrent.ThreadPoolExecutor.runWorker(ThreadPoolExecutor.java:1127)
   [junit4]   2>         at java.util.concurrent.ThreadPoolExecutor$Worker.run(ThreadPoolExecutor.java:617)
   [junit4]   2>         at java.lang.Thread.run(Thread.java:745)
   [junit4]   2> NOTE: test params are: codec=Asserting(Lucene60): {v_t=PostingsFormat(name=LuceneVarGapDocFreqInterval), id=PostingsFormat(name=LuceneVarGapDocFreqInterval), v_s=PostingsFormat(name=LuceneVarGapFixedInterval), v_f=PostingsFormat(name=Direct)}, docValues:{}, maxPointsInLeafNode=1556, maxMBSortInHeap=5.0539196644042015, sim=RandomSimilarity(queryNorm=false,coord=crazy): {}, locale=pt-BR, timezone=Europe/Belgrade
   [junit4]   2> NOTE: SunOS 5.11 amd64/Oracle Corporation 1.8.0_72 (64-bit)/cpus=3,threads=2,free=278588208,total=518979584
   [junit4]   2> NOTE: All tests run in this JVM: [DistributedTermsComponentTest, TestSolrIndexConfig, IndexSchemaRuntimeFieldTest, GraphQueryTest, CollectionTooManyReplicasTest, TestCloudSchemaless, RankQueryTest, HdfsUnloadDistributedZkTest, DistributedVersionInfoTest, TestFastOutputStream, TestFilteredDocIdSet, SolrIndexSplitterTest, SharedFSAutoReplicaFailoverTest, HdfsDirectoryFactoryTest, TestClassicSimilarityFactory, DistributedFacetPivotSmallTest, TestDistributedGrouping, SpellingQueryConverterTest, TestWriterPerf, DistributedSuggestComponentTest, SuggesterTest, TestDynamicLoading, OverseerStatusTest, NumericFieldsTest, TestExpandComponent, TestAtomicUpdateErrorCases, TestQueryTypes, HLLUtilTest, TestReload, CdcrVersionReplicationTest, TestBinaryField, DebugComponentTest, TestShortCircuitedRequests, TestRestManager, TestTrie, TestRebalanceLeaders, ShowFileRequestHandlerTest, TestManagedSynonymFilterFactory, SpellPossibilityIteratorTest, ConnectionReuseTest, SimpleCollectionCreateDeleteTest, CollectionsAPISolrJTest, TestTrieFacet, EchoParamsTest, TriLevelCompositeIdRoutingTest, CleanupOldIndexTest, AddSchemaFieldsUpdateProcessorFactoryTest, FieldAnalysisRequestHandlerTest, RAMDirectoryFactoryTest, SuggesterTSTTest, TestDistributedMissingSort, HighlighterConfigTest, LeaderElectionIntegrationTest, TestNonDefinedSimilarityFactory, DirectUpdateHandlerOptimizeTest, TestCloudPivotFacet, TestSuggestSpellingConverter, TestDefaultSearchFieldResource, TestNamedUpdateProcessors, TestSQLHandler, DistanceFunctionTest, SignatureUpdateProcessorFactoryTest, TestMissingGroups, SearchHandlerTest, CoreAdminHandlerTest, TestUtils, TestQuerySenderListener, AnalyticsMergeStrategyTest, TestUniqueKeyFieldResource, InfoHandlerTest, BigEndianAscendingWordDeserializerTest, TestBinaryResponseWriter, TestSolrCoreProperties, TestShardHandlerFactory, CustomCollectionTest, TestFieldResource, SuggesterWFSTTest, TestSolrJ, RequestLoggingTest, UpdateRequestProcessorFactoryTest, CdcrUpdateLogTest, TestSchemaVersionResource, OverseerCollectionConfigSetProcessorTest, FileBasedSpellCheckerTest, TestCharFilters, ResourceLoaderTest, TestRandomCollapseQParserPlugin, UniqFieldsUpdateProcessorFactoryTest, HdfsRestartWhileUpdatingTest, PluginInfoTest, TestReRankQParserPlugin, ZkStateReaderTest, TestStandardQParsers, DirectoryFactoryTest, TestSimpleQParserPlugin, TestIndexingPerformance, DistributedMLTComponentTest, BlockDirectoryTest, WordBreakSolrSpellCheckerTest, BasicZkTest, ConfigSetsAPITest, HttpPartitionTest, BlockJoinFacetRandomTest, CdcrReplicationHandlerTest, OutputWriterTest, UUIDUpdateProcessorFallbackTest, TestMacros, TestJoin, DistributedExpandComponentTest, CollectionReloadTest, HdfsDirectoryTest, TestFiltering, TestCollapseQParserPlugin, ResponseLogComponentTest, TestLeaderInitiatedRecoveryThread, BinaryUpdateRequestHandlerTest, TestConfigSetsAPIZkFailure, TestAddFieldRealTimeGet, SaslZkACLProviderTest, TestCSVResponseWriter, DistributedQueryComponentCustomSortTest, DateMathParserTest, CheckHdfsIndexTest, TestLMJelinekMercerSimilarityFactory, ShardRoutingCustomTest, TestPHPSerializedResponseWriter, TestSolrCloudWithKerberosAlt, TestRandomFaceting, TestSolrQueryParser, AsyncCallRequestStatusResponseTest, FullHLLTest, TestSolrQueryParserDefaultOperatorResource, TestFieldTypeResource, TestRuleBasedAuthorizationPlugin, SolrCmdDistributorTest, TestManagedSchema, TestSystemIdResolver, FullSolrCloudDistribCmdsTest, TestConfigSetsAPI, SyncSliceTest, OpenCloseCoreStressTest, OverseerTest, ShardRoutingTest, TestReplicationHandler, TestZkChroot, ZkCLITest, AutoCommitTest, TestFaceting, TestRecovery, DistributedSpellCheckComponentTest, TermVectorComponentDistributedTest, ZkControllerTest, TestRealTimeGet, TestStressReorder, TestStressVersions, TestRangeQuery, SimpleFacetsTest, TestSolr4Spatial, StatsComponentTest, SpellCheckComponentTest, QueryElevationComponentTest, BadIndexSchemaTest, TestSort, TestLazyCores]
   [junit4]   2> NOTE: reproduce with: ant test  -Dtestcase=TestLazyCores -Dtests.seed=54EB7CD0CE80B83D -Dtests.slow=true -Dtests.locale=pt-BR -Dtests.timezone=Europe/Belgrade -Dtests.asserts=true -Dtests.file.encoding=UTF-8
   [junit4] ERROR   0.00s J1 | TestLazyCores (suite) <<<
   [junit4]    > Throwable #1: java.lang.AssertionError: ObjectTracker found 4 object(s) that were not released!!! [MDCAwareThreadPoolExecutor, SolrCore, MockDirectoryWrapper, MockDirectoryWrapper]
   [junit4]    > 	at __randomizedtesting.SeedInfo.seed([54EB7CD0CE80B83D]:0)
   [junit4]    > 	at org.apache.solr.SolrTestCaseJ4.afterClass(SolrTestCaseJ4.java:238)
   [junit4]    > 	at java.lang.Thread.run(Thread.java:745)Throwable #2: com.carrotsearch.randomizedtesting.ThreadLeakError: 1 thread leaked from SUITE scope at org.apache.solr.core.TestLazyCores: 
   [junit4]    >    1) Thread[id=16643, name=searcherExecutor-7334-thread-1, state=WAITING, group=TGRP-TestLazyCores]
   [junit4]    >         at sun.misc.Unsafe.park(Native Method)
   [junit4]    >         at java.util.concurrent.locks.LockSupport.park(LockSupport.java:175)
   [junit4]    >         at java.util.concurrent.locks.AbstractQueuedSynchronizer$ConditionObject.await(AbstractQueuedSynchronizer.java:2039)
   [junit4]    >         at java.util.concurrent.LinkedBlockingQueue.take(LinkedBlockingQueue.java:442)
   [junit4]    >         at java.util.concurrent.ThreadPoolExecutor.getTask(ThreadPoolExecutor.java:1067)
   [junit4]    >         at java.util.concurrent.ThreadPoolExecutor.runWorker(ThreadPoolExecutor.java:1127)
   [junit4]    >         at java.util.concurrent.ThreadPoolExecutor$Worker.run(ThreadPoolExecutor.java:617)
   [junit4]    >         at java.lang.Thread.run(Thread.java:745)
   [junit4]    > 	at __randomizedtesting.SeedInfo.seed([54EB7CD0CE80B83D]:0)Throwable #3: com.carrotsearch.randomizedtesting.ThreadLeakError: There are still zombie threads that couldn't be terminated:
   [junit4]    >    1) Thread[id=16643, name=searcherExecutor-7334-thread-1, state=WAITING, group=TGRP-TestLazyCores]
   [junit4]    >         at sun.misc.Unsafe.park(Native Method)
   [junit4]    >         at java.util.concurrent.locks.LockSupport.park(LockSupport.java:175)
   [junit4]    >         at java.util.concurrent.locks.AbstractQueuedSynchronizer$ConditionObject.await(AbstractQueuedSynchronizer.java:2039)
   [junit4]    >         at java.util.concurrent.LinkedBlockingQueue.take(LinkedBlockingQueue.java:442)
   [junit4]    >         at java.util.concurrent.ThreadPoolExecutor.getTask(ThreadPoolExecutor.java:1067)
   [junit4]    >         at java.util.concurrent.ThreadPoolExecutor.runWorker(ThreadPoolExecutor.java:1127)
   [junit4]    >         at java.util.concurrent.ThreadPoolExecutor$Worker.run(ThreadPoolExecutor.java:617)
   [junit4]    >         at java.lang.Thread.run(Thread.java:745)
   [junit4]    > 	at __randomizedtesting.SeedInfo.seed([54EB7CD0CE80B83D]:0)
   [junit4] Completed [406/584 (1!)] on J1 in 147.47s, 8 tests, 1 failure, 2 errors <<< FAILURES!

[...truncated 575 lines...]
BUILD FAILED
/export/home/jenkins/workspace/Lucene-Solr-master-Solaris/build.xml:740: The following error occurred while executing this line:
/export/home/jenkins/workspace/Lucene-Solr-master-Solaris/build.xml:684: The following error occurred while executing this line:
/export/home/jenkins/workspace/Lucene-Solr-master-Solaris/build.xml:59: The following error occurred while executing this line:
/export/home/jenkins/workspace/Lucene-Solr-master-Solaris/solr/build.xml:233: The following error occurred while executing this line:
/export/home/jenkins/workspace/Lucene-Solr-master-Solaris/solr/common-build.xml:529: The following error occurred while executing this line:
/export/home/jenkins/workspace/Lucene-Solr-master-Solaris/lucene/common-build.xml:1457: The following error occurred while executing this line:
/export/home/jenkins/workspace/Lucene-Solr-master-Solaris/lucene/common-build.xml:1014: There were test failures: 584 suites (10 ignored), 2357 tests, 3 suite-level errors, 528 ignored (70 assumptions) [seed: 54EB7CD0CE80B83D]

Total time: 57 minutes 20 seconds
Build step 'Invoke Ant' marked build as failure
Archiving artifacts
[WARNINGS] Skipping publisher since build result is FAILURE
Recording test results
Email was triggered for: Failure - Any
Sending email for trigger: Failure - Any



Mime
View raw message