lucene-dev mailing list archives

Site index · List index
Message view « Date » · « Thread »
Top « Date » · « Thread »
From Michael McCandless <luc...@mikemccandless.com>
Subject Re: [JENKINS] Lucene-Solr-Tests-6.x - Build # 32 - Still Failing
Date Wed, 09 Mar 2016 18:51:37 GMT
I'll dig.

Mike McCandless

http://blog.mikemccandless.com


On Wed, Mar 9, 2016 at 12:59 PM, Apache Jenkins Server
<jenkins@builds.apache.org> wrote:
> Build: https://builds.apache.org/job/Lucene-Solr-Tests-6.x/32/
>
> 1 tests failed.
> FAILED:  org.apache.lucene.search.join.TestBlockJoin.testBugCausedByRewritingTwice
>
> Error Message:
>
>
> Stack Trace:
> java.lang.NullPointerException
>         at __randomizedtesting.SeedInfo.seed([F8CC8C8B5953C710:7B05C20D26C1B69]:0)
>         at org.apache.lucene.search.join.TestBlockJoin.testBugCausedByRewritingTwice(TestBlockJoin.java:298)
>         at sun.reflect.NativeMethodAccessorImpl.invoke0(Native Method)
>         at sun.reflect.NativeMethodAccessorImpl.invoke(NativeMethodAccessorImpl.java:62)
>         at sun.reflect.DelegatingMethodAccessorImpl.invoke(DelegatingMethodAccessorImpl.java:43)
>         at java.lang.reflect.Method.invoke(Method.java:497)
>         at com.carrotsearch.randomizedtesting.RandomizedRunner.invoke(RandomizedRunner.java:1764)
>         at com.carrotsearch.randomizedtesting.RandomizedRunner$8.evaluate(RandomizedRunner.java:871)
>         at com.carrotsearch.randomizedtesting.RandomizedRunner$9.evaluate(RandomizedRunner.java:907)
>         at com.carrotsearch.randomizedtesting.RandomizedRunner$10.evaluate(RandomizedRunner.java:921)
>         at org.apache.lucene.util.TestRuleSetupTeardownChained$1.evaluate(TestRuleSetupTeardownChained.java:49)
>         at org.apache.lucene.util.AbstractBeforeAfterRule$1.evaluate(AbstractBeforeAfterRule.java:45)
>         at org.apache.lucene.util.TestRuleThreadAndTestName$1.evaluate(TestRuleThreadAndTestName.java:48)
>         at org.apache.lucene.util.TestRuleIgnoreAfterMaxFailures$1.evaluate(TestRuleIgnoreAfterMaxFailures.java:64)
>         at org.apache.lucene.util.TestRuleMarkFailure$1.evaluate(TestRuleMarkFailure.java:47)
>         at com.carrotsearch.randomizedtesting.rules.StatementAdapter.evaluate(StatementAdapter.java:36)
>         at com.carrotsearch.randomizedtesting.ThreadLeakControl$StatementRunner.run(ThreadLeakControl.java:367)
>         at com.carrotsearch.randomizedtesting.ThreadLeakControl.forkTimeoutingTask(ThreadLeakControl.java:809)
>         at com.carrotsearch.randomizedtesting.ThreadLeakControl$3.evaluate(ThreadLeakControl.java:460)
>         at com.carrotsearch.randomizedtesting.RandomizedRunner.runSingleTest(RandomizedRunner.java:880)
>         at com.carrotsearch.randomizedtesting.RandomizedRunner$5.evaluate(RandomizedRunner.java:781)
>         at com.carrotsearch.randomizedtesting.RandomizedRunner$6.evaluate(RandomizedRunner.java:816)
>         at com.carrotsearch.randomizedtesting.RandomizedRunner$7.evaluate(RandomizedRunner.java:827)
>         at org.apache.lucene.util.AbstractBeforeAfterRule$1.evaluate(AbstractBeforeAfterRule.java:45)
>         at com.carrotsearch.randomizedtesting.rules.StatementAdapter.evaluate(StatementAdapter.java:36)
>         at org.apache.lucene.util.TestRuleStoreClassName$1.evaluate(TestRuleStoreClassName.java:41)
>         at com.carrotsearch.randomizedtesting.rules.NoShadowingOrOverridesOnMethodsRule$1.evaluate(NoShadowingOrOverridesOnMethodsRule.java:40)
>         at com.carrotsearch.randomizedtesting.rules.NoShadowingOrOverridesOnMethodsRule$1.evaluate(NoShadowingOrOverridesOnMethodsRule.java:40)
>         at com.carrotsearch.randomizedtesting.rules.StatementAdapter.evaluate(StatementAdapter.java:36)
>         at com.carrotsearch.randomizedtesting.rules.StatementAdapter.evaluate(StatementAdapter.java:36)
>         at com.carrotsearch.randomizedtesting.rules.StatementAdapter.evaluate(StatementAdapter.java:36)
>         at org.apache.lucene.util.TestRuleAssertionsRequired$1.evaluate(TestRuleAssertionsRequired.java:53)
>         at org.apache.lucene.util.TestRuleMarkFailure$1.evaluate(TestRuleMarkFailure.java:47)
>         at org.apache.lucene.util.TestRuleIgnoreAfterMaxFailures$1.evaluate(TestRuleIgnoreAfterMaxFailures.java:64)
>         at org.apache.lucene.util.TestRuleIgnoreTestSuites$1.evaluate(TestRuleIgnoreTestSuites.java:54)
>         at com.carrotsearch.randomizedtesting.rules.StatementAdapter.evaluate(StatementAdapter.java:36)
>         at com.carrotsearch.randomizedtesting.ThreadLeakControl$StatementRunner.run(ThreadLeakControl.java:367)
>         at java.lang.Thread.run(Thread.java:745)
>
>
>
>
> Build Log:
> [...truncated 7150 lines...]
>    [junit4] Suite: org.apache.lucene.search.join.TestBlockJoin
>    [junit4]   2> NOTE: reproduce with: ant test  -Dtestcase=TestBlockJoin -Dtests.method=testBugCausedByRewritingTwice
-Dtests.seed=F8CC8C8B5953C710 -Dtests.multiplier=2 -Dtests.slow=true -Dtests.locale=sr-BA
-Dtests.timezone=Europe/Vienna -Dtests.asserts=true -Dtests.file.encoding=ISO-8859-1
>    [junit4] ERROR   0.03s J1 | TestBlockJoin.testBugCausedByRewritingTwice <<<
>    [junit4]    > Throwable #1: java.lang.NullPointerException
>    [junit4]    >        at __randomizedtesting.SeedInfo.seed([F8CC8C8B5953C710:7B05C20D26C1B69]:0)
>    [junit4]    >        at org.apache.lucene.search.join.TestBlockJoin.testBugCausedByRewritingTwice(TestBlockJoin.java:298)
>    [junit4]    >        at java.lang.Thread.run(Thread.java:745)
>    [junit4]   2> NOTE: test params are: codec=Asserting(Lucene60): {country=PostingsFormat(name=Direct),
parent=PostingsFormat(name=Direct), isParent=PostingsFormat(name=MockRandom), docType=PostingsFormat(name=Direct),
isparent=PostingsFormat(name=MockRandom), child0=PostingsFormat(name=MockRandom), foo_parent=PostingsFormat(name=LuceneVarGapFixedInterval),
child1=PostingsFormat(name=LuceneVarGapFixedInterval), parent0=PostingsFormat(name=Direct),
parent1=PostingsFormat(name=Memory doPackFST= false), qualification=PostingsFormat(name=Memory
doPackFST= false), skill=PostingsFormat(name=Memory doPackFST= false), name=PostingsFormat(name=LuceneVarGapFixedInterval),
foo_child=PostingsFormat(name=Memory doPackFST= false), childText=PostingsFormat(name=LuceneVarGapFixedInterval),
parentText=PostingsFormat(name=Memory doPackFST= false), parent2=PostingsFormat(name=MockRandom),
child=PostingsFormat(name=MockRandom)}, docValues:{parent0=DocValuesFormat(name=Direct), parent1=DocValuesFormat(name=Lucene54),
childID=DocValuesFormat(name=Asserting), parentID=DocValuesFormat(name=Lucene54), parent2=DocValuesFormat(name=Lucene54),
child0=DocValuesFormat(name=Lucene54), child1=DocValuesFormat(name=Asserting)}, maxPointsInLeafNode=639,
maxMBSortInHeap=4.0343171941515275, sim=RandomSimilarity(queryNorm=true,coord=crazy): {country=IB
LL-L1, parent=DFR I(n)L3(800.0), qualification=DFR I(ne)L1, skill=IB SPL-L2, childText=DFR
GL3(800.0), parentText=DFR I(n)3(800.0), child=DFR I(ne)L1}, locale=sr-BA, timezone=Europe/Vienna
>    [junit4]   2> NOTE: Linux 3.13.0-52-generic amd64/Oracle Corporation 1.8.0_66 (64-bit)/cpus=4,threads=1,free=233595496,total=308805632
>    [junit4]   2> NOTE: All tests run in this JVM: [TestBlockJoinSorting, TestBlockJoin]
>    [junit4] Completed [6/6 (1!)] on J1 in 22.51s, 19 tests, 1 error <<< FAILURES!
>
> [...truncated 11 lines...]
> BUILD FAILED
> /x1/jenkins/jenkins-slave/workspace/Lucene-Solr-Tests-6.x/build.xml:740: The following
error occurred while executing this line:
> /x1/jenkins/jenkins-slave/workspace/Lucene-Solr-Tests-6.x/build.xml:684: The following
error occurred while executing this line:
> /x1/jenkins/jenkins-slave/workspace/Lucene-Solr-Tests-6.x/build.xml:59: The following
error occurred while executing this line:
> /x1/jenkins/jenkins-slave/workspace/Lucene-Solr-Tests-6.x/lucene/build.xml:476: The following
error occurred while executing this line:
> /x1/jenkins/jenkins-slave/workspace/Lucene-Solr-Tests-6.x/lucene/common-build.xml:2187:
The following error occurred while executing this line:
> /x1/jenkins/jenkins-slave/workspace/Lucene-Solr-Tests-6.x/lucene/module-build.xml:58:
The following error occurred while executing this line:
> /x1/jenkins/jenkins-slave/workspace/Lucene-Solr-Tests-6.x/lucene/common-build.xml:1457:
The following error occurred while executing this line:
> /x1/jenkins/jenkins-slave/workspace/Lucene-Solr-Tests-6.x/lucene/common-build.xml:1014:
There were test failures: 6 suites, 43 tests, 1 error [seed: F8CC8C8B5953C710]
>
> Total time: 21 minutes 46 seconds
> Build step 'Invoke Ant' marked build as failure
> Archiving artifacts
> Recording test results
> Email was triggered for: Failure - Any
> Sending email for trigger: Failure - Any
>
>
>
>
> ---------------------------------------------------------------------
> To unsubscribe, e-mail: dev-unsubscribe@lucene.apache.org
> For additional commands, e-mail: dev-help@lucene.apache.org

---------------------------------------------------------------------
To unsubscribe, e-mail: dev-unsubscribe@lucene.apache.org
For additional commands, e-mail: dev-help@lucene.apache.org


Mime
View raw message