lucene-dev mailing list archives

Site index · List index
Message view « Date » · « Thread »
Top « Date » · « Thread »
From Robert Muir <rcm...@gmail.com>
Subject Re: [JENKINS] Lucene-Solr-NightlyTests-master - Build # 972 - Still Failing
Date Tue, 29 Mar 2016 12:29:50 GMT
Jenkins delay, it started nightly run before my commit last night...

On Tue, Mar 29, 2016 at 2:40 AM, Apache Jenkins Server
<jenkins@builds.apache.org> wrote:
> Build: https://builds.apache.org/job/Lucene-Solr-NightlyTests-master/972/
>
> 1 tests failed.
> FAILED:  org.apache.lucene.spatial.geopoint.search.TestLegacyGeoPointQuery.testRandomBig
>
> Error Message:
> wrong hit (first of possibly more):  FAIL: id=33242 should not match but did   query=GeoPointInBBoxQuery:
field=point: Lower Left: [-35.36866044823183,53.479057449525655] Upper Right: [-35.004868093254466,52.831444927056815]
docID=32721   lat=-35.056571904569864 lon=53.47905730828643   deleted?=false
>
> Stack Trace:
> java.lang.AssertionError: wrong hit (first of possibly more):
>
> FAIL: id=33242 should not match but did
>   query=GeoPointInBBoxQuery: field=point: Lower Left: [-35.36866044823183,53.479057449525655]
Upper Right: [-35.004868093254466,52.831444927056815] docID=32721
>   lat=-35.056571904569864 lon=53.47905730828643
>   deleted?=false
>         at __randomizedtesting.SeedInfo.seed([A591D10E8A69A9D3:22C6AC811B30D553]:0)
>         at org.junit.Assert.fail(Assert.java:93)
>         at org.apache.lucene.spatial.util.BaseGeoPointTestCase.verifyRandomRectangles(BaseGeoPointTestCase.java:855)
>         at org.apache.lucene.spatial.util.BaseGeoPointTestCase.verify(BaseGeoPointTestCase.java:740)
>         at org.apache.lucene.spatial.util.BaseGeoPointTestCase.doTestRandom(BaseGeoPointTestCase.java:665)
>         at org.apache.lucene.spatial.util.BaseGeoPointTestCase.testRandomBig(BaseGeoPointTestCase.java:594)
>         at sun.reflect.NativeMethodAccessorImpl.invoke0(Native Method)
>         at sun.reflect.NativeMethodAccessorImpl.invoke(NativeMethodAccessorImpl.java:62)
>         at sun.reflect.DelegatingMethodAccessorImpl.invoke(DelegatingMethodAccessorImpl.java:43)
>         at java.lang.reflect.Method.invoke(Method.java:498)
>         at com.carrotsearch.randomizedtesting.RandomizedRunner.invoke(RandomizedRunner.java:1764)
>         at com.carrotsearch.randomizedtesting.RandomizedRunner$8.evaluate(RandomizedRunner.java:871)
>         at com.carrotsearch.randomizedtesting.RandomizedRunner$9.evaluate(RandomizedRunner.java:907)
>         at com.carrotsearch.randomizedtesting.RandomizedRunner$10.evaluate(RandomizedRunner.java:921)
>         at org.apache.lucene.util.TestRuleSetupTeardownChained$1.evaluate(TestRuleSetupTeardownChained.java:49)
>         at org.apache.lucene.util.AbstractBeforeAfterRule$1.evaluate(AbstractBeforeAfterRule.java:45)
>         at org.apache.lucene.util.TestRuleThreadAndTestName$1.evaluate(TestRuleThreadAndTestName.java:48)
>         at org.apache.lucene.util.TestRuleIgnoreAfterMaxFailures$1.evaluate(TestRuleIgnoreAfterMaxFailures.java:64)
>         at org.apache.lucene.util.TestRuleMarkFailure$1.evaluate(TestRuleMarkFailure.java:47)
>         at com.carrotsearch.randomizedtesting.rules.StatementAdapter.evaluate(StatementAdapter.java:36)
>         at com.carrotsearch.randomizedtesting.ThreadLeakControl$StatementRunner.run(ThreadLeakControl.java:367)
>         at com.carrotsearch.randomizedtesting.ThreadLeakControl.forkTimeoutingTask(ThreadLeakControl.java:809)
>         at com.carrotsearch.randomizedtesting.ThreadLeakControl$3.evaluate(ThreadLeakControl.java:460)
>         at com.carrotsearch.randomizedtesting.RandomizedRunner.runSingleTest(RandomizedRunner.java:880)
>         at com.carrotsearch.randomizedtesting.RandomizedRunner$5.evaluate(RandomizedRunner.java:781)
>         at com.carrotsearch.randomizedtesting.RandomizedRunner$6.evaluate(RandomizedRunner.java:816)
>         at com.carrotsearch.randomizedtesting.RandomizedRunner$7.evaluate(RandomizedRunner.java:827)
>         at org.apache.lucene.util.AbstractBeforeAfterRule$1.evaluate(AbstractBeforeAfterRule.java:45)
>         at com.carrotsearch.randomizedtesting.rules.StatementAdapter.evaluate(StatementAdapter.java:36)
>         at org.apache.lucene.util.TestRuleStoreClassName$1.evaluate(TestRuleStoreClassName.java:41)
>         at com.carrotsearch.randomizedtesting.rules.NoShadowingOrOverridesOnMethodsRule$1.evaluate(NoShadowingOrOverridesOnMethodsRule.java:40)
>         at com.carrotsearch.randomizedtesting.rules.NoShadowingOrOverridesOnMethodsRule$1.evaluate(NoShadowingOrOverridesOnMethodsRule.java:40)
>         at com.carrotsearch.randomizedtesting.rules.StatementAdapter.evaluate(StatementAdapter.java:36)
>         at com.carrotsearch.randomizedtesting.rules.StatementAdapter.evaluate(StatementAdapter.java:36)
>         at com.carrotsearch.randomizedtesting.rules.StatementAdapter.evaluate(StatementAdapter.java:36)
>         at org.apache.lucene.util.TestRuleAssertionsRequired$1.evaluate(TestRuleAssertionsRequired.java:53)
>         at org.apache.lucene.util.TestRuleMarkFailure$1.evaluate(TestRuleMarkFailure.java:47)
>         at org.apache.lucene.util.TestRuleIgnoreAfterMaxFailures$1.evaluate(TestRuleIgnoreAfterMaxFailures.java:64)
>         at org.apache.lucene.util.TestRuleIgnoreTestSuites$1.evaluate(TestRuleIgnoreTestSuites.java:54)
>         at com.carrotsearch.randomizedtesting.rules.StatementAdapter.evaluate(StatementAdapter.java:36)
>         at com.carrotsearch.randomizedtesting.ThreadLeakControl$StatementRunner.run(ThreadLeakControl.java:367)
>         at java.lang.Thread.run(Thread.java:745)
>
>
>
>
> Build Log:
> [...truncated 9375 lines...]
>    [junit4] Suite: org.apache.lucene.spatial.geopoint.search.TestLegacyGeoPointQuery
>    [junit4]   2> NOTE: download the large Jenkins line-docs file by running 'ant get-jenkins-line-docs'
in the lucene directory.
>    [junit4]   2> NOTE: reproduce with: ant test  -Dtestcase=TestLegacyGeoPointQuery
-Dtests.method=testRandomBig -Dtests.seed=A591D10E8A69A9D3 -Dtests.multiplier=2 -Dtests.nightly=true
-Dtests.slow=true -Dtests.linedocsfile=/x1/jenkins/lucene-data/enwiki.random.lines.txt -Dtests.locale=ar-QA
-Dtests.timezone=Asia/Vladivostok -Dtests.asserts=true -Dtests.file.encoding=UTF-8
>    [junit4] FAILURE 54.6s J1 | TestLegacyGeoPointQuery.testRandomBig <<<
>    [junit4]    > Throwable #1: java.lang.AssertionError: wrong hit (first of possibly
more):
>    [junit4]    > FAIL: id=33242 should not match but did
>    [junit4]    >   query=GeoPointInBBoxQuery: field=point: Lower Left: [-35.36866044823183,53.479057449525655]
Upper Right: [-35.004868093254466,52.831444927056815] docID=32721
>    [junit4]    >   lat=-35.056571904569864 lon=53.47905730828643
>    [junit4]    >   deleted?=false
>    [junit4]    >        at __randomizedtesting.SeedInfo.seed([A591D10E8A69A9D3:22C6AC811B30D553]:0)
>    [junit4]    >        at org.apache.lucene.spatial.util.BaseGeoPointTestCase.verifyRandomRectangles(BaseGeoPointTestCase.java:855)
>    [junit4]    >        at org.apache.lucene.spatial.util.BaseGeoPointTestCase.verify(BaseGeoPointTestCase.java:740)
>    [junit4]    >        at org.apache.lucene.spatial.util.BaseGeoPointTestCase.doTestRandom(BaseGeoPointTestCase.java:665)
>    [junit4]    >        at org.apache.lucene.spatial.util.BaseGeoPointTestCase.testRandomBig(BaseGeoPointTestCase.java:594)
>    [junit4]    >        at java.lang.Thread.run(Thread.java:745)
>    [junit4] IGNOR/A 0.01s J1 | TestLegacyGeoPointQuery.testRandomDistance
>    [junit4]    > Assumption #1: legacy encoding is too slow/hangs on this test
>    [junit4] IGNOR/A 0.01s J1 | TestLegacyGeoPointQuery.testRandomDistanceHuge
>    [junit4]    > Assumption #1: legacy encoding is too slow/hangs on this test
>    [junit4]   2> NOTE: leaving temporary files on disk at: /x1/jenkins/jenkins-slave/workspace/Lucene-Solr-NightlyTests-master/lucene/build/spatial/test/J1/temp/lucene.spatial.geopoint.search.TestLegacyGeoPointQuery_A591D10E8A69A9D3-001
>    [junit4]   2> NOTE: test params are: codec=Asserting(Lucene60): {string=PostingsFormat(name=LuceneVarGapDocFreqInterval),
field=FSTOrd50, id=PostingsFormat(name=MockRandom), point=BlockTreeOrds(blocksize=128)}, docValues:{field=DocValuesFormat(name=Memory),
id=DocValuesFormat(name=Lucene54), point=DocValuesFormat(name=Asserting)}, maxPointsInLeafNode=830,
maxMBSortInHeap=6.526169612052921, sim=RandomSimilarity(queryNorm=false,coord=no): {}, locale=ar-QA,
timezone=Asia/Vladivostok
>    [junit4]   2> NOTE: Linux 3.13.0-52-generic amd64/Oracle Corporation 1.8.0_74 (64-bit)/cpus=4,threads=1,free=114163344,total=257949696
>    [junit4]   2> NOTE: All tests run in this JVM: [TestLegacyGeoPointQuery]
>    [junit4] Completed [3/3 (1!)] on J1 in 230.61s, 42 tests, 1 failure, 2 skipped <<<
FAILURES!
>
> [...truncated 11 lines...]
> BUILD FAILED
> /x1/jenkins/jenkins-slave/workspace/Lucene-Solr-NightlyTests-master/build.xml:747: The
following error occurred while executing this line:
> /x1/jenkins/jenkins-slave/workspace/Lucene-Solr-NightlyTests-master/build.xml:684: The
following error occurred while executing this line:
> /x1/jenkins/jenkins-slave/workspace/Lucene-Solr-NightlyTests-master/build.xml:59: The
following error occurred while executing this line:
> /x1/jenkins/jenkins-slave/workspace/Lucene-Solr-NightlyTests-master/lucene/build.xml:476:
The following error occurred while executing this line:
> /x1/jenkins/jenkins-slave/workspace/Lucene-Solr-NightlyTests-master/lucene/common-build.xml:2187:
The following error occurred while executing this line:
> /x1/jenkins/jenkins-slave/workspace/Lucene-Solr-NightlyTests-master/lucene/module-build.xml:58:
The following error occurred while executing this line:
> /x1/jenkins/jenkins-slave/workspace/Lucene-Solr-NightlyTests-master/lucene/common-build.xml:1457:
The following error occurred while executing this line:
> /x1/jenkins/jenkins-slave/workspace/Lucene-Solr-NightlyTests-master/lucene/common-build.xml:1014:
There were test failures: 3 suites, 95 tests, 1 failure, 3 ignored (3 assumptions) [seed:
A591D10E8A69A9D3]
>
> Total time: 189 minutes 57 seconds
> Build step 'Invoke Ant' marked build as failure
> Archiving artifacts
> No prior successful build to compare, so performing full copy of artifacts
> Recording test results
> Email was triggered for: Failure - Any
> Sending email for trigger: Failure - Any
>
>
>
>
>
> ---------------------------------------------------------------------
> To unsubscribe, e-mail: dev-unsubscribe@lucene.apache.org
> For additional commands, e-mail: dev-help@lucene.apache.org

---------------------------------------------------------------------
To unsubscribe, e-mail: dev-unsubscribe@lucene.apache.org
For additional commands, e-mail: dev-help@lucene.apache.org


Mime
View raw message