lucene-dev mailing list archives

Site index · List index
Message view « Date » · « Thread »
Top « Date » · « Thread »
From Robert Muir <rm...@apache.org>
Subject Re: [JENKINS] Lucene-Solr-6.x-Windows (32bit/jdk1.8.0_72) - Build # 79 - Failure!
Date Mon, 28 Mar 2016 20:03:41 GMT
i committed a fix. The test uses NaN as a marker for "missing".

On Mon, Mar 28, 2016 at 3:51 PM, Policeman Jenkins Server
<jenkins@thetaphi.de> wrote:
> Build: http://jenkins.thetaphi.de/job/Lucene-Solr-6.x-Windows/79/
> Java: 32bit/jdk1.8.0_72 -client -XX:+UseParallelGC
>
> 4 tests failed.
> FAILED:  org.apache.lucene.search.TestLatLonPointQueries.testRandomTiny
>
> Error Message:
> invalid latitude NaN; must be between -90.0 and 90.0
>
> Stack Trace:
> java.lang.IllegalArgumentException: invalid latitude NaN; must be between -90.0 and 90.0
>         at __randomizedtesting.SeedInfo.seed([D965017FF6735DB4:9022DF39A8526518]:0)
>         at org.apache.lucene.spatial.util.GeoUtils.checkLatitude(GeoUtils.java:66)
>         at org.apache.lucene.document.LatLonPoint.encodeLatitude(LatLonPoint.java:140)
>         at org.apache.lucene.search.TestLatLonPointQueries.quantizeLat(TestLatLonPointQueries.java:47)
>         at org.apache.lucene.spatial.util.BaseGeoPointTestCase.verify(BaseGeoPointTestCase.java:730)
>         at org.apache.lucene.spatial.util.BaseGeoPointTestCase.doTestRandom(BaseGeoPointTestCase.java:665)
>         at org.apache.lucene.spatial.util.BaseGeoPointTestCase.testRandomTiny(BaseGeoPointTestCase.java:583)
>         at sun.reflect.NativeMethodAccessorImpl.invoke0(Native Method)
>         at sun.reflect.NativeMethodAccessorImpl.invoke(NativeMethodAccessorImpl.java:62)
>         at sun.reflect.DelegatingMethodAccessorImpl.invoke(DelegatingMethodAccessorImpl.java:43)
>         at java.lang.reflect.Method.invoke(Method.java:498)
>         at com.carrotsearch.randomizedtesting.RandomizedRunner.invoke(RandomizedRunner.java:1764)
>         at com.carrotsearch.randomizedtesting.RandomizedRunner$8.evaluate(RandomizedRunner.java:871)
>         at com.carrotsearch.randomizedtesting.RandomizedRunner$9.evaluate(RandomizedRunner.java:907)
>         at com.carrotsearch.randomizedtesting.RandomizedRunner$10.evaluate(RandomizedRunner.java:921)
>         at org.apache.lucene.util.TestRuleSetupTeardownChained$1.evaluate(TestRuleSetupTeardownChained.java:49)
>         at org.apache.lucene.util.AbstractBeforeAfterRule$1.evaluate(AbstractBeforeAfterRule.java:45)
>         at org.apache.lucene.util.TestRuleThreadAndTestName$1.evaluate(TestRuleThreadAndTestName.java:48)
>         at org.apache.lucene.util.TestRuleIgnoreAfterMaxFailures$1.evaluate(TestRuleIgnoreAfterMaxFailures.java:64)
>         at org.apache.lucene.util.TestRuleMarkFailure$1.evaluate(TestRuleMarkFailure.java:47)
>         at com.carrotsearch.randomizedtesting.rules.StatementAdapter.evaluate(StatementAdapter.java:36)
>         at com.carrotsearch.randomizedtesting.ThreadLeakControl$StatementRunner.run(ThreadLeakControl.java:367)
>         at com.carrotsearch.randomizedtesting.ThreadLeakControl.forkTimeoutingTask(ThreadLeakControl.java:809)
>         at com.carrotsearch.randomizedtesting.ThreadLeakControl$3.evaluate(ThreadLeakControl.java:460)
>         at com.carrotsearch.randomizedtesting.RandomizedRunner.runSingleTest(RandomizedRunner.java:880)
>         at com.carrotsearch.randomizedtesting.RandomizedRunner$5.evaluate(RandomizedRunner.java:781)
>         at com.carrotsearch.randomizedtesting.RandomizedRunner$6.evaluate(RandomizedRunner.java:816)
>         at com.carrotsearch.randomizedtesting.RandomizedRunner$7.evaluate(RandomizedRunner.java:827)
>         at org.apache.lucene.util.AbstractBeforeAfterRule$1.evaluate(AbstractBeforeAfterRule.java:45)
>         at com.carrotsearch.randomizedtesting.rules.StatementAdapter.evaluate(StatementAdapter.java:36)
>         at org.apache.lucene.util.TestRuleStoreClassName$1.evaluate(TestRuleStoreClassName.java:41)
>         at com.carrotsearch.randomizedtesting.rules.NoShadowingOrOverridesOnMethodsRule$1.evaluate(NoShadowingOrOverridesOnMethodsRule.java:40)
>         at com.carrotsearch.randomizedtesting.rules.NoShadowingOrOverridesOnMethodsRule$1.evaluate(NoShadowingOrOverridesOnMethodsRule.java:40)
>         at com.carrotsearch.randomizedtesting.rules.StatementAdapter.evaluate(StatementAdapter.java:36)
>         at com.carrotsearch.randomizedtesting.rules.StatementAdapter.evaluate(StatementAdapter.java:36)
>         at com.carrotsearch.randomizedtesting.rules.StatementAdapter.evaluate(StatementAdapter.java:36)
>         at org.apache.lucene.util.TestRuleAssertionsRequired$1.evaluate(TestRuleAssertionsRequired.java:53)
>         at org.apache.lucene.util.TestRuleMarkFailure$1.evaluate(TestRuleMarkFailure.java:47)
>         at org.apache.lucene.util.TestRuleIgnoreAfterMaxFailures$1.evaluate(TestRuleIgnoreAfterMaxFailures.java:64)
>         at org.apache.lucene.util.TestRuleIgnoreTestSuites$1.evaluate(TestRuleIgnoreTestSuites.java:54)
>         at com.carrotsearch.randomizedtesting.rules.StatementAdapter.evaluate(StatementAdapter.java:36)
>         at com.carrotsearch.randomizedtesting.ThreadLeakControl$StatementRunner.run(ThreadLeakControl.java:367)
>         at java.lang.Thread.run(Thread.java:745)
>
>
> FAILED:  org.apache.lucene.search.TestLatLonPointQueries.testAllLatEqual
>
> Error Message:
> invalid latitude NaN; must be between -90.0 and 90.0
>
> Stack Trace:
> java.lang.IllegalArgumentException: invalid latitude NaN; must be between -90.0 and 90.0
>         at __randomizedtesting.SeedInfo.seed([D965017FF6735DB4:64F057F1FFBE7FB9]:0)
>         at org.apache.lucene.spatial.util.GeoUtils.checkLatitude(GeoUtils.java:66)
>         at org.apache.lucene.document.LatLonPoint.encodeLatitude(LatLonPoint.java:140)
>         at org.apache.lucene.search.TestLatLonPointQueries.quantizeLat(TestLatLonPointQueries.java:47)
>         at org.apache.lucene.spatial.util.BaseGeoPointTestCase.verify(BaseGeoPointTestCase.java:730)
>         at org.apache.lucene.spatial.util.BaseGeoPointTestCase.testAllLatEqual(BaseGeoPointTestCase.java:419)
>         at sun.reflect.NativeMethodAccessorImpl.invoke0(Native Method)
>         at sun.reflect.NativeMethodAccessorImpl.invoke(NativeMethodAccessorImpl.java:62)
>         at sun.reflect.DelegatingMethodAccessorImpl.invoke(DelegatingMethodAccessorImpl.java:43)
>         at java.lang.reflect.Method.invoke(Method.java:498)
>         at com.carrotsearch.randomizedtesting.RandomizedRunner.invoke(RandomizedRunner.java:1764)
>         at com.carrotsearch.randomizedtesting.RandomizedRunner$8.evaluate(RandomizedRunner.java:871)
>         at com.carrotsearch.randomizedtesting.RandomizedRunner$9.evaluate(RandomizedRunner.java:907)
>         at com.carrotsearch.randomizedtesting.RandomizedRunner$10.evaluate(RandomizedRunner.java:921)
>         at org.apache.lucene.util.TestRuleSetupTeardownChained$1.evaluate(TestRuleSetupTeardownChained.java:49)
>         at org.apache.lucene.util.AbstractBeforeAfterRule$1.evaluate(AbstractBeforeAfterRule.java:45)
>         at org.apache.lucene.util.TestRuleThreadAndTestName$1.evaluate(TestRuleThreadAndTestName.java:48)
>         at org.apache.lucene.util.TestRuleIgnoreAfterMaxFailures$1.evaluate(TestRuleIgnoreAfterMaxFailures.java:64)
>         at org.apache.lucene.util.TestRuleMarkFailure$1.evaluate(TestRuleMarkFailure.java:47)
>         at com.carrotsearch.randomizedtesting.rules.StatementAdapter.evaluate(StatementAdapter.java:36)
>         at com.carrotsearch.randomizedtesting.ThreadLeakControl$StatementRunner.run(ThreadLeakControl.java:367)
>         at com.carrotsearch.randomizedtesting.ThreadLeakControl.forkTimeoutingTask(ThreadLeakControl.java:809)
>         at com.carrotsearch.randomizedtesting.ThreadLeakControl$3.evaluate(ThreadLeakControl.java:460)
>         at com.carrotsearch.randomizedtesting.RandomizedRunner.runSingleTest(RandomizedRunner.java:880)
>         at com.carrotsearch.randomizedtesting.RandomizedRunner$5.evaluate(RandomizedRunner.java:781)
>         at com.carrotsearch.randomizedtesting.RandomizedRunner$6.evaluate(RandomizedRunner.java:816)
>         at com.carrotsearch.randomizedtesting.RandomizedRunner$7.evaluate(RandomizedRunner.java:827)
>         at org.apache.lucene.util.AbstractBeforeAfterRule$1.evaluate(AbstractBeforeAfterRule.java:45)
>         at com.carrotsearch.randomizedtesting.rules.StatementAdapter.evaluate(StatementAdapter.java:36)
>         at org.apache.lucene.util.TestRuleStoreClassName$1.evaluate(TestRuleStoreClassName.java:41)
>         at com.carrotsearch.randomizedtesting.rules.NoShadowingOrOverridesOnMethodsRule$1.evaluate(NoShadowingOrOverridesOnMethodsRule.java:40)
>         at com.carrotsearch.randomizedtesting.rules.NoShadowingOrOverridesOnMethodsRule$1.evaluate(NoShadowingOrOverridesOnMethodsRule.java:40)
>         at com.carrotsearch.randomizedtesting.rules.StatementAdapter.evaluate(StatementAdapter.java:36)
>         at com.carrotsearch.randomizedtesting.rules.StatementAdapter.evaluate(StatementAdapter.java:36)
>         at com.carrotsearch.randomizedtesting.rules.StatementAdapter.evaluate(StatementAdapter.java:36)
>         at org.apache.lucene.util.TestRuleAssertionsRequired$1.evaluate(TestRuleAssertionsRequired.java:53)
>         at org.apache.lucene.util.TestRuleMarkFailure$1.evaluate(TestRuleMarkFailure.java:47)
>         at org.apache.lucene.util.TestRuleIgnoreAfterMaxFailures$1.evaluate(TestRuleIgnoreAfterMaxFailures.java:64)
>         at org.apache.lucene.util.TestRuleIgnoreTestSuites$1.evaluate(TestRuleIgnoreTestSuites.java:54)
>         at com.carrotsearch.randomizedtesting.rules.StatementAdapter.evaluate(StatementAdapter.java:36)
>         at com.carrotsearch.randomizedtesting.ThreadLeakControl$StatementRunner.run(ThreadLeakControl.java:367)
>         at java.lang.Thread.run(Thread.java:745)
>
>
> FAILED:  org.apache.lucene.search.TestLatLonPointQueries.testAllLonEqual
>
> Error Message:
> invalid latitude NaN; must be between -90.0 and 90.0
>
> Stack Trace:
> java.lang.IllegalArgumentException: invalid latitude NaN; must be between -90.0 and 90.0
>         at __randomizedtesting.SeedInfo.seed([D965017FF6735DB4:486FF08206D91DA0]:0)
>         at org.apache.lucene.spatial.util.GeoUtils.checkLatitude(GeoUtils.java:66)
>         at org.apache.lucene.document.LatLonPoint.encodeLatitude(LatLonPoint.java:140)
>         at org.apache.lucene.search.TestLatLonPointQueries.quantizeLat(TestLatLonPointQueries.java:47)
>         at org.apache.lucene.spatial.util.BaseGeoPointTestCase.verify(BaseGeoPointTestCase.java:730)
>         at org.apache.lucene.spatial.util.BaseGeoPointTestCase.testAllLonEqual(BaseGeoPointTestCase.java:468)
>         at sun.reflect.NativeMethodAccessorImpl.invoke0(Native Method)
>         at sun.reflect.NativeMethodAccessorImpl.invoke(NativeMethodAccessorImpl.java:62)
>         at sun.reflect.DelegatingMethodAccessorImpl.invoke(DelegatingMethodAccessorImpl.java:43)
>         at java.lang.reflect.Method.invoke(Method.java:498)
>         at com.carrotsearch.randomizedtesting.RandomizedRunner.invoke(RandomizedRunner.java:1764)
>         at com.carrotsearch.randomizedtesting.RandomizedRunner$8.evaluate(RandomizedRunner.java:871)
>         at com.carrotsearch.randomizedtesting.RandomizedRunner$9.evaluate(RandomizedRunner.java:907)
>         at com.carrotsearch.randomizedtesting.RandomizedRunner$10.evaluate(RandomizedRunner.java:921)
>         at org.apache.lucene.util.TestRuleSetupTeardownChained$1.evaluate(TestRuleSetupTeardownChained.java:49)
>         at org.apache.lucene.util.AbstractBeforeAfterRule$1.evaluate(AbstractBeforeAfterRule.java:45)
>         at org.apache.lucene.util.TestRuleThreadAndTestName$1.evaluate(TestRuleThreadAndTestName.java:48)
>         at org.apache.lucene.util.TestRuleIgnoreAfterMaxFailures$1.evaluate(TestRuleIgnoreAfterMaxFailures.java:64)
>         at org.apache.lucene.util.TestRuleMarkFailure$1.evaluate(TestRuleMarkFailure.java:47)
>         at com.carrotsearch.randomizedtesting.rules.StatementAdapter.evaluate(StatementAdapter.java:36)
>         at com.carrotsearch.randomizedtesting.ThreadLeakControl$StatementRunner.run(ThreadLeakControl.java:367)
>         at com.carrotsearch.randomizedtesting.ThreadLeakControl.forkTimeoutingTask(ThreadLeakControl.java:809)
>         at com.carrotsearch.randomizedtesting.ThreadLeakControl$3.evaluate(ThreadLeakControl.java:460)
>         at com.carrotsearch.randomizedtesting.RandomizedRunner.runSingleTest(RandomizedRunner.java:880)
>         at com.carrotsearch.randomizedtesting.RandomizedRunner$5.evaluate(RandomizedRunner.java:781)
>         at com.carrotsearch.randomizedtesting.RandomizedRunner$6.evaluate(RandomizedRunner.java:816)
>         at com.carrotsearch.randomizedtesting.RandomizedRunner$7.evaluate(RandomizedRunner.java:827)
>         at org.apache.lucene.util.AbstractBeforeAfterRule$1.evaluate(AbstractBeforeAfterRule.java:45)
>         at com.carrotsearch.randomizedtesting.rules.StatementAdapter.evaluate(StatementAdapter.java:36)
>         at org.apache.lucene.util.TestRuleStoreClassName$1.evaluate(TestRuleStoreClassName.java:41)
>         at com.carrotsearch.randomizedtesting.rules.NoShadowingOrOverridesOnMethodsRule$1.evaluate(NoShadowingOrOverridesOnMethodsRule.java:40)
>         at com.carrotsearch.randomizedtesting.rules.NoShadowingOrOverridesOnMethodsRule$1.evaluate(NoShadowingOrOverridesOnMethodsRule.java:40)
>         at com.carrotsearch.randomizedtesting.rules.StatementAdapter.evaluate(StatementAdapter.java:36)
>         at com.carrotsearch.randomizedtesting.rules.StatementAdapter.evaluate(StatementAdapter.java:36)
>         at com.carrotsearch.randomizedtesting.rules.StatementAdapter.evaluate(StatementAdapter.java:36)
>         at org.apache.lucene.util.TestRuleAssertionsRequired$1.evaluate(TestRuleAssertionsRequired.java:53)
>         at org.apache.lucene.util.TestRuleMarkFailure$1.evaluate(TestRuleMarkFailure.java:47)
>         at org.apache.lucene.util.TestRuleIgnoreAfterMaxFailures$1.evaluate(TestRuleIgnoreAfterMaxFailures.java:64)
>         at org.apache.lucene.util.TestRuleIgnoreTestSuites$1.evaluate(TestRuleIgnoreTestSuites.java:54)
>         at com.carrotsearch.randomizedtesting.rules.StatementAdapter.evaluate(StatementAdapter.java:36)
>         at com.carrotsearch.randomizedtesting.ThreadLeakControl$StatementRunner.run(ThreadLeakControl.java:367)
>         at java.lang.Thread.run(Thread.java:745)
>
>
> FAILED:  org.apache.lucene.search.TestLatLonPointQueries.testRandomMedium
>
> Error Message:
> invalid latitude NaN; must be between -90.0 and 90.0
>
> Stack Trace:
> java.lang.IllegalArgumentException: invalid latitude NaN; must be between -90.0 and 90.0
>         at __randomizedtesting.SeedInfo.seed([D965017FF6735DB4:64BB36D7B7163ED2]:0)
>         at org.apache.lucene.spatial.util.GeoUtils.checkLatitude(GeoUtils.java:66)
>         at org.apache.lucene.document.LatLonPoint.encodeLatitude(LatLonPoint.java:140)
>         at org.apache.lucene.search.TestLatLonPointQueries.quantizeLat(TestLatLonPointQueries.java:47)
>         at org.apache.lucene.spatial.util.BaseGeoPointTestCase.verify(BaseGeoPointTestCase.java:730)
>         at org.apache.lucene.spatial.util.BaseGeoPointTestCase.doTestRandom(BaseGeoPointTestCase.java:665)
>         at org.apache.lucene.spatial.util.BaseGeoPointTestCase.testRandomMedium(BaseGeoPointTestCase.java:587)
>         at sun.reflect.NativeMethodAccessorImpl.invoke0(Native Method)
>         at sun.reflect.NativeMethodAccessorImpl.invoke(NativeMethodAccessorImpl.java:62)
>         at sun.reflect.DelegatingMethodAccessorImpl.invoke(DelegatingMethodAccessorImpl.java:43)
>         at java.lang.reflect.Method.invoke(Method.java:498)
>         at com.carrotsearch.randomizedtesting.RandomizedRunner.invoke(RandomizedRunner.java:1764)
>         at com.carrotsearch.randomizedtesting.RandomizedRunner$8.evaluate(RandomizedRunner.java:871)
>         at com.carrotsearch.randomizedtesting.RandomizedRunner$9.evaluate(RandomizedRunner.java:907)
>         at com.carrotsearch.randomizedtesting.RandomizedRunner$10.evaluate(RandomizedRunner.java:921)
>         at org.apache.lucene.util.TestRuleSetupTeardownChained$1.evaluate(TestRuleSetupTeardownChained.java:49)
>         at org.apache.lucene.util.AbstractBeforeAfterRule$1.evaluate(AbstractBeforeAfterRule.java:45)
>         at org.apache.lucene.util.TestRuleThreadAndTestName$1.evaluate(TestRuleThreadAndTestName.java:48)
>         at org.apache.lucene.util.TestRuleIgnoreAfterMaxFailures$1.evaluate(TestRuleIgnoreAfterMaxFailures.java:64)
>         at org.apache.lucene.util.TestRuleMarkFailure$1.evaluate(TestRuleMarkFailure.java:47)
>         at com.carrotsearch.randomizedtesting.rules.StatementAdapter.evaluate(StatementAdapter.java:36)
>         at com.carrotsearch.randomizedtesting.ThreadLeakControl$StatementRunner.run(ThreadLeakControl.java:367)
>         at com.carrotsearch.randomizedtesting.ThreadLeakControl.forkTimeoutingTask(ThreadLeakControl.java:809)
>         at com.carrotsearch.randomizedtesting.ThreadLeakControl$3.evaluate(ThreadLeakControl.java:460)
>         at com.carrotsearch.randomizedtesting.RandomizedRunner.runSingleTest(RandomizedRunner.java:880)
>         at com.carrotsearch.randomizedtesting.RandomizedRunner$5.evaluate(RandomizedRunner.java:781)
>         at com.carrotsearch.randomizedtesting.RandomizedRunner$6.evaluate(RandomizedRunner.java:816)
>         at com.carrotsearch.randomizedtesting.RandomizedRunner$7.evaluate(RandomizedRunner.java:827)
>         at org.apache.lucene.util.AbstractBeforeAfterRule$1.evaluate(AbstractBeforeAfterRule.java:45)
>         at com.carrotsearch.randomizedtesting.rules.StatementAdapter.evaluate(StatementAdapter.java:36)
>         at org.apache.lucene.util.TestRuleStoreClassName$1.evaluate(TestRuleStoreClassName.java:41)
>         at com.carrotsearch.randomizedtesting.rules.NoShadowingOrOverridesOnMethodsRule$1.evaluate(NoShadowingOrOverridesOnMethodsRule.java:40)
>         at com.carrotsearch.randomizedtesting.rules.NoShadowingOrOverridesOnMethodsRule$1.evaluate(NoShadowingOrOverridesOnMethodsRule.java:40)
>         at com.carrotsearch.randomizedtesting.rules.StatementAdapter.evaluate(StatementAdapter.java:36)
>         at com.carrotsearch.randomizedtesting.rules.StatementAdapter.evaluate(StatementAdapter.java:36)
>         at com.carrotsearch.randomizedtesting.rules.StatementAdapter.evaluate(StatementAdapter.java:36)
>         at org.apache.lucene.util.TestRuleAssertionsRequired$1.evaluate(TestRuleAssertionsRequired.java:53)
>         at org.apache.lucene.util.TestRuleMarkFailure$1.evaluate(TestRuleMarkFailure.java:47)
>         at org.apache.lucene.util.TestRuleIgnoreAfterMaxFailures$1.evaluate(TestRuleIgnoreAfterMaxFailures.java:64)
>         at org.apache.lucene.util.TestRuleIgnoreTestSuites$1.evaluate(TestRuleIgnoreTestSuites.java:54)
>         at com.carrotsearch.randomizedtesting.rules.StatementAdapter.evaluate(StatementAdapter.java:36)
>         at com.carrotsearch.randomizedtesting.ThreadLeakControl$StatementRunner.run(ThreadLeakControl.java:367)
>         at java.lang.Thread.run(Thread.java:745)
>
>
>
>
> Build Log:
> [...truncated 8446 lines...]
>    [junit4] Suite: org.apache.lucene.search.TestLatLonPointQueries
>    [junit4]   2> NOTE: reproduce with: ant test  -Dtestcase=TestLatLonPointQueries
-Dtests.method=testRandomTiny -Dtests.seed=D965017FF6735DB4 -Dtests.slow=true -Dtests.locale=th-TH-u-nu-thai-x-lvariant-TH
-Dtests.timezone=America/Bahia -Dtests.asserts=true -Dtests.file.encoding=UTF-8
>    [junit4] ERROR   0.01s J0 | TestLatLonPointQueries.testRandomTiny <<<
>    [junit4]    > Throwable #1: java.lang.IllegalArgumentException: invalid latitude
NaN; must be between -90.0 and 90.0
>    [junit4]    >        at __randomizedtesting.SeedInfo.seed([D965017FF6735DB4:9022DF39A8526518]:0)
>    [junit4]    >        at org.apache.lucene.spatial.util.GeoUtils.checkLatitude(GeoUtils.java:66)
>    [junit4]    >        at org.apache.lucene.document.LatLonPoint.encodeLatitude(LatLonPoint.java:140)
>    [junit4]    >        at org.apache.lucene.search.TestLatLonPointQueries.quantizeLat(TestLatLonPointQueries.java:47)
>    [junit4]    >        at org.apache.lucene.spatial.util.BaseGeoPointTestCase.verify(BaseGeoPointTestCase.java:730)
>    [junit4]    >        at org.apache.lucene.spatial.util.BaseGeoPointTestCase.doTestRandom(BaseGeoPointTestCase.java:665)
>    [junit4]    >        at org.apache.lucene.spatial.util.BaseGeoPointTestCase.testRandomTiny(BaseGeoPointTestCase.java:583)
>    [junit4]    >        at java.lang.Thread.run(Thread.java:745)
>    [junit4] IGNOR/A 0.00s J0 | TestLatLonPointQueries.testRandomDistanceHuge
>    [junit4]    > Assumption #1: 'nightly' test group is disabled (@Nightly())
>    [junit4] IGNOR/A 0.00s J0 | TestLatLonPointQueries.testRandomBig
>    [junit4]    > Assumption #1: 'nightly' test group is disabled (@Nightly())
>    [junit4]   2> NOTE: reproduce with: ant test  -Dtestcase=TestLatLonPointQueries
-Dtests.method=testAllLatEqual -Dtests.seed=D965017FF6735DB4 -Dtests.slow=true -Dtests.locale=th-TH-u-nu-thai-x-lvariant-TH
-Dtests.timezone=America/Bahia -Dtests.asserts=true -Dtests.file.encoding=UTF-8
>    [junit4] ERROR   0.01s J0 | TestLatLonPointQueries.testAllLatEqual <<<
>    [junit4]    > Throwable #1: java.lang.IllegalArgumentException: invalid latitude
NaN; must be between -90.0 and 90.0
>    [junit4]    >        at __randomizedtesting.SeedInfo.seed([D965017FF6735DB4:64F057F1FFBE7FB9]:0)
>    [junit4]    >        at org.apache.lucene.spatial.util.GeoUtils.checkLatitude(GeoUtils.java:66)
>    [junit4]    >        at org.apache.lucene.document.LatLonPoint.encodeLatitude(LatLonPoint.java:140)
>    [junit4]    >        at org.apache.lucene.search.TestLatLonPointQueries.quantizeLat(TestLatLonPointQueries.java:47)
>    [junit4]    >        at org.apache.lucene.spatial.util.BaseGeoPointTestCase.verify(BaseGeoPointTestCase.java:730)
>    [junit4]    >        at org.apache.lucene.spatial.util.BaseGeoPointTestCase.testAllLatEqual(BaseGeoPointTestCase.java:419)
>    [junit4]    >        at java.lang.Thread.run(Thread.java:745)
>    [junit4]   2> NOTE: reproduce with: ant test  -Dtestcase=TestLatLonPointQueries
-Dtests.method=testAllLonEqual -Dtests.seed=D965017FF6735DB4 -Dtests.slow=true -Dtests.locale=th-TH-u-nu-thai-x-lvariant-TH
-Dtests.timezone=America/Bahia -Dtests.asserts=true -Dtests.file.encoding=UTF-8
>    [junit4] ERROR   0.01s J0 | TestLatLonPointQueries.testAllLonEqual <<<
>    [junit4]    > Throwable #1: java.lang.IllegalArgumentException: invalid latitude
NaN; must be between -90.0 and 90.0
>    [junit4]    >        at __randomizedtesting.SeedInfo.seed([D965017FF6735DB4:486FF08206D91DA0]:0)
>    [junit4]    >        at org.apache.lucene.spatial.util.GeoUtils.checkLatitude(GeoUtils.java:66)
>    [junit4]    >        at org.apache.lucene.document.LatLonPoint.encodeLatitude(LatLonPoint.java:140)
>    [junit4]    >        at org.apache.lucene.search.TestLatLonPointQueries.quantizeLat(TestLatLonPointQueries.java:47)
>    [junit4]    >        at org.apache.lucene.spatial.util.BaseGeoPointTestCase.verify(BaseGeoPointTestCase.java:730)
>    [junit4]    >        at org.apache.lucene.spatial.util.BaseGeoPointTestCase.testAllLonEqual(BaseGeoPointTestCase.java:468)
>    [junit4]    >        at java.lang.Thread.run(Thread.java:745)
>    [junit4]   2> NOTE: reproduce with: ant test  -Dtestcase=TestLatLonPointQueries
-Dtests.method=testRandomMedium -Dtests.seed=D965017FF6735DB4 -Dtests.slow=true -Dtests.locale=th-TH-u-nu-thai-x-lvariant-TH
-Dtests.timezone=America/Bahia -Dtests.asserts=true -Dtests.file.encoding=UTF-8
>    [junit4] ERROR   0.01s J0 | TestLatLonPointQueries.testRandomMedium <<<
>    [junit4]    > Throwable #1: java.lang.IllegalArgumentException: invalid latitude
NaN; must be between -90.0 and 90.0
>    [junit4]    >        at __randomizedtesting.SeedInfo.seed([D965017FF6735DB4:64BB36D7B7163ED2]:0)
>    [junit4]    >        at org.apache.lucene.spatial.util.GeoUtils.checkLatitude(GeoUtils.java:66)
>    [junit4]    >        at org.apache.lucene.document.LatLonPoint.encodeLatitude(LatLonPoint.java:140)
>    [junit4]    >        at org.apache.lucene.search.TestLatLonPointQueries.quantizeLat(TestLatLonPointQueries.java:47)
>    [junit4]    >        at org.apache.lucene.spatial.util.BaseGeoPointTestCase.verify(BaseGeoPointTestCase.java:730)
>    [junit4]    >        at org.apache.lucene.spatial.util.BaseGeoPointTestCase.doTestRandom(BaseGeoPointTestCase.java:665)
>    [junit4]    >        at org.apache.lucene.spatial.util.BaseGeoPointTestCase.testRandomMedium(BaseGeoPointTestCase.java:587)
>    [junit4]    >        at java.lang.Thread.run(Thread.java:745)
>    [junit4]   2> NOTE: leaving temporary files on disk at: C:\Users\jenkins\workspace\Lucene-Solr-6.x-Windows\lucene\build\sandbox\test\J0\temp\lucene.search.TestLatLonPointQueries_D965017FF6735DB4-001
>    [junit4]   2> NOTE: test params are: codec=Asserting(Lucene60): {string=FST50,
id=FST50}, docValues:{field=DocValuesFormat(name=Direct), id=DocValuesFormat(name=Lucene54),
point=DocValuesFormat(name=Lucene54)}, maxPointsInLeafNode=1824, maxMBSortInHeap=4.8492739867067005,
sim=ClassicSimilarity, locale=th-TH-u-nu-thai-x-lvariant-TH, timezone=America/Bahia
>    [junit4]   2> NOTE: Windows 10 10.0 x86/Oracle Corporation 1.8.0_72 (32-bit)/cpus=3,threads=1,free=66054136,total=184549376
>    [junit4]   2> NOTE: All tests run in this JVM: [TestFieldCacheTermsFilter, TestDocValuesNumbersQuery,
TestLatLonPointDistanceSort, TestInetAddressPoint, TestDocValuesRangeQuery, TestDocValuesTermsQuery,
TestLatLonPointQueries]
>    [junit4] Completed [15/15 (1!)] on J0 in 4.06s, 42 tests, 4 errors, 2 skipped <<<
FAILURES!
>
> [...truncated 13 lines...]
> BUILD FAILED
> C:\Users\jenkins\workspace\Lucene-Solr-6.x-Windows\build.xml:740: The following error
occurred while executing this line:
> C:\Users\jenkins\workspace\Lucene-Solr-6.x-Windows\build.xml:684: The following error
occurred while executing this line:
> C:\Users\jenkins\workspace\Lucene-Solr-6.x-Windows\build.xml:59: The following error
occurred while executing this line:
> C:\Users\jenkins\workspace\Lucene-Solr-6.x-Windows\lucene\build.xml:476: The following
error occurred while executing this line:
> C:\Users\jenkins\workspace\Lucene-Solr-6.x-Windows\lucene\common-build.xml:2187: The
following error occurred while executing this line:
> C:\Users\jenkins\workspace\Lucene-Solr-6.x-Windows\lucene\module-build.xml:58: The following
error occurred while executing this line:
> C:\Users\jenkins\workspace\Lucene-Solr-6.x-Windows\lucene\common-build.xml:1457: The
following error occurred while executing this line:
> C:\Users\jenkins\workspace\Lucene-Solr-6.x-Windows\lucene\common-build.xml:1014: There
were test failures: 15 suites, 118 tests, 4 errors, 3 ignored (3 assumptions) [seed: D965017FF6735DB4]
>
> Total time: 22 minutes 10 seconds
> Build step 'Invoke Ant' marked build as failure
> Archiving artifacts
> [WARNINGS] Skipping publisher since build result is FAILURE
> Recording test results
> Email was triggered for: Failure - Any
> Sending email for trigger: Failure - Any
>

---------------------------------------------------------------------
To unsubscribe, e-mail: dev-unsubscribe@lucene.apache.org
For additional commands, e-mail: dev-help@lucene.apache.org


Mime
View raw message