lucene-dev mailing list archives

Site index · List index
Message view « Date » · « Thread »
Top « Date » · « Thread »
From Policeman Jenkins Server <jenk...@thetaphi.de>
Subject [JENKINS] Lucene-Solr-6.x-MacOSX (64bit/jdk1.8.0) - Build # 48 - Failure!
Date Fri, 01 Apr 2016 13:58:14 GMT
Build: http://jenkins.thetaphi.de/job/Lucene-Solr-6.x-MacOSX/48/
Java: 64bit/jdk1.8.0 -XX:+UseCompressedOops -XX:+UseParallelGC

1 tests failed.
FAILED:  org.apache.solr.util.TestSolrCLIRunExample.testInteractiveSolrCloudExample

Error Message:
Expected 10 to be found in the testCloudExamplePrompt collection but only found 8

Stack Trace:
java.lang.AssertionError: Expected 10 to be found in the testCloudExamplePrompt collection but only found 8
	at __randomizedtesting.SeedInfo.seed([2022787A2936FC9:D973C74D95E6AAAF]:0)
	at org.junit.Assert.fail(Assert.java:93)
	at org.apache.solr.util.TestSolrCLIRunExample.testInteractiveSolrCloudExample(TestSolrCLIRunExample.java:457)
	at sun.reflect.NativeMethodAccessorImpl.invoke0(Native Method)
	at sun.reflect.NativeMethodAccessorImpl.invoke(NativeMethodAccessorImpl.java:62)
	at sun.reflect.DelegatingMethodAccessorImpl.invoke(DelegatingMethodAccessorImpl.java:43)
	at java.lang.reflect.Method.invoke(Method.java:498)
	at com.carrotsearch.randomizedtesting.RandomizedRunner.invoke(RandomizedRunner.java:1764)
	at com.carrotsearch.randomizedtesting.RandomizedRunner$8.evaluate(RandomizedRunner.java:871)
	at com.carrotsearch.randomizedtesting.RandomizedRunner$9.evaluate(RandomizedRunner.java:907)
	at com.carrotsearch.randomizedtesting.RandomizedRunner$10.evaluate(RandomizedRunner.java:921)
	at com.carrotsearch.randomizedtesting.rules.SystemPropertiesRestoreRule$1.evaluate(SystemPropertiesRestoreRule.java:57)
	at org.apache.lucene.util.TestRuleSetupTeardownChained$1.evaluate(TestRuleSetupTeardownChained.java:49)
	at org.apache.lucene.util.AbstractBeforeAfterRule$1.evaluate(AbstractBeforeAfterRule.java:45)
	at org.apache.lucene.util.TestRuleThreadAndTestName$1.evaluate(TestRuleThreadAndTestName.java:48)
	at org.apache.lucene.util.TestRuleIgnoreAfterMaxFailures$1.evaluate(TestRuleIgnoreAfterMaxFailures.java:64)
	at org.apache.lucene.util.TestRuleMarkFailure$1.evaluate(TestRuleMarkFailure.java:47)
	at com.carrotsearch.randomizedtesting.rules.StatementAdapter.evaluate(StatementAdapter.java:36)
	at com.carrotsearch.randomizedtesting.ThreadLeakControl$StatementRunner.run(ThreadLeakControl.java:367)
	at com.carrotsearch.randomizedtesting.ThreadLeakControl.forkTimeoutingTask(ThreadLeakControl.java:809)
	at com.carrotsearch.randomizedtesting.ThreadLeakControl$3.evaluate(ThreadLeakControl.java:460)
	at com.carrotsearch.randomizedtesting.RandomizedRunner.runSingleTest(RandomizedRunner.java:880)
	at com.carrotsearch.randomizedtesting.RandomizedRunner$5.evaluate(RandomizedRunner.java:781)
	at com.carrotsearch.randomizedtesting.RandomizedRunner$6.evaluate(RandomizedRunner.java:816)
	at com.carrotsearch.randomizedtesting.RandomizedRunner$7.evaluate(RandomizedRunner.java:827)
	at com.carrotsearch.randomizedtesting.rules.StatementAdapter.evaluate(StatementAdapter.java:36)
	at com.carrotsearch.randomizedtesting.rules.SystemPropertiesRestoreRule$1.evaluate(SystemPropertiesRestoreRule.java:57)
	at org.apache.lucene.util.AbstractBeforeAfterRule$1.evaluate(AbstractBeforeAfterRule.java:45)
	at com.carrotsearch.randomizedtesting.rules.StatementAdapter.evaluate(StatementAdapter.java:36)
	at org.apache.lucene.util.TestRuleStoreClassName$1.evaluate(TestRuleStoreClassName.java:41)
	at com.carrotsearch.randomizedtesting.rules.NoShadowingOrOverridesOnMethodsRule$1.evaluate(NoShadowingOrOverridesOnMethodsRule.java:40)
	at com.carrotsearch.randomizedtesting.rules.NoShadowingOrOverridesOnMethodsRule$1.evaluate(NoShadowingOrOverridesOnMethodsRule.java:40)
	at com.carrotsearch.randomizedtesting.rules.StatementAdapter.evaluate(StatementAdapter.java:36)
	at com.carrotsearch.randomizedtesting.rules.StatementAdapter.evaluate(StatementAdapter.java:36)
	at com.carrotsearch.randomizedtesting.rules.StatementAdapter.evaluate(StatementAdapter.java:36)
	at org.apache.lucene.util.TestRuleAssertionsRequired$1.evaluate(TestRuleAssertionsRequired.java:53)
	at org.apache.lucene.util.TestRuleMarkFailure$1.evaluate(TestRuleMarkFailure.java:47)
	at org.apache.lucene.util.TestRuleIgnoreAfterMaxFailures$1.evaluate(TestRuleIgnoreAfterMaxFailures.java:64)
	at org.apache.lucene.util.TestRuleIgnoreTestSuites$1.evaluate(TestRuleIgnoreTestSuites.java:54)
	at com.carrotsearch.randomizedtesting.rules.StatementAdapter.evaluate(StatementAdapter.java:36)
	at com.carrotsearch.randomizedtesting.ThreadLeakControl$StatementRunner.run(ThreadLeakControl.java:367)
	at java.lang.Thread.run(Thread.java:745)




Build Log:
[...truncated 12391 lines...]
   [junit4] Suite: org.apache.solr.util.TestSolrCLIRunExample
   [junit4]   2> Creating dataDir: /Users/jenkins/workspace/Lucene-Solr-6.x-MacOSX/solr/build/solr-core/test/J0/temp/solr.util.TestSolrCLIRunExample_2022787A2936FC9-001/init-core-data-001
   [junit4]   2> 3305035 INFO  (TEST-TestSolrCLIRunExample.testInteractiveSolrCloudExample-seed#[2022787A2936FC9]) [    ] o.a.s.SolrTestCaseJ4 ###Starting testInteractiveSolrCloudExample
   [junit4]   2> 3305318 INFO  (TEST-TestSolrCLIRunExample.testInteractiveSolrCloudExample-seed#[2022787A2936FC9]) [    ] o.a.s.c.ZkTestServer STARTING ZK TEST SERVER
   [junit4]   2> 3305319 INFO  (Thread-7489) [    ] o.a.s.c.ZkTestServer client port:0.0.0.0/0.0.0.0:0
   [junit4]   2> 3305319 INFO  (Thread-7489) [    ] o.a.s.c.ZkTestServer Starting server
   [junit4]   2> 3305425 INFO  (TEST-TestSolrCLIRunExample.testInteractiveSolrCloudExample-seed#[2022787A2936FC9]) [    ] o.a.s.c.ZkTestServer start zk server on port:58316
   [junit4]   2> 3305425 INFO  (TEST-TestSolrCLIRunExample.testInteractiveSolrCloudExample-seed#[2022787A2936FC9]) [    ] o.a.s.c.c.SolrZkClient Using default ZkCredentialsProvider
   [junit4]   2> 3305426 INFO  (TEST-TestSolrCLIRunExample.testInteractiveSolrCloudExample-seed#[2022787A2936FC9]) [    ] o.a.s.c.c.ConnectionManager Waiting for client to connect to ZooKeeper
   [junit4]   2> 3305434 INFO  (zkCallback-3536-thread-1) [    ] o.a.s.c.c.ConnectionManager Watcher org.apache.solr.common.cloud.ConnectionManager@4e26f320 name:ZooKeeperConnection Watcher:127.0.0.1:58316 got event WatchedEvent state:SyncConnected type:None path:null path:null type:None
   [junit4]   2> 3305434 INFO  (TEST-TestSolrCLIRunExample.testInteractiveSolrCloudExample-seed#[2022787A2936FC9]) [    ] o.a.s.c.c.ConnectionManager Client is connected to ZooKeeper
   [junit4]   2> 3305435 INFO  (TEST-TestSolrCLIRunExample.testInteractiveSolrCloudExample-seed#[2022787A2936FC9]) [    ] o.a.s.c.c.SolrZkClient Using default ZkACLProvider
   [junit4]   2> 3305435 INFO  (TEST-TestSolrCLIRunExample.testInteractiveSolrCloudExample-seed#[2022787A2936FC9]) [    ] o.a.s.c.c.SolrZkClient makePath: /solr/solr.xml
   [junit4]   2> 3305441 INFO  (jetty-launcher-3535-thread-1) [    ] o.e.j.s.Server jetty-9.3.8.v20160314
   [junit4]   2> 3305443 INFO  (jetty-launcher-3535-thread-1) [    ] o.e.j.s.h.ContextHandler Started o.e.j.s.ServletContextHandler@206cd8b9{/solr,null,AVAILABLE}
   [junit4]   2> 3305444 INFO  (jetty-launcher-3535-thread-1) [    ] o.e.j.s.ServerConnector Started ServerConnector@33dd4782{HTTP/1.1,[http/1.1]}{127.0.0.1:58309}
   [junit4]   2> 3305444 INFO  (jetty-launcher-3535-thread-1) [    ] o.e.j.s.Server Started @3311546ms
   [junit4]   2> 3305444 INFO  (jetty-launcher-3535-thread-1) [    ] o.a.s.c.s.e.JettySolrRunner Jetty properties: {hostContext=/solr, hostPort=58309}
   [junit4]   2> 3305445 INFO  (jetty-launcher-3535-thread-1) [    ] o.a.s.s.SolrDispatchFilter SolrDispatchFilter.init(): sun.misc.Launcher$AppClassLoader@4554617c
   [junit4]   2> 3305445 INFO  (jetty-launcher-3535-thread-1) [    ] o.a.s.c.SolrResourceLoader new SolrResourceLoader for directory: '/Users/jenkins/workspace/Lucene-Solr-6.x-MacOSX/solr/build/solr-core/test/J0/temp/solr.util.TestSolrCLIRunExample_2022787A2936FC9-001/tempDir-002/node1'
   [junit4]   2> 3305445 INFO  (jetty-launcher-3535-thread-1) [    ] o.a.s.c.SolrResourceLoader JNDI not configured for solr (NoInitialContextEx)
   [junit4]   2> 3305445 INFO  (jetty-launcher-3535-thread-1) [    ] o.a.s.c.SolrResourceLoader solr home defaulted to 'solr/' (could not find system property or JNDI)
   [junit4]   2> 3305445 INFO  (jetty-launcher-3535-thread-1) [    ] o.a.s.c.c.SolrZkClient Using default ZkCredentialsProvider
   [junit4]   2> 3305446 INFO  (jetty-launcher-3535-thread-1) [    ] o.a.s.c.c.ConnectionManager Waiting for client to connect to ZooKeeper
   [junit4]   2> 3305447 INFO  (zkCallback-3537-thread-1) [    ] o.a.s.c.c.ConnectionManager Watcher org.apache.solr.common.cloud.ConnectionManager@18476685 name:ZooKeeperConnection Watcher:127.0.0.1:58316/solr got event WatchedEvent state:SyncConnected type:None path:null path:null type:None
   [junit4]   2> 3305447 INFO  (jetty-launcher-3535-thread-1) [    ] o.a.s.c.c.ConnectionManager Client is connected to ZooKeeper
   [junit4]   2> 3305448 INFO  (jetty-launcher-3535-thread-1) [    ] o.a.s.c.c.SolrZkClient Using default ZkACLProvider
   [junit4]   2> 3305448 INFO  (jetty-launcher-3535-thread-1) [    ] o.a.s.s.SolrDispatchFilter solr.xml found in ZooKeeper. Loading...
   [junit4]   2> 3305462 INFO  (jetty-launcher-3535-thread-1) [    ] o.a.s.c.CorePropertiesLocator Config-defined core root directory: /Users/jenkins/workspace/Lucene-Solr-6.x-MacOSX/solr/build/solr-core/test/J0/temp/solr.util.TestSolrCLIRunExample_2022787A2936FC9-001/tempDir-002/node1
   [junit4]   2> 3305462 INFO  (jetty-launcher-3535-thread-1) [    ] o.a.s.c.CoreContainer New CoreContainer 1992651916
   [junit4]   2> 3305462 INFO  (jetty-launcher-3535-thread-1) [    ] o.a.s.c.CoreContainer Loading cores into CoreContainer [instanceDir=/Users/jenkins/workspace/Lucene-Solr-6.x-MacOSX/solr/build/solr-core/test/J0/temp/solr.util.TestSolrCLIRunExample_2022787A2936FC9-001/tempDir-002/node1]
   [junit4]   2> 3305462 WARN  (jetty-launcher-3535-thread-1) [    ] o.a.s.c.CoreContainer Couldn't add files from /Users/jenkins/workspace/Lucene-Solr-6.x-MacOSX/solr/build/solr-core/test/J0/temp/solr.util.TestSolrCLIRunExample_2022787A2936FC9-001/tempDir-002/node1/lib to classpath: /Users/jenkins/workspace/Lucene-Solr-6.x-MacOSX/solr/build/solr-core/test/J0/temp/solr.util.TestSolrCLIRunExample_2022787A2936FC9-001/tempDir-002/node1/lib
   [junit4]   2> 3305462 INFO  (jetty-launcher-3535-thread-1) [    ] o.a.s.h.c.HttpShardHandlerFactory created with socketTimeout : 600000,connTimeout : 60000,maxConnectionsPerHost : 20,maxConnections : 10000,corePoolSize : 0,maximumPoolSize : 2147483647,maxThreadIdleTime : 5,sizeOfQueue : -1,fairnessPolicy : false,useRetries : false,
   [junit4]   2> 3305465 INFO  (jetty-launcher-3535-thread-1) [    ] o.a.s.u.UpdateShardHandler Creating UpdateShardHandler HTTP client with params: socketTimeout=600000&connTimeout=60000&retry=true
   [junit4]   2> 3305465 INFO  (jetty-launcher-3535-thread-1) [    ] o.a.s.l.LogWatcher SLF4J impl is org.slf4j.impl.Log4jLoggerFactory
   [junit4]   2> 3305465 INFO  (jetty-launcher-3535-thread-1) [    ] o.a.s.l.LogWatcher Registering Log Listener [Log4j (org.slf4j.impl.Log4jLoggerFactory)]
   [junit4]   2> 3305465 INFO  (jetty-launcher-3535-thread-1) [    ] o.a.s.c.ZkContainer Zookeeper client=127.0.0.1:58316/solr
   [junit4]   2> 3305465 INFO  (jetty-launcher-3535-thread-1) [    ] o.a.s.c.ZkController zkHost includes chroot
   [junit4]   2> 3305465 INFO  (jetty-launcher-3535-thread-1) [    ] o.a.s.c.c.SolrZkClient Using default ZkCredentialsProvider
   [junit4]   2> 3305466 INFO  (jetty-launcher-3535-thread-1) [    ] o.a.s.c.c.ConnectionManager Waiting for client to connect to ZooKeeper
   [junit4]   2> 3305467 INFO  (zkCallback-3540-thread-1) [    ] o.a.s.c.c.ConnectionManager Watcher org.apache.solr.common.cloud.ConnectionManager@1b1eed75 name:ZooKeeperConnection Watcher:127.0.0.1:58316 got event WatchedEvent state:SyncConnected type:None path:null path:null type:None
   [junit4]   2> 3305467 INFO  (jetty-launcher-3535-thread-1) [    ] o.a.s.c.c.ConnectionManager Client is connected to ZooKeeper
   [junit4]   2> 3305467 INFO  (jetty-launcher-3535-thread-1) [    ] o.a.s.c.c.SolrZkClient Using default ZkACLProvider
   [junit4]   2> 3305469 INFO  (jetty-launcher-3535-thread-1) [n:localhost:58309_solr    ] o.a.s.c.c.ConnectionManager Waiting for client to connect to ZooKeeper
   [junit4]   2> 3305470 INFO  (zkCallback-3541-thread-1-processing-n:localhost:58309_solr) [n:localhost:58309_solr    ] o.a.s.c.c.ConnectionManager Watcher org.apache.solr.common.cloud.ConnectionManager@6aca7ca2 name:ZooKeeperConnection Watcher:127.0.0.1:58316/solr got event WatchedEvent state:SyncConnected type:None path:null path:null type:None
   [junit4]   2> 3305471 INFO  (jetty-launcher-3535-thread-1) [n:localhost:58309_solr    ] o.a.s.c.c.ConnectionManager Client is connected to ZooKeeper
   [junit4]   2> 3305472 INFO  (jetty-launcher-3535-thread-1) [n:localhost:58309_solr    ] o.a.s.c.c.SolrZkClient makePath: /overseer/queue
   [junit4]   2> 3305475 INFO  (jetty-launcher-3535-thread-1) [n:localhost:58309_solr    ] o.a.s.c.c.SolrZkClient makePath: /overseer/collection-queue-work
   [junit4]   2> 3305480 INFO  (jetty-launcher-3535-thread-1) [n:localhost:58309_solr    ] o.a.s.c.c.SolrZkClient makePath: /overseer/collection-map-running
   [junit4]   2> 3305484 INFO  (jetty-launcher-3535-thread-1) [n:localhost:58309_solr    ] o.a.s.c.c.SolrZkClient makePath: /overseer/collection-map-completed
   [junit4]   2> 3305487 INFO  (jetty-launcher-3535-thread-1) [n:localhost:58309_solr    ] o.a.s.c.c.SolrZkClient makePath: /overseer/collection-map-failure
   [junit4]   2> 3305490 INFO  (jetty-launcher-3535-thread-1) [n:localhost:58309_solr    ] o.a.s.c.c.SolrZkClient makePath: /live_nodes
   [junit4]   2> 3305492 INFO  (jetty-launcher-3535-thread-1) [n:localhost:58309_solr    ] o.a.s.c.c.SolrZkClient makePath: /collections
   [junit4]   2> 3305494 INFO  (jetty-launcher-3535-thread-1) [n:localhost:58309_solr    ] o.a.s.c.c.SolrZkClient makePath: /aliases.json
   [junit4]   2> 3305496 INFO  (jetty-launcher-3535-thread-1) [n:localhost:58309_solr    ] o.a.s.c.c.SolrZkClient makePath: /clusterstate.json
   [junit4]   2> 3305498 INFO  (jetty-launcher-3535-thread-1) [n:localhost:58309_solr    ] o.a.s.c.c.SolrZkClient makePath: /security.json
   [junit4]   2> 3305500 INFO  (jetty-launcher-3535-thread-1) [n:localhost:58309_solr    ] o.a.s.c.c.ZkStateReader Updating cluster state from ZooKeeper... 
   [junit4]   2> 3305502 INFO  (jetty-launcher-3535-thread-1) [n:localhost:58309_solr    ] o.a.s.c.c.ZkStateReader Updated live nodes from ZooKeeper... (0) -> (0)
   [junit4]   2> 3305505 INFO  (jetty-launcher-3535-thread-1) [n:localhost:58309_solr    ] o.a.s.c.c.SolrZkClient makePath: /overseer_elect
   [junit4]   2> 3305507 INFO  (jetty-launcher-3535-thread-1) [n:localhost:58309_solr    ] o.a.s.c.c.SolrZkClient makePath: /overseer_elect/election
   [junit4]   2> 3305509 INFO  (jetty-launcher-3535-thread-1) [n:localhost:58309_solr    ] o.a.s.c.Overseer Overseer (id=null) closing
   [junit4]   2> 3305510 INFO  (jetty-launcher-3535-thread-1) [n:localhost:58309_solr    ] o.a.s.c.LeaderElector Joined leadership election with path: /overseer_elect/election/95651039852036099-localhost:58309_solr-n_0000000000
   [junit4]   2> 3305511 INFO  (jetty-launcher-3535-thread-1) [n:localhost:58309_solr    ] o.a.s.c.OverseerElectionContext I am going to be the leader localhost:58309_solr
   [junit4]   2> 3305511 INFO  (jetty-launcher-3535-thread-1) [n:localhost:58309_solr    ] o.a.s.c.c.SolrZkClient makePath: /overseer_elect/leader
   [junit4]   2> 3305513 INFO  (jetty-launcher-3535-thread-1) [n:localhost:58309_solr    ] o.a.s.c.Overseer Overseer (id=95651039852036099-localhost:58309_solr-n_0000000000) starting
   [junit4]   2> 3305516 INFO  (jetty-launcher-3535-thread-1) [n:localhost:58309_solr    ] o.a.s.c.c.SolrZkClient makePath: /overseer/queue-work
   [junit4]   2> 3305526 INFO  (jetty-launcher-3535-thread-1) [n:localhost:58309_solr    ] o.a.s.c.OverseerAutoReplicaFailoverThread Starting OverseerAutoReplicaFailoverThread autoReplicaFailoverWorkLoopDelay=10000 autoReplicaFailoverWaitAfterExpiration=30000 autoReplicaFailoverBadNodeExpiration=60000
   [junit4]   2> 3305526 INFO  (OverseerCollectionConfigSetProcessor-95651039852036099-localhost:58309_solr-n_0000000000) [n:localhost:58309_solr    ] o.a.s.c.OverseerTaskProcessor Process current queue of overseer operations
   [junit4]   2> 3305527 INFO  (OverseerStateUpdate-95651039852036099-localhost:58309_solr-n_0000000000) [n:localhost:58309_solr    ] o.a.s.c.Overseer Starting to work on the main queue
   [junit4]   2> 3305527 INFO  (jetty-launcher-3535-thread-1) [n:localhost:58309_solr    ] o.a.s.c.ZkController Register node as live in ZooKeeper:/live_nodes/localhost:58309_solr
   [junit4]   2> 3305528 INFO  (jetty-launcher-3535-thread-1) [n:localhost:58309_solr    ] o.a.s.c.c.SolrZkClient makePath: /live_nodes/localhost:58309_solr
   [junit4]   2> 3305532 INFO  (OverseerStateUpdate-95651039852036099-localhost:58309_solr-n_0000000000) [n:localhost:58309_solr    ] o.a.s.c.c.ZkStateReader Updated live nodes from ZooKeeper... (0) -> (1)
   [junit4]   2> 3305532 INFO  (zkCallback-3541-thread-1-processing-n:localhost:58309_solr) [n:localhost:58309_solr    ] o.a.s.c.c.ZkStateReader A live node change: [WatchedEvent state:SyncConnected type:NodeChildrenChanged path:/live_nodes], has occurred - updating... (live nodes size: [1])
   [junit4]   2> 3305532 INFO  (zkCallback-3541-thread-1-processing-n:localhost:58309_solr) [n:localhost:58309_solr    ] o.a.s.c.c.ZkStateReader Updated live nodes from ZooKeeper... (1) -> (1)
   [junit4]   2> 3305544 INFO  (jetty-launcher-3535-thread-1) [n:localhost:58309_solr    ] o.a.s.c.CoreContainer Security conf doesn't exist. Skipping setup for authorization module.
   [junit4]   2> 3305544 INFO  (jetty-launcher-3535-thread-1) [n:localhost:58309_solr    ] o.a.s.c.CoreContainer No authentication plugin used.
   [junit4]   2> 3305545 INFO  (jetty-launcher-3535-thread-1) [n:localhost:58309_solr    ] o.a.s.c.CorePropertiesLocator Looking for core definitions underneath /Users/jenkins/workspace/Lucene-Solr-6.x-MacOSX/solr/build/solr-core/test/J0/temp/solr.util.TestSolrCLIRunExample_2022787A2936FC9-001/tempDir-002/node1
   [junit4]   2> 3305548 INFO  (jetty-launcher-3535-thread-1) [n:localhost:58309_solr    ] o.a.s.c.CorePropertiesLocator Found 0 core definitions
   [junit4]   2> 3305549 INFO  (jetty-launcher-3535-thread-1) [n:localhost:58309_solr    ] o.a.s.s.SolrDispatchFilter user.dir=/Users/jenkins/workspace/Lucene-Solr-6.x-MacOSX/solr/build/solr-core/test/J0
   [junit4]   2> 3305549 INFO  (jetty-launcher-3535-thread-1) [n:localhost:58309_solr    ] o.a.s.s.SolrDispatchFilter SolrDispatchFilter.init() done
   [junit4]   2> 3305549 INFO  (TEST-TestSolrCLIRunExample.testInteractiveSolrCloudExample-seed#[2022787A2936FC9]) [    ] o.a.s.c.c.SolrZkClient Using default ZkCredentialsProvider
   [junit4]   2> 3305550 INFO  (TEST-TestSolrCLIRunExample.testInteractiveSolrCloudExample-seed#[2022787A2936FC9]) [    ] o.a.s.c.c.ConnectionManager Waiting for client to connect to ZooKeeper
   [junit4]   2> 3305552 INFO  (zkCallback-3542-thread-1) [    ] o.a.s.c.c.ConnectionManager Watcher org.apache.solr.common.cloud.ConnectionManager@8845316 name:ZooKeeperConnection Watcher:127.0.0.1:58316 got event WatchedEvent state:SyncConnected type:None path:null path:null type:None
   [junit4]   2> 3305552 INFO  (TEST-TestSolrCLIRunExample.testInteractiveSolrCloudExample-seed#[2022787A2936FC9]) [    ] o.a.s.c.c.ConnectionManager Client is connected to ZooKeeper
   [junit4]   2> 3305552 INFO  (TEST-TestSolrCLIRunExample.testInteractiveSolrCloudExample-seed#[2022787A2936FC9]) [    ] o.a.s.c.c.SolrZkClient Using default ZkACLProvider
   [junit4]   2> 3305624 INFO  (qtp1131987597-21674) [n:localhost:58309_solr    ] o.a.s.s.HttpSolrCall [admin] webapp=null path=/admin/info/system params={wt=json} status=0 QTime=66
   [junit4]   2> 3305630 INFO  (qtp1131987597-21675) [n:localhost:58309_solr    ] o.a.s.h.a.CollectionsHandler Invoked Collection Action :clusterstatus with params action=CLUSTERSTATUS&wt=json and sendToOCPQueue=true
   [junit4]   2> 3305632 INFO  (qtp1131987597-21675) [n:localhost:58309_solr    ] o.a.s.s.HttpSolrCall [admin] webapp=null path=/admin/collections params={action=CLUSTERSTATUS&wt=json} status=0 QTime=2
   [junit4]   2> 3305633 INFO  (TEST-TestSolrCLIRunExample.testInteractiveSolrCloudExample-seed#[2022787A2936FC9]) [    ] o.a.s.c.c.SolrZkClient Using default ZkCredentialsProvider
   [junit4]   2> 3305633 INFO  (TEST-TestSolrCLIRunExample.testInteractiveSolrCloudExample-seed#[2022787A2936FC9]) [    ] o.a.s.c.c.ConnectionManager Waiting for client to connect to ZooKeeper
   [junit4]   2> 3305634 INFO  (zkCallback-3545-thread-1) [    ] o.a.s.c.c.ConnectionManager Watcher org.apache.solr.common.cloud.ConnectionManager@1d164269 name:ZooKeeperConnection Watcher:127.0.0.1:58316/solr got event WatchedEvent state:SyncConnected type:None path:null path:null type:None
   [junit4]   2> 3305635 INFO  (TEST-TestSolrCLIRunExample.testInteractiveSolrCloudExample-seed#[2022787A2936FC9]) [    ] o.a.s.c.c.ConnectionManager Client is connected to ZooKeeper
   [junit4]   2> 3305635 INFO  (TEST-TestSolrCLIRunExample.testInteractiveSolrCloudExample-seed#[2022787A2936FC9]) [    ] o.a.s.c.c.SolrZkClient Using default ZkACLProvider
   [junit4]   2> 3305635 INFO  (TEST-TestSolrCLIRunExample.testInteractiveSolrCloudExample-seed#[2022787A2936FC9]) [    ] o.a.s.c.c.ZkStateReader Updating cluster state from ZooKeeper... 
   [junit4]   2> 3305637 INFO  (TEST-TestSolrCLIRunExample.testInteractiveSolrCloudExample-seed#[2022787A2936FC9]) [    ] o.a.s.c.c.ZkStateReader Updated live nodes from ZooKeeper... (0) -> (1)
   [junit4]   2> 3305641 INFO  (qtp1131987597-21679) [n:localhost:58309_solr    ] o.a.s.h.a.CollectionsHandler Invoked Collection Action :list with params action=list&wt=json and sendToOCPQueue=true
   [junit4]   2> 3305641 INFO  (qtp1131987597-21679) [n:localhost:58309_solr    ] o.a.s.s.HttpSolrCall [admin] webapp=null path=/admin/collections params={action=list&wt=json} status=0 QTime=0
   [junit4]   2> 3305666 INFO  (qtp1131987597-21676) [n:localhost:58309_solr    ] o.a.s.s.HttpSolrCall [admin] webapp=null path=/admin/info/system params={wt=json} status=0 QTime=22
   [junit4]   2> 3305671 INFO  (qtp1131987597-21678) [n:localhost:58309_solr    ] o.a.s.h.a.CollectionsHandler Invoked Collection Action :clusterstatus with params action=CLUSTERSTATUS&wt=json and sendToOCPQueue=true
   [junit4]   2> 3305673 INFO  (qtp1131987597-21678) [n:localhost:58309_solr    ] o.a.s.s.HttpSolrCall [admin] webapp=null path=/admin/collections params={action=CLUSTERSTATUS&wt=json} status=0 QTime=1
   [junit4]   2> 3305673 INFO  (TEST-TestSolrCLIRunExample.testInteractiveSolrCloudExample-seed#[2022787A2936FC9]) [    ] o.a.s.c.c.SolrZkClient Using default ZkCredentialsProvider
   [junit4]   2> 3305674 INFO  (TEST-TestSolrCLIRunExample.testInteractiveSolrCloudExample-seed#[2022787A2936FC9]) [    ] o.a.s.c.c.ConnectionManager Waiting for client to connect to ZooKeeper
   [junit4]   2> 3305676 INFO  (zkCallback-3547-thread-1) [    ] o.a.s.c.c.ConnectionManager Watcher org.apache.solr.common.cloud.ConnectionManager@91923dc name:ZooKeeperConnection Watcher:127.0.0.1:58316/solr got event WatchedEvent state:SyncConnected type:None path:null path:null type:None
   [junit4]   2> 3305676 INFO  (TEST-TestSolrCLIRunExample.testInteractiveSolrCloudExample-seed#[2022787A2936FC9]) [    ] o.a.s.c.c.ConnectionManager Client is connected to ZooKeeper
   [junit4]   2> 3305676 INFO  (TEST-TestSolrCLIRunExample.testInteractiveSolrCloudExample-seed#[2022787A2936FC9]) [    ] o.a.s.c.c.SolrZkClient Using default ZkACLProvider
   [junit4]   2> 3305676 INFO  (TEST-TestSolrCLIRunExample.testInteractiveSolrCloudExample-seed#[2022787A2936FC9]) [    ] o.a.s.c.c.ZkStateReader Updating cluster state from ZooKeeper... 
   [junit4]   2> 3305678 INFO  (TEST-TestSolrCLIRunExample.testInteractiveSolrCloudExample-seed#[2022787A2936FC9]) [    ] o.a.s.c.c.ZkStateReader Updated live nodes from ZooKeeper... (0) -> (1)
   [junit4]   2> 3305681 INFO  (TEST-TestSolrCLIRunExample.testInteractiveSolrCloudExample-seed#[2022787A2936FC9]) [    ] o.a.s.c.c.SolrZkClient makePath: /configs/testCloudExamplePrompt/currency.xml
   [junit4]   2> 3305686 INFO  (TEST-TestSolrCLIRunExample.testInteractiveSolrCloudExample-seed#[2022787A2936FC9]) [    ] o.a.s.c.c.SolrZkClient makePath: /configs/testCloudExamplePrompt/elevate.xml
   [junit4]   2> 3305716 INFO  (TEST-TestSolrCLIRunExample.testInteractiveSolrCloudExample-seed#[2022787A2936FC9]) [    ] o.a.s.c.c.SolrZkClient makePath: /configs/testCloudExamplePrompt/lang/contractions_ca.txt
   [junit4]   2> 3305720 INFO  (TEST-TestSolrCLIRunExample.testInteractiveSolrCloudExample-seed#[2022787A2936FC9]) [    ] o.a.s.c.c.SolrZkClient makePath: /configs/testCloudExamplePrompt/lang/contractions_fr.txt
   [junit4]   2> 3305724 INFO  (TEST-TestSolrCLIRunExample.testInteractiveSolrCloudExample-seed#[2022787A2936FC9]) [    ] o.a.s.c.c.SolrZkClient makePath: /configs/testCloudExamplePrompt/lang/contractions_ga.txt
   [junit4]   2> 3305727 INFO  (TEST-TestSolrCLIRunExample.testInteractiveSolrCloudExample-seed#[2022787A2936FC9]) [    ] o.a.s.c.c.SolrZkClient makePath: /configs/testCloudExamplePrompt/lang/contractions_it.txt
   [junit4]   2> 3305737 INFO  (TEST-TestSolrCLIRunExample.testInteractiveSolrCloudExample-seed#[2022787A2936FC9]) [    ] o.a.s.c.c.SolrZkClient makePath: /configs/testCloudExamplePrompt/lang/hyphenations_ga.txt
   [junit4]   2> 3305741 INFO  (TEST-TestSolrCLIRunExample.testInteractiveSolrCloudExample-seed#[2022787A2936FC9]) [    ] o.a.s.c.c.SolrZkClient makePath: /configs/testCloudExamplePrompt/lang/stemdict_nl.txt
   [junit4]   2> 3305745 INFO  (TEST-TestSolrCLIRunExample.testInteractiveSolrCloudExample-seed#[2022787A2936FC9]) [    ] o.a.s.c.c.SolrZkClient makePath: /configs/testCloudExamplePrompt/lang/stoptags_ja.txt
   [junit4]   2> 3305749 INFO  (TEST-TestSolrCLIRunExample.testInteractiveSolrCloudExample-seed#[2022787A2936FC9]) [    ] o.a.s.c.c.SolrZkClient makePath: /configs/testCloudExamplePrompt/lang/stopwords_ar.txt
   [junit4]   2> 3305753 INFO  (TEST-TestSolrCLIRunExample.testInteractiveSolrCloudExample-seed#[2022787A2936FC9]) [    ] o.a.s.c.c.SolrZkClient makePath: /configs/testCloudExamplePrompt/lang/stopwords_bg.txt
   [junit4]   2> 3305757 INFO  (TEST-TestSolrCLIRunExample.testInteractiveSolrCloudExample-seed#[2022787A2936FC9]) [    ] o.a.s.c.c.SolrZkClient makePath: /configs/testCloudExamplePrompt/lang/stopwords_ca.txt
   [junit4]   2> 3305761 INFO  (TEST-TestSolrCLIRunExample.testInteractiveSolrCloudExample-seed#[2022787A2936FC9]) [    ] o.a.s.c.c.SolrZkClient makePath: /configs/testCloudExamplePrompt/lang/stopwords_cz.txt
   [junit4]   2> 3305764 INFO  (TEST-TestSolrCLIRunExample.testInteractiveSolrCloudExample-seed#[2022787A2936FC9]) [    ] o.a.s.c.c.SolrZkClient makePath: /configs/testCloudExamplePrompt/lang/stopwords_da.txt
   [junit4]   2> 3305788 INFO  (TEST-TestSolrCLIRunExample.testInteractiveSolrCloudExample-seed#[2022787A2936FC9]) [    ] o.a.s.c.c.SolrZkClient makePath: /configs/testCloudExamplePrompt/lang/stopwords_de.txt
   [junit4]   2> 3305792 INFO  (TEST-TestSolrCLIRunExample.testInteractiveSolrCloudExample-seed#[2022787A2936FC9]) [    ] o.a.s.c.c.SolrZkClient makePath: /configs/testCloudExamplePrompt/lang/stopwords_el.txt
   [junit4]   2> 3305796 INFO  (TEST-TestSolrCLIRunExample.testInteractiveSolrCloudExample-seed#[2022787A2936FC9]) [    ] o.a.s.c.c.SolrZkClient makePath: /configs/testCloudExamplePrompt/lang/stopwords_en.txt
   [junit4]   2> 3305800 INFO  (TEST-TestSolrCLIRunExample.testInteractiveSolrCloudExample-seed#[2022787A2936FC9]) [    ] o.a.s.c.c.SolrZkClient makePath: /configs/testCloudExamplePrompt/lang/stopwords_es.txt
   [junit4]   2> 3305804 INFO  (TEST-TestSolrCLIRunExample.testInteractiveSolrCloudExample-seed#[2022787A2936FC9]) [    ] o.a.s.c.c.SolrZkClient makePath: /configs/testCloudExamplePrompt/lang/stopwords_eu.txt
   [junit4]   2> 3305808 INFO  (TEST-TestSolrCLIRunExample.testInteractiveSolrCloudExample-seed#[2022787A2936FC9]) [    ] o.a.s.c.c.SolrZkClient makePath: /configs/testCloudExamplePrompt/lang/stopwords_fa.txt
   [junit4]   2> 3305811 INFO  (TEST-TestSolrCLIRunExample.testInteractiveSolrCloudExample-seed#[2022787A2936FC9]) [    ] o.a.s.c.c.SolrZkClient makePath: /configs/testCloudExamplePrompt/lang/stopwords_fi.txt
   [junit4]   2> 3305815 INFO  (TEST-TestSolrCLIRunExample.testInteractiveSolrCloudExample-seed#[2022787A2936FC9]) [    ] o.a.s.c.c.SolrZkClient makePath: /configs/testCloudExamplePrompt/lang/stopwords_fr.txt
   [junit4]   2> 3305834 INFO  (TEST-TestSolrCLIRunExample.testInteractiveSolrCloudExample-seed#[2022787A2936FC9]) [    ] o.a.s.c.c.SolrZkClient makePath: /configs/testCloudExamplePrompt/lang/stopwords_ga.txt
   [junit4]   2> 3305837 INFO  (TEST-TestSolrCLIRunExample.testInteractiveSolrCloudExample-seed#[2022787A2936FC9]) [    ] o.a.s.c.c.SolrZkClient makePath: /configs/testCloudExamplePrompt/lang/stopwords_gl.txt
   [junit4]   2> 3305842 INFO  (TEST-TestSolrCLIRunExample.testInteractiveSolrCloudExample-seed#[2022787A2936FC9]) [    ] o.a.s.c.c.SolrZkClient makePath: /configs/testCloudExamplePrompt/lang/stopwords_hi.txt
   [junit4]   2> 3305847 INFO  (TEST-TestSolrCLIRunExample.testInteractiveSolrCloudExample-seed#[2022787A2936FC9]) [    ] o.a.s.c.c.SolrZkClient makePath: /configs/testCloudExamplePrompt/lang/stopwords_hu.txt
   [junit4]   2> 3305851 INFO  (TEST-TestSolrCLIRunExample.testInteractiveSolrCloudExample-seed#[2022787A2936FC9]) [    ] o.a.s.c.c.SolrZkClient makePath: /configs/testCloudExamplePrompt/lang/stopwords_hy.txt
   [junit4]   2> 3305860 INFO  (TEST-TestSolrCLIRunExample.testInteractiveSolrCloudExample-seed#[2022787A2936FC9]) [    ] o.a.s.c.c.SolrZkClient makePath: /configs/testCloudExamplePrompt/lang/stopwords_id.txt
   [junit4]   2> 3305864 INFO  (TEST-TestSolrCLIRunExample.testInteractiveSolrCloudExample-seed#[2022787A2936FC9]) [    ] o.a.s.c.c.SolrZkClient makePath: /configs/testCloudExamplePrompt/lang/stopwords_it.txt
   [junit4]   2> 3305868 INFO  (TEST-TestSolrCLIRunExample.testInteractiveSolrCloudExample-seed#[2022787A2936FC9]) [    ] o.a.s.c.c.SolrZkClient makePath: /configs/testCloudExamplePrompt/lang/stopwords_ja.txt
   [junit4]   2> 3305873 INFO  (TEST-TestSolrCLIRunExample.testInteractiveSolrCloudExample-seed#[2022787A2936FC9]) [    ] o.a.s.c.c.SolrZkClient makePath: /configs/testCloudExamplePrompt/lang/stopwords_lv.txt
   [junit4]   2> 3305877 INFO  (TEST-TestSolrCLIRunExample.testInteractiveSolrCloudExample-seed#[2022787A2936FC9]) [    ] o.a.s.c.c.SolrZkClient makePath: /configs/testCloudExamplePrompt/lang/stopwords_nl.txt
   [junit4]   2> 3305881 INFO  (TEST-TestSolrCLIRunExample.testInteractiveSolrCloudExample-seed#[2022787A2936FC9]) [    ] o.a.s.c.c.SolrZkClient makePath: /configs/testCloudExamplePrompt/lang/stopwords_no.txt
   [junit4]   2> 3305886 INFO  (TEST-TestSolrCLIRunExample.testInteractiveSolrCloudExample-seed#[2022787A2936FC9]) [    ] o.a.s.c.c.SolrZkClient makePath: /configs/testCloudExamplePrompt/lang/stopwords_pt.txt
   [junit4]   2> 3305890 INFO  (TEST-TestSolrCLIRunExample.testInteractiveSolrCloudExample-seed#[2022787A2936FC9]) [    ] o.a.s.c.c.SolrZkClient makePath: /configs/testCloudExamplePrompt/lang/stopwords_ro.txt
   [junit4]   2> 3305894 INFO  (TEST-TestSolrCLIRunExample.testInteractiveSolrCloudExample-seed#[2022787A2936FC9]) [    ] o.a.s.c.c.SolrZkClient makePath: /configs/testCloudExamplePrompt/lang/stopwords_ru.txt
   [junit4]   2> 3305899 INFO  (TEST-TestSolrCLIRunExample.testInteractiveSolrCloudExample-seed#[2022787A2936FC9]) [    ] o.a.s.c.c.SolrZkClient makePath: /configs/testCloudExamplePrompt/lang/stopwords_sv.txt
   [junit4]   2> 3305903 INFO  (TEST-TestSolrCLIRunExample.testInteractiveSolrCloudExample-seed#[2022787A2936FC9]) [    ] o.a.s.c.c.SolrZkClient makePath: /configs/testCloudExamplePrompt/lang/stopwords_th.txt
   [junit4]   2> 3305907 INFO  (TEST-TestSolrCLIRunExample.testInteractiveSolrCloudExample-seed#[2022787A2936FC9]) [    ] o.a.s.c.c.SolrZkClient makePath: /configs/testCloudExamplePrompt/lang/stopwords_tr.txt
   [junit4]   2> 3305911 INFO  (TEST-TestSolrCLIRunExample.testInteractiveSolrCloudExample-seed#[2022787A2936FC9]) [    ] o.a.s.c.c.SolrZkClient makePath: /configs/testCloudExamplePrompt/lang/userdict_ja.txt
   [junit4]   2> 3305919 INFO  (TEST-TestSolrCLIRunExample.testInteractiveSolrCloudExample-seed#[2022787A2936FC9]) [    ] o.a.s.c.c.SolrZkClient makePath: /configs/testCloudExamplePrompt/managed-schema
   [junit4]   2> 3305945 INFO  (TEST-TestSolrCLIRunExample.testInteractiveSolrCloudExample-seed#[2022787A2936FC9]) [    ] o.a.s.c.c.SolrZkClient makePath: /configs/testCloudExamplePrompt/params.json
   [junit4]   2> 3305949 INFO  (TEST-TestSolrCLIRunExample.testInteractiveSolrCloudExample-seed#[2022787A2936FC9]) [    ] o.a.s.c.c.SolrZkClient makePath: /configs/testCloudExamplePrompt/protwords.txt
   [junit4]   2> 3305959 INFO  (TEST-TestSolrCLIRunExample.testInteractiveSolrCloudExample-seed#[2022787A2936FC9]) [    ] o.a.s.c.c.SolrZkClient makePath: /configs/testCloudExamplePrompt/solrconfig.xml
   [junit4]   2> 3305963 INFO  (TEST-TestSolrCLIRunExample.testInteractiveSolrCloudExample-seed#[2022787A2936FC9]) [    ] o.a.s.c.c.SolrZkClient makePath: /configs/testCloudExamplePrompt/stopwords.txt
   [junit4]   2> 3305967 INFO  (TEST-TestSolrCLIRunExample.testInteractiveSolrCloudExample-seed#[2022787A2936FC9]) [    ] o.a.s.c.c.SolrZkClient makePath: /configs/testCloudExamplePrompt/synonyms.txt
   [junit4]   2> 3305971 INFO  (qtp1131987597-21672) [n:localhost:58309_solr    ] o.a.s.h.a.CollectionsHandler Invoked Collection Action :list with params action=list&wt=json and sendToOCPQueue=true
   [junit4]   2> 3305971 INFO  (qtp1131987597-21672) [n:localhost:58309_solr    ] o.a.s.s.HttpSolrCall [admin] webapp=null path=/admin/collections params={action=list&wt=json} status=0 QTime=0
   [junit4]   2> 3305973 INFO  (qtp1131987597-21676) [n:localhost:58309_solr    ] o.a.s.h.a.CollectionsHandler Invoked Collection Action :create with params replicationFactor=2&maxShardsPerNode=4&collection.configName=testCloudExamplePrompt&name=testCloudExamplePrompt&action=CREATE&numShards=2&wt=json and sendToOCPQueue=true
   [junit4]   2> 3305977 INFO  (OverseerCollectionConfigSetProcessor-95651039852036099-localhost:58309_solr-n_0000000000) [n:localhost:58309_solr    ] o.a.s.c.OverseerTaskProcessor Overseer Collection Message Handler: Get the message id:/overseer/collection-queue-work/qn-0000000000 message:{
   [junit4]   2>   "name":"testCloudExamplePrompt",
   [junit4]   2>   "fromApi":"true",
   [junit4]   2>   "replicationFactor":"2",
   [junit4]   2>   "collection.configName":"testCloudExamplePrompt",
   [junit4]   2>   "numShards":"2",
   [junit4]   2>   "maxShardsPerNode":"4",
   [junit4]   2>   "stateFormat":"2",
   [junit4]   2>   "operation":"create"}
   [junit4]   2> 3305978 INFO  (OverseerThreadFactory-11011-thread-1-processing-n:localhost:58309_solr) [n:localhost:58309_solr    ] o.a.s.c.OverseerCollectionMessageHandler OverseerCollectionMessageHandler.processMessage : create , {
   [junit4]   2>   "name":"testCloudExamplePrompt",
   [junit4]   2>   "fromApi":"true",
   [junit4]   2>   "replicationFactor":"2",
   [junit4]   2>   "collection.configName":"testCloudExamplePrompt",
   [junit4]   2>   "numShards":"2",
   [junit4]   2>   "maxShardsPerNode":"4",
   [junit4]   2>   "stateFormat":"2",
   [junit4]   2>   "operation":"create"}
   [junit4]   2> 3305978 INFO  (OverseerThreadFactory-11011-thread-1-processing-n:localhost:58309_solr) [n:localhost:58309_solr    ] o.a.s.c.OverseerCollectionMessageHandler Create collection testCloudExamplePrompt
   [junit4]   2> 3305979 WARN  (OverseerThreadFactory-11011-thread-1-processing-n:localhost:58309_solr) [n:localhost:58309_solr    ] o.a.s.c.OverseerCollectionMessageHandler Specified replicationFactor of 2 on collection testCloudExamplePrompt is higher than or equal to the number of Solr instances currently live or live and part of your createNodeSet(1). It's unusual to run two replica of the same slice on the same Solr-instance.
   [junit4]   2> 3305980 INFO  (OverseerThreadFactory-11011-thread-1-processing-n:localhost:58309_solr) [n:localhost:58309_solr    ] o.a.s.c.OverseerCollectionMessageHandler creating collections conf node /collections/testCloudExamplePrompt 
   [junit4]   2> 3305981 INFO  (OverseerThreadFactory-11011-thread-1-processing-n:localhost:58309_solr) [n:localhost:58309_solr    ] o.a.s.c.c.SolrZkClient makePath: /collections/testCloudExamplePrompt
   [junit4]   2> 3305983 INFO  (zkCallback-3541-thread-1-processing-n:localhost:58309_solr) [n:localhost:58309_solr    ] o.a.s.c.c.ZkStateReader A collections change: [WatchedEvent state:SyncConnected type:NodeChildrenChanged path:/collections], has occurred - updating...
   [junit4]   2> 3305983 INFO  (zkCallback-3547-thread-1) [    ] o.a.s.c.c.ZkStateReader A collections change: [WatchedEvent state:SyncConnected type:NodeChildrenChanged path:/collections], has occurred - updating...
   [junit4]   2> 3305988 INFO  (OverseerStateUpdate-95651039852036099-localhost:58309_solr-n_0000000000) [n:localhost:58309_solr    ] o.a.s.c.Overseer processMessage: queueSize: 1, message = {
   [junit4]   2>   "name":"testCloudExamplePrompt",
   [junit4]   2>   "fromApi":"true",
   [junit4]   2>   "replicationFactor":"2",
   [junit4]   2>   "collection.configName":"testCloudExamplePrompt",
   [junit4]   2>   "numShards":"2",
   [junit4]   2>   "maxShardsPerNode":"4",
   [junit4]   2>   "stateFormat":"2",
   [junit4]   2>   "operation":"create"} current state version: 0
   [junit4]   2> 3305988 INFO  (OverseerStateUpdate-95651039852036099-localhost:58309_solr-n_0000000000) [n:localhost:58309_solr    ] o.a.s.c.o.ClusterStateMutator building a new cName: testCloudExamplePrompt
   [junit4]   2> 3305990 INFO  (OverseerStateUpdate-95651039852036099-localhost:58309_solr-n_0000000000) [n:localhost:58309_solr    ] o.a.s.c.o.ZkStateWriter going to create_collection /collections/testCloudExamplePrompt/state.json
   [junit4]   2> 3306088 INFO  (OverseerThreadFactory-11011-thread-1-processing-n:localhost:58309_solr) [n:localhost:58309_solr    ] o.a.s.c.OverseerCollectionMessageHandler Creating SolrCores for new collection testCloudExamplePrompt, shardNames [shard1, shard2] , replicationFactor : 2
   [junit4]   2> 3306088 INFO  (OverseerThreadFactory-11011-thread-1-processing-n:localhost:58309_solr) [n:localhost:58309_solr    ] o.a.s.c.OverseerCollectionMessageHandler Creating core testCloudExamplePrompt_shard2_replica2 as part of shard shard2 of collection testCloudExamplePrompt on localhost:58309_solr
   [junit4]   2> 3306089 INFO  (OverseerThreadFactory-11011-thread-1-processing-n:localhost:58309_solr) [n:localhost:58309_solr    ] o.a.s.c.OverseerCollectionMessageHandler Creating core testCloudExamplePrompt_shard2_replica1 as part of shard shard2 of collection testCloudExamplePrompt on localhost:58309_solr
   [junit4]   2> 3306090 INFO  (OverseerThreadFactory-11011-thread-1-processing-n:localhost:58309_solr) [n:localhost:58309_solr    ] o.a.s.c.OverseerCollectionMessageHandler Creating core testCloudExamplePrompt_shard1_replica2 as part of shard shard1 of collection testCloudExamplePrompt on localhost:58309_solr
   [junit4]   2> 3306091 INFO  (qtp1131987597-21678) [n:localhost:58309_solr    ] o.a.s.h.a.CoreAdminOperation core create command qt=/admin/cores&collection.configName=testCloudExamplePrompt&name=testCloudExamplePrompt_shard2_replica2&action=CREATE&numShards=2&collection=testCloudExamplePrompt&shard=shard2&wt=javabin&version=2
   [junit4]   2> 3306091 INFO  (qtp1131987597-21679) [n:localhost:58309_solr    ] o.a.s.h.a.CoreAdminOperation core create command qt=/admin/cores&collection.configName=testCloudExamplePrompt&name=testCloudExamplePrompt_shard2_replica1&action=CREATE&numShards=2&collection=testCloudExamplePrompt&shard=shard2&wt=javabin&version=2
   [junit4]   2> 3306091 INFO  (qtp1131987597-21678) [n:localhost:58309_solr    ] o.a.s.c.CoreDescriptor Created CoreDescriptor: {name=testCloudExamplePrompt_shard2_replica2, collection.configName=testCloudExamplePrompt, config=solrconfig.xml, transient=false, schema=schema.xml, loadOnStartup=true, configSetProperties=configsetprops.json, collection=testCloudExamplePrompt, numShards=2, dataDir=data/, shard=shard2}
   [junit4]   2> 3306092 INFO  (qtp1131987597-21679) [n:localhost:58309_solr    ] o.a.s.c.CoreDescriptor Created CoreDescriptor: {name=testCloudExamplePrompt_shard2_replica1, collection.configName=testCloudExamplePrompt, config=solrconfig.xml, transient=false, schema=schema.xml, loadOnStartup=true, configSetProperties=configsetprops.json, collection=testCloudExamplePrompt, numShards=2, dataDir=data/, shard=shard2}
   [junit4]   2> 3306092 INFO  (OverseerThreadFactory-11011-thread-1-processing-n:localhost:58309_solr) [n:localhost:58309_solr    ] o.a.s.c.OverseerCollectionMessageHandler Creating core testCloudExamplePrompt_shard1_replica1 as part of shard shard1 of collection testCloudExamplePrompt on localhost:58309_solr
   [junit4]   2> 3306093 INFO  (qtp1131987597-21677) [n:localhost:58309_solr    ] o.a.s.h.a.CoreAdminOperation core create command qt=/admin/cores&collection.configName=testCloudExamplePrompt&name=testCloudExamplePrompt_shard1_replica2&action=CREATE&numShards=2&collection=testCloudExamplePrompt&shard=shard1&wt=javabin&version=2
   [junit4]   2> 3306094 INFO  (qtp1131987597-21677) [n:localhost:58309_solr    ] o.a.s.c.CoreDescriptor Created CoreDescriptor: {name=testCloudExamplePrompt_shard1_replica2, collection.configName=testCloudExamplePrompt, config=solrconfig.xml, transient=false, schema=schema.xml, loadOnStartup=true, configSetProperties=configsetprops.json, collection=testCloudExamplePrompt, numShards=2, dataDir=data/, shard=shard1}
   [junit4]   2> 3306094 INFO  (qtp1131987597-21672) [n:localhost:58309_solr    ] o.a.s.h.a.CoreAdminOperation core create command qt=/admin/cores&collection.configName=testCloudExamplePrompt&name=testCloudExamplePrompt_shard1_replica1&action=CREATE&numShards=2&collection=testCloudExamplePrompt&shard=shard1&wt=javabin&version=2
   [junit4]   2> 3306095 INFO  (qtp1131987597-21678) [n:localhost:58309_solr c:testCloudExamplePrompt s:shard2  x:testCloudExamplePrompt_shard2_replica2] o.a.s.c.ZkController publishing state=down
   [junit4]   2> 3306095 INFO  (qtp1131987597-21679) [n:localhost:58309_solr c:testCloudExamplePrompt s:shard2  x:testCloudExamplePrompt_shard2_replica1] o.a.s.c.ZkController publishing state=down
   [junit4]   2> 3306096 INFO  (qtp1131987597-21672) [n:localhost:58309_solr    ] o.a.s.c.CoreDescriptor Created CoreDescriptor: {name=testCloudExamplePrompt_shard1_replica1, collection.configName=testCloudExamplePrompt, config=solrconfig.xml, transient=false, schema=schema.xml, loadOnStartup=true, configSetProperties=configsetprops.json, collection=testCloudExamplePrompt, numShards=2, dataDir=data/, shard=shard1}
   [junit4]   2> 3306098 INFO  (qtp1131987597-21677) [n:localhost:58309_solr c:testCloudExamplePrompt s:shard1  x:testCloudExamplePrompt_shard1_replica2] o.a.s.c.ZkController publishing state=down
   [junit4]   2> 3306098 INFO  (qtp1131987597-21678) [n:localhost:58309_solr c:testCloudExamplePrompt s:shard2  x:testCloudExamplePrompt_shard2_replica2] o.a.s.c.ZkController Registering watch for collection testCloudExamplePrompt
   [junit4]   2> 3306098 INFO  (qtp1131987597-21678) [n:localhost:58309_solr c:testCloudExamplePrompt s:shard2  x:testCloudExamplePrompt_shard2_replica2] o.a.s.c.c.ZkStateReader addZkWatch [testCloudExamplePrompt]
   [junit4]   2> 3306099 INFO  (qtp1131987597-21679) [n:localhost:58309_solr c:testCloudExamplePrompt s:shard2  x:testCloudExamplePrompt_shard2_replica1] o.a.s.c.ZkController Registering watch for collection testCloudExamplePrompt
   [junit4]   2> 3306099 INFO  (qtp1131987597-21679) [n:localhost:58309_solr c:testCloudExamplePrompt s:shard2  x:testCloudExamplePrompt_shard2_replica1] o.a.s.c.ZkController look for our core node name
   [junit4]   2> 3306100 INFO  (qtp1131987597-21672) [n:localhost:58309_solr c:testCloudExamplePrompt s:shard1  x:testCloudExamplePrompt_shard1_replica1] o.a.s.c.ZkController publishing state=down
   [junit4]   2> 3306100 INFO  (qtp1131987597-21678) [n:localhost:58309_solr c:testCloudExamplePrompt s:shard2  x:testCloudExamplePrompt_shard2_replica2] o.a.s.c.c.ZkStateReader Add data for [testCloudExamplePrompt] ver [0]
   [junit4]   2> 3306100 INFO  (qtp1131987597-21678) [n:localhost:58309_solr c:testCloudExamplePrompt s:shard2  x:testCloudExamplePrompt_shard2_replica2] o.a.s.c.ZkController look for our core node name
   [junit4]   2> 3306100 INFO  (OverseerStateUpdate-95651039852036099-localhost:58309_solr-n_0000000000) [n:localhost:58309_solr    ] o.a.s.c.Overseer processMessage: queueSize: 2, message = {
   [junit4]   2>   "core":"testCloudExamplePrompt_shard2_replica2",
   [junit4]   2>   "roles":null,
   [junit4]   2>   "base_url":"http://localhost:58309/solr",
   [junit4]   2>   "node_name":"localhost:58309_solr",
   [junit4]   2>   "numShards":"2",
   [junit4]   2>   "state":"down",
   [junit4]   2>   "shard":"shard2",
   [junit4]   2>   "collection":"testCloudExamplePrompt",
   [junit4]   2>   "operation":"state"} current state version: 0
   [junit4]   2> 3306101 INFO  (qtp1131987597-21677) [n:localhost:58309_solr c:testCloudExamplePrompt s:shard1  x:testCloudExamplePrompt_shard1_replica2] o.a.s.c.ZkController Registering watch for collection testCloudExamplePrompt
   [junit4]   2> 3306101 INFO  (qtp1131987597-21677) [n:localhost:58309_solr c:testCloudExamplePrompt s:shard1  x:testCloudExamplePrompt_shard1_replica2] o.a.s.c.ZkController look for our core node name
   [junit4]   2> 3306101 INFO  (OverseerStateUpdate-95651039852036099-localhost:58309_solr-n_0000000000) [n:localhost:58309_solr    ] o.a.s.c.o.ReplicaMutator Update state numShards=2 message={
   [junit4]   2>   "core":"testCloudExamplePrompt_shard2_replica2",
   [junit4]   2>   "roles":null,
   [junit4]   2>   "base_url":"http://localhost:58309/solr",
   [junit4]   2>   "node_name":"localhost:58309_solr",
   [junit4]   2>   "numShards":"2",
   [junit4]   2>   "state":"down",
   [junit4]   2>   "shard":"shard2",
   [junit4]   2>   "collection":"testCloudExamplePrompt",
   [junit4]   2>   "operation":"state"}
   [junit4]   2> 3306101 INFO  (qtp1131987597-21672) [n:localhost:58309_solr c:testCloudExamplePrompt s:shard1  x:testCloudExamplePrompt_shard1_replica1] o.a.s.c.ZkController Registering watch for collection testCloudExamplePrompt
   [junit4]   2> 3306102 INFO  (qtp1131987597-21672) [n:localhost:58309_solr c:testCloudExamplePrompt s:shard1  x:testCloudExamplePrompt_shard1_replica1] o.a.s.c.ZkController look for our core node name
   [junit4]   2> 3306104 INFO  (OverseerStateUpdate-95651039852036099-localhost:58309_solr-n_0000000000) [n:localhost:58309_solr    ] o.a.s.c.Overseer processMessage: queueSize: 2, message = {
   [junit4]   2>   "core":"testCloudExamplePrompt_shard2_replica1",
   [junit4]   2>   "roles":null,
   [junit4]   2>   "base_url":"http://localhost:58309/solr",
   [junit4]   2>   "node_name":"localhost:58309_solr",
   [junit4]   2>   "numShards":"2",
   [junit4]   2>   "state":"down",
   [junit4]   2>   "shard":"shard2",
   [junit4]   2>   "collection":"testCloudExamplePrompt",
   [junit4]   2>   "operation":"state"} current state version: 0
   [junit4]   2> 3306106 INFO  (OverseerStateUpdate-95651039852036099-localhost:58309_solr-n_0000000000) [n:localhost:58309_solr    ] o.a.s.c.o.ReplicaMutator Update state numShards=2 message={
   [junit4]   2>   "core":"testCloudExamplePrompt_shard2_replica1",
   [junit4]   2>   "roles":null,
   [junit4]   2>   "base_url":"http://localhost:58309/solr",
   [junit4]   2>   "node_name":"localhost:58309_solr",
   [junit4]   2>   "numShards":"2",
   [junit4]   2>   "state":"down",
   [junit4]   2>   "shard":"shard2",
   [junit4]   2>   "collection":"testCloudExamplePrompt",
   [junit4]   2>   "operation":"state"}
   [junit4]   2> 3306109 INFO  (OverseerStateUpdate-95651039852036099-localhost:58309_solr-n_0000000000) [n:localhost:58309_solr    ] o.a.s.c.Overseer processMessage: queueSize: 2, message = {
   [junit4]   2>   "core":"testCloudExamplePrompt_shard1_replica2",
   [junit4]   2>   "roles":null,
   [junit4]   2>   "base_url":"http://localhost:58309/solr",
   [junit4]   2>   "node_name":"localhost:58309_solr",
   [junit4]   2>   "numShards":"2",
   [junit4]   2>   "state":"down",
   [junit4]   2>   "shard":"shard1",
   [junit4]   2>   "collection":"testCloudExamplePrompt",
   [junit4]   2>   "operation":"state"} current state version: 0
   [junit4]   2> 3306110 INFO  (OverseerStateUpdate-95651039852036099-localhost:58309_solr-n_0000000000) [n:localhost:58309_solr    ] o.a.s.c.o.ReplicaMutator Update state numShards=2 message={
   [junit4]   2>   "core":"testCloudExamplePrompt_shard1_replica2",
   [junit4]   2>   "roles":null,
   [junit4]   2>   "base_url":"http://localhost:58309/solr",
   [junit4]   2>   "node_name":"localhost:58309_solr",
   [junit4]   2>   "numShards":"2",
   [junit4]   2>   "state":"down",
   [junit4]   2>   "shard":"shard1",
   [junit4]   2>   "collection":"testCloudExamplePrompt",
   [junit4]   2>   "operation":"state"}
   [junit4]   2> 3306113 INFO  (OverseerStateUpdate-95651039852036099-localhost:58309_solr-n_0000000000) [n:localhost:58309_solr    ] o.a.s.c.Overseer processMessage: queueSize: 2, message = {
   [junit4]   2>   "core":"testCloudExamplePrompt_shard1_replica1",
   [junit4]   2>   "roles":null,
   [junit4]   2>   "base_url":"http://localhost:58309/solr",
   [junit4]   2>   "node_name":"localhost:58309_solr",
   [junit4]   2>   "numShards":"2",
   [junit4]   2>   "state":"down",
   [junit4]   2>   "shard":"shard1",
   [junit4]   2>   "collection":"testCloudExamplePrompt",
   [junit4]   2>   "operation":"state"} current state version: 0
   [junit4]   2> 3306113 INFO  (OverseerStateUpdate-95651039852036099-localhost:58309_solr-n_0000000000) [n:localhost:58309_solr    ] o.a.s.c.o.ReplicaMutator Update state numShards=2 message={
   [junit4]   2>   "core":"testCloudExamplePrompt_shard1_replica1",
   [junit4]   2>   "roles":null,
   [junit4]   2>   "base_url":"http://localhost:58309/solr",
   [junit4]   2>   "node_name":"localhost:58309_solr",
   [junit4]   2>   "numShards":"2",
   [junit4]   2>   "state":"down",
   [junit4]   2>   "shard":"shard1",
   [junit4]   2>   "collection":"testCloudExamplePrompt",
   [junit4]   2>   "operation":"state"}
   [junit4]   2> 3306217 INFO  (OverseerStateUpdate-95651039852036099-localhost:58309_solr-n_0000000000) [n:localhost:58309_solr    ] o.a.s.c.o.ZkStateWriter going to update_collection /collections/testCloudExamplePrompt/state.json version: 0
   [junit4]   2> 3306218 INFO  (zkCallback-3541-thread-1-processing-n:localhost:58309_solr) [n:localhost:58309_solr    ] o.a.s.c.c.ZkStateReader A cluster state change: [WatchedEvent state:SyncConnected type:NodeDataChanged path:/collections/testCloudExamplePrompt/state.json] for collection [testCloudExamplePrompt] has occurred - updating... (live nodes size: [1])
   [junit4]   2> 3306220 INFO  (zkCallback-3541-thread-1-processing-n:localhost:58309_solr) [n:localhost:58309_solr    ] o.a.s.c.c.ZkStateReader Updating data for [testCloudExamplePrompt] from [0] to [1]
   [junit4]   2> 3307104 INFO  (qtp1131987597-21678) [n:localhost:58309_solr c:testCloudExamplePrompt s:shard2  x:testCloudExamplePrompt_shard2_replica2] o.a.s.c.ZkController waiting to find shard id in clusterstate for testCloudExamplePrompt_shard2_replica2
   [junit4]   2> 3307104 INFO  (qtp1131987597-21678) [n:localhost:58309_solr c:testCloudExamplePrompt s:shard2  x:testCloudExamplePrompt_shard2_replica2] o.a.s.c.ZkController Check for collection zkNode:testCloudExamplePrompt
   [junit4]   2> 3307104 INFO  (qtp1131987597-21679) [n:localhost:58309_solr c:testCloudExamplePrompt s:shard2  x:testCloudExamplePrompt_shard2_replica1] o.a.s.c.ZkController waiting to find shard id in clusterstate for testCloudExamplePrompt_shard2_replica1
   [junit4]   2> 3307104 INFO  (qtp1131987597-21679) [n:localhost:58309_solr c:testCloudExamplePrompt s:shard2  x:testCloudExamplePrompt_shard2_replica1] o.a.s.c.ZkController Check for collection zkNode:testCloudExamplePrompt
   [junit4]   2> 3307104 INFO  (qtp1131987597-21677) [n:localhost:58309_solr c:testCloudExamplePrompt s:shard1  x:testCloudExamplePrompt_shard1_replica2] o.a.s.c.ZkController waiting to find shard id in clusterstate for testCloudExamplePrompt_shard1_replica2
   [junit4]   2> 3307104 INFO  (qtp1131987597-21677) [n:localhost:58309_solr c:testCloudExamplePrompt s:shard1  x:testCloudExamplePrompt_shard1_replica2] o.a.s.c.ZkController Check for collection zkNode:testCloudExamplePrompt
   [junit4]   2> 3307104 INFO  (qtp1131987597-21672) [n:localhost:58309_solr c:testCloudExamplePrompt s:shard1  x:testCloudExamplePrompt_shard1_replica1] o.a.s.c.ZkController waiting to find shard id in clusterstate for testCloudExamplePrompt_shard1_replica1
   [junit4]   2> 3307105 INFO  (qtp1131987597-21672) [n:localhost:58309_solr c:testCloudExamplePrompt s:shard1  x:testCloudExamplePrompt_shard1_replica1] o.a.s.c.ZkController Check for collection zkNode:testCloudExamplePrompt
   [junit4]   2> 3307105 INFO  (qtp1131987597-21678) [n:localhost:58309_solr c:testCloudExamplePrompt s:shard2  x:testCloudExamplePrompt_shard2_replica2] o.a.s.c.ZkController Collection zkNode exists
   [junit4]   2> 3307105 INFO  (qtp1131987597-21678) [n:localhost:58309_solr c:testCloudExamplePrompt s:shard2  x:testCloudExamplePrompt_shard2_replica2] o.a.s.c.c.ZkStateReader Load collection config from: [/collections/testCloudExamplePrompt]
   [junit4]   2> 3307105 INFO  (qtp1131987597-21679) [n:localhost:58309_solr c:testCloudExamplePrompt s:shard2  x:testCloudExamplePrompt_shard2_replica1] o.a.s.c.ZkController Collection zkNode exists
   [junit4]   2> 3307106 INFO  (qtp1131987597-21679) [n:localhost:58309_solr c:testCloudExamplePrompt s:shard2  x:testCloudExamplePrompt_shard2_replica1] o.a.s.c.c.ZkStateReader Load collection config from: [/collections/testCloudExamplePrompt]
   [junit4]   2> 3307106 INFO  (qtp1131987597-21677) [n:localhost:58309_solr c:testCloudExamplePrompt s:shard1  x:testCloudExamplePrompt_shard1_replica2] o.a.s.c.ZkController Collection zkNode exists
   [junit4]   2> 3307106 INFO  (qtp1131987597-21677) [n:localhost:58309_solr c:testCloudExamplePrompt s:shard1  x:testCloudExamplePrompt_shard1_replica2] o.a.s.c.c.ZkStateReader Load collection config from: [/collections/testCloudExamplePrompt]
   [junit4]   2> 3307106 INFO  (qtp1131987597-21672) [n:localhost:58309_solr c:testCloudExamplePrompt s:shard1  x:testCloudExamplePrompt_shard1_replica1] o.a.s.c.ZkController Collection zkNode exists
   [junit4]   2> 3307106 INFO  (qtp1131987597-21672) [n:localhost:58309_solr c:testCloudExamplePrompt s:shard1  x:testCloudExamplePrompt_shard1_replica1] o.a.s.c.c.ZkStateReader Load collection config from: [/collections/testCloudExamplePrompt]
   [junit4]   2> 3307108 INFO  (qtp1131987597-21678) [n:localhost:58309_solr c:testCloudExamplePrompt s:shard2  x:testCloudExamplePrompt_shard2_replica2] o.a.s.c.c.ZkStateReader path=[/collections/testCloudExamplePrompt] [configName]=[testCloudExamplePrompt] specified config exists in ZooKeeper
   [junit4]   2> 3307108 INFO  (qtp1131987597-21678) [n:localhost:58309_solr c:testCloudExamplePrompt s:shard2  x:testCloudExamplePrompt_shard2_replica2] o.a.s.c.SolrResourceLoader new SolrResourceLoader for directory: '/Users/jenkins/workspace/Lucene-Solr-6.x-MacOSX/solr/build/solr-core/test/J0/temp/solr.util.TestSolrCLIRunExample_2022787A2936FC9-001/tempDir-002/node1/testCloudExamplePrompt_shard2_replica2'
   [junit4]   2> 3307108 INFO  (qtp1131987597-21677) [n:localhost:58309_solr c:testCloudExamplePrompt s:shard1  x:testCloudExamplePrompt_shard1_replica2] o.a.s.c.c.ZkStateReader path=[/collections/testCloudExamplePrompt] [configName]=[testCloudExamplePrompt] specified config exists in ZooKeeper
   [junit4]   2> 3307108 INFO  (qtp1131987597-21679) [n:localhost:58309_solr c:testCloudExamplePrompt s:shard2  x:testCloudExamplePrompt_shard2_replica1] o.a.s.c.c.ZkStateReader path=[/collections/testCloudExamplePrompt] [configName]=[testCloudExamplePrompt] specified config exists in ZooKeeper
   [junit4]   2> 3307108 INFO  (qtp1131987597-21679) [n:localhost:58309_solr c:testCloudExamplePrompt s:shard2  x:testCloudExamplePrompt_shard2_replica1] o.a.s.c.SolrResourceLoader new SolrResourceLoader for directory: '/Users/jenkins/workspace/Lucene-Solr-6.x-MacOSX/solr/build/solr-core/test/J0/temp/solr.util.TestSolrCLIRunExample_2022787A2936FC9-001/tempDir-002/node1/testCloudExamplePrompt_shard2_replica1'
   [junit4]   2> 3307108 INFO  (qtp1131987597-21677) [n:localhost:58309_solr c:testCloudExamplePrompt s:shard1  x:testCloudExamplePrompt_shard1_replica2] o.a.s.c.SolrResourceLoader new SolrResourceLoader for directory: '/Users/jenkins/workspace/Lucene-Solr-6.x-MacOSX/solr/build/solr-core/test/J0/temp/solr.util.TestSolrCLIRunExample_2022787A2936FC9-001/tempDir-002/node1/testCloudExamplePrompt_shard1_replica2'
   [junit4]   2> 3307108 INFO  (qtp1131987597-21679) [n:localhost:58309_solr c:testCloudExamplePrompt s:shard2  x:testCloudExamplePrompt_shard2_replica1] o.a.s.c.SolrResourceLoader JNDI not configured for solr (NoInitialContextEx)
   [junit4]   2> 3307108 INFO  (qtp1131987597-21677) [n:localhost:58309_solr c:testCloudExamplePrompt s:shard1  x:testCloudExamplePrompt_shard1_replica2] o.a.s.c.SolrResourceLoader JNDI not configured for solr (NoInitialContextEx)
   [junit4]   2> 3307108 INFO  (qtp1131987597-21679) [n:localhost:58309_solr c:testCloudExamplePrompt s:shard2  x:testCloudExamplePrompt_shard2_replica1] o.a.s.c.SolrResourceLoader solr home defaulted to 'solr/' (could not find system property or JNDI)
   [junit4]   2> 3307108 INFO  (qtp1131987597-21678) [n:localhost:58309_solr c:testCloudExamplePrompt s:shard2  x:testCloudExamplePrompt_shard2_replica2] o.a.s.c.SolrResourceLoader JNDI not configured for solr (NoInitialContextEx)
   [junit4]   2> 3307109 INFO  (qtp1131987597-21678) [n:localhost:58309_solr c:testCloudExamplePrompt s:shard2  x:testCloudExamplePrompt_shard2_replica2] o.a.s.c.SolrResourceLoader solr home defaulted to 'solr/' (could not find system property or JNDI)
   [junit4]   2> 3307109 INFO  (qtp1131987597-21677) [n:localhost:58309_solr c:testCloudExamplePrompt s:shard1  x:testCloudExamplePrompt_shard1_replica2] o.a.s.c.SolrResourceLoader solr home defaulted to 'solr/' (could not find system property or JNDI)
   [junit4]   2> 3307108 INFO  (qtp1131987597-21672) [n:localhost:58309_solr c:testCloudExamplePrompt s:shard1  x:testCloudExamplePrompt_shard1_replica1] o.a.s.c.c.ZkStateReader path=[/collections/testCloudExamplePrompt] [configName]=[testCloudExamplePrompt] specified config exists in ZooKeeper
   [junit4]   2> 3307110 INFO  (qtp1131987597-21672) [n:localhost:58309_solr c:testCloudExamplePrompt s:shard1  x:testCloudExamplePrompt_shard1_replica1] o.a.s.c.SolrResourceLoader new SolrResourceLoader for directory: '/Users/jenkins/workspace/Lucene-Solr-6.x-MacOSX/solr/build/solr-core/test/J0/temp/solr.util.TestSolrCLIRunExample_2022787A2936FC9-001/tempDir-002/node1/testCloudExamplePrompt_shard1_replica1'
   [junit4]   2> 3307110 INFO  (qtp1131987597-21672) [n:localhost:58309_solr c:testCloudExamplePrompt s:shard1  x:testCloudExamplePrompt_shard1_replica1] o.a.s.c.SolrResourceLoader JNDI not configured for solr (NoInitialContextEx)
   [junit4]   2> 3307110 INFO  (qtp1131987597-21672) [n:localhost:58309_solr c:testCloudExamplePrompt s:shard1  x:testCloudExamplePrompt_shard1_replica1] o.a.s.c.SolrResourceLoader solr home defaulted to 'solr/' (could not find system property or JNDI)
   [junit4]   2> 3307112 INFO  (qtp1131987597-21677) [n:localhost:58309_solr c:testCloudExamplePrompt s:shard1  x:testCloudExamplePrompt_shard1_replica2] o.a.s.c.Config loaded config solrconfig.xml with version 0 
   [junit4]   2> 3307112 INFO  (qtp1131987597-21679) [n:localhost:58309_solr c:testCloudExamplePrompt s:shard2  x:testCloudExamplePrompt_shard2_replica1] o.a.s.c.Config loaded config solrconfig.xml with version 0 
   [junit4]   2> 3307112 INFO  (qtp1131987597-21678) [n:localhost:58309_solr c:testCloudExamplePrompt s:shard2  x:testCloudExamplePrompt_shard2_replica2] o.a.s.c.Config loaded config solrconfig.xml with version 0 
   [junit4]   2> 3307117 INFO  (qtp1131987597-21672) [n:localhost:58309_solr c:testCloudExamplePrompt s:shard1  x:testCloudExamplePrompt_shard1_replica1] o.a.s.c.Config loaded config solrconfig.xml with version 0 
   [junit4]   2> 3307123 INFO  (qtp1131987597-21677) [n:localhost:58309_solr c:testCloudExamplePrompt s:shard1  x:testCloudExamplePrompt_shard1_replica2] o.a.s.c.RequestParams conf resource params.json loaded . version : 0 
   [junit4]   2> 3307123 INFO  (qtp1131987597-21677) [n:localhost:58309_solr c:testCloudExamplePrompt s:shard1  x:testCloudExamplePrompt_shard1_replica2] o.a.s.c.RequestParams request params refreshed to version 0
   [junit4]   2> 3307123 INFO  (qtp1131987597-21679) [n:localhost:58309_solr c:testCloudExamplePrompt s:shard2  x:testCloudExamplePrompt_shard2_replica1] o.a.s.c.RequestParams conf resource params.json loaded . version : 0 
   [junit4]   2> 3307123 INFO  (qtp1131987597-21677) [n:localhost:58309_solr c:testCloudExamplePrompt s:shard1  x:testCloudExamplePrompt_shard1_replica2] o.a.s.c.SolrConfig current version of requestparams : 0
   [junit4]   2> 3307123 INFO  (qtp1131987597-21679) [n:localhost:58309_solr c:testCloudExamplePrompt s:shard2  x:testCloudExamplePrompt_shard2_replica1] o.a.s.c.RequestParams request params refreshed to version 0
   [junit4]   2> 3307123 INFO  (qtp1131987597-21679) [n:localhost:58309_solr c:testCloudExamplePrompt s:shard2  x:testCloudExamplePrompt_shard2_replica1] o.a.s.c.SolrConfig current version of requestparams : 0
   [junit4]   2> 3307123 INFO  (qtp1131987597-21678) [n:localhost:58309_solr c:testCloudExamplePrompt s:shard2  x:testCloudExamplePrompt_shard2_replica2] o.a.s.c.RequestParams conf resource params.json loaded . version : 0 
   [junit4]   2> 3307124 INFO  (qtp1131987597-21678) [n:localhost:58309_solr c:testCloudExamplePrompt s:shard2  x:testCloudExamplePrompt_shard2_replica2] o.a.s.c.RequestParams request params refreshed to version 0
   [junit4]   2> 3307124 INFO  (qtp1131987597-21677) [n:localhost:58309_solr c:testCloudExamplePrompt s:shard1  x:testCloudExamplePrompt_shard1_replica2] o.a.s.c.SolrConfig Adding specified lib dirs to ClassLoader
   [junit4]   2> 3307124 INFO  (qtp1131987597-21679) [n:localhost:58309_solr c:testCloudExamplePrompt s:shard2  x:testCloudExamplePrompt_shard2_replica1] o.a.s.c.SolrConfig Adding specified lib dirs to ClassLoader
   [junit4]   2> 3307125 WARN  (qtp1131987597-21677) [n:localhost:58309_solr c:testCloudExamplePrompt s:shard1  x:testCloudExamplePrompt_shard1_replica2] o.a.s.c.SolrConfig Couldn't add files from /Users/jenkins/workspace/Lucene-Solr-6.x-MacOSX/solr/build/solr-core/test/J0/temp/solr.util.TestSolrCLIRunExample_2022787A2936FC9-001/tempDir-002/node1/testCloudExamplePrompt_shard1_replica2/../../../../contrib/extraction/lib filtered by .*\.jar to classpath: /Users/jenkins/workspace/Lucene-Solr-6.x-MacOSX/solr/build/solr-core/test/J0/temp/solr.util.TestSolrCLIRunExample_2022787A2936FC9-001/tempDir-002/node1/testCloudExamplePrompt_shard1_replica2/../../../../contrib/extraction/lib
   [junit4]   2> 3307124 INFO  (qtp1131987597-21678) [n:localhost:58309_solr c:testCloudExamplePrompt s:shard2  x:testCloudExamplePrompt_shard2_replica2] o.a.s.c.SolrConfig current version of requestparams : 0
   [junit4]   2> 3307126 INFO  (qtp1131987597-21678) [n:localhost:58309_solr c:testCloudExamplePrompt s:shard2  x:testCloudExamplePrompt_shard2_replica2] o.a.s.c.SolrConfig Adding specified lib dirs to ClassLoader
   [junit4]   2> 3307126 WARN  (qtp1131987597-21677) [n:localhost:58309_solr c:testCloudExamplePrompt s:shard1  x:testCloudExamplePrompt_shard1_replica2] o.a.s.c.SolrConfig Couldn't add files from /Users/jenkins/workspace/Lucene-Solr-6.x-MacOSX/solr/build/solr-core/test/J0/temp/solr.util.TestSolrCLIRunExample_2022787A2936FC9-001/tempDir-002/node1/testCloudExamplePrompt_shard1_replica2/../../../../dist filtered by solr-cell-\d.*\.jar to classpath: /Users/jenkins/workspace/Lucene-Solr-6.x-MacOSX/solr/build/solr-core/test/J0/temp/solr.util.TestSolrCLIRunExample_2022787A2936FC9-001/tempDir-002/node1/testCloudExamplePrompt_shard1_replica2/../../../../dist
   [junit4]   2> 3307127 WARN  (qtp1131987597-21678) [n:localhost:58309_solr c:testCloudExamplePrompt s:shard2  x:testCloudExamplePrompt_shard2_replica2] o.a.s.c.SolrConfig Couldn't add files from /Users/jenkins/workspace/Lucene-Solr-6.x-MacOSX/solr/build/solr-core/test/J0/temp/solr.util.TestSolrCLIRunExample_2022787A2936FC9-001/tempDir-002/node1/testCloudExamplePrompt_shard2_replica2/../../../../contrib/extraction/lib filtered by .*\.jar to classpath: /Users/jenkins/workspace/Lucene-Solr-6.x-MacOSX/solr/build/solr-core/test/J0/temp/solr.util.TestSolrCLIRunExample_2022787A2936FC9-001/tempDir-002/node1/testCloudExamplePrompt_shard2_replica2/../../../../contrib/extraction/lib
   [junit4]   2> 3307125 WARN  (qtp1131987597-21679) [n:localhost:58309_solr c:testCloudExamplePrompt s:shard2  x:testCloudExamplePrompt_shard2_replica1] o.a.s.c.SolrConfig Couldn't add files from /Users/jenkins/workspace/Lucene-Solr-6.x-MacOSX/solr/build/solr-core/test/J0/temp/solr.util.TestSolrCLIRunExample_2022787A2936FC9-001/tempDir-002/node1/testCloudExamplePrompt_shard2_replica1/../../../../contrib/extraction/lib filtered by .*\.jar to classpath: /Users/jenkins/workspace/Lucene-Solr-6.x-MacOSX/solr/build/solr-core/test/J0/temp/solr.util.TestSolrCLIRunExample_2022787A2936FC9-001/tempDir-002/node1/testCloudExamplePrompt_shard2_replica1/../../../../contrib/extraction/lib
   [junit4]   2> 3307128 WARN  (qtp1131987597-21677) [n:localhost:58309_solr c:testCloudExamplePrompt s:shard1  x:testCloudExamplePrompt_shard1_replica2] o.a.s.c.SolrConfig Couldn't add files from /Users/jenkins/workspace/Lucene-Solr-6.x-MacOSX/solr/build/solr-core/test/J0/temp/solr.util.TestSolrCLIRunExample_2022787A2936FC9-001/tempDir-002/node1/testCloudExamplePrompt_shard1_replica2/../../../../contrib/clustering/lib filtered by .*\.jar to classpath: /Users/jenkins/workspace/Lucene-Solr-6.x-MacOSX/solr/build/solr-core/test/J0/temp/solr.util.TestSolrCLIRunExample_2022787A2936FC9-001/tempDir-002/node1/testCloudExamplePrompt_shard1_replica2/../../../../contrib/clustering/lib
   [junit4]   2> 3307128 WARN  (qtp1131987597-21677) [n:localhost:58309_solr c:testCloudExamplePrompt s:shard1  x:testCloudExamplePrompt_shard1_replica2] o.a.s.c.SolrConfig Couldn't add files from /Users/jenkins/workspace/Lucene-Solr-6.x-MacOSX/solr/build/solr-core/test/J0/temp/solr.util.TestSolrCLIRunExample_2022787A2936FC9-001/tempDir-002/node1/testCloudExamplePrompt_shard1_replica2/../../../../dist filtered by solr-clustering-\d.*\.jar to classpath: /Users/jenkins/workspace/Lucene-Solr-6.x-MacOSX/solr/build/solr-core/test/J0/temp/solr.util.TestSolrCLIRunExample_2022787A2936FC9-001/tempDir-002/node1/testCloudExamplePrompt_shard1_replica2/../../../../dist
   [junit4]   2> 3307128 WARN  (qtp1131987597-21679) [n:localhost:58309_solr c:testCloudExamplePrompt s:shard2  x:testCloudExamplePrompt_shard2_replica1] o.a.s.c.SolrConfig Couldn't add files from /Users/jenkins/workspace/Lucene-Solr-6.x-MacOSX/solr/build/solr-core/test/J0/temp/solr.util.TestSolrCLIRunExample_2022787A2936FC9-001/tempDir-002/node1/testCloudExamplePrompt_shard2_replica1/../../../../dist filtered by solr-cell-\d.*\.jar to classpath: /Users/jenkins/workspace/Lucene-Solr-6.x-MacOSX/solr/build/solr-core/test/J0/temp/solr.util.TestSolrCLIRunExample_2022787A2936FC9-001/tempDir-002/node1/testCloudExamplePrompt_shard2_replica1/../../../../dist
   [junit4]   2> 3307129 WARN  (qtp1131987597-21678) [n:localhost:58309_solr c:testCloudExamplePrompt s:shard2  x:testCloudExamplePrompt_shard2_replica2] o.a.s.c.SolrConfig Couldn't add files from /Users/jenkins/workspace/Lucene-Solr-6.x-MacOSX/solr/build/solr-core/test/J0/temp/solr.util.TestSolrCLIRunExample_2022787A2936FC9-001/tempDir-002/node1/testCloudExamplePrompt_shard2_replica2/../../../../dist filtered by solr-cell-\d.*\.jar to classpath: /Users/jenkins/workspace/Lucene-Solr-6.x-MacOSX/solr/build/solr-core/test/J0/temp/solr.util.TestSolrCLIRunExample_2022787A2936FC9-001/tempDir-002/node1/testCloudExamplePrompt_shard2_replica2/../../../../dist
   [junit4]   2> 3307129 WARN  (qtp1131987597-21679) [n:localhost:58309_solr c:testCloudExamplePrompt s:shard2  x:testCloudExamplePrompt_shard2_replica1] o.a.s.c.SolrConfig Couldn't add files from /Users/jenkins/workspace/Lucene-Solr-6.x-MacOSX/solr/build/solr-core/test/J0/temp/solr.util.TestSolrCLIRunExample_2022787A2936FC9-001/tempDir-002/node1/testCloudExamplePrompt_shard2_replica1/../../../../contrib/clustering/lib filtered by .*\.jar to classpath: /Users/jenkins/workspace/Lucene-Solr-6.x-MacOSX/solr/build/solr-core/test/J0/temp/solr.util.TestSolrCLIRunExample_2022787A2936FC9-001/tempDir-002/node1/testCloudExamplePrompt_shard2_replica1/../../../../contrib/clustering/lib
   [junit4]   2> 3307130 WARN  (qtp1131987597-21677) [n:localhost:58309_solr c:testCloudExamplePrompt s:shard1  x:testCloudExamplePrompt_shard1_replica2] o.a.s.c.SolrConfig Couldn't add files from /Users/jenkins/workspace/Lucene-Solr-6.x-MacOSX/solr/build/solr-core/test/J0/temp/solr.util.TestSolrCLIRunExample_2022787A2936FC9-001/tempDir-002/node1/testCloudExamplePrompt_shard1_replica2/../../../../contrib/langid/lib filtered by .*\.jar to classpath: /Users/jenkins/workspace/Lucene-Solr-6.x-MacOSX/solr/build/solr-core/test/J0/temp/solr.util.TestSolrCLIRunExample_2022787A2936FC9-001/tempDir-002/node1/testCloudExamplePrompt_shard1_replica2/../../../../contrib/langid/lib
   [junit4]   2> 3307130 WARN  (qtp1131987597-21679) [n:localhost:58309_solr c:testCloudExamplePrompt s:shard2  x:testCloudExamplePrompt_shard2_replica1] o.a.s.c.SolrConfig Couldn't add files from /Users/jenkins/workspace/Lucene-Solr-6.x-MacOSX/solr/build/solr-core/test/J0/temp/solr.util.TestSolrCLIRunExample_2022787A2936FC9-001/tempDir-002/node1/testCloudExamplePrompt_shard2_replica1/../../../../dist filtered by solr-clustering-\d.*\.jar to classpath: /Users/jenkins/workspace/Lucene-Solr-6.x-MacOSX/solr/build/solr-core/test/J0/temp/solr.util.TestSolrCLIRunExample_2022787A2936FC9-001/tempDir-002/node1/testCloudExamplePrompt_shard2_replica1/../../../../dist
   [junit4]   2> 3307130 WARN  (qtp1131987597-21677) [n:localhost:58309_solr c:testCloudExamplePrompt s:shard1  x:testCloudExamplePrompt_shard1_replica2] o.a.s.c.SolrConfig Couldn't add files from /Users/jenkins/workspace/Lucene-Solr-6.x-MacOSX/solr/build/solr-core/test/J0/temp/solr.util.TestSolrCLIRunExample_2022787A2936FC9-001/tempDir-002/node1/testCloudExamplePrompt_shard1_replica2/../../../../dist filtered by solr-langid-\d.*\.jar to classpath: /Users/jenkins/workspace/Lucene-Solr-6.x-MacOSX/solr/build/solr-core/test/J0/temp/solr.util.TestSolrCLIRunExample_2022787A2936FC9-001/tempDir-002/node1/testCloudExamplePrompt_shard1_replica2/../../../../dist
   [junit4]   2> 3307130 WARN  (qtp1131987597-21678) [n:localhost:58309_solr c:testCloudExamplePrompt s:shard2  x:testCloudExamplePrompt_shard2_replica2] o.a.s.c.SolrConfig Couldn't add files from /Users/jenkins/workspace/Lucene-Solr-6.x-MacOSX/solr/build/solr-core/test/J0/temp/solr.util.TestSolrCLIRunExample_2022787A2936FC9-001/tempDir-002/node1/testCloudExamplePrompt_shard2_replica2/../../../../contrib/clustering/lib filtered by .*\.jar to classpath: /Users/jenkins/workspace/Lucene-Solr-6.x-MacOSX/solr/build/solr-core/test/J0/temp/solr.util.TestSolrCLIRunExample_2022787A2936FC9-001/tempDir-002/node1/testCloudExamplePrompt_shard2_replica2/../../../../contrib/clustering/lib
   [junit4]   2> 3307131 WARN  (qtp1131987597-21679) [n:localhost:58309_solr c:testCloudExamplePrompt s:shard2  x:testCloudExamplePrompt_shard2_replica1] o.a.s.c.SolrConfig Couldn't add files from /Users/jenkins/workspace/Lucene-Solr-6.x-MacOSX/solr/build/solr-core/test/J0/temp/solr.util.TestSolrCLIRunExample_2022787A2936FC9-001/tempDir-002/node1/testCloudExamplePrompt_shard2_replica1/../../../../contrib/langid/lib filtered by .*\.jar to classpath: /Users/jenkins/workspace/Lucene-Solr-6.x-MacOSX/solr/build/solr-core/test/J0/temp/solr.util.TestSolrCLIRunExample_2022787A2936FC9-001/tempDir-002/node1/testCloudExamplePrompt_shard2_replica1/../../../../contrib/langid/lib
   [junit4]   2> 3307131 WARN  (qtp1131987597-21678) [n:localhost:58309_solr c:testCloudExamplePrompt s:shard2  x:testCloudExamplePrompt_shard2_replica2] o.a.s.c.SolrConfig Couldn't add files from /Users/jenkins/workspace/Lucene-Solr-6.x-MacOSX/solr/build/solr-core/test/J0/temp/solr.util.TestSolrCLIRunExample_2022787A2936FC9-001/tempDir-002/node1/testCloudExamplePrompt_shard2_replica2/../../../../dist filtered by solr-clustering-\d.*\.jar to classpath: /Users/jenkins/workspace/Lucene-Solr-6.x-MacOSX/solr/build/solr-core/test/J0/temp/solr.util.TestSolrCLIRunExample_2022787A2936FC9-001/tempDir-002/node1/testCloudExamplePrompt_shard2_replica2/../../../../dist
   [junit4]   2> 3307131 WARN  (qtp1131987597-21679) [n:localhost:58309_solr c:testCloudExamplePrompt s:shard2  x:testCloudExamplePrompt_shard2_replica1] o.a.s.c.SolrConfig Couldn't add files from /Users/jenkins/workspace/Lucene-Solr-6.x-MacOSX/solr/build/solr-core/test/J0/temp/solr.util.TestSolrCLIRunExample_2022787A2936FC9-001/tempDir-002/node1/testCloudExamplePrompt_shard2_replica1/../../../../dist filtered by solr-langid-\d.*\.jar to classpath: /Users/jenkins/workspace/Lucene-Solr-6.x-MacOSX/solr/build/solr-core/test/J0/temp/solr.util.TestSolrCLIRunExample_2022787A2936FC9-001/tempDir-002/node1/testCloudExamplePrompt_shard2_replica1/../../../../dist
   [junit4]   2> 3307131 WARN  (qtp1131987597-21677) [n:localhost:58309_solr c:testCloudExamplePrompt s:shard1  x:testCloudExamplePrompt_shard1_replica2] o.a.s.c.SolrConfig Couldn't add files from /Users/jenkins/workspace/Lucene-Solr-6.x-MacOSX/solr/build/solr-core/test/J0/temp/solr.util.TestSolrCLIRunExample_2022787A2936FC9-001/tempDir-002/node1/testCloudExamplePrompt_shard1_replica2/../../../../contrib/velocity/lib filtered by .*\.jar to classpath: /Users/jenkins/workspace/Lucene-Solr-6.x-MacOSX/solr/build/solr-core/test/J0/temp/solr.util.TestSolrCLIRunExample_2022787A2936FC9-001/tempDir-002/node1/testCloudExamplePrompt_shard1_replica2/../../../../contrib/velocity/lib
   [junit4]   2> 3307131 WARN  (qtp1131987597-21677) [n:localhost:58309_solr c:testCloudExamplePrompt s:shard1  x:testCloudExamplePrompt_shard1_replica2] o.a.s.c.SolrConfig Couldn't add files from /Users/jenkins/workspace/Lucene-Solr-6.x-MacOSX/solr/build/solr-core/test/J0/temp/solr.util.TestSolrCLIRunExample_2022787A2936FC9-001/tempDir-002/node1/testCloudExamplePrompt_shard1_replica2/../../../../dist filtered by solr-velocity-\d.*\.jar to classpath: /Users/jenkins/workspace/Lucene-Solr-6.x-MacOSX/solr/build/solr-core/test/J0/temp/solr.util.TestSolrCLIRunExample_2022787A2936FC9-001/tempDir-002/node1/testCloudExamplePrompt_shard1_replica2/../../../../dist
   [junit4]   2> 3307132 WARN  (qtp1131987597-21679) [n:localhost:58309_solr c:testCloudExamplePrompt s:shard2  x:testCloudExamplePrompt_shard2_replica1] o.a.s.c.SolrConfig Couldn't add files from /Users/jenkins/workspace/Lucene-Solr-6.x-MacOSX/solr/build/solr-core/test/J0/temp/solr.util.TestSolrCLIRunExample_2022787A2936FC9-001/tempDir-002/node1/testCloudExamplePrompt_shard2_replica1/../../../../contrib/velocity/lib filtered by .*\.jar to classpath: /Users/jenkins/workspace/Lucene-Solr-6.x-MacOSX/solr/build/solr-core/test/J0/temp/solr.util.TestSolrCLIRunExample_2022787A2936FC9-001/tempDir-002/node1/testCloudExamplePrompt_shard2_replica1/../../../../contrib/velocity/lib
   [junit4]   2> 3307132 WARN  (qtp1131987597-21679) [n:localhost:58309_solr c:testCloudExamplePrompt s:shard2  x:testCloudExamplePrompt_shard2_replica1] o.a.s.c.SolrConfig Couldn't add files from /Users/jenkins/workspace/Lucene-Solr-6.x-MacOSX/solr/build/solr-core/test/J0/temp/solr.util.TestSolrCLIRunExample_2022787A2936FC9-001/tempDir-002/node1/testCloudExamplePrompt_shard2_replica1/../../../../dist filtered by solr-velocity-\d.*\.jar to classpath: /Users/jenkins/workspace/Lucene-Solr-6.x-MacOSX/solr/build/solr-core/test/J0/temp/solr.util.TestSolrCLIRunExample_2022787A2936FC9-001/tempDir-002/node1/testCloudExamplePrompt_shard2_replica1/../../../../dist
   [junit4]   2> 3307132 WARN  (qtp1131987597-21678) [n:localhost:58309_solr c:testCloudExamplePrompt s:shard2  x:testCloudExamplePrompt_shard2_replica2] o.a.s.c.SolrConfig Couldn't add files from /Users/jenkins/workspace/Lucene-Solr-6.x-MacOSX/solr/build/solr-core/test/J0/temp/solr.util.TestSolrCLIRunExample_2022787A2936FC9-001/tempDir-002/node1/testCloudExamplePrompt_shard2_replica2/../../../../contrib/langid/lib filtered by .*\.jar to classpath: /Users/jenkins/workspace/Lucene-Solr-6.x-MacOSX/solr/build/solr-core/test/J0/temp/solr.util.TestSolrCLIRunExample_2022787A2936FC9-001/tempDir-002/node1/testCloudExamplePrompt_shard2_replica2/../../../../contrib/langid/lib
   [junit4]   2> 3307132 WARN  (qtp1131987597-21678) [n:localhost:58309_solr c:testCloudExamplePrompt s:shard2  x:testCloudExamplePrompt_shard2_replica2] o.a.s.c.SolrConfig Couldn't add files from /Users/jenkins/workspace/Lucene-Solr-6.x-MacOSX/solr/build/solr-core/test/J0/temp/solr.util.TestSolrCLIRunExample_2022787A2936FC9-001/tempDir-002/node1/testCloudExamplePrompt_shard2_replica2/../../../../dist filtered by solr-langid-\d.*\.jar to classpath: /Users/jenkins/workspace/Lucene-Solr-6.x-MacOSX/solr/build/solr-core/test/J0/temp/solr.util.TestSolrCLIRunExample_2022787A2936FC9-001/tempDir-002/node1/testCloudExamplePrompt_shard2_replica2/../../../../dist
   [junit4]   2> 3307133 WARN  (qtp1131987597-21678) [n:localhost:58309_solr c:testCloudExamplePrompt s:shard2  x:testCloudExamplePrompt_shard2_replica2] o.a.s.c.SolrConfig Couldn't add files from /Users/jenkins/workspace/Lucene-Solr-6.x-MacOSX/solr/build/solr-core/test/J0/temp/solr.util.TestSolrCLIRunExample_2022787A2936FC9-001/tempDir-002/node1/testCloudExamplePrompt_shard2_replica2/../../../../contrib/velocity/lib filtered by .*\.jar to classpath: /Users/jenkins/workspace/Lucene-Solr-6.x-MacOSX/solr/build/solr-core/test/J0/temp/solr.util.TestSolrCLIRunExample_2022787A2936FC9-001/tempDir-002/node1/testCloudExamplePrompt_shard2_replica2/../../../../contrib/velocity/lib
   [junit4]   2> 3307134 WARN  (qtp1131987597-21678) [n:localhost:58309_solr c:testCloudExamplePrompt s:shard2  x:testCloudExamplePrompt_shard2_replica2] o.a.s.c.SolrConfig Couldn't add files from /Users/jenkins/workspace/Lucene-Solr-6.x-MacOSX/solr/build/solr-core/test/J0/temp/solr.util.TestSolrCLIRunExample_2022787A2936FC9-001/tempDir-002/node1/testCloudExamplePrompt_shard2_replica2/../../../../dist filtered by solr-velocity-\d.*\.jar to classpath: /Users/jenkins/workspace/Lucene-Solr-6.x-MacOSX/solr/build/solr-core/test/J0/temp/solr.util.TestSolrCLIRunExample_2022787A2936FC9-001/tempDir-002/node1/testCloudExamplePrompt_shard2_replica2/../../../../dist
   [junit4]   2> 3307139 INFO  (qtp1131987597-21677) [n:localhost:58309_solr c:testCloudExamplePrompt s:shard1  x:testCloudExamplePrompt_shard1_replica2] o.a.s.c.SolrConfig Using Lucene MatchVersion: 6.1.0
   [junit4]   2> 3307140 INFO  (qtp1131987597-21679) [n:localhost:58309_solr c:testCloudExamplePrompt s:shard2  x:testCloudExamplePrompt_shard2_replica1] o.a.s.c.SolrConfig Using Lucene MatchVersion: 6.1.0
   [junit4]   2> 3307150 INFO  (qtp1131987597-21678) [n:localhost:58309_solr c:testCloudExamplePrompt s:shard2  x:testCloudExamplePrompt_shard2_replica2] o.a.s.c.SolrConfig Using Lucene MatchVersion: 6.1.0
   [junit4]   2> 3307153 INFO  (qtp1131987597-21677) [n:localhost:58309_solr c:testCloudExamplePrompt s:shard1  x:testCloudExamplePrompt_shard1_replica2] o.a.s.c.SolrConfig Loaded SolrConfig: solrconfig.xml
   [junit4]   2> 3307161 INFO  (qtp1131987597-21677) [n:localhost:58309_solr c:testCloudExamplePrompt s:shard1  x:testCloudExamplePrompt_shard1_replica2] o.a.s.s.IndexSchema [testCloudExamplePrompt_shard1_replica2] Schema name=example-data-driven-schema
   [junit4]   2> 3307182 INFO  (qtp1131987597-21679) [n:localhost:58309_solr c:testCloudExamplePrompt s:shard2  x:testCloudExamplePrompt_shard2_replica1] o.a.s.c.SolrConfig Loaded SolrConfig: solrconfig.xml
   [junit4]   2> 3307184 INFO  (qtp1131987597-21672) [n:localhost:58309_solr c:testCloudExamplePrompt s:shard1  x:testCloudExamplePrompt_shard1_replica1] o.a.s.c.RequestParams conf resource params.json loaded . version : 0 
   [junit4]   2> 3307184 INFO  (qtp1131987597-21672) [n:localhost:58309_solr c:testCloudExamplePrompt s:shard1  x:testCloudExamplePrompt_shard1_replica1] o.a.s.c.RequestParams request params refreshed to version 0
   [junit4]   2> 3307184 INFO  (qtp1131987597-21672) [n:localhost:58309_solr c:testCloudExamplePrompt s:shard1  x:testCloudExamplePrompt_shard1_replica1] o.a.s.c.SolrConfig current version of requestparams : 0
   [junit4]   2> 3307185 INFO  (qtp1131987597-21672) [n:localhost:58309_solr c:testCloudExamplePrompt s:shard1  x:testCloudExamplePrompt_shard1_replica1] o.a.s.c.SolrConfig Adding specified lib dirs to ClassLoader
   [junit4]   2> 3307186 INFO  (qtp1131987597-21678) [n:localhost:58309_solr c:testCloudExamplePrompt s:shard2  x:testCloudExamplePrompt_shard2_replica2] o.a.s.c.SolrConfig Loaded SolrConfig: solrconfig.xml
   [junit4]   2> 3307186 WARN  (qtp1131987597-21672) [n:localhost:58309_solr c:testCloudExamplePrompt s:shard1  x:testCloudExamplePrompt_shard1_replica1] o.a.s.c.SolrConfig Couldn't add files from /Users/jenkins/workspace/Lucene-Solr-6.x-MacOSX/solr/build/solr-core/test/J0/temp/solr.util.TestSolrCLIRunExample_2022787A2936FC9-001/tempDir-002/node1/testCloudExamplePrompt_shard1_replica1/../../../../contrib/extraction/lib filtered by .*\.jar to classpath: /Users/jenkins/workspace/Lucene-Solr-6.x-MacOSX/solr/build/solr-core/test/J0/temp/solr.util.TestSolrCLIRunExample_2022787A2936FC9-001/tempDir-002/node1/testCloudExamplePrompt_shard1_replica1/../../../../contrib/extraction/lib
   [junit4]   2> 3307187 WARN  (qtp1131987597-21672) [n:localhost:58309_solr c:testCloudExamplePrompt s:shard1  x:testCloudExamplePrompt_shard1_replica1] o.a.s.c.SolrConfig Couldn't add files from /Users/jenkins/workspace/Lucene-Solr-6.x-MacOSX/solr/build/solr-core/test/J0/temp/solr.util.TestSolrCLIRunExample_2022787A2936FC9-001/tempDir-002/node1/testCloudExamplePrompt_shard1_replica1/../../../../dist filtered by solr-cell-\d.*\.jar to classpath: /Users/jenkins/workspace/Lucene-Solr-6.x-MacOSX/solr/build/solr-core/test/J0/temp/solr.util.TestSolrCLIRunExample_2022787A2936FC9-001/tempDir-002/node1/testCloudExamplePrompt_shard1_replica1/../../../../dist
   [junit4]   2> 3307188 WARN  (qtp1131987597-21672) [n:localhost:58309_solr c:testCloudExamplePrompt s:shard1  x:testCloudExamplePrompt_shard1_replica1] o.a.s.c.SolrConfig Couldn't add files from /Users/jenkins/workspace/Lucene-Solr-6.x-MacOSX/solr/build/solr-core/test/J0/temp/solr.util.TestSolrCLIRunExample_2022787A2936FC9-001/tempDir-002/node1/testCloudExamplePrompt_shard1_replica1/../../../../contrib/clustering/lib filtered by .*\.jar to classpath: /Users/jenkins/workspace/Lucene-Solr-6.x-MacOSX/solr/build/solr-core/test/J0/temp/solr.util.TestSolrCLIRunExample_2022787A2936FC9-001/tempDir-002/node1/testCloudExamplePrompt_shard1_replica1/../../../../contrib/clustering/lib
   [junit4]   2> 3307189 WARN  (qtp1131987597-21672) [n:localhost:58309_solr c:testCloudExamplePrompt s:shard1  x:testCloudExamplePrompt_shard1_replica1] o.a.s.c.SolrConfig Couldn't add files from /Users/jenkins/workspace/Lucene-Solr-6.x-MacOSX/solr/build/solr-core/test/J0/temp/solr.util.TestSolrCLIRunExample_2022787A2936FC9-001/tempDir-002/node1/testCloudExamplePrompt_shard1_replica1/../../../../dist filtered by solr-clustering-\d.*\.jar to classpath: /Users/jenkins/workspace/Lucene-Solr-6.x-MacOSX/solr/build/solr-core/test/J0/temp/solr.util.TestSolrCLIRunExample_2022787A2936FC9-001/tempDir-002/node1/testCloudExamplePrompt_shard1_replica1/../../../../dist
   [junit4]   2> 3307190 WARN  (qtp1131987597-21672) [n:localhost:58309_solr c:testCloudExamplePrompt s:shard1  x:testCloudExamplePrompt_shard1_replica1] o.a.s.c.SolrConfig Couldn't add files from /Users/jenkins/workspace/Lucene-Solr-6.x-MacOSX/solr/build/solr-core/test/J0/temp/solr.util.TestSolrCLIRunExample_2022787A2936FC9-001/tempDir-002/node1/testCloudExamplePrompt_shard1_replica1/../../../../contrib/langid/lib filtered by .*\.jar to classpath: /Users/jenkins/workspace/Lucene-Solr-6.x-MacOSX/solr/build/solr-core/test/J0/temp/solr.util.TestSolrCLIRunExample_2022787A2936FC9-001/tempDir-002/node1/testCloudExamplePrompt_shard1_replica1/../../../../contrib/langid/lib
   [junit4]   2> 3307190 WARN  (qtp1131987597-21672) [n:localhost:58309_solr c:testCloudExamplePrompt s:shard1  x:testCloudExamplePrompt_shard1_replica1] o.a.s.c.SolrConfig Couldn't add files from /Users/jenkins/workspace/Lucene-Solr-6.x-MacOSX/solr/build/solr-core/test/J0/temp/solr.util.TestSolrCLIRunExample_2022787A2936FC9-001/tempDir-002/node1/testCloudExamplePrompt_shard1_replica1/../../../../dist filtered by solr-langid-\d.*\.jar to classpath: /Users/jenkins/workspace/Lucene-Solr-6.x-MacOSX/solr/build/solr-core/test/J0/temp/solr.util.TestSolrCLIRunExample_2022787A2936FC9-001/tempDir-002/node1/testCloudExamplePrompt_shard1_replica1/../../../../dist
   [junit4]   2> 3307192 WARN  (qtp1131987597-21672) [n:localhost:58309_solr c:testCloudExamplePrompt s:shard1  x:testCloudExamplePrompt_shard1_replica1] o.a.s.c.SolrConfig Couldn't add files from /Users/jenkins/workspace/Lucene-Solr-6.x-MacOSX/solr/build/solr-core/test/J0/temp/solr.util.TestSolrCLIRunExample_2022787A2936FC9-001/tempDir-002/node1/testCloudExamplePrompt_shard1_replica1/../../../../contrib/velocity/lib filtered by .*\.jar to classpath: /Users/jenkins/workspace/Lucene-Solr-6.x-MacOSX/solr/build/solr-core/test/J0/temp/solr.util.TestSolrCLIRunExample_2022787A2936FC9-001/tempDir-002/node1/testCloudExamplePrompt_shard1_replica1/../../../../contrib/velocity/lib
   [junit4]   2> 3307192 WARN  (qtp1131987597-21672) [n:localhost:58309_solr c:testCloudExamplePrompt s:shard1  x:testCloudExamplePrompt_shard1_replica1] o.a.s.c.SolrConfig Couldn't add files from /Users/jenkins/workspace/Lucene-Solr-6.x-MacOSX/solr/build/solr-core/test/J0/temp/solr.util.TestSolrCLIRunExample_2022787A2936FC9-001/tempDir-002/node1/testCloudExamplePrompt_shard1_replica1/../../../../dist filtered by solr-velocity-\d.*\.jar to classpath: /Users/jenkins/workspace/Lucene-Solr-6.x-MacOSX/solr/build/solr-core/test/J0/temp/solr.util.TestSolrCLIRunExample_2022787A2936FC9-001/tempDir-002/node1/testCloudExamplePrompt_shard1_replica1/../../../../dist
   [junit4]   2> 3307202 INFO  (qtp1131987597-21672) [n:localhost:58309_solr c:testCloudExamplePrompt s:shard1  x:testCloudExamplePrompt_shard1_replica1] o.a.s.c.SolrConfig Using Lucene MatchVersion: 6.1.0
   [junit4]   2> 3307218 INFO  (qtp1131987597-21679) [n:localhost:58309_solr c:testCloudExamplePrompt s:shard2  x:testCloudExamplePrompt_shard2_replica1] o.a.s.s.IndexSchema [testCloudExamplePrompt_shard2_replica1] Schema name=example-data-driven-schema
   [junit4]   2> 3307221 INFO  (qtp1131987597-21678) [n:localhost:58309_solr c:testCloudExamplePrompt s:shard2  x:testCloudExamplePrompt_shard2_replica2] o.a.s.s.IndexSchema [testCloudExamplePrompt_shard2_replica2] Schema name=example-data-driven-schema
   [junit4]   2> 3307225 INFO  (qtp1131987597-21672) [n:localhost:58309_solr c:testCloudExamplePrompt s:shard1  x:testCloudExamplePrompt_shard1_replica1] o.a.s.c.SolrConfig Loaded SolrConfig: solrconfig.xml
   [junit4]   2> 3307262 INFO  (qtp1131987597-21672) [n:localhost:58309_solr c:testCloudExamplePrompt s:shard1  x:testCloudExamplePrompt_shard1_replica1] o.a.s.s.IndexSchema [testCloudExamplePrompt_shard1_replica1] Schema name=example-data-driven-schema
   [junit4]   2> 3307463 INFO  (qtp1131987597-21677) [n:localhost:58309_solr c:testCloudExamplePrompt s:shard1  x:testCloudExamplePrompt_shard1_replica2] o.a.s.s.IndexSchema unique key field: id
   [junit4]   2> 3307499 INFO  (qtp1131987597-21672) [n:localhost:58309_solr c:testCloudExamplePrompt s:shard1  x:testCloudExamplePrompt_shard1_replica1] o.a.s.s.IndexSchema unique key field: id
   [junit4]   2> 3307502 INFO  (qtp1131987597-21679) [n:localhost:58309_solr c:testCloudExamplePrompt s:shard2  x:testCloudExamplePrompt_shard2_replica1] o.a.s.s.IndexSchema unique key field: id
   [junit4]   2> 3307564 INFO  (qtp1131987597-21678) [n:localhost:58309_solr c:testCloudExamplePrompt s:shard2  x:testCloudExamplePrompt_shard2_replica2] o.a.s.s.IndexSchema unique key field: id
   [junit4]   2> 3307648 INFO  (qtp1131987597-21677) [n:localhost:58309_solr c:testCloudExamplePrompt s:shard1  x:testCloudExamplePrompt_shard1_replica2] o.a.s.s.FileExchangeRateProvider Reloading exchange rates from file currency.xml
   [junit4]   2> 3307651 INFO  (qtp1131987597-21677) [n:localhost:58309_solr c:testCloudExamplePrompt s:shard1  x:testCloudExamplePrompt_shard1_replica2] o.a.s.s.FileExchangeRateProvider Reloading exchange rates from file currency.xml
   [junit4]   2> 3307724 INFO  (qtp1131987597-21678) [n:localhost:58309_solr c:testCloudExamplePrompt s:shard2  x:testCloudExamplePrompt_shard2_replica2] o.a.s.s.FileExchangeRateProvider Reloading exchange rates from file currency.xml

[...truncated too long message...]

temp/solr.util.TestSolrCLIRunExample_2022787A2936FC9-001/tempDir-003/schemaless/solr/gettingstarted/data;done=false>>]
   [junit4]   2> 3337765 INFO  (coreCloseExecutor-11072-thread-1) [    x:gettingstarted] o.a.s.c.CachingDirectoryFactory Closing directory: /Users/jenkins/workspace/Lucene-Solr-6.x-MacOSX/solr/build/solr-core/test/J0/temp/solr.util.TestSolrCLIRunExample_2022787A2936FC9-001/tempDir-003/schemaless/solr/gettingstarted/data
   [junit4]   2> 3337766 INFO  (TEST-TestSolrCLIRunExample.testSchemalessExample-seed#[2022787A2936FC9]) [    ] o.e.j.s.h.ContextHandler Stopped o.e.j.s.ServletContextHandler@63e90003{/solr,null,UNAVAILABLE}
   [junit4]   2> 3337767 INFO  (TEST-TestSolrCLIRunExample.testSchemalessExample-seed#[2022787A2936FC9]) [    ] o.a.s.u.TestSolrCLIRunExample Stopped standalone Solr instance running on port 58373
   [junit4]   2> 3337767 INFO  (TEST-TestSolrCLIRunExample.testSchemalessExample-seed#[2022787A2936FC9]) [    ] o.a.s.SolrTestCaseJ4 ###Ending testSchemalessExample
   [junit4]   2> 3337768 INFO  (SUITE-TestSolrCLIRunExample-seed#[2022787A2936FC9]-worker) [    ] o.a.s.SolrTestCaseJ4 ###deleteCore
   [junit4]   2> NOTE: leaving temporary files on disk at: /Users/jenkins/workspace/Lucene-Solr-6.x-MacOSX/solr/build/solr-core/test/J0/temp/solr.util.TestSolrCLIRunExample_2022787A2936FC9-001
   [junit4]   2> NOTE: test params are: codec=Asserting(Lucene60): {}, docValues:{}, maxPointsInLeafNode=1137, maxMBSortInHeap=6.598533396532496, sim=RandomSimilarity(queryNorm=false,coord=yes): {}, locale=en-SG, timezone=Antarctica/Syowa
   [junit4]   2> NOTE: Mac OS X 10.11.3 x86_64/Oracle Corporation 1.8.0_72 (64-bit)/cpus=3,threads=1,free=50598208,total=529530880
   [junit4]   2> NOTE: All tests run in this JVM: [OverriddenZkACLAndCredentialsProvidersTest, TestBulkSchemaAPI, ScriptEngineTest, TestMinMaxOnMultiValuedField, TestSchemaManager, TestTolerantUpdateProcessorCloud, TestSchemaSimilarityResource, TestCopyFieldCollectionResource, HdfsNNFailoverTest, SchemaVersionSpecificBehaviorTest, WrapperMergePolicyFactoryTest, TestConfigSetsAPIExclusivity, SimpleMLTQParserTest, MBeansHandlerTest, BigEndianAscendingWordDeserializerTest, AddBlockUpdateTest, TestMaxScoreQueryParser, TestHashPartitioner, ShardSplitTest, TestAuthenticationFramework, TestComplexPhraseQParserPlugin, SolrRequestParserTest, TestSchemaNameResource, TestSerializedLuceneMatchVersion, TlogReplayBufferedWhileIndexingTest, TestReplicationHandler, ReturnFieldsTest, ClassificationUpdateProcessorFactoryTest, TestPseudoReturnFields, AlternateDirectoryTest, TestChildDocTransformer, JavabinLoaderTest, ZkControllerTest, IndexBasedSpellCheckerTest, DeleteReplicaTest, TestGroupingSearch, SSLMigrationTest, AnalysisAfterCoreReloadTest, SyncSliceTest, TestFaceting, ForceLeaderTest, TestRequestStatusCollectionAPI, TestQueryWrapperFilter, TestManagedResourceStorage, SolrTestCaseJ4Test, TestRandomRequestDistribution, UUIDUpdateProcessorFallbackTest, PrimUtilsTest, BlockJoinFacetSimpleTest, BadCopyFieldTest, CollectionStateFormat2Test, LeaderFailoverAfterPartitionTest, TestJmxIntegration, TestHashQParserPlugin, ClusterStateUpdateTest, TestFileDictionaryLookup, OverseerTaskQueueTest, DocValuesMultiTest, TestExtendedDismaxParser, ConnectionManagerTest, TestDFRSimilarityFactory, ZkCLITest, TestPerFieldSimilarityClassic, TestSearcherReuse, SimplePostToolTest, TestCoreContainer, TestFunctionQuery, TestTolerantSearch, RequiredFieldsTest, TestCollationFieldDocValues, JSONWriterTest, LeaderElectionTest, BitVectorTest, MergeStrategyTest, PrimitiveFieldTypeTest, DistributedFacetPivotLargeTest, IndexSchemaTest, CloudExitableDirectoryReaderTest, TestLazyCores, SuggestComponentContextFilterQueryTest, TestIntervalFaceting, FacetPivotSmallTest, ParsingFieldUpdateProcessorsTest, TestArbitraryIndexDir, TestExactStatsCache, CoreAdminCreateDiscoverTest, BlockJoinFacetDistribTest, DistributedDebugComponentTest, TestCryptoKeys, TestFieldCollectionResource, UUIDFieldTest, TestDFISimilarityFactory, CoreMergeIndexesAdminHandlerTest, TestMergePolicyConfig, TestSolrFieldCacheMBean, PeerSyncTest, TermsComponentTest, TestPivotHelperCode, SystemInfoHandlerTest, TestDocBasedVersionConstraints, ChaosMonkeyNothingIsSafeTest, PolyFieldTest, TestWordDelimiterFilterFactory, SliceStateTest, SharedFSAutoReplicaFailoverUtilsTest, TestJsonRequest, MoreLikeThisHandlerTest, HardAutoCommitTest, ZkStateWriterTest, HdfsBasicDistributedZkTest, TestDocumentBuilder, TestStressVersions, DistributedSpellCheckComponentTest, TestDistribIDF, TestReplicationHandlerBackup, TestComponentsName, TestXmlQParser, SpatialFilterTest, TestConfigSetImmutable, LeaderInitiatedRecoveryOnShardRestartTest, DocumentBuilderTest, FullHLLTest, TestReloadAndDeleteDocs, DirectUpdateHandlerTest, TestXIncludeConfig, TestCursorMarkWithoutUniqueKey, TestIBSimilarityFactory, OverseerRolesTest, TestSurroundQueryParser, URLClassifyProcessorTest, TestAnalyzedSuggestions, HdfsDirectoryTest, HLLUtilTest, TestManagedStopFilterFactory, ResponseHeaderTest, ClusterStateTest, TestPartialUpdateDeduplication, QueryResultKeyTest, DisMaxRequestHandlerTest, BasicDistributedZk2Test, CollectionsAPIDistributedZkTest, ShardRoutingTest, FullSolrCloudDistribCmdsTest, TestRandomDVFaceting, ShardRoutingCustomTest, TestRealTimeGet, TestStressReorder, TestReload, TestRangeQuery, SimpleFacetsTest, SolrCoreTest, StatsComponentTest, SpellCheckComponentTest, QueryElevationComponentTest, ConvertedLegacyTest, TestSort, TestFiltering, HighlighterTest, SoftAutoCommitTest, ShowFileRequestHandlerTest, DistributedQueryElevationComponentTest, CurrencyFieldXmlFileTest, TestCoreDiscovery, SignatureUpdateProcessorFactoryTest, SuggesterFSTTest, CoreAdminHandlerTest, DocValuesTest, SuggesterTSTTest, TestStressLucene, TestTrie, TestCSVLoader, SolrCoreCheckLockOnStartupTest, TestUpdate, TestAtomicUpdateErrorCases, QueryEqualityTest, DefaultValueUpdateProcessorTest, StatelessScriptUpdateProcessorFactoryTest, TestRemoteStreaming, TestSolrDeletionPolicy1, SolrInfoMBeanTest, XsltUpdateRequestHandlerTest, LukeRequestHandlerTest, TestQueryUtils, StandardRequestHandlerTest, DirectSolrSpellCheckerTest, DocumentAnalysisRequestHandlerTest, TestQueryTypes, TestOmitPositions, FileBasedSpellCheckerTest, XmlUpdateRequestHandlerTest, TestValueSourceCache, PathHierarchyTokenizerFactoryTest, TestIndexingPerformance, FastVectorHighlighterTest, RegexBoostProcessorTest, SolrPluginUtilsTest, TestCollationField, UpdateRequestProcessorFactoryTest, QueryParsingTest, UniqFieldsUpdateProcessorFactoryTest, JsonLoaderTest, TestPHPSerializedResponseWriter, PingRequestHandlerTest, SOLR749Test, TestQuerySenderListener, UpdateParamsTest, TestQuerySenderNoQuery, CopyFieldTest, SolrIndexConfigTest, BadComponentTest, TestStressRecovery, SpellPossibilityIteratorTest, TestCodecSupport, TestJmxMonitoredMap, TestFastOutputStream, TestFastLRUCache, SpellingQueryConverterTest, DOMUtilTest, TestLRUCache, CircularListTest, CursorPagingTest, TestHighlightDedupGrouping, TestEmbeddedSolrServerConstructors, TestJettySolrRunner, ActionThrottleTest, AssignTest, AsyncMigrateRouteKeyTest, CollectionsAPIAsyncDistributedZkTest, CollectionsAPISolrJTest, DeleteInactiveReplicaTest, DeleteLastCustomShardedReplicaTest, DistribCursorPagingTest, DistribJoinFromCollectionTest, MultiThreadedOCPTest, OutOfBoxZkACLAndCredentialsProvidersTest, OverseerCollectionConfigSetProcessorTest, OverseerStatusTest, ReplicationFactorTest, RestartWhileUpdatingTest, SimpleCollectionCreateDeleteTest, SolrCloudExampleTest, TestCollectionAPI, TestMiniSolrCloudClusterBase, TestMiniSolrCloudClusterSSL, TestReplicaProperties, TestShortCircuitedRequests, TestSizeLimitedDistributedMap, TriLevelCompositeIdRoutingTest, ExitableDirectoryReaderTest, HdfsDirectoryFactoryTest, TestConfigOverlay, TestConfigSetProperties, TestConfigSets, TestDynamicLoading, TestConfigReload, TestRestoreCore, TestSolrConfigHandlerCloud, InfoHandlerTest, SecurityConfHandlerTest, SegmentsInfoRequestHandlerTest, DistributedExpandComponentTest, DistributedFacetPivotSmallAdvancedTest, DistributedFacetPivotWhiteBoxTest, DistributedQueryComponentCustomSortTest, DistributedQueryComponentOptimizationTest, TestDistributedStatsComponentCardinality, TestNoOpRegenerator, TestRecoveryHdfs, TestSmileRequest, TestOrdValues, TestSortByMinMaxFunction, BJQParserTest, BlockJoinFacetRandomTest, GraphQueryTest, TestScoreJoinQPNoScore, TestClassicSimilarityFactory, TestDefaultStatsCache, TestExactSharedStatsCache, TestAuthorizationFramework, BlockDirectoryTest, TolerantUpdateProcessorTest, DistanceUnitsTest, TestObjectReleaseTracker, TestRTimerTree, TestSolrCLIRunExample]
   [junit4] Completed [581/585 (1!)] on J0 in 32.75s, 3 tests, 1 failure, 1 skipped <<< FAILURES!

[...truncated 30 lines...]
BUILD FAILED
/Users/jenkins/workspace/Lucene-Solr-6.x-MacOSX/build.xml:740: The following error occurred while executing this line:
/Users/jenkins/workspace/Lucene-Solr-6.x-MacOSX/build.xml:684: The following error occurred while executing this line:
/Users/jenkins/workspace/Lucene-Solr-6.x-MacOSX/build.xml:59: The following error occurred while executing this line:
/Users/jenkins/workspace/Lucene-Solr-6.x-MacOSX/solr/build.xml:233: The following error occurred while executing this line:
/Users/jenkins/workspace/Lucene-Solr-6.x-MacOSX/solr/common-build.xml:529: The following error occurred while executing this line:
/Users/jenkins/workspace/Lucene-Solr-6.x-MacOSX/lucene/common-build.xml:1457: The following error occurred while executing this line:
/Users/jenkins/workspace/Lucene-Solr-6.x-MacOSX/lucene/common-build.xml:1014: There were test failures: 585 suites (10 ignored), 2360 tests, 1 failure, 119 ignored (69 assumptions) [seed: 2022787A2936FC9]

Total time: 78 minutes 44 seconds
Build step 'Invoke Ant' marked build as failure
Archiving artifacts
[WARNINGS] Skipping publisher since build result is FAILURE
Recording test results
Email was triggered for: Failure - Any
Sending email for trigger: Failure - Any



Mime
View raw message