lucene-dev mailing list archives

Site index · List index
Message view « Date » · « Thread »
Top « Date » · « Thread »
From Policeman Jenkins Server <jenk...@thetaphi.de>
Subject [JENKINS] Lucene-Solr-6.x-MacOSX (64bit/jdk1.8.0) - Build # 57 - Still Failing!
Date Wed, 06 Apr 2016 07:44:15 GMT
Build: http://jenkins.thetaphi.de/job/Lucene-Solr-6.x-MacOSX/57/
Java: 64bit/jdk1.8.0 -XX:+UseCompressedOops -XX:+UseConcMarkSweepGC

1 tests failed.
FAILED:  org.apache.solr.handler.TestReplicationHandler.doTestIndexAndConfigAliasReplication

Error Message:
[/Users/jenkins/workspace/Lucene-Solr-6.x-MacOSX/solr/build/solr-core/test/J0/temp/solr.handler.TestReplicationHandler_DF38016AA724300F-001/solr-instance-006/./collection1/data, /Users/jenkins/workspace/Lucene-Solr-6.x-MacOSX/solr/build/solr-core/test/J0/temp/solr.handler.TestReplicationHandler_DF38016AA724300F-001/solr-instance-006/./collection1/data/index.20160406195441695, /Users/jenkins/workspace/Lucene-Solr-6.x-MacOSX/solr/build/solr-core/test/J0/temp/solr.handler.TestReplicationHandler_DF38016AA724300F-001/solr-instance-006/./collection1/data/index.20160406195441554] expected:<2> but was:<3>

Stack Trace:
java.lang.AssertionError: [/Users/jenkins/workspace/Lucene-Solr-6.x-MacOSX/solr/build/solr-core/test/J0/temp/solr.handler.TestReplicationHandler_DF38016AA724300F-001/solr-instance-006/./collection1/data, /Users/jenkins/workspace/Lucene-Solr-6.x-MacOSX/solr/build/solr-core/test/J0/temp/solr.handler.TestReplicationHandler_DF38016AA724300F-001/solr-instance-006/./collection1/data/index.20160406195441695, /Users/jenkins/workspace/Lucene-Solr-6.x-MacOSX/solr/build/solr-core/test/J0/temp/solr.handler.TestReplicationHandler_DF38016AA724300F-001/solr-instance-006/./collection1/data/index.20160406195441554] expected:<2> but was:<3>
	at __randomizedtesting.SeedInfo.seed([DF38016AA724300F:284BEF3261CC9FE9]:0)
	at org.junit.Assert.fail(Assert.java:93)
	at org.junit.Assert.failNotEquals(Assert.java:647)
	at org.junit.Assert.assertEquals(Assert.java:128)
	at org.junit.Assert.assertEquals(Assert.java:472)
	at org.apache.solr.handler.TestReplicationHandler.checkForSingleIndex(TestReplicationHandler.java:818)
	at org.apache.solr.handler.TestReplicationHandler.doTestIndexAndConfigAliasReplication(TestReplicationHandler.java:1248)
	at sun.reflect.NativeMethodAccessorImpl.invoke0(Native Method)
	at sun.reflect.NativeMethodAccessorImpl.invoke(NativeMethodAccessorImpl.java:62)
	at sun.reflect.DelegatingMethodAccessorImpl.invoke(DelegatingMethodAccessorImpl.java:43)
	at java.lang.reflect.Method.invoke(Method.java:498)
	at com.carrotsearch.randomizedtesting.RandomizedRunner.invoke(RandomizedRunner.java:1764)
	at com.carrotsearch.randomizedtesting.RandomizedRunner$8.evaluate(RandomizedRunner.java:871)
	at com.carrotsearch.randomizedtesting.RandomizedRunner$9.evaluate(RandomizedRunner.java:907)
	at com.carrotsearch.randomizedtesting.RandomizedRunner$10.evaluate(RandomizedRunner.java:921)
	at com.carrotsearch.randomizedtesting.rules.SystemPropertiesRestoreRule$1.evaluate(SystemPropertiesRestoreRule.java:57)
	at org.apache.lucene.util.TestRuleSetupTeardownChained$1.evaluate(TestRuleSetupTeardownChained.java:49)
	at org.apache.lucene.util.AbstractBeforeAfterRule$1.evaluate(AbstractBeforeAfterRule.java:45)
	at org.apache.lucene.util.TestRuleThreadAndTestName$1.evaluate(TestRuleThreadAndTestName.java:48)
	at org.apache.lucene.util.TestRuleIgnoreAfterMaxFailures$1.evaluate(TestRuleIgnoreAfterMaxFailures.java:64)
	at org.apache.lucene.util.TestRuleMarkFailure$1.evaluate(TestRuleMarkFailure.java:47)
	at com.carrotsearch.randomizedtesting.rules.StatementAdapter.evaluate(StatementAdapter.java:36)
	at com.carrotsearch.randomizedtesting.ThreadLeakControl$StatementRunner.run(ThreadLeakControl.java:367)
	at com.carrotsearch.randomizedtesting.ThreadLeakControl.forkTimeoutingTask(ThreadLeakControl.java:809)
	at com.carrotsearch.randomizedtesting.ThreadLeakControl$3.evaluate(ThreadLeakControl.java:460)
	at com.carrotsearch.randomizedtesting.RandomizedRunner.runSingleTest(RandomizedRunner.java:880)
	at com.carrotsearch.randomizedtesting.RandomizedRunner$5.evaluate(RandomizedRunner.java:781)
	at com.carrotsearch.randomizedtesting.RandomizedRunner$6.evaluate(RandomizedRunner.java:816)
	at com.carrotsearch.randomizedtesting.RandomizedRunner$7.evaluate(RandomizedRunner.java:827)
	at com.carrotsearch.randomizedtesting.rules.StatementAdapter.evaluate(StatementAdapter.java:36)
	at com.carrotsearch.randomizedtesting.rules.SystemPropertiesRestoreRule$1.evaluate(SystemPropertiesRestoreRule.java:57)
	at org.apache.lucene.util.AbstractBeforeAfterRule$1.evaluate(AbstractBeforeAfterRule.java:45)
	at com.carrotsearch.randomizedtesting.rules.StatementAdapter.evaluate(StatementAdapter.java:36)
	at org.apache.lucene.util.TestRuleStoreClassName$1.evaluate(TestRuleStoreClassName.java:41)
	at com.carrotsearch.randomizedtesting.rules.NoShadowingOrOverridesOnMethodsRule$1.evaluate(NoShadowingOrOverridesOnMethodsRule.java:40)
	at com.carrotsearch.randomizedtesting.rules.NoShadowingOrOverridesOnMethodsRule$1.evaluate(NoShadowingOrOverridesOnMethodsRule.java:40)
	at com.carrotsearch.randomizedtesting.rules.StatementAdapter.evaluate(StatementAdapter.java:36)
	at com.carrotsearch.randomizedtesting.rules.StatementAdapter.evaluate(StatementAdapter.java:36)
	at com.carrotsearch.randomizedtesting.rules.StatementAdapter.evaluate(StatementAdapter.java:36)
	at org.apache.lucene.util.TestRuleAssertionsRequired$1.evaluate(TestRuleAssertionsRequired.java:53)
	at org.apache.lucene.util.TestRuleMarkFailure$1.evaluate(TestRuleMarkFailure.java:47)
	at org.apache.lucene.util.TestRuleIgnoreAfterMaxFailures$1.evaluate(TestRuleIgnoreAfterMaxFailures.java:64)
	at org.apache.lucene.util.TestRuleIgnoreTestSuites$1.evaluate(TestRuleIgnoreTestSuites.java:54)
	at com.carrotsearch.randomizedtesting.rules.StatementAdapter.evaluate(StatementAdapter.java:36)
	at com.carrotsearch.randomizedtesting.ThreadLeakControl$StatementRunner.run(ThreadLeakControl.java:367)
	at java.lang.Thread.run(Thread.java:745)




Build Log:
[...truncated 10870 lines...]
   [junit4] Suite: org.apache.solr.handler.TestReplicationHandler
   [junit4]   2> Creating dataDir: /Users/jenkins/workspace/Lucene-Solr-6.x-MacOSX/solr/build/solr-core/test/J0/temp/solr.handler.TestReplicationHandler_DF38016AA724300F-001/init-core-data-001
   [junit4]   2> 484879 INFO  (TEST-TestReplicationHandler.testEmptyCommits-seed#[DF38016AA724300F]) [    ] o.a.s.SolrTestCaseJ4 ###Starting testEmptyCommits
   [junit4]   2> 484880 INFO  (TEST-TestReplicationHandler.testEmptyCommits-seed#[DF38016AA724300F]) [    ] o.a.s.SolrTestCaseJ4 Writing core.properties file to /Users/jenkins/workspace/Lucene-Solr-6.x-MacOSX/solr/build/solr-core/test/J0/temp/solr.handler.TestReplicationHandler_DF38016AA724300F-001/solr-instance-001/collection1
   [junit4]   2> 484905 INFO  (TEST-TestReplicationHandler.testEmptyCommits-seed#[DF38016AA724300F]) [    ] o.e.j.s.Server jetty-9.3.8.v20160314
   [junit4]   2> 484910 INFO  (TEST-TestReplicationHandler.testEmptyCommits-seed#[DF38016AA724300F]) [    ] o.e.j.s.h.ContextHandler Started o.e.j.s.ServletContextHandler@29d264d{/solr,null,AVAILABLE}
   [junit4]   2> 484917 INFO  (TEST-TestReplicationHandler.testEmptyCommits-seed#[DF38016AA724300F]) [    ] o.e.j.s.ServerConnector Started ServerConnector@68fba1b7{HTTP/1.1,[http/1.1]}{127.0.0.1:52431}
   [junit4]   2> 484917 INFO  (TEST-TestReplicationHandler.testEmptyCommits-seed#[DF38016AA724300F]) [    ] o.e.j.s.Server Started @491009ms
   [junit4]   2> 484917 INFO  (TEST-TestReplicationHandler.testEmptyCommits-seed#[DF38016AA724300F]) [    ] o.a.s.c.s.e.JettySolrRunner Jetty properties: {solr.data.dir=/Users/jenkins/workspace/Lucene-Solr-6.x-MacOSX/solr/build/solr-core/test/J0/temp/solr.handler.TestReplicationHandler_DF38016AA724300F-001/solr-instance-001/collection1/data, hostContext=/solr, hostPort=52431}
   [junit4]   2> 484918 INFO  (TEST-TestReplicationHandler.testEmptyCommits-seed#[DF38016AA724300F]) [    ] o.a.s.s.SolrDispatchFilter SolrDispatchFilter.init(): sun.misc.Launcher$AppClassLoader@4554617c
   [junit4]   2> 484918 INFO  (TEST-TestReplicationHandler.testEmptyCommits-seed#[DF38016AA724300F]) [    ] o.a.s.c.SolrResourceLoader new SolrResourceLoader for directory: '/Users/jenkins/workspace/Lucene-Solr-6.x-MacOSX/solr/build/solr-core/test/J0/temp/solr.handler.TestReplicationHandler_DF38016AA724300F-001/solr-instance-001'
   [junit4]   2> 484918 INFO  (TEST-TestReplicationHandler.testEmptyCommits-seed#[DF38016AA724300F]) [    ] o.a.s.c.SolrResourceLoader JNDI not configured for solr (NoInitialContextEx)
   [junit4]   2> 484918 INFO  (TEST-TestReplicationHandler.testEmptyCommits-seed#[DF38016AA724300F]) [    ] o.a.s.c.SolrResourceLoader solr home defaulted to 'solr/' (could not find system property or JNDI)
   [junit4]   2> 484918 INFO  (TEST-TestReplicationHandler.testEmptyCommits-seed#[DF38016AA724300F]) [    ] o.a.s.c.SolrXmlConfig Loading container configuration from /Users/jenkins/workspace/Lucene-Solr-6.x-MacOSX/solr/build/solr-core/test/J0/temp/solr.handler.TestReplicationHandler_DF38016AA724300F-001/solr-instance-001/solr.xml
   [junit4]   2> 484923 INFO  (TEST-TestReplicationHandler.testEmptyCommits-seed#[DF38016AA724300F]) [    ] o.a.s.c.CorePropertiesLocator Config-defined core root directory: /Users/jenkins/workspace/Lucene-Solr-6.x-MacOSX/solr/build/solr-core/test/J0/temp/solr.handler.TestReplicationHandler_DF38016AA724300F-001/solr-instance-001/.
   [junit4]   2> 484924 INFO  (TEST-TestReplicationHandler.testEmptyCommits-seed#[DF38016AA724300F]) [    ] o.a.s.c.CoreContainer New CoreContainer 1077453940
   [junit4]   2> 484924 INFO  (TEST-TestReplicationHandler.testEmptyCommits-seed#[DF38016AA724300F]) [    ] o.a.s.c.CoreContainer Loading cores into CoreContainer [instanceDir=/Users/jenkins/workspace/Lucene-Solr-6.x-MacOSX/solr/build/solr-core/test/J0/temp/solr.handler.TestReplicationHandler_DF38016AA724300F-001/solr-instance-001]
   [junit4]   2> 484924 WARN  (TEST-TestReplicationHandler.testEmptyCommits-seed#[DF38016AA724300F]) [    ] o.a.s.c.CoreContainer Couldn't add files from /Users/jenkins/workspace/Lucene-Solr-6.x-MacOSX/solr/build/solr-core/test/J0/temp/solr.handler.TestReplicationHandler_DF38016AA724300F-001/solr-instance-001/lib to classpath: /Users/jenkins/workspace/Lucene-Solr-6.x-MacOSX/solr/build/solr-core/test/J0/temp/solr.handler.TestReplicationHandler_DF38016AA724300F-001/solr-instance-001/lib
   [junit4]   2> 484925 INFO  (TEST-TestReplicationHandler.testEmptyCommits-seed#[DF38016AA724300F]) [    ] o.a.s.h.c.HttpShardHandlerFactory created with socketTimeout : 90000,urlScheme : ,connTimeout : 15000,maxConnectionsPerHost : 20,maxConnections : 10000,corePoolSize : 0,maximumPoolSize : 2147483647,maxThreadIdleTime : 5,sizeOfQueue : -1,fairnessPolicy : false,useRetries : false,
   [junit4]   2> 484929 INFO  (TEST-TestReplicationHandler.testEmptyCommits-seed#[DF38016AA724300F]) [    ] o.a.s.u.UpdateShardHandler Creating UpdateShardHandler HTTP client with params: socketTimeout=340000&connTimeout=45000&retry=true
   [junit4]   2> 484930 INFO  (TEST-TestReplicationHandler.testEmptyCommits-seed#[DF38016AA724300F]) [    ] o.a.s.l.LogWatcher SLF4J impl is org.slf4j.impl.Log4jLoggerFactory
   [junit4]   2> 484930 INFO  (TEST-TestReplicationHandler.testEmptyCommits-seed#[DF38016AA724300F]) [    ] o.a.s.l.LogWatcher Registering Log Listener [Log4j (org.slf4j.impl.Log4jLoggerFactory)]
   [junit4]   2> 484930 INFO  (TEST-TestReplicationHandler.testEmptyCommits-seed#[DF38016AA724300F]) [    ] o.a.s.c.CoreContainer Security conf doesn't exist. Skipping setup for authorization module.
   [junit4]   2> 484930 INFO  (TEST-TestReplicationHandler.testEmptyCommits-seed#[DF38016AA724300F]) [    ] o.a.s.c.CoreContainer No authentication plugin used.
   [junit4]   2> 484931 INFO  (TEST-TestReplicationHandler.testEmptyCommits-seed#[DF38016AA724300F]) [    ] o.a.s.c.CorePropertiesLocator Looking for core definitions underneath /Users/jenkins/workspace/Lucene-Solr-6.x-MacOSX/solr/build/solr-core/test/J0/temp/solr.handler.TestReplicationHandler_DF38016AA724300F-001/solr-instance-001/.
   [junit4]   2> 484933 INFO  (TEST-TestReplicationHandler.testEmptyCommits-seed#[DF38016AA724300F]) [    ] o.a.s.c.CoreDescriptor Created CoreDescriptor: {name=collection1, config=solrconfig.xml, loadOnStartup=true, schema=schema.xml, configSetProperties=configsetprops.json, transient=false, dataDir=data/}
   [junit4]   2> 484933 INFO  (TEST-TestReplicationHandler.testEmptyCommits-seed#[DF38016AA724300F]) [    ] o.a.s.c.CorePropertiesLocator Found core collection1 in /Users/jenkins/workspace/Lucene-Solr-6.x-MacOSX/solr/build/solr-core/test/J0/temp/solr.handler.TestReplicationHandler_DF38016AA724300F-001/solr-instance-001/./collection1
   [junit4]   2> 484933 INFO  (TEST-TestReplicationHandler.testEmptyCommits-seed#[DF38016AA724300F]) [    ] o.a.s.c.CorePropertiesLocator Found 1 core definitions
   [junit4]   2> 484934 INFO  (coreLoadExecutor-1049-thread-1) [    ] o.a.s.c.SolrResourceLoader new SolrResourceLoader for directory: '/Users/jenkins/workspace/Lucene-Solr-6.x-MacOSX/solr/build/solr-core/test/J0/temp/solr.handler.TestReplicationHandler_DF38016AA724300F-001/solr-instance-001/collection1'
   [junit4]   2> 484934 INFO  (coreLoadExecutor-1049-thread-1) [    ] o.a.s.c.SolrResourceLoader JNDI not configured for solr (NoInitialContextEx)
   [junit4]   2> 484934 INFO  (coreLoadExecutor-1049-thread-1) [    ] o.a.s.c.SolrResourceLoader solr home defaulted to 'solr/' (could not find system property or JNDI)
   [junit4]   2> 484935 INFO  (TEST-TestReplicationHandler.testEmptyCommits-seed#[DF38016AA724300F]) [    ] o.a.s.s.SolrDispatchFilter user.dir=/Users/jenkins/workspace/Lucene-Solr-6.x-MacOSX/solr/build/solr-core/test/J0
   [junit4]   2> 484935 INFO  (TEST-TestReplicationHandler.testEmptyCommits-seed#[DF38016AA724300F]) [    ] o.a.s.s.SolrDispatchFilter SolrDispatchFilter.init() done
   [junit4]   2> 484959 INFO  (coreLoadExecutor-1049-thread-1) [    ] o.a.s.c.SolrConfig current version of requestparams : -1
   [junit4]   2> 484966 INFO  (coreLoadExecutor-1049-thread-1) [    ] o.a.s.c.SolrConfig Using Lucene MatchVersion: 6.1.0
   [junit4]   2> 484972 INFO  (coreLoadExecutor-1049-thread-1) [    ] o.a.s.c.SolrConfig Loaded SolrConfig: solrconfig.xml
   [junit4]   2> 484975 INFO  (coreLoadExecutor-1049-thread-1) [    ] o.a.s.s.IndexSchema [collection1] Schema name=test
   [junit4]   2> 484981 INFO  (coreLoadExecutor-1049-thread-1) [    ] o.a.s.s.IndexSchema unique key field: id
   [junit4]   2> 484988 INFO  (coreLoadExecutor-1049-thread-1) [    ] o.a.s.c.ConfigSetProperties Did not find ConfigSet properties, assuming default properties: Can't find resource 'configsetprops.json' in classpath or '/Users/jenkins/workspace/Lucene-Solr-6.x-MacOSX/solr/build/solr-core/test/J0/temp/solr.handler.TestReplicationHandler_DF38016AA724300F-001/solr-instance-001/collection1'
   [junit4]   2> 484988 INFO  (coreLoadExecutor-1049-thread-1) [    ] o.a.s.c.CoreContainer Creating SolrCore 'collection1' using configuration from instancedir /Users/jenkins/workspace/Lucene-Solr-6.x-MacOSX/solr/build/solr-core/test/J0/temp/solr.handler.TestReplicationHandler_DF38016AA724300F-001/solr-instance-001/./collection1
   [junit4]   2> 484988 INFO  (coreLoadExecutor-1049-thread-1) [    x:collection1] o.a.s.c.SolrCore org.apache.solr.core.MockDirectoryFactory
   [junit4]   2> 484989 INFO  (coreLoadExecutor-1049-thread-1) [    x:collection1] o.a.s.c.SolrCore [[collection1] ] Opening new SolrCore at [/Users/jenkins/workspace/Lucene-Solr-6.x-MacOSX/solr/build/solr-core/test/J0/temp/solr.handler.TestReplicationHandler_DF38016AA724300F-001/solr-instance-001/collection1], dataDir=[/Users/jenkins/workspace/Lucene-Solr-6.x-MacOSX/solr/build/solr-core/test/J0/temp/solr.handler.TestReplicationHandler_DF38016AA724300F-001/solr-instance-001/./collection1/data/]
   [junit4]   2> 484989 INFO  (coreLoadExecutor-1049-thread-1) [    x:collection1] o.a.s.c.SolrCore JMX monitoring not detected for core: collection1
   [junit4]   2> 484989 INFO  (coreLoadExecutor-1049-thread-1) [    x:collection1] o.a.s.c.CachingDirectoryFactory return new directory for /Users/jenkins/workspace/Lucene-Solr-6.x-MacOSX/solr/build/solr-core/test/J0/temp/solr.handler.TestReplicationHandler_DF38016AA724300F-001/solr-instance-001/./collection1/data
   [junit4]   2> 484990 INFO  (coreLoadExecutor-1049-thread-1) [    x:collection1] o.a.s.c.SolrCore New index directory detected: old=null new=/Users/jenkins/workspace/Lucene-Solr-6.x-MacOSX/solr/build/solr-core/test/J0/temp/solr.handler.TestReplicationHandler_DF38016AA724300F-001/solr-instance-001/./collection1/data/index/
   [junit4]   2> 484990 WARN  (coreLoadExecutor-1049-thread-1) [    x:collection1] o.a.s.c.SolrCore [collection1] Solr index directory '/Users/jenkins/workspace/Lucene-Solr-6.x-MacOSX/solr/build/solr-core/test/J0/temp/solr.handler.TestReplicationHandler_DF38016AA724300F-001/solr-instance-001/./collection1/data/index' doesn't exist. Creating new index...
   [junit4]   2> 484990 INFO  (coreLoadExecutor-1049-thread-1) [    x:collection1] o.a.s.c.CachingDirectoryFactory return new directory for /Users/jenkins/workspace/Lucene-Solr-6.x-MacOSX/solr/build/solr-core/test/J0/temp/solr.handler.TestReplicationHandler_DF38016AA724300F-001/solr-instance-001/./collection1/data/index
   [junit4]   2> 484990 INFO  (coreLoadExecutor-1049-thread-1) [    x:collection1] o.a.s.u.RandomMergePolicy RandomMergePolicy wrapping class org.apache.lucene.index.LogByteSizeMergePolicy: [LogByteSizeMergePolicy: minMergeSize=1677721, mergeFactor=26, maxMergeSize=2147483648, maxMergeSizeForForcedMerge=9223372036854775807, calibrateSizeByDeletes=true, maxMergeDocs=2147483647, maxCFSSegmentSizeMB=8.796093022207999E12, noCFSRatio=1.0]
   [junit4]   2> 484991 INFO  (coreLoadExecutor-1049-thread-1) [    x:collection1] o.a.s.c.SolrDeletionPolicy SolrDeletionPolicy.onCommit: commits: num=1
   [junit4]   2> 	commit{dir=MockDirectoryWrapper(RAMDirectory@493f78e1 lockFactory=org.apache.lucene.store.SingleInstanceLockFactory@42b5c414),segFN=segments_1,generation=1}
   [junit4]   2> 484991 INFO  (coreLoadExecutor-1049-thread-1) [    x:collection1] o.a.s.c.SolrDeletionPolicy newest commit generation = 1
   [junit4]   2> 484992 INFO  (OldIndexDirectoryCleanupThreadForCore-collection1) [    x:collection1] o.a.s.c.SolrCore Looking for old index directories to cleanup for core collection1 in /Users/jenkins/workspace/Lucene-Solr-6.x-MacOSX/solr/build/solr-core/test/J0/temp/solr.handler.TestReplicationHandler_DF38016AA724300F-001/solr-instance-001/./collection1/data/
   [junit4]   2> 484995 INFO  (coreLoadExecutor-1049-thread-1) [    x:collection1] o.a.s.c.SolrCore no updateRequestProcessorChain defined as default, creating implicit default
   [junit4]   2> 485004 INFO  (coreLoadExecutor-1049-thread-1) [    x:collection1] o.a.s.h.l.XMLLoader xsltCacheLifetimeSeconds=60
   [junit4]   2> 485005 INFO  (coreLoadExecutor-1049-thread-1) [    x:collection1] o.a.s.h.l.XMLLoader xsltCacheLifetimeSeconds=60
   [junit4]   2> 485007 INFO  (coreLoadExecutor-1049-thread-1) [    x:collection1] o.a.s.h.l.XMLLoader xsltCacheLifetimeSeconds=60
   [junit4]   2> 485009 INFO  (coreLoadExecutor-1049-thread-1) [    x:collection1] o.a.s.h.l.XMLLoader xsltCacheLifetimeSeconds=60
   [junit4]   2> 485012 INFO  (coreLoadExecutor-1049-thread-1) [    x:collection1] o.a.s.c.PluginBag requestHandler : 'lazy' created with startup=lazy 
   [junit4]   2> 485012 INFO  (coreLoadExecutor-1049-thread-1) [    x:collection1] o.a.s.c.RequestHandlers Registered paths: /admin/mbeans,standard,lazy,/update/json/docs,/admin/luke,/export,/get,/admin/properties,/update/json,/admin/threads,/update/csv,/sql,/admin/segments,/admin/system,/replication,defaults,/config,/stream,/schema,/admin/plugins,/admin/logging,/admin/ping,/update,/admin/file
   [junit4]   2> 485012 INFO  (coreLoadExecutor-1049-thread-1) [    x:collection1] o.a.s.c.SolrCore Using default statsCache cache: org.apache.solr.search.stats.LocalStatsCache
   [junit4]   2> 485012 INFO  (coreLoadExecutor-1049-thread-1) [    x:collection1] o.a.s.u.CommitTracker Hard AutoCommit: disabled
   [junit4]   2> 485012 INFO  (coreLoadExecutor-1049-thread-1) [    x:collection1] o.a.s.u.CommitTracker Soft AutoCommit: disabled
   [junit4]   2> 485013 INFO  (coreLoadExecutor-1049-thread-1) [    x:collection1] o.a.s.u.RandomMergePolicy RandomMergePolicy wrapping class org.apache.lucene.index.AlcoholicMergePolicy: [AlcoholicMergePolicy: minMergeSize=0, mergeFactor=10, maxMergeSize=1331820619, maxMergeSizeForForcedMerge=9223372036854775807, calibrateSizeByDeletes=true, maxMergeDocs=2147483647, maxCFSSegmentSizeMB=8.796093022207999E12, noCFSRatio=0.1]
   [junit4]   2> 485013 INFO  (coreLoadExecutor-1049-thread-1) [    x:collection1] o.a.s.c.SolrDeletionPolicy SolrDeletionPolicy.onInit: commits: num=1
   [junit4]   2> 	commit{dir=MockDirectoryWrapper(RAMDirectory@493f78e1 lockFactory=org.apache.lucene.store.SingleInstanceLockFactory@42b5c414),segFN=segments_1,generation=1}
   [junit4]   2> 485013 INFO  (coreLoadExecutor-1049-thread-1) [    x:collection1] o.a.s.c.SolrDeletionPolicy newest commit generation = 1
   [junit4]   2> 485013 INFO  (coreLoadExecutor-1049-thread-1) [    x:collection1] o.a.s.s.SolrIndexSearcher Opening [Searcher@65589b34[collection1] main]
   [junit4]   2> 485014 INFO  (coreLoadExecutor-1049-thread-1) [    x:collection1] o.a.s.r.ManagedResourceStorage File-based storage initialized to use dir: /Users/jenkins/workspace/Lucene-Solr-6.x-MacOSX/solr/build/solr-core/test/J0/temp/solr.handler.TestReplicationHandler_DF38016AA724300F-001/solr-instance-001/collection1/conf
   [junit4]   2> 485014 INFO  (coreLoadExecutor-1049-thread-1) [    x:collection1] o.a.s.r.RestManager Initializing RestManager with initArgs: {storageDir=/Users/jenkins/workspace/Lucene-Solr-6.x-MacOSX/solr/build/solr-core/test/J0/temp/solr.handler.TestReplicationHandler_DF38016AA724300F-001/solr-instance-001/collection1/conf}
   [junit4]   2> 485014 INFO  (coreLoadExecutor-1049-thread-1) [    x:collection1] o.a.s.r.ManagedResourceStorage Reading _rest_managed.json using file:dir=/Users/jenkins/workspace/Lucene-Solr-6.x-MacOSX/solr/build/solr-core/test/J0/temp/solr.handler.TestReplicationHandler_DF38016AA724300F-001/solr-instance-001/collection1/conf
   [junit4]   2> 485015 INFO  (coreLoadExecutor-1049-thread-1) [    x:collection1] o.a.s.r.RestManager Initializing 0 registered ManagedResources
   [junit4]   2> 485015 INFO  (coreLoadExecutor-1049-thread-1) [    x:collection1] o.a.s.h.ReplicationHandler Replication enabled for following config files: schema.xml,xslt/dummy.xsl
   [junit4]   2> 485015 INFO  (coreLoadExecutor-1049-thread-1) [    x:collection1] o.a.s.h.ReplicationHandler Commits will be reserved for  10000
   [junit4]   2> 485015 INFO  (searcherExecutor-1050-thread-1-processing-x:collection1) [    x:collection1] o.a.s.c.SolrCore [collection1] Registered new searcher Searcher@65589b34[collection1] main{ExitableDirectoryReader(UninvertingDirectoryReader())}
   [junit4]   2> 485016 INFO  (coreLoadExecutor-1049-thread-1) [    x:collection1] o.a.s.c.CoreContainer registering core: collection1
   [junit4]   2> 485441 INFO  (TEST-TestReplicationHandler.testEmptyCommits-seed#[DF38016AA724300F]) [    ] o.a.s.SolrTestCaseJ4 Writing core.properties file to /Users/jenkins/workspace/Lucene-Solr-6.x-MacOSX/solr/build/solr-core/test/J0/temp/solr.handler.TestReplicationHandler_DF38016AA724300F-001/solr-instance-002/collection1
   [junit4]   2> 485450 INFO  (TEST-TestReplicationHandler.testEmptyCommits-seed#[DF38016AA724300F]) [    ] o.e.j.s.Server jetty-9.3.8.v20160314
   [junit4]   2> 485454 INFO  (TEST-TestReplicationHandler.testEmptyCommits-seed#[DF38016AA724300F]) [    ] o.e.j.s.h.ContextHandler Started o.e.j.s.ServletContextHandler@1fd9c235{/solr,null,AVAILABLE}
   [junit4]   2> 485455 INFO  (TEST-TestReplicationHandler.testEmptyCommits-seed#[DF38016AA724300F]) [    ] o.e.j.s.ServerConnector Started ServerConnector@528dc032{HTTP/1.1,[http/1.1]}{127.0.0.1:52432}
   [junit4]   2> 485455 INFO  (TEST-TestReplicationHandler.testEmptyCommits-seed#[DF38016AA724300F]) [    ] o.e.j.s.Server Started @491547ms
   [junit4]   2> 485455 INFO  (TEST-TestReplicationHandler.testEmptyCommits-seed#[DF38016AA724300F]) [    ] o.a.s.c.s.e.JettySolrRunner Jetty properties: {solr.data.dir=/Users/jenkins/workspace/Lucene-Solr-6.x-MacOSX/solr/build/solr-core/test/J0/temp/solr.handler.TestReplicationHandler_DF38016AA724300F-001/solr-instance-002/collection1/data, hostContext=/solr, hostPort=52432}
   [junit4]   2> 485456 INFO  (TEST-TestReplicationHandler.testEmptyCommits-seed#[DF38016AA724300F]) [    ] o.a.s.s.SolrDispatchFilter SolrDispatchFilter.init(): sun.misc.Launcher$AppClassLoader@4554617c
   [junit4]   2> 485456 INFO  (TEST-TestReplicationHandler.testEmptyCommits-seed#[DF38016AA724300F]) [    ] o.a.s.c.SolrResourceLoader new SolrResourceLoader for directory: '/Users/jenkins/workspace/Lucene-Solr-6.x-MacOSX/solr/build/solr-core/test/J0/temp/solr.handler.TestReplicationHandler_DF38016AA724300F-001/solr-instance-002'
   [junit4]   2> 485456 INFO  (TEST-TestReplicationHandler.testEmptyCommits-seed#[DF38016AA724300F]) [    ] o.a.s.c.SolrResourceLoader JNDI not configured for solr (NoInitialContextEx)
   [junit4]   2> 485457 INFO  (TEST-TestReplicationHandler.testEmptyCommits-seed#[DF38016AA724300F]) [    ] o.a.s.c.SolrResourceLoader solr home defaulted to 'solr/' (could not find system property or JNDI)
   [junit4]   2> 485457 INFO  (TEST-TestReplicationHandler.testEmptyCommits-seed#[DF38016AA724300F]) [    ] o.a.s.c.SolrXmlConfig Loading container configuration from /Users/jenkins/workspace/Lucene-Solr-6.x-MacOSX/solr/build/solr-core/test/J0/temp/solr.handler.TestReplicationHandler_DF38016AA724300F-001/solr-instance-002/solr.xml
   [junit4]   2> 485469 INFO  (TEST-TestReplicationHandler.testEmptyCommits-seed#[DF38016AA724300F]) [    ] o.a.s.c.CorePropertiesLocator Config-defined core root directory: /Users/jenkins/workspace/Lucene-Solr-6.x-MacOSX/solr/build/solr-core/test/J0/temp/solr.handler.TestReplicationHandler_DF38016AA724300F-001/solr-instance-002/.
   [junit4]   2> 485469 INFO  (TEST-TestReplicationHandler.testEmptyCommits-seed#[DF38016AA724300F]) [    ] o.a.s.c.CoreContainer New CoreContainer 919082473
   [junit4]   2> 485469 INFO  (TEST-TestReplicationHandler.testEmptyCommits-seed#[DF38016AA724300F]) [    ] o.a.s.c.CoreContainer Loading cores into CoreContainer [instanceDir=/Users/jenkins/workspace/Lucene-Solr-6.x-MacOSX/solr/build/solr-core/test/J0/temp/solr.handler.TestReplicationHandler_DF38016AA724300F-001/solr-instance-002]
   [junit4]   2> 485469 WARN  (TEST-TestReplicationHandler.testEmptyCommits-seed#[DF38016AA724300F]) [    ] o.a.s.c.CoreContainer Couldn't add files from /Users/jenkins/workspace/Lucene-Solr-6.x-MacOSX/solr/build/solr-core/test/J0/temp/solr.handler.TestReplicationHandler_DF38016AA724300F-001/solr-instance-002/lib to classpath: /Users/jenkins/workspace/Lucene-Solr-6.x-MacOSX/solr/build/solr-core/test/J0/temp/solr.handler.TestReplicationHandler_DF38016AA724300F-001/solr-instance-002/lib
   [junit4]   2> 485470 INFO  (TEST-TestReplicationHandler.testEmptyCommits-seed#[DF38016AA724300F]) [    ] o.a.s.h.c.HttpShardHandlerFactory created with socketTimeout : 90000,urlScheme : ,connTimeout : 15000,maxConnectionsPerHost : 20,maxConnections : 10000,corePoolSize : 0,maximumPoolSize : 2147483647,maxThreadIdleTime : 5,sizeOfQueue : -1,fairnessPolicy : false,useRetries : false,
   [junit4]   2> 485471 INFO  (TEST-TestReplicationHandler.testEmptyCommits-seed#[DF38016AA724300F]) [    ] o.a.s.u.UpdateShardHandler Creating UpdateShardHandler HTTP client with params: socketTimeout=340000&connTimeout=45000&retry=true
   [junit4]   2> 485471 INFO  (TEST-TestReplicationHandler.testEmptyCommits-seed#[DF38016AA724300F]) [    ] o.a.s.l.LogWatcher SLF4J impl is org.slf4j.impl.Log4jLoggerFactory
   [junit4]   2> 485472 INFO  (TEST-TestReplicationHandler.testEmptyCommits-seed#[DF38016AA724300F]) [    ] o.a.s.l.LogWatcher Registering Log Listener [Log4j (org.slf4j.impl.Log4jLoggerFactory)]
   [junit4]   2> 485472 INFO  (TEST-TestReplicationHandler.testEmptyCommits-seed#[DF38016AA724300F]) [    ] o.a.s.c.CoreContainer Security conf doesn't exist. Skipping setup for authorization module.
   [junit4]   2> 485472 INFO  (TEST-TestReplicationHandler.testEmptyCommits-seed#[DF38016AA724300F]) [    ] o.a.s.c.CoreContainer No authentication plugin used.
   [junit4]   2> 485474 INFO  (TEST-TestReplicationHandler.testEmptyCommits-seed#[DF38016AA724300F]) [    ] o.a.s.c.CorePropertiesLocator Looking for core definitions underneath /Users/jenkins/workspace/Lucene-Solr-6.x-MacOSX/solr/build/solr-core/test/J0/temp/solr.handler.TestReplicationHandler_DF38016AA724300F-001/solr-instance-002/.
   [junit4]   2> 485477 INFO  (TEST-TestReplicationHandler.testEmptyCommits-seed#[DF38016AA724300F]) [    ] o.a.s.c.CoreDescriptor Created CoreDescriptor: {name=collection1, config=solrconfig.xml, loadOnStartup=true, schema=schema.xml, configSetProperties=configsetprops.json, transient=false, dataDir=data/}
   [junit4]   2> 485477 INFO  (TEST-TestReplicationHandler.testEmptyCommits-seed#[DF38016AA724300F]) [    ] o.a.s.c.CorePropertiesLocator Found core collection1 in /Users/jenkins/workspace/Lucene-Solr-6.x-MacOSX/solr/build/solr-core/test/J0/temp/solr.handler.TestReplicationHandler_DF38016AA724300F-001/solr-instance-002/./collection1
   [junit4]   2> 485477 INFO  (TEST-TestReplicationHandler.testEmptyCommits-seed#[DF38016AA724300F]) [    ] o.a.s.c.CorePropertiesLocator Found 1 core definitions
   [junit4]   2> 485478 INFO  (coreLoadExecutor-1059-thread-1) [    ] o.a.s.c.SolrResourceLoader new SolrResourceLoader for directory: '/Users/jenkins/workspace/Lucene-Solr-6.x-MacOSX/solr/build/solr-core/test/J0/temp/solr.handler.TestReplicationHandler_DF38016AA724300F-001/solr-instance-002/collection1'
   [junit4]   2> 485479 INFO  (coreLoadExecutor-1059-thread-1) [    ] o.a.s.c.SolrResourceLoader JNDI not configured for solr (NoInitialContextEx)
   [junit4]   2> 485479 INFO  (coreLoadExecutor-1059-thread-1) [    ] o.a.s.c.SolrResourceLoader solr home defaulted to 'solr/' (could not find system property or JNDI)
   [junit4]   2> 485478 INFO  (TEST-TestReplicationHandler.testEmptyCommits-seed#[DF38016AA724300F]) [    ] o.a.s.s.SolrDispatchFilter user.dir=/Users/jenkins/workspace/Lucene-Solr-6.x-MacOSX/solr/build/solr-core/test/J0
   [junit4]   2> 485479 INFO  (TEST-TestReplicationHandler.testEmptyCommits-seed#[DF38016AA724300F]) [    ] o.a.s.s.SolrDispatchFilter SolrDispatchFilter.init() done
   [junit4]   2> 485486 INFO  (coreLoadExecutor-1059-thread-1) [    ] o.a.s.c.SolrConfig current version of requestparams : -1
   [junit4]   2> 485489 INFO  (coreLoadExecutor-1059-thread-1) [    ] o.a.s.c.SolrConfig Using Lucene MatchVersion: 6.1.0
   [junit4]   2> 485500 INFO  (coreLoadExecutor-1059-thread-1) [    ] o.a.s.c.SolrConfig Loaded SolrConfig: solrconfig.xml
   [junit4]   2> 485506 INFO  (coreLoadExecutor-1059-thread-1) [    ] o.a.s.s.IndexSchema [collection1] Schema name=test
   [junit4]   2> 485508 INFO  (coreLoadExecutor-1059-thread-1) [    ] o.a.s.s.IndexSchema unique key field: id
   [junit4]   2> 485510 INFO  (coreLoadExecutor-1059-thread-1) [    ] o.a.s.c.ConfigSetProperties Did not find ConfigSet properties, assuming default properties: Can't find resource 'configsetprops.json' in classpath or '/Users/jenkins/workspace/Lucene-Solr-6.x-MacOSX/solr/build/solr-core/test/J0/temp/solr.handler.TestReplicationHandler_DF38016AA724300F-001/solr-instance-002/collection1'
   [junit4]   2> 485510 INFO  (coreLoadExecutor-1059-thread-1) [    ] o.a.s.c.CoreContainer Creating SolrCore 'collection1' using configuration from instancedir /Users/jenkins/workspace/Lucene-Solr-6.x-MacOSX/solr/build/solr-core/test/J0/temp/solr.handler.TestReplicationHandler_DF38016AA724300F-001/solr-instance-002/./collection1
   [junit4]   2> 485510 INFO  (coreLoadExecutor-1059-thread-1) [    x:collection1] o.a.s.c.SolrCore org.apache.solr.core.MockDirectoryFactory
   [junit4]   2> 485510 INFO  (coreLoadExecutor-1059-thread-1) [    x:collection1] o.a.s.c.SolrCore [[collection1] ] Opening new SolrCore at [/Users/jenkins/workspace/Lucene-Solr-6.x-MacOSX/solr/build/solr-core/test/J0/temp/solr.handler.TestReplicationHandler_DF38016AA724300F-001/solr-instance-002/collection1], dataDir=[/Users/jenkins/workspace/Lucene-Solr-6.x-MacOSX/solr/build/solr-core/test/J0/temp/solr.handler.TestReplicationHandler_DF38016AA724300F-001/solr-instance-002/./collection1/data/]
   [junit4]   2> 485510 INFO  (coreLoadExecutor-1059-thread-1) [    x:collection1] o.a.s.c.SolrCore JMX monitoring not detected for core: collection1
   [junit4]   2> 485511 INFO  (coreLoadExecutor-1059-thread-1) [    x:collection1] o.a.s.c.CachingDirectoryFactory return new directory for /Users/jenkins/workspace/Lucene-Solr-6.x-MacOSX/solr/build/solr-core/test/J0/temp/solr.handler.TestReplicationHandler_DF38016AA724300F-001/solr-instance-002/./collection1/data
   [junit4]   2> 485512 INFO  (coreLoadExecutor-1059-thread-1) [    x:collection1] o.a.s.c.SolrCore New index directory detected: old=null new=/Users/jenkins/workspace/Lucene-Solr-6.x-MacOSX/solr/build/solr-core/test/J0/temp/solr.handler.TestReplicationHandler_DF38016AA724300F-001/solr-instance-002/./collection1/data/index/
   [junit4]   2> 485513 WARN  (coreLoadExecutor-1059-thread-1) [    x:collection1] o.a.s.c.SolrCore [collection1] Solr index directory '/Users/jenkins/workspace/Lucene-Solr-6.x-MacOSX/solr/build/solr-core/test/J0/temp/solr.handler.TestReplicationHandler_DF38016AA724300F-001/solr-instance-002/./collection1/data/index' doesn't exist. Creating new index...
   [junit4]   2> 485513 INFO  (coreLoadExecutor-1059-thread-1) [    x:collection1] o.a.s.c.CachingDirectoryFactory return new directory for /Users/jenkins/workspace/Lucene-Solr-6.x-MacOSX/solr/build/solr-core/test/J0/temp/solr.handler.TestReplicationHandler_DF38016AA724300F-001/solr-instance-002/./collection1/data/index
   [junit4]   2> 485513 INFO  (coreLoadExecutor-1059-thread-1) [    x:collection1] o.a.s.u.RandomMergePolicy RandomMergePolicy wrapping class org.apache.lucene.index.LogByteSizeMergePolicy: [LogByteSizeMergePolicy: minMergeSize=1677721, mergeFactor=26, maxMergeSize=2147483648, maxMergeSizeForForcedMerge=9223372036854775807, calibrateSizeByDeletes=true, maxMergeDocs=2147483647, maxCFSSegmentSizeMB=8.796093022207999E12, noCFSRatio=1.0]
   [junit4]   2> 485515 INFO  (coreLoadExecutor-1059-thread-1) [    x:collection1] o.a.s.c.SolrDeletionPolicy SolrDeletionPolicy.onCommit: commits: num=1
   [junit4]   2> 	commit{dir=MockDirectoryWrapper(RAMDirectory@2fe62163 lockFactory=org.apache.lucene.store.SingleInstanceLockFactory@532dd4ae),segFN=segments_1,generation=1}
   [junit4]   2> 485515 INFO  (coreLoadExecutor-1059-thread-1) [    x:collection1] o.a.s.c.SolrDeletionPolicy newest commit generation = 1
   [junit4]   2> 485516 INFO  (OldIndexDirectoryCleanupThreadForCore-collection1) [    x:collection1] o.a.s.c.SolrCore Looking for old index directories to cleanup for core collection1 in /Users/jenkins/workspace/Lucene-Solr-6.x-MacOSX/solr/build/solr-core/test/J0/temp/solr.handler.TestReplicationHandler_DF38016AA724300F-001/solr-instance-002/./collection1/data/
   [junit4]   2> 485518 INFO  (coreLoadExecutor-1059-thread-1) [    x:collection1] o.a.s.c.SolrCore no updateRequestProcessorChain defined as default, creating implicit default
   [junit4]   2> 485520 INFO  (coreLoadExecutor-1059-thread-1) [    x:collection1] o.a.s.h.l.XMLLoader xsltCacheLifetimeSeconds=60
   [junit4]   2> 485521 INFO  (coreLoadExecutor-1059-thread-1) [    x:collection1] o.a.s.h.l.XMLLoader xsltCacheLifetimeSeconds=60
   [junit4]   2> 485522 INFO  (coreLoadExecutor-1059-thread-1) [    x:collection1] o.a.s.h.l.XMLLoader xsltCacheLifetimeSeconds=60
   [junit4]   2> 485524 INFO  (coreLoadExecutor-1059-thread-1) [    x:collection1] o.a.s.h.l.XMLLoader xsltCacheLifetimeSeconds=60
   [junit4]   2> 485527 INFO  (coreLoadExecutor-1059-thread-1) [    x:collection1] o.a.s.c.PluginBag requestHandler : 'lazy' created with startup=lazy 
   [junit4]   2> 485527 INFO  (coreLoadExecutor-1059-thread-1) [    x:collection1] o.a.s.c.RequestHandlers Registered paths: /admin/mbeans,standard,lazy,/update/json/docs,/admin/luke,/export,/get,/admin/properties,/update/json,/admin/threads,/update/csv,/sql,/admin/segments,/admin/system,/replication,defaults,/config,/stream,/schema,/admin/plugins,/admin/logging,/admin/ping,/update,/admin/file
   [junit4]   2> 485527 INFO  (coreLoadExecutor-1059-thread-1) [    x:collection1] o.a.s.c.SolrCore Using default statsCache cache: org.apache.solr.search.stats.LocalStatsCache
   [junit4]   2> 485528 INFO  (coreLoadExecutor-1059-thread-1) [    x:collection1] o.a.s.u.CommitTracker Hard AutoCommit: disabled
   [junit4]   2> 485528 INFO  (coreLoadExecutor-1059-thread-1) [    x:collection1] o.a.s.u.CommitTracker Soft AutoCommit: disabled
   [junit4]   2> 485530 INFO  (coreLoadExecutor-1059-thread-1) [    x:collection1] o.a.s.u.RandomMergePolicy RandomMergePolicy wrapping class org.apache.lucene.index.AlcoholicMergePolicy: [AlcoholicMergePolicy: minMergeSize=0, mergeFactor=10, maxMergeSize=1331820619, maxMergeSizeForForcedMerge=9223372036854775807, calibrateSizeByDeletes=true, maxMergeDocs=2147483647, maxCFSSegmentSizeMB=8.796093022207999E12, noCFSRatio=0.1]
   [junit4]   2> 485531 INFO  (coreLoadExecutor-1059-thread-1) [    x:collection1] o.a.s.c.SolrDeletionPolicy SolrDeletionPolicy.onInit: commits: num=1
   [junit4]   2> 	commit{dir=MockDirectoryWrapper(RAMDirectory@2fe62163 lockFactory=org.apache.lucene.store.SingleInstanceLockFactory@532dd4ae),segFN=segments_1,generation=1}
   [junit4]   2> 485531 INFO  (coreLoadExecutor-1059-thread-1) [    x:collection1] o.a.s.c.SolrDeletionPolicy newest commit generation = 1
   [junit4]   2> 485531 INFO  (coreLoadExecutor-1059-thread-1) [    x:collection1] o.a.s.s.SolrIndexSearcher Opening [Searcher@740945f4[collection1] main]
   [junit4]   2> 485531 INFO  (coreLoadExecutor-1059-thread-1) [    x:collection1] o.a.s.r.ManagedResourceStorage File-based storage initialized to use dir: /Users/jenkins/workspace/Lucene-Solr-6.x-MacOSX/solr/build/solr-core/test/J0/temp/solr.handler.TestReplicationHandler_DF38016AA724300F-001/solr-instance-002/collection1/conf
   [junit4]   2> 485531 INFO  (coreLoadExecutor-1059-thread-1) [    x:collection1] o.a.s.r.RestManager Initializing RestManager with initArgs: {storageDir=/Users/jenkins/workspace/Lucene-Solr-6.x-MacOSX/solr/build/solr-core/test/J0/temp/solr.handler.TestReplicationHandler_DF38016AA724300F-001/solr-instance-002/collection1/conf}
   [junit4]   2> 485531 INFO  (coreLoadExecutor-1059-thread-1) [    x:collection1] o.a.s.r.ManagedResourceStorage Reading _rest_managed.json using file:dir=/Users/jenkins/workspace/Lucene-Solr-6.x-MacOSX/solr/build/solr-core/test/J0/temp/solr.handler.TestReplicationHandler_DF38016AA724300F-001/solr-instance-002/collection1/conf
   [junit4]   2> 485532 INFO  (coreLoadExecutor-1059-thread-1) [    x:collection1] o.a.s.r.RestManager Initializing 0 registered ManagedResources
   [junit4]   2> 485534 INFO  (coreLoadExecutor-1059-thread-1) [    x:collection1] o.a.s.h.ReplicationHandler Poll scheduled at an interval of 1000ms
   [junit4]   2> 485534 INFO  (coreLoadExecutor-1059-thread-1) [    x:collection1] o.a.s.c.CoreContainer registering core: collection1
   [junit4]   2> 485535 INFO  (searcherExecutor-1060-thread-1-processing-x:collection1) [    x:collection1] o.a.s.c.SolrCore [collection1] Registered new searcher Searcher@740945f4[collection1] main{ExitableDirectoryReader(UninvertingDirectoryReader())}
   [junit4]   2> 485992 INFO  (qtp1747409814-2609) [    x:collection1] o.a.s.c.S.Request [collection1]  webapp=/solr path=/select params={q=*:*&sort=id+desc&wt=javabin&version=2} hits=0 status=0 QTime=0
   [junit4]   2> 485992 INFO  (qtp1747409814-2610) [    x:collection1] o.a.s.c.S.Request [collection1]  webapp=/solr path=/replication params={qt=/replication&wt=javabin&version=2&command=indexversion} status=0 QTime=0
   [junit4]   2> 486015 INFO  (qtp1747409814-2610) [    x:collection1] o.a.s.u.p.LogUpdateProcessorFactory [collection1]  webapp=/solr path=/update params={wt=javabin&version=2}{add=[1]} 0 18
   [junit4]   2> 486019 INFO  (qtp1747409814-2612) [    x:collection1] o.a.s.u.DirectUpdateHandler2 start commit{,optimize=false,openSearcher=true,waitSearcher=true,expungeDeletes=false,softCommit=false,prepareCommit=false}
   [junit4]   2> 486032 INFO  (qtp1747409814-2612) [    x:collection1] o.a.s.c.SolrDeletionPolicy SolrDeletionPolicy.onCommit: commits: num=2
   [junit4]   2> 	commit{dir=MockDirectoryWrapper(RAMDirectory@493f78e1 lockFactory=org.apache.lucene.store.SingleInstanceLockFactory@42b5c414),segFN=segments_1,generation=1}
   [junit4]   2> 	commit{dir=MockDirectoryWrapper(RAMDirectory@493f78e1 lockFactory=org.apache.lucene.store.SingleInstanceLockFactory@42b5c414),segFN=segments_2,generation=2}
   [junit4]   2> 486035 INFO  (qtp1747409814-2612) [    x:collection1] o.a.s.c.SolrDeletionPolicy newest commit generation = 2
   [junit4]   2> 486039 INFO  (qtp1747409814-2612) [    x:collection1] o.a.s.s.SolrIndexSearcher Opening [Searcher@176ba0d2[collection1] main]
   [junit4]   2> 486039 INFO  (qtp1747409814-2612) [    x:collection1] o.a.s.u.DirectUpdateHandler2 end_commit_flush
   [junit4]   2> 486039 INFO  (searcherExecutor-1050-thread-1-processing-x:collection1) [    x:collection1] o.a.s.c.SolrCore [collection1] Registered new searcher Searcher@176ba0d2[collection1] main{ExitableDirectoryReader(UninvertingDirectoryReader(Uninverting(_0(6.1.0):C1)))}
   [junit4]   2> 486039 INFO  (qtp1747409814-2612) [    x:collection1] o.a.s.u.p.LogUpdateProcessorFactory [collection1]  webapp=/solr path=/update params={commit=true&wt=javabin&version=2}{commit=} 0 20
   [junit4]   2> 486076 WARN  (explicit-fetchindex-cmd) [    x:collection1] o.a.s.h.IndexFetcher 'masterUrl' must be specified without the /replication suffix
   [junit4]   2> 486080 INFO  (qtp1747409814-2613) [    x:collection1] o.a.s.c.S.Request [collection1]  webapp=/solr path=/replication params={qt=/replication&wt=javabin&version=2&command=indexversion} status=0 QTime=0
   [junit4]   2> 486081 INFO  (explicit-fetchindex-cmd) [    x:collection1] o.a.s.h.IndexFetcher Master's generation: 2
   [junit4]   2> 486081 INFO  (explicit-fetchindex-cmd) [    x:collection1] o.a.s.h.IndexFetcher Slave's generation: 1
   [junit4]   2> 486081 INFO  (explicit-fetchindex-cmd) [    x:collection1] o.a.s.h.IndexFetcher Starting replication process
   [junit4]   2> 486096 INFO  (qtp1747409814-2613) [    x:collection1] o.a.s.c.S.Request [collection1]  webapp=/solr path=/replication params={generation=2&qt=/replication&wt=javabin&version=2&command=filelist} status=0 QTime=8
   [junit4]   2> 486096 INFO  (explicit-fetchindex-cmd) [    x:collection1] o.a.s.h.IndexFetcher Number of files in latest index in master: 11
   [junit4]   2> 486098 INFO  (explicit-fetchindex-cmd) [    x:collection1] o.a.s.c.CachingDirectoryFactory return new directory for /Users/jenkins/workspace/Lucene-Solr-6.x-MacOSX/solr/build/solr-core/test/J0/temp/solr.handler.TestReplicationHandler_DF38016AA724300F-001/solr-instance-002/./collection1/data/index.20160406195421341
   [junit4]   2> 486099 INFO  (explicit-fetchindex-cmd) [    x:collection1] o.a.s.u.DefaultSolrCoreState Rollback old IndexWriter... core=collection1
   [junit4]   2> 486099 INFO  (explicit-fetchindex-cmd) [    x:collection1] o.a.s.u.RandomMergePolicy RandomMergePolicy wrapping class org.apache.lucene.index.LogDocMergePolicy: [LogDocMergePolicy: minMergeSize=1000, mergeFactor=14, maxMergeSize=9223372036854775807, maxMergeSizeForForcedMerge=9223372036854775807, calibrateSizeByDeletes=false, maxMergeDocs=2147483647, maxCFSSegmentSizeMB=8.796093022207999E12, noCFSRatio=1.0]
   [junit4]   2> 486100 INFO  (explicit-fetchindex-cmd) [    x:collection1] o.a.s.c.SolrDeletionPolicy SolrDeletionPolicy.onInit: commits: num=1
   [junit4]   2> 	commit{dir=MockDirectoryWrapper(RAMDirectory@2fe62163 lockFactory=org.apache.lucene.store.SingleInstanceLockFactory@532dd4ae),segFN=segments_1,generation=1}
   [junit4]   2> 486101 INFO  (explicit-fetchindex-cmd) [    x:collection1] o.a.s.c.SolrDeletionPolicy newest commit generation = 1
   [junit4]   2> 486101 INFO  (explicit-fetchindex-cmd) [    x:collection1] o.a.s.u.DefaultSolrCoreState New IndexWriter is ready to be used.
   [junit4]   2> 486101 INFO  (explicit-fetchindex-cmd) [    x:collection1] o.a.s.c.SolrDeletionPolicy SolrDeletionPolicy.onCommit: commits: num=1
   [junit4]   2> 	commit{dir=MockDirectoryWrapper(RAMDirectory@2fe62163 lockFactory=org.apache.lucene.store.SingleInstanceLockFactory@532dd4ae),segFN=segments_1,generation=1}
   [junit4]   2> 486101 INFO  (explicit-fetchindex-cmd) [    x:collection1] o.a.s.c.SolrDeletionPolicy newest commit generation = 1
   [junit4]   2> 486105 INFO  (explicit-fetchindex-cmd) [    x:collection1] o.a.s.u.DefaultSolrCoreState Rollback old IndexWriter... core=collection1
   [junit4]   2> 486105 INFO  (explicit-fetchindex-cmd) [    x:collection1] o.a.s.h.IndexFetcher Starting download (fullCopy=false) to MockDirectoryWrapper(RAMDirectory@69fbe65c lockFactory=org.apache.lucene.store.SingleInstanceLockFactory@6e5ae252)
   [junit4]   2> 486108 INFO  (qtp1747409814-2608) [    x:collection1] o.a.s.c.S.Request [collection1]  webapp=/solr path=/replication params={generation=2&qt=/replication&file=_0.si&checksum=true&wt=filestream&command=filecontent} status=0 QTime=0
   [junit4]   2> 486114 INFO  (qtp1747409814-2611) [    x:collection1] o.a.s.c.S.Request [collection1]  webapp=/solr path=/replication params={generation=2&qt=/replication&file=_0_TestBloomFilteredLucenePostings_0.doc&checksum=true&wt=filestream&command=filecontent} status=0 QTime=0
   [junit4]   2> 486122 INFO  (qtp1747409814-2609) [    x:collection1] o.a.s.c.S.Request [collection1]  webapp=/solr path=/replication params={generation=2&qt=/replication&file=_0_TestBloomFilteredLucenePostings_0.tim&checksum=true&wt=filestream&command=filecontent} status=0 QTime=0
   [junit4]   2> 486127 INFO  (qtp1747409814-2610) [    x:collection1] o.a.s.c.S.Request [collection1]  webapp=/solr path=/replication params={generation=2&qt=/replication&file=_0_TestBloomFilteredLucenePostings_0.tip&checksum=true&wt=filestream&command=filecontent} status=0 QTime=0
   [junit4]   2> 486135 INFO  (qtp1747409814-2612) [    x:collection1] o.a.s.c.S.Request [collection1]  webapp=/solr path=/replication params={generation=2&qt=/replication&file=_0.nvd&checksum=true&wt=filestream&command=filecontent} status=0 QTime=0
   [junit4]   2> 486140 INFO  (qtp1747409814-2612) [    x:collection1] o.a.s.c.S.Request [collection1]  webapp=/solr path=/replication params={generation=2&qt=/replication&file=_0.fdx&checksum=true&wt=filestream&command=filecontent} status=0 QTime=0
   [junit4]   2> 486144 INFO  (qtp1747409814-2613) [    x:collection1] o.a.s.c.S.Request [collection1]  webapp=/solr path=/replication params={generation=2&qt=/replication&file=_0.fdt&checksum=true&wt=filestream&command=filecontent} status=0 QTime=0
   [junit4]   2> 486154 INFO  (qtp1747409814-2608) [    x:collection1] o.a.s.c.S.Request [collection1]  webapp=/solr path=/replication params={generation=2&qt=/replication&file=_0.fnm&checksum=true&wt=filestream&command=filecontent} status=0 QTime=0
   [junit4]   2> 486168 INFO  (qtp1747409814-2611) [    x:collection1] o.a.s.c.S.Request [collection1]  webapp=/solr path=/replication params={generation=2&qt=/replication&file=_0.nvm&checksum=true&wt=filestream&command=filecontent} status=0 QTime=0
   [junit4]   2> 486173 INFO  (qtp1747409814-2609) [    x:collection1] o.a.s.c.S.Request [collection1]  webapp=/solr path=/replication params={generation=2&qt=/replication&file=_0_TestBloomFilteredLucenePostings_0.blm&checksum=true&wt=filestream&command=filecontent} status=0 QTime=0
   [junit4]   2> 486208 INFO  (qtp1747409814-2610) [    x:collection1] o.a.s.c.S.Request [collection1]  webapp=/solr path=/replication params={generation=2&qt=/replication&file=segments_2&checksum=true&wt=filestream&command=filecontent} status=0 QTime=0
   [junit4]   2> 486209 INFO  (explicit-fetchindex-cmd) [    x:collection1] o.a.s.h.IndexFetcher Total time taken for download (fullCopy=false,bytesDownloaded=2009) : 0 secs (null bytes/sec) to MockDirectoryWrapper(RAMDirectory@69fbe65c lockFactory=org.apache.lucene.store.SingleInstanceLockFactory@6e5ae252)
   [junit4]   2> 486216 INFO  (explicit-fetchindex-cmd) [    x:collection1] o.a.s.u.RandomMergePolicy RandomMergePolicy wrapping class org.apache.lucene.index.LogByteSizeMergePolicy: [LogByteSizeMergePolicy: minMergeSize=1677721, mergeFactor=31, maxMergeSize=2147483648, maxMergeSizeForForcedMerge=9223372036854775807, calibrateSizeByDeletes=true, maxMergeDocs=2147483647, maxCFSSegmentSizeMB=8.796093022207999E12, noCFSRatio=0.0]
   [junit4]   2> 486219 INFO  (explicit-fetchindex-cmd) [    x:collection1] o.a.s.c.SolrDeletionPolicy SolrDeletionPolicy.onInit: commits: num=2
   [junit4]   2> 	commit{dir=MockDirectoryWrapper(RAMDirectory@2fe62163 lockFactory=org.apache.lucene.store.SingleInstanceLockFactory@532dd4ae),segFN=segments_1,generation=1}
   [junit4]   2> 	commit{dir=MockDirectoryWrapper(RAMDirectory@2fe62163 lockFactory=org.apache.lucene.store.SingleInstanceLockFactory@532dd4ae),segFN=segments_2,generation=2}
   [junit4]   2> 486219 INFO  (explicit-fetchindex-cmd) [    x:collection1] o.a.s.c.SolrDeletionPolicy newest commit generation = 2
   [junit4]   2> 486219 INFO  (explicit-fetchindex-cmd) [    x:collection1] o.a.s.u.DefaultSolrCoreState New IndexWriter is ready to be used.
   [junit4]   2> 486224 INFO  (explicit-fetchindex-cmd) [    x:collection1] o.a.s.s.SolrIndexSearcher Opening [Searcher@33b9e555[collection1] main]
   [junit4]   2> 486224 INFO  (searcherExecutor-1060-thread-1-processing-x:collection1) [    x:collection1] o.a.s.c.SolrCore [collection1] Registered new searcher Searcher@33b9e555[collection1] main{ExitableDirectoryReader(UninvertingDirectoryReader(Uninverting(_0(6.1.0):C1)))}
   [junit4]   2> 486225 INFO  (explicit-fetchindex-cmd) [    x:collection1] o.a.s.c.CachingDirectoryFactory looking to close /Users/jenkins/workspace/Lucene-Solr-6.x-MacOSX/solr/build/solr-core/test/J0/temp/solr.handler.TestReplicationHandler_DF38016AA724300F-001/solr-instance-002/./collection1/data/index.20160406195421341 [CachedDir<<refCount=0;path=/Users/jenkins/workspace/Lucene-Solr-6.x-MacOSX/solr/build/solr-core/test/J0/temp/solr.handler.TestReplicationHandler_DF38016AA724300F-001/solr-instance-002/./collection1/data/index.20160406195421341;done=true>>]
   [junit4]   2> 486225 INFO  (explicit-fetchindex-cmd) [    x:collection1] o.a.s.c.CachingDirectoryFactory Closing directory, CoreContainer#isShutdown=false
   [junit4]   2> 486225 INFO  (explicit-fetchindex-cmd) [    x:collection1] o.a.s.c.CachingDirectoryFactory Closing directory: /Users/jenkins/workspace/Lucene-Solr-6.x-MacOSX/solr/build/solr-core/test/J0/temp/solr.handler.TestReplicationHandler_DF38016AA724300F-001/solr-instance-002/./collection1/data/index.20160406195421341
   [junit4]   2> 486225 INFO  (qtp1512974425-2625) [    x:collection1] o.a.s.c.S.Request [collection1]  webapp=/solr path=/replication params={wait=true&masterUrl=http://127.0.0.1:52431/solr/collection1/replication&command=fetchindex} status=0 QTime=149
   [junit4]   2> 486250 INFO  (qtp1512974425-2627) [    x:collection1] o.a.s.c.S.Request [collection1]  webapp=/solr path=/select params={q=name:empty1&sort=id+desc&wt=javabin&version=2} hits=1 status=0 QTime=0
   [junit4]   2> 486251 INFO  (TEST-TestReplicationHandler.testEmptyCommits-seed#[DF38016AA724300F]) [    ] o.a.s.h.TestReplicationHandler Waited for 0ms and found 1 docs
   [junit4]   2> 486256 INFO  (qtp1747409814-2606) [    x:collection1] o.a.s.c.S.Request [collection1]  webapp=/solr path=/replication params={_trace=getDetails&qt=/replication&wt=javabin&version=2&command=details} status=0 QTime=0
   [junit4]   2> 486259 INFO  (qtp1747409814-2612) [    x:collection1] o.a.s.c.S.Request [collection1]  webapp=/solr path=/replication params={_trace=getDetails&qt=/replication&wt=javabin&version=2&command=details} status=0 QTime=0
   [junit4]   2> 486272 INFO  (qtp1747409814-2613) [    x:collection1] o.a.s.c.S.Request [collection1]  webapp=/solr path=/replication params={slave=false&qt=/replication&wt=javabin&version=2&command=details} status=0 QTime=1
   [junit4]   2> 486273 INFO  (qtp1512974425-2628) [    x:collection1] o.a.s.c.S.Request [collection1]  webapp=/solr path=/replication params={_trace=getDetails&qt=/replication&wt=javabin&version=2&command=details} status=0 QTime=10
   [junit4]   2> 486275 INFO  (qtp1747409814-2608) [    x:collection1] o.a.s.c.S.Request [collection1]  webapp=/solr path=/replication params={_trace=assertVersions&qt=/replication&wt=javabin&version=2&command=indexversion} status=0 QTime=0
   [junit4]   2> 486278 INFO  (qtp1512974425-2629) [    x:collection1] o.a.s.c.S.Request [collection1]  webapp=/solr path=/replication params={_trace=assertVersions&qt=/replication&wt=javabin&version=2&command=indexversion} status=0 QTime=0
   [junit4]   2> 486288 INFO  (qtp1747409814-2611) [    x:collection1] o.a.s.u.DirectUpdateHandler2 start commit{,optimize=false,openSearcher=true,waitSearcher=true,expungeDeletes=false,softCommit=false,prepareCommit=false}
   [junit4]   2> 486289 INFO  (qtp1747409814-2611) [    x:collection1] o.a.s.u.DirectUpdateHandler2 No uncommitted changes. Skipping IW.commit.
   [junit4]   2> 486289 INFO  (qtp1747409814-2611) [    x:collection1] o.a.s.c.SolrCore SolrIndexSearcher has not changed - not re-opening: org.apache.solr.search.SolrIndexSearcher
   [junit4]   2> 486289 INFO  (qtp1747409814-2611) [    x:collection1] o.a.s.u.DirectUpdateHandler2 end_commit_flush
   [junit4]   2> 486289 INFO  (qtp1747409814-2611) [    x:collection1] o.a.s.u.p.LogUpdateProcessorFactory [collection1]  webapp=/solr path=/update params={commit=true&wt=javabin&version=2}{commit=} 0 1
   [junit4]   2> 486292 WARN  (explicit-fetchindex-cmd) [    x:collection1] o.a.s.h.IndexFetcher 'masterUrl' must be specified without the /replication suffix
   [junit4]   2> 486296 INFO  (qtp1747409814-2609) [    x:collection1] o.a.s.c.S.Request [collection1]  webapp=/solr path=/replication params={qt=/replication&wt=javabin&version=2&command=indexversion} status=0 QTime=0
   [junit4]   2> 486296 INFO  (explicit-fetchindex-cmd) [    x:collection1] o.a.s.h.IndexFetcher Slave in sync with master.
   [junit4]   2> 486297 INFO  (qtp1512974425-2630) [    x:collection1] o.a.s.c.S.Request [collection1]  webapp=/solr path=/replication params={wait=true&masterUrl=http://127.0.0.1:52431/solr/collection1/replication&command=fetchindex} status=0 QTime=5
   [junit4]   2> 486315 INFO  (qtp1747409814-2610) [    x:collection1] o.a.s.u.p.LogUpdateProcessorFactory [collection1]  webapp=/solr path=/update params={wt=javabin&version=2}{add=[2]} 0 13
   [junit4]   2> 486319 INFO  (qtp1747409814-2606) [    x:collection1] o.a.s.u.DirectUpdateHandler2 start commit{,optimize=false,openSearcher=true,waitSearcher=true,expungeDeletes=false,softCommit=false,prepareCommit=false}
   [junit4]   2> 486339 INFO  (qtp1747409814-2606) [    x:collection1] o.a.s.c.SolrDeletionPolicy SolrDeletionPolicy.onCommit: commits: num=3
   [junit4]   2> 	commit{dir=MockDirectoryWrapper(RAMDirectory@493f78e1 lockFactory=org.apache.lucene.store.SingleInstanceLockFactory@42b5c414),segFN=segments_1,generation=1}
   [junit4]   2> 	commit{dir=MockDirectoryWrapper(RAMDirectory@493f78e1 lockFactory=org.apache.lucene.store.SingleInstanceLockFactory@42b5c414),segFN=segments_2,generation=2}
   [junit4]   2> 	commit{dir=MockDirectoryWrapper(RAMDirectory@493f78e1 lockFactory=org.apache.lucene.store.SingleInstanceLockFactory@42b5c414),segFN=segments_3,generation=3}
   [junit4]   2> 486340 INFO  (qtp1747409814-2606) [    x:collection1] o.a.s.c.SolrDeletionPolicy newest commit generation = 3
   [junit4]   2> 486340 INFO  (qtp1747409814-2606) [    x:collection1] o.a.s.s.SolrIndexSearcher Opening [Searcher@66b608c0[collection1] main]
   [junit4]   2> 486340 INFO  (qtp1747409814-2606) [    x:collection1] o.a.s.u.DirectUpdateHandler2 end_commit_flush
   [junit4]   2> 486340 INFO  (searcherExecutor-1050-thread-1-processing-x:collection1) [    x:collection1] o.a.s.c.SolrCore [collection1] Registered new searcher Searcher@66b608c0[collection1] main{ExitableDirectoryReader(UninvertingDirectoryReader(Uninverting(_0(6.1.0):C1) Uninverting(_1(6.1.0):C1)))}
   [junit4]   2> 486341 INFO  (qtp1747409814-2606) [    x:collection1] o.a.s.u.p.LogUpdateProcessorFactory [collection1]  webapp=/solr path=/update params={commit=true&wt=javabin&version=2}{commit=} 0 21
   [junit4]   2> 486342 WARN  (explicit-fetchindex-cmd) [    x:collection1] o.a.s.h.IndexFetcher 'masterUrl' must be specified without the /replication suffix
   [junit4]   2> 486347 INFO  (qtp1747409814-2612) [    x:collection1] o.a.s.c.S.Request [collection1]  webapp=/solr path=/replication params={qt=/replication&wt=javabin&version=2&command=indexversion} status=0 QTime=0
   [junit4]   2> 486347 INFO  (explicit-fetchindex-cmd) [    x:collection1] o.a.s.h.IndexFetcher Master's generation: 3
   [junit4]   2> 486347 INFO  (explicit-fetchindex-cmd) [    x:collection1] o.a.s.h.IndexFetcher Slave's generation: 2
   [junit4]   2> 486347 INFO  (explicit-fetchindex-cmd) [    x:collection1] o.a.s.h.IndexFetcher Starting replication process
   [junit4]   2> 486353 INFO  (qtp1747409814-2612) [    x:collection1] o.a.s.c.S.Request [collection1]  webapp=/solr path=/replication params={generation=3&qt=/replication&wt=javabin&version=2&command=filelist} status=0 QTime=2
   [junit4]   2> 486353 INFO  (explicit-fetchindex-cmd) [    x:collection1] o.a.s.h.IndexFetcher Number of files in latest index in master: 21
   [junit4]   2> 486354 INFO  (explicit-fetchindex-cmd) [    x:collection1] o.a.s.c.CachingDirectoryFactory return new directory for /Users/jenkins/workspace/Lucene-Solr-6.x-MacOSX/solr/build/solr-core/test/J0/temp/solr.handler.TestReplicationHandler_DF38016AA724300F-001/solr-instance-002/./collection1/data/index.20160406195421598
   [junit4]   2> 486358 INFO  (explicit-fetchindex-cmd) [    x:collection1] o.a.s.u.DefaultSolrCoreState Rollback old IndexWriter... core=collection1
   [junit4]   2> 486359 INFO  (explicit-fetchindex-cmd) [    x:collection1] o.a.s.u.RandomMergePolicy RandomMergePolicy wrapping class org.apache.lucene.index.LogDocMergePolicy: [LogDocMergePolicy: minMergeSize=1000, mergeFactor=14, maxMergeSize=9223372036854775807, maxMergeSizeForForcedMerge=9223372036854775807, calibrateSizeByDeletes=false, maxMergeDocs=2147483647, maxCFSSegmentSizeMB=8.796093022207999E12, noCFSRatio=1.0]
   [junit4]   2> 486361 INFO  (explicit-fetchindex-cmd) [    x:collection1] o.a.s.c.SolrDeletionPolicy SolrDeletionPolicy.onInit: commits: num=1
   [junit4]   2> 	commit{dir=MockDirectoryWrapper(RAMDirectory@2fe62163 lockFactory=org.apache.lucene.store.SingleInstanceLockFactory@532dd4ae),segFN=segments_2,generation=2}
   [junit4]   2> 486361 INFO  (explicit-fetchindex-cmd) [    x:collection1] o.a.s.c.SolrDeletionPolicy newest commit generation = 2
   [junit4]   2> 486362 INFO  (explicit-fetchindex-cmd) [    x:collection1] o.a.s.u.DefaultSolrCoreState New IndexWriter is ready to be used.
   [junit4]   2> 486362 INFO  (explicit-fetchindex-cmd) [    x:collection1] o.a.s.c.SolrDeletionPolicy SolrDeletionPolicy.onCommit: commits: num=1
   [junit4]   2> 	commit{dir=MockDirectoryWrapper(RAMDirectory@2fe62163 lockFactory=org.apache.lucene.store.SingleInstanceLockFactory@532dd4ae),segFN=segments_2,generation=2}
   [junit4]   2> 486362 INFO  (explicit-fetchindex-cmd) [    x:collection1] o.a.s.c.SolrDeletionPolicy newest commit generation = 2
   [junit4]   2> 486362 INFO  (explicit-fetchindex-cmd) [    x:collection1] o.a.s.u.DefaultSolrCoreState Rollback old IndexWriter... core=collection1
   [junit4]   2> 486362 INFO  (explicit-fetchindex-cmd) [    x:collection1] o.a.s.h.IndexFetcher Starting download (fullCopy=false) to MockDirectoryWrapper(RAMDirectory@7dda0a0 lockFactory=org.apache.lucene.store.SingleInstanceLockFactory@102c13a8)
   [junit4]   2> 486362 INFO  (explicit-fetchindex-cmd) [    x:collection1] o.a.s.h.IndexFetcher Skipping download for _0.si because it already exists
   [junit4]   2> 486362 INFO  (explicit-fetchindex-cmd) [    x:collection1] o.a.s.h.IndexFetcher Skipping download for _0_TestBloomFilteredLucenePostings_0.doc because it already exists
   [junit4]   2> 486362 INFO  (explicit-fetchindex-cmd) [    x:collection1] o.a.s.h.IndexFetcher Skipping download for _0_TestBloomFilteredLucenePostings_0.tim because it already exists
   [junit4]   2> 486362 INFO  (explicit-fetchindex-cmd) [    x:collection1] o.a.s.h.IndexFetcher Skipping download for _0_TestBloomFilteredLucenePostings_0.tip because it already exists
   [junit4]   2> 486362 INFO  (explicit-fetchindex-cmd) [    x:collection1] o.a.s.h.IndexFetcher Skipping download for _0.nvd because it already exists
   [junit4]   2> 486367 INFO  (explicit-fetchindex-cmd) [    x:collection1] o.a.s.h.IndexFetcher Skipping download for _0.fdx because it already exists
   [junit4]   2> 486367 INFO  (explicit-fetchindex-cmd) [    x:collection1] o.a.s.h.IndexFetcher Skipping download for _0.fdt because it already exists
   [junit4]   2> 486367 INFO  (explicit-fetchindex-cmd) [    x:collection1] o.a.s.h.IndexFetcher Skipping download for _0.fnm because it already exists
   [junit4]   2> 486367 INFO  (explicit-fetchindex-cmd) [    x:collection1] o.a.s.h.IndexFetcher Skipping download for _0.nvm because it already exists
   [junit4]   2> 486367 INFO  (explicit-fetchindex-cmd) [    x:collection1] o.a.s.h.IndexFetcher Skipping download for _0_TestBloomFilteredLucenePostings_0.blm because it already exists
   [junit4]   2> 486370 INFO  (qtp1747409814-2608) [    x:collection1] o.a.s.c.S.Request [collection1]  webapp=/solr path=/replication params={generation=3&qt=/replication&file=_1_TestBloomFilteredLucenePostings_0.tip&checksum=true&wt=filestream&command=filecontent} status=0 QTime=0
   [junit4]   2> 486378 INFO  (qtp1747409814-2611) [    x:collection1] o.a.s.c.S.Request [collection1]  webapp=/solr path=/replication params={generation=3&qt=/replication&file=_1.si&checksum=true&wt=filestream&command=filecontent} status=0 QTime=0
   [junit4]   2> 486384 INFO  (qtp1747409814-2609) [    x:collection1] o.a.s.c.S.Request [collection1]  webapp=/solr path=/replication params={generation=3&qt=/replication&file=_1_TestBloomFilteredLucenePostings_0.doc&checksum=true&wt=filestream&command=filecontent} status=0 QTime=0
   [junit4]   2> 486390 INFO  (qtp1747409814-2610) [    x:collection1] o.a.s.c.S.Request [collection1]  webapp=/solr path=/replication params={generation=3&qt=/replication&file=_1_TestBloomFilteredLucenePostings_0.tim&checksum=true&wt=filestream&command=filecontent} status=0 QTime=0
   [junit4]   2> 486393 INFO  (qtp1747409814-2606) [    x:collection1] o.a.s.c.S.Request [collection1]  webapp=/solr path=/replication params={generation=3&qt=/replication&file=_1.nvd&checksum=true&wt=filestream&command=filecontent} status=0 QTime=0
   [junit4]   2> 486396 INFO  (qtp1747409814-2606) [    x:collection1] o.a.s.c.S.Request [collection1]  webapp=/solr path=/replication params={generation=3&qt=/replication&file=_1_TestBloomFilteredLucenePostings_0.blm&checksum=true&wt=filestream&command=filecontent} status=0 QTime=0
   [junit4]   2> 486401 INFO  (qtp1747409814-2612) [    x:collection1] o.a.s.c.S.Request [collection1]  webapp=/solr path=/replication params={generation=3&qt=/replication&file=_1.fdx&checksum=true&wt=filestream&command=filecontent} status=0 QTime=0
   [junit4]   2> 486405 INFO  (qtp1747409814-2608) [    x:collection1] o.a.s.c.S.Request [collection1]  webapp=/solr path=/replication params={generation=3&qt=/replication&file=_1.fnm&checksum=true&wt=filestream&command=filecontent} status=0 QTime=0
   [junit4]   2> 486413 INFO  (qtp1747409814-2611) [    x:collection1] o.a.s.c.S.Request [collection1]  webapp=/solr path=/replication params={generation=3&qt=/replication&file=_1.nvm&checksum=true&wt=filestream&command=filecontent} status=0 QTime=0
   [junit4]   2> 486418 INFO  (qtp1747409814-2609) [    x:collection1] o.a.s.c.S.Request [collection1]  webapp=/solr path=/replication params={generation=3&qt=/replication&file=_1.fdt&checksum=true&wt=filestream&command=filecontent} status=0 QTime=0
   [junit4]   2> 486421 INFO  (qtp1747409814-2610) [    x:collection1] o.a.s.c.S.Request [collection1]  webapp=/solr path=/replication params={generation=3&qt=/replication&file=segments_3&checksum=true&wt=filestream&command=filecontent} status=0 QTime=0
   [junit4]   2> 486422 INFO  (explicit-fetchindex-cmd) [    x:collection1] o.a.s.h.IndexFetcher Total time taken for download (fullCopy=false,bytesDownloaded=2072) : 0 secs (null bytes/sec) to MockDirectoryWrapper(RAMDirectory@7dda0a0 lockFactory=org.apache.lucene.store.SingleInstanceLockFactory@102c13a8)
   [junit4]   2> 486425 INFO  (explicit-fetchindex-cmd) [    x:collection1] o.a.s.u.RandomMergePolicy RandomMergePolicy wrapping class org.apache.lucene.index.LogByteSizeMergePolicy: [LogByteSizeMergePolicy: minMergeSize=1677721, mergeFactor=31, maxMergeSize=2147483648, maxMergeSizeForForcedMerge=9223372036854775807, calibrateSizeByDeletes=true, maxMergeDocs=2147483647, maxCFSSegmentSizeMB=8.796093022207999E12, noCFSRatio=0.0]
   [junit4]   2> 486426 INFO  (explicit-fetchindex-cmd) [    x:collection1] o.a.s.c.SolrDeletionPolicy SolrDeletionPolicy.onInit: commits: num=2
   [junit4]   2> 	commit{dir=MockDirectoryWrapper(RAMDirectory@2fe62163 lockFactory=org.apache.lucene.store.SingleInstanceLockFactory@532dd4ae),segFN=segments_2,generation=2}
   [junit4]   2> 	commit{dir=MockDirectoryWrapper(RAMDirectory@2fe62163 lockFactory=org.apache.lucene.store.SingleInstanceLockFactory@532dd4ae),segFN=segments_3,generation=3}
   [junit4]   2> 486426 INFO  (explicit-fetchindex-cmd) [    x:collection1] o.a.s.c.SolrDeletionPolicy newest commit generation = 3
   [junit4]   2> 486426 INFO  (explicit-fetchindex-cmd) [    x:collection1] o.a.s.u.DefaultSolrCoreState New IndexWriter is ready to be used.
   [junit4]   2> 486429 INFO  (explicit-fetchindex-cmd) [    x:collection1] o.a.s.s.SolrIndexSearcher Opening [Searcher@56632e98[collection1] main]
   [junit4]   2> 486429 INFO  (searcherExecutor-1060-thread-1-processing-x:collection1) [    x:collection1] o.a.s.c.SolrCore [collection1] Registered new searcher Searcher@56632e98[collection1] main{ExitableDirectoryReader(UninvertingDirectoryReader(Uninverting(_0(6.1.0):C1) Uninverting(_1(6.1.0):C1)))}
   [junit4]   2> 486429 INFO  (explicit-fetchindex-cmd) [    x:collection1] o.a.s.c.CachingDirectoryFactory looking to close /Users/jenkins/workspace/Lucene-Solr-6.x-MacOSX/solr/build/solr-core/test/J0/temp/solr.handler.TestReplicationHandler_DF38016AA724300F-001/solr-instance-002/./collection1/data/index.20160406195421598 [CachedDir<<refCount=0;path=/Users/jenkins/workspace/Lucene-Solr-6.x-MacOSX/solr/build/solr-core/test/J0/temp/solr.handler.TestReplicationHandler_DF38016AA724300F-001/solr-instance-002/./collection1/data/index.20160406195421598;done=true>>]
   [junit4]   2> 486429 INFO  (explicit-fetchindex-cmd) [    x:collection1] o.a.s.c.CachingDirectoryFactory Closing directory, CoreContainer#isShutdown=false
   [junit4]   2> 486429 INFO  (explicit-fetchindex-cmd) [    x:collection1] o.a.s.c.CachingDirectoryFactory Closing directory: /Users/jenkins/workspace/Lucene-Solr-6.x-MacOSX/solr/build/solr-core/test/J0/temp/solr.handler.TestReplicationHandler_DF38016AA724300F-001/solr-instance-002/./collection1/data/index.20160406195421598
   [junit4]   2> 486430 INFO  (qtp1512974425-2623) [    x:collection1] o.a.s.c.S.Request [collection1]  webapp=/solr path=/replication params={wait=true&masterUrl=http://127.0.0.1:52431/solr/collection1/replication&command=fetchindex} status=0 QTime=87
   [junit4]   2> 486435 INFO  (qtp1512974425-2625) [    x:collection1] o.a.s.c.S.Request [collection1]  webapp=/solr path=/select params={q=name:empty2&sort=id+desc&wt=javabin&version=2} hits=1 status=0 QTime=0
   [junit4]   2> 486436 INFO  (TEST-TestReplicationHandler.testEmptyCommits-seed#[DF38016AA724300F]) [    ] o.a.s.h.TestReplicationHandler Waited for 0ms and found 1 docs
   [junit4]   2> 486441 INFO  (qtp1747409814-2613) [    x:collection1] o.a.s.c.S.Request [collection1]  webapp=/solr path=/replication params={_trace=getDetails&qt=/replication&wt=javabin&version=2&command=details} status=0 QTime=2
   [junit4]   2> 486444 INFO  (qtp1747409814-2606) [    x:collection1] o.a.s.c.S.Request [collection1]  webapp=/solr path=/replication params={_trace=getDetails&qt=/replication&wt=javabin&version=2&command=details} status=0 QTime=0
   [junit4]   2> 486453 INFO  (qtp1747409814-2612) [    x:collection1] o.a.s.c.S.Request [collection1]  webapp=/solr path=/replication params={slave=false&qt=/replication&wt=javabin&version=2&command=details} status=0 QTime=3
   [junit4]   2> 486453 INFO  (qtp1512974425-2626) [    x:collection1] o.a.s.c.S.Request [collection1]  webapp=/solr path=/replication params={_trace=getDetails&qt=/replication&wt=javabin&version=2&command=details} status=0 QTime=6
   [junit4]   2> 486457 INFO  (qtp1747409814-2608) [    x:collection1] o.a.s.c.S.Request [collection1]  webapp=/solr path=/replication params={_trace=assertVersions&qt=/replication&wt=javabin&version=2&command=indexversion} status=0 QTime=0
   [junit4]   2> 486460 INFO  (qtp1512974425-2627) [    x:collection1] o.a.s.c.S.Request [collection1]  webapp=/solr path=/replication params={_trace=assertVersions&qt=/replication&wt=javabin&version=2&command=indexversion} status=0 QTime=0
   [junit4]   2> 486466 INFO  (qtp1747409814-2611) [    x:collection1] o.a.s.u.p.LogUpdateProcessorFactory [collection1]  webapp=/solr path=/update params={wt=javabin&version=2}{add=[3]} 0 1
   [junit4]   2> 486469 INFO  (qtp1747409814-2609) [    x:collection1] o.a.s.u.DirectUpdateHandler2 start commit{,optimize=false,openSearcher=false,waitSearcher=true,expungeDeletes=false,softCommit=false,prepareCommit=false}
   [junit4]   2> 486481 INFO  (qtp1747409814-2609) [    x:collection1] o.a.s.c.SolrDeletionPolicy SolrDeletionPolicy.onCommit: commits: num=4
   [junit4]   2> 	commit{dir=MockDirectoryWrapper(RAMDirectory@493f78e1 lockFactory=org.apache.lucene.store.SingleInstanceLockFactory@42b5c414),segFN=segments_1,generation=1}
   [junit4]   2> 	commit{dir=MockDirectoryWrapper(RAMDirectory@493f78e1 lockFactory=org.apache.lucene.store.SingleInstanceLockFactory@42b5c414),segFN=segments_2,generation=2}
   [junit4]   2> 	commit{dir=MockDirectoryWrapper(RAMDirectory@493f78e1 lockFactory=org.apache.lucene.store.SingleInstanceLockFactory@42b5c414),segFN=segments_3,generation=3}
   [junit4]   2> 	commit{dir=MockDirectoryWrapper(RAMDirectory@493f78e1 lockFactory=org.apache.lucene.store.SingleInstanceLockFactory@42b5c414),segFN=segments_4,generation=4}
   [junit4]   2> 486481 INFO  (qtp1747409814-2609) [    x:collection1] o.a.s.c.SolrDeletionPolicy newest commit generation = 4
   [junit4]   2> 486482 INFO  (qtp1747409814-2609) [    x:collection1] o.a.s.s.SolrIndexSearcher Opening [Searcher@6f5e5af[collection1] realtime]
   [junit4]   2> 486482 INFO  (qtp1747409814-2609) [    x:collection1] o.a.s.u.DirectUpdateHandler2 end_commit_flush
   [junit4]   2> 486482 INFO  (qtp1747409814-2609) [    x:collection1] o.a.s.u.p.LogUpdateProcessorFactory [collection1]  webapp=/solr path=/update params={openSearcher=false&commit=true&wt=javabin&version=2}{commit=} 0 13
   [junit4]   2> 486483 WARN  (explicit-fetchindex-cmd) [    x:collection1] o.a.s.h.IndexFetcher 'masterUrl' must be specified without the /replication suffix
   [junit4]   2> 486486 INFO  (qtp1747409814-2610) [    x:collection1] o.a.s.c.S.Request [collection1]  webapp=/solr path=/replication params={qt=/replication&wt=javabin&version=2&command=indexversion} status=0 QTime=0
   [junit4]   2> 486487 INFO  (explicit-fetchindex-cmd) [    x:collection1] o.a.s.h.IndexFetcher Master's generation: 4
   [junit4]   2> 486487 INFO  (explicit-fetchindex-cmd) [    x:collection1] o.a.s.h.IndexFetcher Slave's generation: 3
   [junit4]   2> 486487 INFO  (explicit-fetchindex-cmd) [    x:collection1] o.a.s.h.IndexFetcher Starting replication process
   [junit4]   2> 486494 INFO  (qtp1747409814-2610) [    x:collection1] o.a.s.c.S.Request [collection1]  webapp=/solr path=/replication params={generation=4&qt=/replication&wt=javabin&version=2&command=filelist} status=0 QTime=4
   [junit4]   2> 486494 INFO  (explicit-fetchindex-cmd) [    x:collection1] o.a.s.h.IndexFetcher Number of files in latest index in master: 31
   [junit4]   2> 486495 INFO  (explicit-fetchindex-cmd) [    x:collection1] o.a.s.c.CachingDirectoryFactory return new directory for /Users/jenkins/workspace/Lucene-Solr-6.x-MacOSX/solr/build/solr-core/test/J0/temp/solr.handler.TestReplicationHandler_DF38016AA724300F-001/solr-instance-002/./collection1/data/index.20160406195421739
   [junit4]   2> 486500 INFO  (explicit-fetchindex-cmd) [    x:collection1] o.a.s.u.DefaultSolrCoreState Rollback old IndexWriter... core=collection1
   [junit4]   2> 486501 INFO  (explicit-fetchindex-cmd) [    x:collection1] o.a.s.u.RandomMergePolicy RandomMergePolicy wrapping class org.apache.lucene.index.LogDocMergePolicy: [LogDocMergePolicy: minMergeSize=1000, mergeFactor=14, maxMergeSize=9223372036854775807, maxMergeSizeForForcedMerge=9223372036854775807, calibrateSizeByDeletes=false, maxMergeDocs=2147483647, maxCFSSegmentSizeMB=8.796093022207999E12, noCFSRatio=1.0]
   [junit4]   2> 486508 INFO  (explicit-fetchindex-cmd) [    x:collection1] o.a.s.c.SolrDeletionPolicy SolrDeletionPolicy.onInit: commits: num=2
   [junit4]   2> 	commit{dir=MockDirectoryWrapper(RAMDirectory@2fe62163 lockFactory=org.apache.lucene.store.SingleInstanceLockFactory@532dd4ae),segFN=segments_2,generation=2}
   [junit4]   2> 	commit{dir=MockDirectoryWrapper(RAMDirectory@2fe62163 lockFactory=org.apache.lucene.store.SingleInstanceLockFactory@532dd4ae),segFN=segments_3,generation=3}
   [junit4]   2> 486508 INFO  (explicit-fetchindex-cmd) [    x:collection1] o.a.s.c.SolrDeletionPolicy newest commit generation = 3
   [junit4]   2> 486509 INFO  (explicit-fetchindex-cmd) [    x:collection1] o.a.s.u.DefaultSolrCoreState New IndexWriter is ready to be used.
   [junit4]   2> 486509 INFO  (explicit-fetchindex-cmd) [    x:collection1] o.a.s.c.SolrDeletionPolicy SolrDeletionPolicy.onCommit: commits: num=2
   [junit4]   2> 	commit{dir=MockDirectoryWrapper(RAMDirectory@2fe62163 lockFactory=org.apache.lucene.store.SingleInstanceLockFactory@532dd4ae),segFN=segments_2,generation=2}
   [junit4]   2> 	commit{dir=MockDirectoryWrapper(RAMDirectory@2fe62163 lockFactory=org.apache.lucene.store.SingleInstanceLockFactory@532dd4ae),segFN=segments_3,generation=3}
   [junit4]   2> 486509 INFO  (explicit-fetchindex-cmd) [    x:collection1] o.a.s.c.SolrDeletionPolicy newest commit generation = 3
   [junit4]   2> 486512 INFO  (explicit-fetchindex-cmd) [    x:collection1] o.a.s.h.IndexFetcher Found unused file: segments_2
   [junit4]   2> 486512 INFO  (explicit-fetchindex-cmd) [    x:collection1] o.a.s.c.SolrDeletionPolicy SolrDeletionPolicy.onCommit: commits: num=2
   [junit4]   2> 	commit{dir=MockDirectoryWrapper(RAMDirectory@2fe62163 lockFactory=org.apache.lucene.store.SingleInstanceLockFactory@532dd4ae),segFN=segments_2,generation=2}
   [junit4]   2> 	commit{dir=MockDirectoryWrapper(RAMDirectory@2fe62163 lockFactory=org.apache.lucene.store.SingleInstanceLockFactory@532dd4ae),segFN=segments_3,generation=3}
   [junit4]   2> 486512 INFO  (explicit-fetchindex-cmd) [    x:collection1] o.a.s.c.SolrDeletionPolicy newest commit generation = 3
   [junit4]   2> 486512 INFO  (explicit-fetchindex-cmd) [    x:collection1] o.a.s.h.IndexFetcher Sleeping for 1000ms to wait for unused lucene index files to be delete-able
   [junit4]   2> 487514 INFO  (explicit-fetchindex-cmd) [    x:collection1] o.a.s.h.IndexFetcher Found unused file: segments_2
   [junit4]   2> 487514 INFO  (explicit-fetchindex-cmd) [    x:collection1] o.a.s.c.SolrDeletionPolicy SolrDeletionPolicy.onCommit: commits: num=2
   [junit4]   2> 	commit{dir=MockDirectoryWrapper(RAMDirectory@2fe62163 lockFactory=org.apache.lucene.store.SingleInstanceLockFactory@532dd4ae),segFN=segments_2,generation=2}
   [junit4]   2> 	commit{dir=MockDirectoryWrapper(RAMDirectory@2fe62163 lockFactory=org.apache.lucene.store.SingleInstanceLockFactory@532dd4ae),segFN=segments_3,generation=3}
   [junit4]   2> 487514 INFO  (explicit-fetchindex-cmd) [    x:collection1] o.a.s.c.SolrDeletionPolicy newest commit generation = 3
   [junit4]   2> 487514 INFO  (explicit-fetchindex-cmd) [    x:collection1] o.a.s.h.IndexFetcher Sleeping for 1000ms to wait for unused lucene index files to be delete-able
   [junit4]   2> 488517 INFO  (explicit-fetchindex-cmd) [    x:collection1] o.a.s.h.IndexFetcher Found unused file: segments_2
   [junit4]   2> 488517 INFO  (explicit-fetchindex-cmd) [    x:collection1] o.a.s.c.SolrDeletionPolicy SolrDeletionPolicy.onCommit: commits: num=2
   [junit4]   2> 	commit{dir=MockDirectoryWrapper(RAMDirectory@2fe62163 lockFactory=org.apache.lucene.store.SingleInstanceLockFactory@532dd4ae),segFN=segments_2,generation=2}
   [junit4]   2> 	commit{dir=MockDirectoryWrapper(RAMDirectory@2fe62163 lockFactory=org.apache.lucene.store.SingleInstanceLockFactory@532dd4ae),segFN=segments_3,generation=3}
   [junit4]   2> 488517 INFO  (explicit-fetchindex-cmd) [    x:collection1] o.a.s.c.SolrDeletionPolicy newest commit generation = 3
   [junit4]   2> 488517 INFO  (explicit-fetchindex-cmd) [    x:collection1] o.a.s.h.IndexFetcher Sleeping for 1000ms to wait for unused lucene index files to be delete-able
   [junit4]   2> 489522 INFO  (explicit-fetchindex-cmd) [    x:collection1] o.a.s.h.IndexFetcher Found unused file: segments_2
   [junit4]   2> 489522 INFO  (explicit-fetchindex-cmd) [    x:collection1] o.a.s.c.SolrDeletionPolicy SolrDeletionPolicy.onCommit: commits: num=2
   [junit4]   2> 	commit{dir=MockDirectoryWrapper(RAMDirectory@2fe62163 lockFactory=org.apache.lucene.store.SingleInstanceLockFactory@532dd4ae),segFN=segments_2,generation=2}
   [junit4]   2> 	commit{dir=MockDirectoryWrapper(RAMDirectory@2fe62163 lockFactory=org.apache.lucene.store.SingleInstanceLockFactory@532dd4ae),segFN=segments_3,generation=3}
   [junit4]   2> 489522 INFO  (explicit-fetchindex-cmd) [    x:collection1] o.a.s.c.SolrDeletionPolicy newest commit generation = 3
   [junit4]   2> 489522 INFO  (explicit-fetchindex-cmd) [    x:collection1] o.a.s.h.IndexFetcher Sleeping for 1000ms to wait for unused lucene index files to be delete-able
   [junit4]   2> 490523 INFO  (explicit-fetchindex-cmd) [    x:collection1] o.a.s.h.IndexFetcher Found unused file: segments_2
   [junit4]   2> 490523 INFO  (explicit-fetchindex-cmd) [    x:collection1] o.a.s.c.SolrDeletionPolicy SolrDeletionPolicy.onCommit: commits: num=2
   [junit4]   2> 	commit{dir=MockDirectoryWrapper(RAMDirectory@2fe62163 lockFactory=org.apache.lucene.store.SingleInstanceLockFactory@532dd4ae),segFN=segments_2,generation=2}
   [junit4]   2> 	commit{dir=MockDirectoryWrapper(RAMDirectory@2fe62163 lockFactory=org.apache.lucene.store.SingleInstanceLockFactory@532dd4ae),segFN=segments_3,generation=3}
   [junit4]   2> 490523 INFO  (explicit-fetchindex-cmd) [    x:collection1] o.a.s.c.SolrDeletionPolicy newest commit generation = 3
   [junit4]   2> 490523 INFO  (explicit-fetchindex-cmd) [    x:collection1] o.a.s.h.IndexFetcher Sleeping for 1000ms to wait for unused lucene index files to be delete-able
   [junit4]   2> 491530 INFO  (explicit-fetchindex-cmd) [    x:collection1] o.a.s.h.IndexFetcher Found unused file: segments_2
   [junit4]   2> 491530 INFO  (explicit-fetchindex-cmd) [    x:collection1] o.a.s.c.SolrDeletionPolicy SolrDeletionPolicy.onCommit: commits: num=2
   [junit4]   2> 	commit{dir=MockDirectoryWrapper(RAMDirectory@2fe62163 lockFactory=org.apache.lucene.store.SingleInstanceLockFactory@532dd4ae),segFN=segments_2,generation=2}
   [junit4]   2> 	commit{dir=MockDirectoryWrapper(RAMDirectory@2fe62163 lockFactory=org.apache.lucene.store.SingleInstanceLockFactory@532dd4ae),segFN=segments_3,generation=3}
   [junit4]   2> 491530 INFO  (explicit-fetchindex-cmd) [    x:collection1] o.a.s.c.SolrDeletionPolicy newest commit generation = 3
   [junit4]   2> 491530 INFO  (explicit-fetchindex-cmd) [    x:collection1] o.a.s.h.IndexFetcher Sleeping for 1000ms to wait for unused lucene index files to be delete-able
   [junit4]   2> 492537 INFO  (explicit-fetchindex-cmd) [    x:collection1] o.a.s.h.IndexFetcher Found unused file: segments_2
   [junit4]   2> 492537 INFO  (explicit-fetchindex-cmd) [    x:collection1] o.a.s.c.SolrDeletionPolicy SolrDeletionPolicy.onCommit: commits: num=2
   [junit4]   2> 	commit{dir=MockDirectoryWrapper(RAMDirectory@2fe62163 lockFactory=org.apache.lucene.store.SingleInstanceLockFactory@532dd4ae),segFN=segments_2,generation=2}
   [junit4]   2> 	commit{dir=MockDirectoryWrapper(RAMDirectory@2fe62163 lockFactory=org.apache.lucene.store.SingleInstanceLockFactory@532dd4ae),segFN=segments_3,generation=3}
   [junit4]   2> 492537 INFO  (explicit-fetchindex-cmd) [    x:collection1] o.a.s.c.SolrDeletionPolicy newest commit generation = 3
   [junit4]   2> 492537 INFO  (explicit-fetchindex-cmd) [    x:collection1] o.a.s.h.IndexFetcher Sleeping for 1000ms to wait for unused lucene index files to be delete-able
   [junit4]   2> 493548 INFO  (explicit-fetchindex-cmd) [    x:collection1] o.a.s.h.IndexFetcher Found unused file: segments_2
   [junit4]   2> 493549 INFO  (explicit-fetchindex-cmd) [    x:collection1] o.a.s.c.SolrDeletionPolicy SolrDeletionPolicy.onCommit: commits: num=2
   [junit4]   2> 	commit{dir=MockDirectoryWrapper(RAMDirectory@2fe62163 lockFactory=org.apache.lucene.store.SingleInstanceLockFactory@532dd4ae),segFN=segments_2,generation=2}
   [junit4]   2> 	commit{dir=MockDirectoryWrapper(RAMDirectory@2fe62163 lockFactory=org.apache.lucene.store.SingleInstanceLockFactory@532dd4ae),segFN=segments_3,generation=3}
   [junit4]   2> 493549 INFO  (explicit-fetchindex-cmd) [    x:collection1] o.a.s.c.SolrDeletionPolicy newest commit generation = 3
   [junit4]   2> 493549 INFO  (explicit-fetchindex-cmd) [    x:collection1] o.a.s.h.IndexFetcher Sleeping for 1000ms to wait for unused lucene index files to be delete-able
   [junit4]   2> 494559 INFO  (explicit-fetchindex-cmd) [    x:collection1] o.a.s.h.IndexFetcher Found unused file: segments_2
   [junit4]   2> 494559 INFO  (explicit-fetchindex-cmd) [    x:collection1] o.a.s.c.SolrDeletionPolicy SolrDeletionPolicy.onCommit: commits: num=2
   [junit4]   2> 	commit{dir=MockDirectoryWrapper(RAMDirectory@2fe62163 lockFactory=org.apache.lucene.store.SingleInstanceLockFactory@532dd4ae),segFN=segments_2,generation=2}
   [junit4]   2> 	commit{dir=MockDirectoryWrapper(RAMDirectory@2fe62163 lockFactory=org.apache.lucene.store.SingleInstanceLockFactory@532dd4ae),segFN=segments_3,generation=3}
   [junit4]   2> 494559 INFO  (explicit-fetchindex-cmd) [    x:collection1] o.a.s.c.SolrDeletionPolicy newest commit generation = 3
   [junit4]   2> 494559 INFO  (explicit-fetchindex-cmd) [    x:collection1] o.a.s.h.IndexFetcher Sleeping for 1000ms to wait for unused lucene index files to be delete-able
   [junit4]   2> 495560 INFO  (explicit-fetchindex-cmd) [    x:collection1] o.a.s.h.IndexFetcher Found unused file: segments_2
   [junit4]   2> 495560 INFO  (explicit-fetchindex-cmd) [    x:collection1] o.a.s.c.SolrDeletionPolicy SolrDeletionPolicy.onCommit: commits: num=2
   [junit4]   2> 	commit{dir=MockDirectoryWrapper(RAMDirectory@2fe62163 lockFactory=org.apache.lucene.store.SingleInstanceLockFactory@532dd4ae),segFN=segments_2,generation=2}
   [junit4]   2> 	commit{dir=MockDirectoryWrapper(RAMDirectory@2fe62163 lockFactory=org.apache.lucene.store.SingleInstanceLockFactory@532dd4ae),segFN=segments_3,generation=3}
   [junit4]   2> 495560 INFO  (explicit-fetchindex-cmd) [    x:collection1] o.a.s.c.SolrDeletionPolicy newest commit generation = 3
   [junit4]   2> 495560 INFO  (explicit-fetchindex-cmd) [    x:collection1] o.a.s.h.IndexFetcher Sleeping for 1000ms to wait for unused lucene index files to be delete-able
   [junit4]   2> 496561 INFO  (explicit-fetchindex-cmd) [    x:collection1] o.a.s.h.IndexFetcher Found unused file: segments_2
   [junit4]   2> 496561 INFO  (explicit-fetchindex-cmd) [    x:collection1] o.a.s.c.SolrDeletionPolicy SolrDeletionPolicy.onCommit: commits: num=2
   [junit4]   2> 	commit{dir=MockDirectoryWrapper(RAMDirectory@2fe62163 lockFactory=org.apache.lucene.store.SingleInstanceLockFactory@532dd4ae),segFN=segments_2,generation=2}
   [junit4]   2> 	commit{dir=MockDirectoryWrapper(RAMDirectory@2fe62163 lockFactory=org.apache.lucene.store.SingleInstanceLockFactory@532dd4ae),segFN=segments_3,generation=3}
   [junit4]   2> 496561 INFO  (explicit-fetchindex-cmd) [    x:collection1] o.a.s.c.SolrDeletionPolicy newest commit generation = 3
   [junit4]   2> 496561 INFO  (explicit-fetchindex-cmd) [    x:collection1] o.a.s.h.IndexFetcher Sleeping for 1000ms to wait for unused lucene index files to be delete-able
   [junit4]   2> 497572 INFO  (explicit-fetchindex-cmd) [    x:collection1] o.a.s.h.IndexFetcher IndexFetcher slept for 11000ms for unused lucene index files to be delete-able
   [junit4]   2> 497573 INFO  (explicit-fetchindex-cmd) [    x:collection1] o.a.s.u.DefaultSolrCoreState Rollback old IndexWriter... core=collection1
   [junit4]   2> 497573 INFO  (explicit-fetchindex-cmd) [    x:collection1] o.a.s.h.IndexFetcher Starting download (fullCopy=false) to MockDirectoryWrapper(RAMDirectory@6b34cce9 lockFactory=org.apache.lucene.store.SingleInstanceLockFactory@490a1d23)
   [junit4]   2> 497573 INFO  (explicit-fetchindex-cmd) [    x:collection1] o.a.s.h.IndexFetcher Skipping download for _0.si because it already exists
   [junit4]   2> 497573 INFO  (explicit-fetchindex-cmd) [    x:collection1] o.a.s.h.IndexFetcher Skipping download for _0_TestBloomFilteredLucenePostings_0.doc because it already exists
   [junit4]   2> 497573 INFO  (explicit-fetchindex-cmd) [    x:collection1] o.a.s.h.IndexFetcher Skipping download for _0_TestBloomFilteredLucenePostings_0.tim because it already exists
   [junit4]   2> 497573 INFO  (explicit-fetchindex-cmd) [    x:collection1] o.a.s.h.IndexFetcher Skipping download for _0_TestBloomFilteredLucenePostings_0.tip because it already exists
   [junit4]   2> 497573 INFO  (explicit-fetchindex-cmd) [    x:collection1] o.a.s.h.IndexFetcher Skipping download for _0.nvd because it already exists
   [junit4]   2> 497573 INFO  (explicit-fetchindex-cmd) [    x:collection1] o.a.s.h.IndexFetcher Skipping download for _0.fdx because it already exists
   [junit4]   2> 497573 INFO  (explicit-fetchindex-cmd) [    x:collection1] o.a.s.h.IndexFetcher Skipping download for _0.fdt because it already exists
   [junit4]   2> 497573 INFO  (explicit-fetchindex-cmd) [    x:collection1] o.a.s.h.IndexFetcher Skipping download for _0.fnm because it already exists
   [junit4]   2> 497573 INFO  (explicit-fetchindex-cmd) [    x:collection1] o.a.s.h.IndexFetcher Skipping download for _0.nvm because it already exists
   [junit4]   2> 497573 INFO  (explicit-fetchindex-cmd) [    x:collection1] o.a.s.h.IndexFetcher Skipping download for _0_TestBloomFilteredLucenePostings_0.blm because it already exists
   [junit4]   2> 497573 INFO  (explicit-fetchindex-cmd) [    x:collection1] o.a.s.h.IndexFetcher Skipping download for _1_TestBloomFilteredLucenePostings_0.tip because it already exists
   [junit4]   2> 497574 INFO  (explicit-fetchindex-cmd) [    x:collection1] o.a.s.h.IndexFetcher Skipping download for _1.si because it already exists
   [junit4]   2> 497574 INFO  (explicit-fetchindex-cmd) [    x:collection1] o.a.s.h.IndexFetcher Skipping download for _1_TestBloomFilteredLucenePostings_0.doc because it already exists
   [junit4]   2> 497574 INFO  (explicit-fetchindex-cmd) [    x:collection1] o.a.s.h.IndexFetcher Skipping download for _1_TestBloomFilteredLucenePostings_0.tim because it already exists
   [junit4]   2> 497574 INFO  (explicit-fetchindex-cmd) [    x:collection1] o.a.s.h.IndexFetcher Skipping download for _1.nvd because it already exists
   [junit4]   2> 497574 INFO  (explicit-fetchindex-cmd) [    x:collection1] o.a.s.h.IndexFetcher Skipping download for _1_TestBloomFilteredLucenePostings_0.blm because it already exists
   [junit4]   2> 497574 INFO  (explicit-fetchindex-cmd) [    x:collection1] o.a.s.h.IndexFetcher Skipping download for _1.fdx because it already exists
   [junit4]   2> 497574 INFO  (explicit-fetchindex-cmd) [    x:collection1] o.a.s.h.IndexFetcher Skipping download for _1.fnm because it already exists
   [junit4]   2> 497574 INFO  (explicit-fetchindex-cmd) [    x:collection1] o.a.s.h.IndexFetcher Skipping download for _1.nvm because it already exists
   [junit4]   2> 497574 INFO  (explicit-fetchindex-cmd) [    x:collection1] o.a.s.h.IndexFetcher Skipping download for _1.fdt because it already exists
   [junit4]   2> 497578 INFO  (qtp1747409814-2606) [    x:collection1] o.a.s.c.S.Request [collection1]  webapp=/solr path=/replication params={generation=4&qt=/replication&file=_2.nvd&checksum=true&wt=filestream&command=filecontent} status=0 QTime=0
   [junit4]   2> 497590 INFO  (qtp1747409814-2612) [    x:collection1] o.a.s.c.S.Request [collection1]  webapp=/solr path=/replication params={generation=4&qt=/replication&file=_2.si&checksum=true&wt=filestream&command=filecontent} status=0 QTime=0
   [junit4]   2> 497596 INFO  (qtp1747409814-2608) [    x:collection1] o.a.s.c.S.Request [collection1]  webapp=/solr path=/replication params={generation=4&qt=/replication&file=_2_TestBloomFilteredLu

[...truncated too long message...]

tion1] o.a.s.u.DefaultSolrCoreState SolrCoreState ref count has reached 0 - closing IndexWriter
   [junit4]   2> 573923 INFO  (coreCloseExecutor-1679-thread-1) [    x:collection1] o.a.s.u.DefaultSolrCoreState closing IndexWriter with IndexWriterCloser
   [junit4]   2> 573923 INFO  (coreCloseExecutor-1679-thread-1) [    x:collection1] o.a.s.c.SolrCore [collection1] Closing main searcher on request.
   [junit4]   2> 573924 INFO  (coreCloseExecutor-1679-thread-1) [    x:collection1] o.a.s.c.CachingDirectoryFactory Closing MockDirectoryFactory - 2 directories currently being tracked
   [junit4]   2> 573924 INFO  (coreCloseExecutor-1679-thread-1) [    x:collection1] o.a.s.c.CachingDirectoryFactory looking to close /Users/jenkins/workspace/Lucene-Solr-6.x-MacOSX/solr/build/solr-core/test/J0/temp/solr.handler.TestReplicationHandler_DF38016AA724300F-001/solr-instance-026/./collection1/data/index [CachedDir<<refCount=0;path=/Users/jenkins/workspace/Lucene-Solr-6.x-MacOSX/solr/build/solr-core/test/J0/temp/solr.handler.TestReplicationHandler_DF38016AA724300F-001/solr-instance-026/./collection1/data/index;done=false>>]
   [junit4]   2> 573924 INFO  (coreCloseExecutor-1679-thread-1) [    x:collection1] o.a.s.c.CachingDirectoryFactory Closing directory, CoreContainer#isShutdown=true
   [junit4]   2> 573924 INFO  (coreCloseExecutor-1679-thread-1) [    x:collection1] o.a.s.c.CachingDirectoryFactory Closing directory: /Users/jenkins/workspace/Lucene-Solr-6.x-MacOSX/solr/build/solr-core/test/J0/temp/solr.handler.TestReplicationHandler_DF38016AA724300F-001/solr-instance-026/./collection1/data/index
   [junit4]   2> 573924 INFO  (coreCloseExecutor-1679-thread-1) [    x:collection1] o.a.s.c.CachingDirectoryFactory looking to close /Users/jenkins/workspace/Lucene-Solr-6.x-MacOSX/solr/build/solr-core/test/J0/temp/solr.handler.TestReplicationHandler_DF38016AA724300F-001/solr-instance-026/./collection1/data [CachedDir<<refCount=0;path=/Users/jenkins/workspace/Lucene-Solr-6.x-MacOSX/solr/build/solr-core/test/J0/temp/solr.handler.TestReplicationHandler_DF38016AA724300F-001/solr-instance-026/./collection1/data;done=false>>]
   [junit4]   2> 573924 INFO  (coreCloseExecutor-1679-thread-1) [    x:collection1] o.a.s.c.CachingDirectoryFactory Closing directory, CoreContainer#isShutdown=true
   [junit4]   2> 573924 INFO  (coreCloseExecutor-1679-thread-1) [    x:collection1] o.a.s.c.CachingDirectoryFactory Closing directory: /Users/jenkins/workspace/Lucene-Solr-6.x-MacOSX/solr/build/solr-core/test/J0/temp/solr.handler.TestReplicationHandler_DF38016AA724300F-001/solr-instance-026/./collection1/data
   [junit4]   2> 573925 INFO  (TEST-TestReplicationHandler.doTestDetails-seed#[DF38016AA724300F]) [    ] o.e.j.s.h.ContextHandler Stopped o.e.j.s.ServletContextHandler@f2d5475{/solr,null,UNAVAILABLE}
   [junit4]   2> 573928 INFO  (TEST-TestReplicationHandler.doTestDetails-seed#[DF38016AA724300F]) [    ] o.e.j.s.ServerConnector Stopped ServerConnector@6632e727{HTTP/1.1,[http/1.1]}{127.0.0.1:0}
   [junit4]   2> 573928 INFO  (TEST-TestReplicationHandler.doTestDetails-seed#[DF38016AA724300F]) [    ] o.a.s.c.CoreContainer Shutting down CoreContainer instance=2045246484
   [junit4]   2> 573929 INFO  (coreCloseExecutor-1681-thread-1) [    x:collection1] o.a.s.c.SolrCore [collection1]  CLOSING SolrCore org.apache.solr.core.SolrCore@1b90547b
   [junit4]   2> 573929 INFO  (coreCloseExecutor-1681-thread-1) [    x:collection1] o.a.s.u.DirectUpdateHandler2 closing DirectUpdateHandler2{commits=0,autocommits=0,soft autocommits=0,optimizes=0,rollbacks=0,expungeDeletes=0,docsPending=0,adds=0,deletesById=0,deletesByQuery=0,errors=0,cumulative_adds=0,cumulative_deletesById=0,cumulative_deletesByQuery=0,cumulative_errors=0}
   [junit4]   2> 573929 INFO  (coreCloseExecutor-1681-thread-1) [    x:collection1] o.a.s.u.SolrCoreState Closing SolrCoreState
   [junit4]   2> 573929 INFO  (coreCloseExecutor-1681-thread-1) [    x:collection1] o.a.s.u.DefaultSolrCoreState SolrCoreState ref count has reached 0 - closing IndexWriter
   [junit4]   2> 573929 INFO  (coreCloseExecutor-1681-thread-1) [    x:collection1] o.a.s.u.DefaultSolrCoreState closing IndexWriter with IndexWriterCloser
   [junit4]   2> 573930 INFO  (coreCloseExecutor-1681-thread-1) [    x:collection1] o.a.s.c.SolrCore [collection1] Closing main searcher on request.
   [junit4]   2> 573930 INFO  (coreCloseExecutor-1681-thread-1) [    x:collection1] o.a.s.c.CachingDirectoryFactory Closing MockDirectoryFactory - 2 directories currently being tracked
   [junit4]   2> 573930 INFO  (coreCloseExecutor-1681-thread-1) [    x:collection1] o.a.s.c.CachingDirectoryFactory looking to close /Users/jenkins/workspace/Lucene-Solr-6.x-MacOSX/solr/build/solr-core/test/J0/temp/solr.handler.TestReplicationHandler_DF38016AA724300F-001/solr-instance-027/./collection1/data/index [CachedDir<<refCount=0;path=/Users/jenkins/workspace/Lucene-Solr-6.x-MacOSX/solr/build/solr-core/test/J0/temp/solr.handler.TestReplicationHandler_DF38016AA724300F-001/solr-instance-027/./collection1/data/index;done=false>>]
   [junit4]   2> 573930 INFO  (coreCloseExecutor-1681-thread-1) [    x:collection1] o.a.s.c.CachingDirectoryFactory Closing directory, CoreContainer#isShutdown=true
   [junit4]   2> 573930 INFO  (coreCloseExecutor-1681-thread-1) [    x:collection1] o.a.s.c.CachingDirectoryFactory Closing directory: /Users/jenkins/workspace/Lucene-Solr-6.x-MacOSX/solr/build/solr-core/test/J0/temp/solr.handler.TestReplicationHandler_DF38016AA724300F-001/solr-instance-027/./collection1/data/index
   [junit4]   2> 573930 INFO  (coreCloseExecutor-1681-thread-1) [    x:collection1] o.a.s.c.CachingDirectoryFactory looking to close /Users/jenkins/workspace/Lucene-Solr-6.x-MacOSX/solr/build/solr-core/test/J0/temp/solr.handler.TestReplicationHandler_DF38016AA724300F-001/solr-instance-027/./collection1/data [CachedDir<<refCount=0;path=/Users/jenkins/workspace/Lucene-Solr-6.x-MacOSX/solr/build/solr-core/test/J0/temp/solr.handler.TestReplicationHandler_DF38016AA724300F-001/solr-instance-027/./collection1/data;done=false>>]
   [junit4]   2> 573930 INFO  (coreCloseExecutor-1681-thread-1) [    x:collection1] o.a.s.c.CachingDirectoryFactory Closing directory, CoreContainer#isShutdown=true
   [junit4]   2> 573930 INFO  (coreCloseExecutor-1681-thread-1) [    x:collection1] o.a.s.c.CachingDirectoryFactory Closing directory: /Users/jenkins/workspace/Lucene-Solr-6.x-MacOSX/solr/build/solr-core/test/J0/temp/solr.handler.TestReplicationHandler_DF38016AA724300F-001/solr-instance-027/./collection1/data
   [junit4]   2> 573931 INFO  (TEST-TestReplicationHandler.doTestDetails-seed#[DF38016AA724300F]) [    ] o.e.j.s.h.ContextHandler Stopped o.e.j.s.ServletContextHandler@33a7c49a{/solr,null,UNAVAILABLE}
   [junit4]   2> 573934 INFO  (SUITE-TestReplicationHandler-seed#[DF38016AA724300F]-worker) [    ] o.a.s.SolrTestCaseJ4 ###deleteCore
   [junit4]   2> NOTE: leaving temporary files on disk at: /Users/jenkins/workspace/Lucene-Solr-6.x-MacOSX/solr/build/solr-core/test/J0/temp/solr.handler.TestReplicationHandler_DF38016AA724300F-001
   [junit4]   2> NOTE: test params are: codec=Asserting(Lucene60): {name=TestBloomFilteredLucenePostings(BloomFilteringPostingsFormat(Lucene50(blocksize=128))), id=TestBloomFilteredLucenePostings(BloomFilteringPostingsFormat(Lucene50(blocksize=128))), newname=TestBloomFilteredLucenePostings(BloomFilteringPostingsFormat(Lucene50(blocksize=128)))}, docValues:{}, maxPointsInLeafNode=1887, maxMBSortInHeap=6.5975624652383615, sim=ClassicSimilarity, locale=he, timezone=Pacific/Fakaofo
   [junit4]   2> NOTE: Mac OS X 10.11.4 x86_64/Oracle Corporation 1.8.0_72 (64-bit)/cpus=3,threads=1,free=90730112,total=223666176
   [junit4]   2> NOTE: All tests run in this JVM: [LeaderInitiatedRecoveryOnShardRestartTest, MBeansHandlerTest, ConnectionManagerTest, TestSolrFieldCacheMBean, JSONWriterTest, TestQueryWrapperFilter, UnloadDistributedZkTest, TestIntervalFaceting, TestAnalyzeInfixSuggestions, DistributedSpellCheckComponentTest, BlockDirectoryTest, TestCryptoKeys, TestXmlQParser, TestSchemaSimilarityResource, TestDocBasedVersionConstraints, TestFieldTypeCollectionResource, CdcrUpdateLogTest, SliceStateTest, ZkStateWriterTest, TestCSVLoader, TestDynamicFieldCollectionResource, TestCursorMarkWithoutUniqueKey, OverseerRolesTest, TestPostingsSolrHighlighter, ChaosMonkeyNothingIsSafeTest, FastVectorHighlighterTest, TestSizeLimitedDistributedMap, WrapperMergePolicyFactoryTest, BadCopyFieldTest, LeaderElectionTest, DocValuesMultiTest, SolrCloudExampleTest, TestNoOpRegenerator, PrimitiveFieldTypeTest, FacetPivotSmallTest, PreAnalyzedFieldTest, TestReplicationHandler]
   [junit4] Completed [104/585 (1!)] on J0 in 89.08s, 13 tests, 1 failure <<< FAILURES!

[...truncated 1553 lines...]
BUILD FAILED
/Users/jenkins/workspace/Lucene-Solr-6.x-MacOSX/build.xml:740: The following error occurred while executing this line:
/Users/jenkins/workspace/Lucene-Solr-6.x-MacOSX/build.xml:684: The following error occurred while executing this line:
/Users/jenkins/workspace/Lucene-Solr-6.x-MacOSX/build.xml:59: The following error occurred while executing this line:
/Users/jenkins/workspace/Lucene-Solr-6.x-MacOSX/solr/build.xml:233: The following error occurred while executing this line:
/Users/jenkins/workspace/Lucene-Solr-6.x-MacOSX/solr/common-build.xml:529: The following error occurred while executing this line:
/Users/jenkins/workspace/Lucene-Solr-6.x-MacOSX/lucene/common-build.xml:1457: The following error occurred while executing this line:
/Users/jenkins/workspace/Lucene-Solr-6.x-MacOSX/lucene/common-build.xml:1014: There were test failures: 585 suites (10 ignored), 2361 tests, 1 failure, 119 ignored (69 assumptions) [seed: DF38016AA724300F]

Total time: 80 minutes 29 seconds
Build step 'Invoke Ant' marked build as failure
Archiving artifacts
[WARNINGS] Skipping publisher since build result is FAILURE
Recording test results
Email was triggered for: Failure - Any
Sending email for trigger: Failure - Any



Mime
View raw message