lucene-dev mailing list archives

Site index · List index
Message view « Date » · « Thread »
Top « Date » · « Thread »
From Policeman Jenkins Server <jenk...@thetaphi.de>
Subject [JENKINS] Lucene-Solr-6.x-Solaris (64bit/jdk1.8.0) - Build # 61 - Failure!
Date Sat, 09 Apr 2016 06:26:02 GMT
Build: http://jenkins.thetaphi.de/job/Lucene-Solr-6.x-Solaris/61/
Java: 64bit/jdk1.8.0 -XX:-UseCompressedOops -XX:+UseSerialGC

1 tests failed.
FAILED:  org.apache.solr.handler.component.SpellCheckComponentTest.test

Error Message:
List size mismatch @ spellcheck/suggestions

Stack Trace:
java.lang.RuntimeException: List size mismatch @ spellcheck/suggestions
	at __randomizedtesting.SeedInfo.seed([3834065169971C0A:B060398BC76B71F2]:0)
	at org.apache.solr.SolrTestCaseJ4.assertJQ(SolrTestCaseJ4.java:871)
	at org.apache.solr.SolrTestCaseJ4.assertJQ(SolrTestCaseJ4.java:818)
	at org.apache.solr.handler.component.SpellCheckComponentTest.test(SpellCheckComponentTest.java:147)
	at sun.reflect.NativeMethodAccessorImpl.invoke0(Native Method)
	at sun.reflect.NativeMethodAccessorImpl.invoke(NativeMethodAccessorImpl.java:62)
	at sun.reflect.DelegatingMethodAccessorImpl.invoke(DelegatingMethodAccessorImpl.java:43)
	at java.lang.reflect.Method.invoke(Method.java:498)
	at com.carrotsearch.randomizedtesting.RandomizedRunner.invoke(RandomizedRunner.java:1764)
	at com.carrotsearch.randomizedtesting.RandomizedRunner$8.evaluate(RandomizedRunner.java:871)
	at com.carrotsearch.randomizedtesting.RandomizedRunner$9.evaluate(RandomizedRunner.java:907)
	at com.carrotsearch.randomizedtesting.RandomizedRunner$10.evaluate(RandomizedRunner.java:921)
	at com.carrotsearch.randomizedtesting.rules.SystemPropertiesRestoreRule$1.evaluate(SystemPropertiesRestoreRule.java:57)
	at org.apache.lucene.util.TestRuleSetupTeardownChained$1.evaluate(TestRuleSetupTeardownChained.java:49)
	at org.apache.lucene.util.AbstractBeforeAfterRule$1.evaluate(AbstractBeforeAfterRule.java:45)
	at org.apache.lucene.util.TestRuleThreadAndTestName$1.evaluate(TestRuleThreadAndTestName.java:48)
	at org.apache.lucene.util.TestRuleIgnoreAfterMaxFailures$1.evaluate(TestRuleIgnoreAfterMaxFailures.java:64)
	at org.apache.lucene.util.TestRuleMarkFailure$1.evaluate(TestRuleMarkFailure.java:47)
	at com.carrotsearch.randomizedtesting.rules.StatementAdapter.evaluate(StatementAdapter.java:36)
	at com.carrotsearch.randomizedtesting.ThreadLeakControl$StatementRunner.run(ThreadLeakControl.java:367)
	at com.carrotsearch.randomizedtesting.ThreadLeakControl.forkTimeoutingTask(ThreadLeakControl.java:809)
	at com.carrotsearch.randomizedtesting.ThreadLeakControl$3.evaluate(ThreadLeakControl.java:460)
	at com.carrotsearch.randomizedtesting.RandomizedRunner.runSingleTest(RandomizedRunner.java:880)
	at com.carrotsearch.randomizedtesting.RandomizedRunner$5.evaluate(RandomizedRunner.java:781)
	at com.carrotsearch.randomizedtesting.RandomizedRunner$6.evaluate(RandomizedRunner.java:816)
	at com.carrotsearch.randomizedtesting.RandomizedRunner$7.evaluate(RandomizedRunner.java:827)
	at com.carrotsearch.randomizedtesting.rules.StatementAdapter.evaluate(StatementAdapter.java:36)
	at com.carrotsearch.randomizedtesting.rules.SystemPropertiesRestoreRule$1.evaluate(SystemPropertiesRestoreRule.java:57)
	at org.apache.lucene.util.AbstractBeforeAfterRule$1.evaluate(AbstractBeforeAfterRule.java:45)
	at com.carrotsearch.randomizedtesting.rules.StatementAdapter.evaluate(StatementAdapter.java:36)
	at org.apache.lucene.util.TestRuleStoreClassName$1.evaluate(TestRuleStoreClassName.java:41)
	at com.carrotsearch.randomizedtesting.rules.NoShadowingOrOverridesOnMethodsRule$1.evaluate(NoShadowingOrOverridesOnMethodsRule.java:40)
	at com.carrotsearch.randomizedtesting.rules.NoShadowingOrOverridesOnMethodsRule$1.evaluate(NoShadowingOrOverridesOnMethodsRule.java:40)
	at com.carrotsearch.randomizedtesting.rules.StatementAdapter.evaluate(StatementAdapter.java:36)
	at com.carrotsearch.randomizedtesting.rules.StatementAdapter.evaluate(StatementAdapter.java:36)
	at com.carrotsearch.randomizedtesting.rules.StatementAdapter.evaluate(StatementAdapter.java:36)
	at org.apache.lucene.util.TestRuleAssertionsRequired$1.evaluate(TestRuleAssertionsRequired.java:53)
	at org.apache.lucene.util.TestRuleMarkFailure$1.evaluate(TestRuleMarkFailure.java:47)
	at org.apache.lucene.util.TestRuleIgnoreAfterMaxFailures$1.evaluate(TestRuleIgnoreAfterMaxFailures.java:64)
	at org.apache.lucene.util.TestRuleIgnoreTestSuites$1.evaluate(TestRuleIgnoreTestSuites.java:54)
	at com.carrotsearch.randomizedtesting.rules.StatementAdapter.evaluate(StatementAdapter.java:36)
	at com.carrotsearch.randomizedtesting.ThreadLeakControl$StatementRunner.run(ThreadLeakControl.java:367)
	at java.lang.Thread.run(Thread.java:745)




Build Log:
[...truncated 11553 lines...]
   [junit4] Suite: org.apache.solr.handler.component.SpellCheckComponentTest
   [junit4]   2> Creating dataDir: /export/home/jenkins/workspace/Lucene-Solr-6.x-Solaris/solr/build/solr-core/test/J1/temp/solr.handler.component.SpellCheckComponentTest_3834065169971C0A-001/init-core-data-001
   [junit4]   2> 2244368 INFO  (SUITE-SpellCheckComponentTest-seed#[3834065169971C0A]-worker) [    ] o.a.s.SolrTestCaseJ4 Randomized ssl (false) and clientAuth (false)
   [junit4]   2> 2244369 INFO  (SUITE-SpellCheckComponentTest-seed#[3834065169971C0A]-worker) [    ] o.a.s.SolrTestCaseJ4 ####initCore
   [junit4]   2> 2244369 INFO  (SUITE-SpellCheckComponentTest-seed#[3834065169971C0A]-worker) [    ] o.a.s.c.SolrResourceLoader new SolrResourceLoader for directory: '/export/home/jenkins/workspace/Lucene-Solr-6.x-Solaris/solr/core/src/test-files/solr/collection1'
   [junit4]   2> 2244369 INFO  (SUITE-SpellCheckComponentTest-seed#[3834065169971C0A]-worker) [    ] o.a.s.c.SolrResourceLoader JNDI not configured for solr (NoInitialContextEx)
   [junit4]   2> 2244369 INFO  (SUITE-SpellCheckComponentTest-seed#[3834065169971C0A]-worker) [    ] o.a.s.c.SolrResourceLoader using system property solr.solr.home: /export/home/jenkins/workspace/Lucene-Solr-6.x-Solaris/solr/core/src/test-files/solr
   [junit4]   2> 2244369 INFO  (SUITE-SpellCheckComponentTest-seed#[3834065169971C0A]-worker) [    ] o.a.s.c.SolrResourceLoader Adding 'file:/export/home/jenkins/workspace/Lucene-Solr-6.x-Solaris/solr/core/src/test-files/solr/collection1/lib/classes/' to classloader
   [junit4]   2> 2244369 INFO  (SUITE-SpellCheckComponentTest-seed#[3834065169971C0A]-worker) [    ] o.a.s.c.SolrResourceLoader Adding 'file:/export/home/jenkins/workspace/Lucene-Solr-6.x-Solaris/solr/core/src/test-files/solr/collection1/lib/README' to classloader
   [junit4]   2> 2244403 INFO  (SUITE-SpellCheckComponentTest-seed#[3834065169971C0A]-worker) [    ] o.a.s.c.SolrConfig current version of requestparams : -1
   [junit4]   2> 2244406 WARN  (SUITE-SpellCheckComponentTest-seed#[3834065169971C0A]-worker) [    ] o.a.s.c.Config Beginning with Solr 5.5, <mergePolicy> is deprecated, use <mergePolicyFactory> instead.
   [junit4]   2> 2244406 INFO  (SUITE-SpellCheckComponentTest-seed#[3834065169971C0A]-worker) [    ] o.a.s.c.SolrConfig Using Lucene MatchVersion: 6.1.0
   [junit4]   2> 2244415 INFO  (SUITE-SpellCheckComponentTest-seed#[3834065169971C0A]-worker) [    ] o.a.s.c.SolrConfig Loaded SolrConfig: solrconfig-spellcheckcomponent.xml
   [junit4]   2> 2244418 INFO  (SUITE-SpellCheckComponentTest-seed#[3834065169971C0A]-worker) [    ] o.a.s.s.IndexSchema [null] Schema name=test
   [junit4]   2> 2244499 INFO  (SUITE-SpellCheckComponentTest-seed#[3834065169971C0A]-worker) [    ] o.a.s.s.OpenExchangeRatesOrgProvider Initialized with rates=open-exchange-rates.json, refreshInterval=1440.
   [junit4]   2> 2244503 INFO  (SUITE-SpellCheckComponentTest-seed#[3834065169971C0A]-worker) [    ] o.a.s.s.IndexSchema default search field in schema is text
   [junit4]   2> 2244504 INFO  (SUITE-SpellCheckComponentTest-seed#[3834065169971C0A]-worker) [    ] o.a.s.s.IndexSchema unique key field: id
   [junit4]   2> 2244507 INFO  (SUITE-SpellCheckComponentTest-seed#[3834065169971C0A]-worker) [    ] o.a.s.s.FileExchangeRateProvider Reloading exchange rates from file currency.xml
   [junit4]   2> 2244509 INFO  (SUITE-SpellCheckComponentTest-seed#[3834065169971C0A]-worker) [    ] o.a.s.s.FileExchangeRateProvider Reloading exchange rates from file currency.xml
   [junit4]   2> 2244510 INFO  (SUITE-SpellCheckComponentTest-seed#[3834065169971C0A]-worker) [    ] o.a.s.s.OpenExchangeRatesOrgProvider Reloading exchange rates from open-exchange-rates.json
   [junit4]   2> 2244511 INFO  (SUITE-SpellCheckComponentTest-seed#[3834065169971C0A]-worker) [    ] o.a.s.s.OpenExchangeRatesOrgProvider Reloading exchange rates from open-exchange-rates.json
   [junit4]   2> 2244511 INFO  (SUITE-SpellCheckComponentTest-seed#[3834065169971C0A]-worker) [    ] o.a.s.c.SolrResourceLoader JNDI not configured for solr (NoInitialContextEx)
   [junit4]   2> 2244511 INFO  (SUITE-SpellCheckComponentTest-seed#[3834065169971C0A]-worker) [    ] o.a.s.c.SolrResourceLoader using system property solr.solr.home: /export/home/jenkins/workspace/Lucene-Solr-6.x-Solaris/solr/core/src/test-files/solr
   [junit4]   2> 2244511 INFO  (SUITE-SpellCheckComponentTest-seed#[3834065169971C0A]-worker) [    ] o.a.s.c.SolrResourceLoader new SolrResourceLoader for directory: '/export/home/jenkins/workspace/Lucene-Solr-6.x-Solaris/solr/core/src/test-files/solr'
   [junit4]   2> 2244511 INFO  (SUITE-SpellCheckComponentTest-seed#[3834065169971C0A]-worker) [    ] o.a.s.c.SolrResourceLoader JNDI not configured for solr (NoInitialContextEx)
   [junit4]   2> 2244511 INFO  (SUITE-SpellCheckComponentTest-seed#[3834065169971C0A]-worker) [    ] o.a.s.c.SolrResourceLoader using system property solr.solr.home: /export/home/jenkins/workspace/Lucene-Solr-6.x-Solaris/solr/core/src/test-files/solr
   [junit4]   2> 2244511 INFO  (SUITE-SpellCheckComponentTest-seed#[3834065169971C0A]-worker) [    ] o.a.s.c.CoreContainer New CoreContainer 1496694199
   [junit4]   2> 2244511 INFO  (SUITE-SpellCheckComponentTest-seed#[3834065169971C0A]-worker) [    ] o.a.s.c.CoreContainer Loading cores into CoreContainer [instanceDir=/export/home/jenkins/workspace/Lucene-Solr-6.x-Solaris/solr/core/src/test-files/solr]
   [junit4]   2> 2244512 WARN  (SUITE-SpellCheckComponentTest-seed#[3834065169971C0A]-worker) [    ] o.a.s.c.CoreContainer Couldn't add files from /export/home/jenkins/workspace/Lucene-Solr-6.x-Solaris/solr/core/src/test-files/solr/lib to classpath: /export/home/jenkins/workspace/Lucene-Solr-6.x-Solaris/solr/core/src/test-files/solr/lib
   [junit4]   2> 2244512 INFO  (SUITE-SpellCheckComponentTest-seed#[3834065169971C0A]-worker) [    ] o.a.s.h.c.HttpShardHandlerFactory created with socketTimeout : 600000,connTimeout : 60000,maxConnectionsPerHost : 20,maxConnections : 10000,corePoolSize : 0,maximumPoolSize : 2147483647,maxThreadIdleTime : 5,sizeOfQueue : -1,fairnessPolicy : false,useRetries : false,
   [junit4]   2> 2244513 INFO  (SUITE-SpellCheckComponentTest-seed#[3834065169971C0A]-worker) [    ] o.a.s.u.UpdateShardHandler Creating UpdateShardHandler HTTP client with params: socketTimeout=30000&connTimeout=30000&retry=true
   [junit4]   2> 2244513 INFO  (SUITE-SpellCheckComponentTest-seed#[3834065169971C0A]-worker) [    ] o.a.s.l.LogWatcher SLF4J impl is org.slf4j.impl.Log4jLoggerFactory
   [junit4]   2> 2244513 INFO  (SUITE-SpellCheckComponentTest-seed#[3834065169971C0A]-worker) [    ] o.a.s.l.LogWatcher Registering Log Listener [Log4j (org.slf4j.impl.Log4jLoggerFactory)]
   [junit4]   2> 2244513 INFO  (SUITE-SpellCheckComponentTest-seed#[3834065169971C0A]-worker) [    ] o.a.s.c.CoreContainer Security conf doesn't exist. Skipping setup for authorization module.
   [junit4]   2> 2244513 INFO  (SUITE-SpellCheckComponentTest-seed#[3834065169971C0A]-worker) [    ] o.a.s.c.CoreContainer No authentication plugin used.
   [junit4]   2> 2244514 INFO  (SUITE-SpellCheckComponentTest-seed#[3834065169971C0A]-worker) [    ] o.a.s.c.CoreDescriptor Created CoreDescriptor: {name=collection1, config=solrconfig-spellcheckcomponent.xml, transient=false, schema=schema.xml, loadOnStartup=true, configSetProperties=configsetprops.json, collection=collection1, dataDir=/export/home/jenkins/workspace/Lucene-Solr-6.x-Solaris/solr/build/solr-core/test/J1/temp/solr.handler.component.SpellCheckComponentTest_3834065169971C0A-001/init-core-data-001, shard=shard1}
   [junit4]   2> 2244515 INFO  (coreLoadExecutor-7528-thread-1) [    ] o.a.s.c.SolrResourceLoader new SolrResourceLoader for directory: '/export/home/jenkins/workspace/Lucene-Solr-6.x-Solaris/solr/core/src/test-files/solr/collection1'
   [junit4]   2> 2244515 INFO  (coreLoadExecutor-7528-thread-1) [    ] o.a.s.c.SolrResourceLoader JNDI not configured for solr (NoInitialContextEx)
   [junit4]   2> 2244515 INFO  (coreLoadExecutor-7528-thread-1) [    ] o.a.s.c.SolrResourceLoader using system property solr.solr.home: /export/home/jenkins/workspace/Lucene-Solr-6.x-Solaris/solr/core/src/test-files/solr
   [junit4]   2> 2244515 INFO  (coreLoadExecutor-7528-thread-1) [    ] o.a.s.c.SolrResourceLoader Adding 'file:/export/home/jenkins/workspace/Lucene-Solr-6.x-Solaris/solr/core/src/test-files/solr/collection1/lib/classes/' to classloader
   [junit4]   2> 2244515 INFO  (coreLoadExecutor-7528-thread-1) [    ] o.a.s.c.SolrResourceLoader Adding 'file:/export/home/jenkins/workspace/Lucene-Solr-6.x-Solaris/solr/core/src/test-files/solr/collection1/lib/README' to classloader
   [junit4]   2> 2244533 INFO  (coreLoadExecutor-7528-thread-1) [    ] o.a.s.c.SolrConfig current version of requestparams : -1
   [junit4]   2> 2244536 WARN  (coreLoadExecutor-7528-thread-1) [    ] o.a.s.c.Config Beginning with Solr 5.5, <mergePolicy> is deprecated, use <mergePolicyFactory> instead.
   [junit4]   2> 2244537 INFO  (coreLoadExecutor-7528-thread-1) [    ] o.a.s.c.SolrConfig Using Lucene MatchVersion: 6.1.0
   [junit4]   2> 2244552 INFO  (coreLoadExecutor-7528-thread-1) [    ] o.a.s.c.SolrConfig Loaded SolrConfig: solrconfig-spellcheckcomponent.xml
   [junit4]   2> 2244556 INFO  (coreLoadExecutor-7528-thread-1) [    ] o.a.s.s.IndexSchema [collection1] Schema name=test
   [junit4]   2> 2244638 INFO  (coreLoadExecutor-7528-thread-1) [    ] o.a.s.s.OpenExchangeRatesOrgProvider Initialized with rates=open-exchange-rates.json, refreshInterval=1440.
   [junit4]   2> 2244642 INFO  (coreLoadExecutor-7528-thread-1) [    ] o.a.s.s.IndexSchema default search field in schema is text
   [junit4]   2> 2244643 INFO  (coreLoadExecutor-7528-thread-1) [    ] o.a.s.s.IndexSchema unique key field: id
   [junit4]   2> 2244646 INFO  (coreLoadExecutor-7528-thread-1) [    ] o.a.s.s.FileExchangeRateProvider Reloading exchange rates from file currency.xml
   [junit4]   2> 2244647 INFO  (coreLoadExecutor-7528-thread-1) [    ] o.a.s.s.FileExchangeRateProvider Reloading exchange rates from file currency.xml
   [junit4]   2> 2244648 INFO  (coreLoadExecutor-7528-thread-1) [    ] o.a.s.s.OpenExchangeRatesOrgProvider Reloading exchange rates from open-exchange-rates.json
   [junit4]   2> 2244649 INFO  (coreLoadExecutor-7528-thread-1) [    ] o.a.s.s.OpenExchangeRatesOrgProvider Reloading exchange rates from open-exchange-rates.json
   [junit4]   2> 2244650 INFO  (coreLoadExecutor-7528-thread-1) [    ] o.a.s.c.ConfigSetProperties Did not find ConfigSet properties, assuming default properties: Can't find resource 'configsetprops.json' in classpath or '/export/home/jenkins/workspace/Lucene-Solr-6.x-Solaris/solr/core/src/test-files/solr/collection1'
   [junit4]   2> 2244650 INFO  (coreLoadExecutor-7528-thread-1) [    ] o.a.s.c.CoreContainer Creating SolrCore 'collection1' using configuration from instancedir /export/home/jenkins/workspace/Lucene-Solr-6.x-Solaris/solr/core/src/test-files/solr/collection1
   [junit4]   2> 2244650 INFO  (coreLoadExecutor-7528-thread-1) [    x:collection1] o.a.s.c.SolrCore org.apache.solr.core.MockDirectoryFactory
   [junit4]   2> 2244651 INFO  (coreLoadExecutor-7528-thread-1) [    x:collection1] o.a.s.c.SolrCore [[collection1] ] Opening new SolrCore at [/export/home/jenkins/workspace/Lucene-Solr-6.x-Solaris/solr/core/src/test-files/solr/collection1], dataDir=[/export/home/jenkins/workspace/Lucene-Solr-6.x-Solaris/solr/build/solr-core/test/J1/temp/solr.handler.component.SpellCheckComponentTest_3834065169971C0A-001/init-core-data-001/]
   [junit4]   2> 2244651 INFO  (coreLoadExecutor-7528-thread-1) [    x:collection1] o.a.s.c.SolrCore JMX monitoring not detected for core: collection1
   [junit4]   2> 2244651 INFO  (coreLoadExecutor-7528-thread-1) [    x:collection1] o.a.s.c.CachingDirectoryFactory return new directory for /export/home/jenkins/workspace/Lucene-Solr-6.x-Solaris/solr/build/solr-core/test/J1/temp/solr.handler.component.SpellCheckComponentTest_3834065169971C0A-001/init-core-data-001
   [junit4]   2> 2244651 INFO  (coreLoadExecutor-7528-thread-1) [    x:collection1] o.a.s.c.SolrCore New index directory detected: old=null new=/export/home/jenkins/workspace/Lucene-Solr-6.x-Solaris/solr/build/solr-core/test/J1/temp/solr.handler.component.SpellCheckComponentTest_3834065169971C0A-001/init-core-data-001/index/
   [junit4]   2> 2244651 WARN  (coreLoadExecutor-7528-thread-1) [    x:collection1] o.a.s.c.SolrCore [collection1] Solr index directory '/export/home/jenkins/workspace/Lucene-Solr-6.x-Solaris/solr/build/solr-core/test/J1/temp/solr.handler.component.SpellCheckComponentTest_3834065169971C0A-001/init-core-data-001/index' doesn't exist. Creating new index...
   [junit4]   2> 2244651 INFO  (coreLoadExecutor-7528-thread-1) [    x:collection1] o.a.s.c.CachingDirectoryFactory return new directory for /export/home/jenkins/workspace/Lucene-Solr-6.x-Solaris/solr/build/solr-core/test/J1/temp/solr.handler.component.SpellCheckComponentTest_3834065169971C0A-001/init-core-data-001/index
   [junit4]   2> 2244651 INFO  (coreLoadExecutor-7528-thread-1) [    x:collection1] o.a.s.u.RandomMergePolicy RandomMergePolicy wrapping class org.apache.lucene.index.LogByteSizeMergePolicy: [LogByteSizeMergePolicy: minMergeSize=1677721, mergeFactor=18, maxMergeSize=2147483648, maxMergeSizeForForcedMerge=9223372036854775807, calibrateSizeByDeletes=true, maxMergeDocs=2147483647, maxCFSSegmentSizeMB=8.796093022207999E12, noCFSRatio=0.5121316442908842]
   [junit4]   2> 2244652 INFO  (coreLoadExecutor-7528-thread-1) [    x:collection1] o.a.s.c.SolrDeletionPolicy SolrDeletionPolicy.onCommit: commits: num=1
   [junit4]   2> 	commit{dir=MockDirectoryWrapper(RAMDirectory@459a5b10 lockFactory=org.apache.lucene.store.SingleInstanceLockFactory@5ebace85),segFN=segments_1,generation=1}
   [junit4]   2> 2244652 INFO  (coreLoadExecutor-7528-thread-1) [    x:collection1] o.a.s.c.SolrDeletionPolicy newest commit generation = 1
   [junit4]   2> 2244652 INFO  (OldIndexDirectoryCleanupThreadForCore-collection1) [    x:collection1] o.a.s.c.SolrCore Looking for old index directories to cleanup for core collection1 in /export/home/jenkins/workspace/Lucene-Solr-6.x-Solaris/solr/build/solr-core/test/J1/temp/solr.handler.component.SpellCheckComponentTest_3834065169971C0A-001/init-core-data-001/
   [junit4]   2> 2244654 INFO  (coreLoadExecutor-7528-thread-1) [    x:collection1] o.a.s.c.SolrCore no updateRequestProcessorChain defined as default, creating implicit default
   [junit4]   2> 2244656 INFO  (coreLoadExecutor-7528-thread-1) [    x:collection1] o.a.s.h.l.XMLLoader xsltCacheLifetimeSeconds=60
   [junit4]   2> 2244657 INFO  (coreLoadExecutor-7528-thread-1) [    x:collection1] o.a.s.h.l.XMLLoader xsltCacheLifetimeSeconds=60
   [junit4]   2> 2244658 INFO  (coreLoadExecutor-7528-thread-1) [    x:collection1] o.a.s.h.l.XMLLoader xsltCacheLifetimeSeconds=60
   [junit4]   2> 2244658 INFO  (coreLoadExecutor-7528-thread-1) [    x:collection1] o.a.s.h.l.XMLLoader xsltCacheLifetimeSeconds=60
   [junit4]   2> 2244660 INFO  (coreLoadExecutor-7528-thread-1) [    x:collection1] o.a.s.c.RequestHandlers Registered paths: /admin/mbeans,standard,spellCheckCompRH,/update/json/docs,/admin/luke,/export,/get,/admin/properties,/update/json,/admin/threads,/update/csv,/sql,/admin/segments,spellCheckCompRH1,/admin/system,/replication,/config,/stream,/schema,/admin/plugins,/admin/logging,spellCheckWithWordbreak,/admin/ping,/update,/admin/file
   [junit4]   2> 2244660 INFO  (coreLoadExecutor-7528-thread-1) [    x:collection1] o.a.s.c.SolrCore Using default statsCache cache: org.apache.solr.search.stats.LocalStatsCache
   [junit4]   2> 2244660 INFO  (coreLoadExecutor-7528-thread-1) [    x:collection1] o.a.s.u.CommitTracker Hard AutoCommit: disabled
   [junit4]   2> 2244660 INFO  (coreLoadExecutor-7528-thread-1) [    x:collection1] o.a.s.u.CommitTracker Soft AutoCommit: disabled
   [junit4]   2> 2244661 INFO  (coreLoadExecutor-7528-thread-1) [    x:collection1] o.a.s.u.RandomMergePolicy RandomMergePolicy wrapping class org.apache.lucene.index.LogByteSizeMergePolicy: [LogByteSizeMergePolicy: minMergeSize=1677721, mergeFactor=25, maxMergeSize=2147483648, maxMergeSizeForForcedMerge=9223372036854775807, calibrateSizeByDeletes=true, maxMergeDocs=2147483647, maxCFSSegmentSizeMB=8.796093022207999E12, noCFSRatio=0.5089920484679016]
   [junit4]   2> 2244661 INFO  (coreLoadExecutor-7528-thread-1) [    x:collection1] o.a.s.c.SolrDeletionPolicy SolrDeletionPolicy.onInit: commits: num=1
   [junit4]   2> 	commit{dir=MockDirectoryWrapper(RAMDirectory@459a5b10 lockFactory=org.apache.lucene.store.SingleInstanceLockFactory@5ebace85),segFN=segments_1,generation=1}
   [junit4]   2> 2244661 INFO  (coreLoadExecutor-7528-thread-1) [    x:collection1] o.a.s.c.SolrDeletionPolicy newest commit generation = 1
   [junit4]   2> 2244661 INFO  (coreLoadExecutor-7528-thread-1) [    x:collection1] o.a.s.s.SolrIndexSearcher Opening [Searcher@58e7c968[collection1] main]
   [junit4]   2> 2244661 WARN  (coreLoadExecutor-7528-thread-1) [    x:collection1] o.a.s.r.ManagedResourceStorage Cannot write to config directory /export/home/jenkins/workspace/Lucene-Solr-6.x-Solaris/solr/core/src/test-files/solr/collection1/conf; switching to use InMemory storage instead.
   [junit4]   2> 2244661 INFO  (coreLoadExecutor-7528-thread-1) [    x:collection1] o.a.s.r.RestManager Initializing RestManager with initArgs: {}
   [junit4]   2> 2244661 INFO  (coreLoadExecutor-7528-thread-1) [    x:collection1] o.a.s.r.ManagedResourceStorage Reading _rest_managed.json using InMemoryStorage
   [junit4]   2> 2244661 INFO  (coreLoadExecutor-7528-thread-1) [    x:collection1] o.a.s.r.RestManager Initializing 0 registered ManagedResources
   [junit4]   2> 2244661 INFO  (coreLoadExecutor-7528-thread-1) [    x:collection1] o.a.s.h.c.SpellCheckComponent Initializing spell checkers
   [junit4]   2> 2244687 INFO  (coreLoadExecutor-7528-thread-1) [    x:collection1] o.a.s.h.c.SpellCheckComponent Registering newSearcher listener for spellchecker: default
   [junit4]   2> 2244704 INFO  (coreLoadExecutor-7528-thread-1) [    x:collection1] o.a.s.h.c.SpellCheckComponent Registering newSearcher listener for spellchecker: default_teststop
   [junit4]   2> 2244705 INFO  (coreLoadExecutor-7528-thread-1) [    x:collection1] o.a.s.s.DirectSolrSpellChecker init: {name=direct,classname=solr.DirectSolrSpellChecker,minQueryLength=3,maxQueryFrequency=100.0,field=teststop}
   [junit4]   2> 2244705 INFO  (coreLoadExecutor-7528-thread-1) [    x:collection1] o.a.s.s.DirectSolrSpellChecker init: {name=direct_lowerfilt,classname=solr.DirectSolrSpellChecker,minQueryLength=3,maxQueryFrequency=100.0,field=lowerfilt}
   [junit4]   2> 2244714 INFO  (coreLoadExecutor-7528-thread-1) [    x:collection1] o.a.s.h.c.SpellCheckComponent Registering newSearcher listener for spellchecker: threshold
   [junit4]   2> 2244714 INFO  (coreLoadExecutor-7528-thread-1) [    x:collection1] o.a.s.s.DirectSolrSpellChecker init: {name=threshold_direct,classname=solr.DirectSolrSpellChecker,field=lowerfilt,spellcheckIndexDir=spellcheckerThreshold,buildOnCommit=true,thresholdTokenFrequency=0.29}
   [junit4]   2> 2244714 INFO  (coreLoadExecutor-7528-thread-1) [    x:collection1] o.a.s.h.c.SpellCheckComponent Registering newSearcher listener for spellchecker: threshold_direct
   [junit4]   2> 2244723 INFO  (coreLoadExecutor-7528-thread-1) [    x:collection1] o.a.s.h.c.SpellCheckComponent Registering newSearcher listener for spellchecker: multipleFields
   [junit4]   2> 2244763 INFO  (coreLoadExecutor-7528-thread-1) [    x:collection1] o.a.s.h.c.SpellCheckComponent Registering newSearcher listener for spellchecker: freq
   [junit4]   2> 2244785 INFO  (coreLoadExecutor-7528-thread-1) [    x:collection1] o.a.s.h.c.SpellCheckComponent Registering newSearcher listener for spellchecker: fqcn
   [junit4]   2> 2244786 INFO  (coreLoadExecutor-7528-thread-1) [    x:collection1] o.a.s.h.ReplicationHandler Commits will be reserved for  10000
   [junit4]   2> 2244786 INFO  (searcherExecutor-7529-thread-1-processing-x:collection1) [    x:collection1] o.a.s.h.c.SpellCheckComponent Loading spell index for spellchecker: default
   [junit4]   2> 2244786 INFO  (coreLoadExecutor-7528-thread-1) [    x:collection1] o.a.s.c.CoreContainer registering core: collection1
   [junit4]   2> 2244787 INFO  (searcherExecutor-7529-thread-1-processing-x:collection1) [    x:collection1] o.a.s.h.c.SpellCheckComponent Loading spell index for spellchecker: default_teststop
   [junit4]   2> 2244787 INFO  (searcherExecutor-7529-thread-1-processing-x:collection1) [    x:collection1] o.a.s.h.c.SpellCheckComponent Loading spell index for spellchecker: direct
   [junit4]   2> 2244787 INFO  (searcherExecutor-7529-thread-1-processing-x:collection1) [    x:collection1] o.a.s.h.c.SpellCheckComponent Loading spell index for spellchecker: direct_lowerfilt
   [junit4]   2> 2244787 INFO  (searcherExecutor-7529-thread-1-processing-x:collection1) [    x:collection1] o.a.s.h.c.SpellCheckComponent Loading spell index for spellchecker: wordbreak
   [junit4]   2> 2244787 INFO  (searcherExecutor-7529-thread-1-processing-x:collection1) [    x:collection1] o.a.s.h.c.SpellCheckComponent Loading spell index for spellchecker: threshold
   [junit4]   2> 2244787 INFO  (SUITE-SpellCheckComponentTest-seed#[3834065169971C0A]-worker) [    ] o.a.s.SolrTestCaseJ4 ####initCore end
   [junit4]   2> 2244787 INFO  (searcherExecutor-7529-thread-1-processing-x:collection1) [    x:collection1] o.a.s.h.c.SpellCheckComponent Loading spell index for spellchecker: threshold_direct
   [junit4]   2> 2244787 INFO  (searcherExecutor-7529-thread-1-processing-x:collection1) [    x:collection1] o.a.s.h.c.SpellCheckComponent Loading spell index for spellchecker: multipleFields
   [junit4]   2> 2244788 INFO  (searcherExecutor-7529-thread-1-processing-x:collection1) [    x:collection1] o.a.s.h.c.SpellCheckComponent Loading spell index for spellchecker: jarowinkler
   [junit4]   2> 2244790 INFO  (TEST-SpellCheckComponentTest.test-seed#[3834065169971C0A]) [    ] o.a.s.SolrTestCaseJ4 ###Starting test
   [junit4]   2> 2244791 INFO  (TEST-SpellCheckComponentTest.test-seed#[3834065169971C0A]) [    ] o.a.s.u.p.LogUpdateProcessorFactory [collection1]  webapp=null path=null params={}{add=[0]} 0 0
   [junit4]   2> 2244792 INFO  (searcherExecutor-7529-thread-1-processing-x:collection1) [    x:collection1] o.a.s.h.c.SpellCheckComponent Loading spell index for spellchecker: external
   [junit4]   2> 2244793 INFO  (searcherExecutor-7529-thread-1-processing-x:collection1) [    x:collection1] o.a.s.h.c.SpellCheckComponent Loading spell index for spellchecker: freq
   [junit4]   2> 2244793 INFO  (TEST-SpellCheckComponentTest.test-seed#[3834065169971C0A]) [    ] o.a.s.u.p.LogUpdateProcessorFactory [collection1]  webapp=null path=null params={}{add=[1]} 0 0
   [junit4]   2> 2244793 INFO  (searcherExecutor-7529-thread-1-processing-x:collection1) [    x:collection1] o.a.s.h.c.SpellCheckComponent Loading spell index for spellchecker: fqcn
   [junit4]   2> 2244793 INFO  (TEST-SpellCheckComponentTest.test-seed#[3834065169971C0A]) [    ] o.a.s.u.p.LogUpdateProcessorFactory [collection1]  webapp=null path=null params={}{add=[2]} 0 0
   [junit4]   2> 2244793 INFO  (TEST-SpellCheckComponentTest.test-seed#[3834065169971C0A]) [    ] o.a.s.u.p.LogUpdateProcessorFactory [collection1]  webapp=null path=null params={}{add=[3]} 0 0
   [junit4]   2> 2244794 INFO  (TEST-SpellCheckComponentTest.test-seed#[3834065169971C0A]) [    ] o.a.s.u.p.LogUpdateProcessorFactory [collection1]  webapp=null path=null params={}{add=[4]} 0 0
   [junit4]   2> 2244794 INFO  (TEST-SpellCheckComponentTest.test-seed#[3834065169971C0A]) [    ] o.a.s.u.p.LogUpdateProcessorFactory [collection1]  webapp=null path=null params={}{add=[5]} 0 0
   [junit4]   2> 2244795 INFO  (TEST-SpellCheckComponentTest.test-seed#[3834065169971C0A]) [    ] o.a.s.u.p.LogUpdateProcessorFactory [collection1]  webapp=null path=null params={}{add=[6]} 0 0
   [junit4]   2> 2244795 INFO  (TEST-SpellCheckComponentTest.test-seed#[3834065169971C0A]) [    ] o.a.s.u.p.LogUpdateProcessorFactory [collection1]  webapp=null path=null params={}{add=[7]} 0 0
   [junit4]   2> 2244795 INFO  (TEST-SpellCheckComponentTest.test-seed#[3834065169971C0A]) [    ] o.a.s.u.p.LogUpdateProcessorFactory [collection1]  webapp=null path=null params={}{add=[8]} 0 0
   [junit4]   2> 2244795 INFO  (TEST-SpellCheckComponentTest.test-seed#[3834065169971C0A]) [    ] o.a.s.u.p.LogUpdateProcessorFactory [collection1]  webapp=null path=null params={}{add=[9]} 0 0
   [junit4]   2> 2244796 INFO  (TEST-SpellCheckComponentTest.test-seed#[3834065169971C0A]) [    ] o.a.s.u.DirectUpdateHandler2 start commit{,optimize=false,openSearcher=true,waitSearcher=true,expungeDeletes=false,softCommit=false,prepareCommit=false}
   [junit4]   2> 2244799 INFO  (TEST-SpellCheckComponentTest.test-seed#[3834065169971C0A]) [    ] o.a.s.c.SolrDeletionPolicy SolrDeletionPolicy.onCommit: commits: num=2
   [junit4]   2> 	commit{dir=MockDirectoryWrapper(RAMDirectory@459a5b10 lockFactory=org.apache.lucene.store.SingleInstanceLockFactory@5ebace85),segFN=segments_1,generation=1}
   [junit4]   2> 	commit{dir=MockDirectoryWrapper(RAMDirectory@459a5b10 lockFactory=org.apache.lucene.store.SingleInstanceLockFactory@5ebace85),segFN=segments_2,generation=2}
   [junit4]   2> 2244799 INFO  (TEST-SpellCheckComponentTest.test-seed#[3834065169971C0A]) [    ] o.a.s.c.SolrDeletionPolicy newest commit generation = 2
   [junit4]   2> 2244799 WARN  (TEST-SpellCheckComponentTest.test-seed#[3834065169971C0A]) [    ] o.a.s.c.SolrCore [collection1] PERFORMANCE WARNING: Overlapping onDeckSearchers=2
   [junit4]   2> 2244800 INFO  (TEST-SpellCheckComponentTest.test-seed#[3834065169971C0A]) [    ] o.a.s.s.SolrIndexSearcher Opening [Searcher@61ff4e20[collection1] main]
   [junit4]   2> 2244800 INFO  (TEST-SpellCheckComponentTest.test-seed#[3834065169971C0A]) [    ] o.a.s.u.DirectUpdateHandler2 end_commit_flush
   [junit4]   2> 2244800 INFO  (searcherExecutor-7529-thread-1-processing-x:collection1) [    x:collection1] o.a.s.h.c.SpellCheckComponent Loading spell index for spellchecker: perDict
   [junit4]   2> 2244800 INFO  (searcherExecutor-7529-thread-1-processing-x:collection1) [    x:collection1] o.a.s.c.SolrCore [collection1] Registered new searcher Searcher@58e7c968[collection1] main{ExitableDirectoryReader(UninvertingDirectoryReader())}
   [junit4]   2> 2244801 INFO  (searcherExecutor-7529-thread-1) [    ] o.a.s.h.c.SpellCheckComponent Loading spell index for spellchecker: default
   [junit4]   2> 2244801 INFO  (searcherExecutor-7529-thread-1) [    ] o.a.s.h.c.SpellCheckComponent Loading spell index for spellchecker: default_teststop
   [junit4]   2> 2244801 INFO  (searcherExecutor-7529-thread-1) [    ] o.a.s.h.c.SpellCheckComponent Loading spell index for spellchecker: direct
   [junit4]   2> 2244801 INFO  (searcherExecutor-7529-thread-1) [    ] o.a.s.h.c.SpellCheckComponent Loading spell index for spellchecker: direct_lowerfilt
   [junit4]   2> 2244801 INFO  (searcherExecutor-7529-thread-1) [    ] o.a.s.h.c.SpellCheckComponent Loading spell index for spellchecker: wordbreak
   [junit4]   2> 2244801 INFO  (searcherExecutor-7529-thread-1) [    ] o.a.s.h.c.SpellCheckComponent Loading spell index for spellchecker: threshold
   [junit4]   2> 2244802 INFO  (searcherExecutor-7529-thread-1) [    ] o.a.s.h.c.SpellCheckComponent Loading spell index for spellchecker: threshold_direct
   [junit4]   2> 2244802 INFO  (searcherExecutor-7529-thread-1) [    ] o.a.s.h.c.SpellCheckComponent Loading spell index for spellchecker: multipleFields
   [junit4]   2> 2244802 INFO  (searcherExecutor-7529-thread-1) [    ] o.a.s.h.c.SpellCheckComponent Loading spell index for spellchecker: jarowinkler
   [junit4]   2> 2244802 INFO  (searcherExecutor-7529-thread-1) [    ] o.a.s.h.c.SpellCheckComponent Loading spell index for spellchecker: external
   [junit4]   2> 2244803 INFO  (searcherExecutor-7529-thread-1) [    ] o.a.s.h.c.SpellCheckComponent Loading spell index for spellchecker: freq
   [junit4]   2> 2244803 INFO  (searcherExecutor-7529-thread-1) [    ] o.a.s.h.c.SpellCheckComponent Loading spell index for spellchecker: fqcn
   [junit4]   2> 2244803 INFO  (searcherExecutor-7529-thread-1) [    ] o.a.s.h.c.SpellCheckComponent Loading spell index for spellchecker: perDict
   [junit4]   2> 2244803 INFO  (searcherExecutor-7529-thread-1) [    ] o.a.s.c.SolrCore [collection1] Registered new searcher Searcher@61ff4e20[collection1] main{ExitableDirectoryReader(UninvertingDirectoryReader(Uninverting(_0(6.1.0):c10)))}
   [junit4]   2> 2244803 INFO  (TEST-SpellCheckComponentTest.test-seed#[3834065169971C0A]) [    ] o.a.s.u.p.LogUpdateProcessorFactory [collection1]  webapp=null path=null params={}{commit=} 0 7
   [junit4]   2> 2244804 INFO  (TEST-SpellCheckComponentTest.test-seed#[3834065169971C0A]) [    ] o.a.s.c.S.Request [collection1]  webapp=null path=null params={q=documemt&qt=spellCheckCompRH&spellcheck=true&wt=xml} hits=0 status=0 QTime=0
   [junit4]   2> 2244805 ERROR (TEST-SpellCheckComponentTest.test-seed#[3834065169971C0A]) [    ] o.a.s.SolrTestCaseJ4 query failed JSON validation. error=List size mismatch @ spellcheck/suggestions
   [junit4]   2>  expected =/spellcheck=={'suggestions':['documemt',{'numFound':1,'startOffset':0,'endOffset':8,'suggestion':['document']}]}
   [junit4]   2>  response = {
   [junit4]   2>   "responseHeader":{
   [junit4]   2>     "status":0,
   [junit4]   2>     "QTime":0},
   [junit4]   2>   "response":{"numFound":0,"start":0,"docs":[]
   [junit4]   2>   },
   [junit4]   2>   "spellcheck":{
   [junit4]   2>     "suggestions":[]}}
   [junit4]   2> 
   [junit4]   2>  request = q=documemt&qt=spellCheckCompRH&spellcheck=true&wt=xml
   [junit4]   2> 2244805 INFO  (TEST-SpellCheckComponentTest.test-seed#[3834065169971C0A]) [    ] o.a.s.SolrTestCaseJ4 ###Ending test
   [junit4]   2> 2244806 INFO  (TEST-SpellCheckComponentTest.test-seed#[3834065169971C0A]) [    ] o.a.s.u.DirectUpdateHandler2 [collection1] REMOVING ALL DOCUMENTS FROM INDEX
   [junit4]   2> 2244806 INFO  (TEST-SpellCheckComponentTest.test-seed#[3834065169971C0A]) [    ] o.a.s.u.p.LogUpdateProcessorFactory [collection1]  webapp=null path=null params={}{deleteByQuery=*:*} 0 0
   [junit4]   2> 2244806 INFO  (TEST-SpellCheckComponentTest.test-seed#[3834065169971C0A]) [    ] o.a.s.u.DirectUpdateHandler2 start commit{,optimize=false,openSearcher=true,waitSearcher=true,expungeDeletes=false,softCommit=false,prepareCommit=false}
   [junit4]   2> 2244806 INFO  (TEST-SpellCheckComponentTest.test-seed#[3834065169971C0A]) [    ] o.a.s.c.SolrDeletionPolicy SolrDeletionPolicy.onCommit: commits: num=2
   [junit4]   2> 	commit{dir=MockDirectoryWrapper(RAMDirectory@459a5b10 lockFactory=org.apache.lucene.store.SingleInstanceLockFactory@5ebace85),segFN=segments_2,generation=2}
   [junit4]   2> 	commit{dir=MockDirectoryWrapper(RAMDirectory@459a5b10 lockFactory=org.apache.lucene.store.SingleInstanceLockFactory@5ebace85),segFN=segments_3,generation=3}
   [junit4]   2> 2244806 INFO  (TEST-SpellCheckComponentTest.test-seed#[3834065169971C0A]) [    ] o.a.s.c.SolrDeletionPolicy newest commit generation = 3
   [junit4]   2> 2244806 INFO  (TEST-SpellCheckComponentTest.test-seed#[3834065169971C0A]) [    ] o.a.s.s.SolrIndexSearcher Opening [Searcher@ef19dff[collection1] main]
   [junit4]   2> 2244807 INFO  (TEST-SpellCheckComponentTest.test-seed#[3834065169971C0A]) [    ] o.a.s.u.DirectUpdateHandler2 end_commit_flush
   [junit4]   2> 2244807 INFO  (searcherExecutor-7529-thread-1) [    ] o.a.s.h.c.SpellCheckComponent Building spell index for spell checker: default
   [junit4]   2> 2244817 INFO  (searcherExecutor-7529-thread-1) [    ] o.a.s.h.c.SpellCheckComponent Building spell index for spell checker: default_teststop
   [junit4]   2> 2244840 INFO  (searcherExecutor-7529-thread-1) [    ] o.a.s.h.c.SpellCheckComponent Building spell index for spell checker: threshold
   [junit4]   2> 2244850 INFO  (searcherExecutor-7529-thread-1) [    ] o.a.s.h.c.SpellCheckComponent Building spell index for spell checker: threshold_direct
   [junit4]   2> 2244850 INFO  (searcherExecutor-7529-thread-1) [    ] o.a.s.h.c.SpellCheckComponent Building spell index for spell checker: multipleFields
   [junit4]   2> 2244868 INFO  (searcherExecutor-7529-thread-1) [    ] o.a.s.h.c.SpellCheckComponent Building spell index for spell checker: freq
   [junit4]   2> 2244878 INFO  (searcherExecutor-7529-thread-1) [    ] o.a.s.h.c.SpellCheckComponent Building spell index for spell checker: fqcn
   [junit4]   2> 2244898 INFO  (searcherExecutor-7529-thread-1) [    ] o.a.s.c.SolrCore [collection1] Registered new searcher Searcher@ef19dff[collection1] main{ExitableDirectoryReader(UninvertingDirectoryReader())}
   [junit4]   2> 2244898 INFO  (TEST-SpellCheckComponentTest.test-seed#[3834065169971C0A]) [    ] o.a.s.u.p.LogUpdateProcessorFactory [collection1]  webapp=null path=null params={}{commit=} 0 92
   [junit4]   2> NOTE: reproduce with: ant test  -Dtestcase=SpellCheckComponentTest -Dtests.method=test -Dtests.seed=3834065169971C0A -Dtests.slow=true -Dtests.locale=id-ID -Dtests.timezone=America/Bogota -Dtests.asserts=true -Dtests.file.encoding=US-ASCII
   [junit4] ERROR   0.12s J1 | SpellCheckComponentTest.test <<<
   [junit4]    > Throwable #1: java.lang.RuntimeException: List size mismatch @ spellcheck/suggestions
   [junit4]    > 	at __randomizedtesting.SeedInfo.seed([3834065169971C0A:B060398BC76B71F2]:0)
   [junit4]    > 	at org.apache.solr.SolrTestCaseJ4.assertJQ(SolrTestCaseJ4.java:871)
   [junit4]    > 	at org.apache.solr.SolrTestCaseJ4.assertJQ(SolrTestCaseJ4.java:818)
   [junit4]    > 	at org.apache.solr.handler.component.SpellCheckComponentTest.test(SpellCheckComponentTest.java:147)
   [junit4]    > 	at java.lang.Thread.run(Thread.java:745)
   [junit4]   2> 2244905 INFO  (TEST-SpellCheckComponentTest.testRebuildOnCommit-seed#[3834065169971C0A]) [    ] o.a.s.SolrTestCaseJ4 ###Starting testRebuildOnCommit
   [junit4]   2> 2244906 INFO  (TEST-SpellCheckComponentTest.testRebuildOnCommit-seed#[3834065169971C0A]) [    ] o.a.s.u.p.LogUpdateProcessorFactory [collection1]  webapp=null path=null params={}{add=[0]} 0 0
   [junit4]   2> 2244906 INFO  (TEST-SpellCheckComponentTest.testRebuildOnCommit-seed#[3834065169971C0A]) [    ] o.a.s.u.p.LogUpdateProcessorFactory [collection1]  webapp=null path=null params={}{add=[1]} 0 0
   [junit4]   2> 2244907 INFO  (TEST-SpellCheckComponentTest.testRebuildOnCommit-seed#[3834065169971C0A]) [    ] o.a.s.u.p.LogUpdateProcessorFactory [collection1]  webapp=null path=null params={}{add=[2]} 0 0
   [junit4]   2> 2244907 INFO  (TEST-SpellCheckComponentTest.testRebuildOnCommit-seed#[3834065169971C0A]) [    ] o.a.s.u.p.LogUpdateProcessorFactory [collection1]  webapp=null path=null params={}{add=[3]} 0 0
   [junit4]   2> 2244907 INFO  (TEST-SpellCheckComponentTest.testRebuildOnCommit-seed#[3834065169971C0A]) [    ] o.a.s.u.p.LogUpdateProcessorFactory [collection1]  webapp=null path=null params={}{add=[4]} 0 0
   [junit4]   2> 2244907 INFO  (TEST-SpellCheckComponentTest.testRebuildOnCommit-seed#[3834065169971C0A]) [    ] o.a.s.u.p.LogUpdateProcessorFactory [collection1]  webapp=null path=null params={}{add=[5]} 0 0
   [junit4]   2> 2244908 INFO  (TEST-SpellCheckComponentTest.testRebuildOnCommit-seed#[3834065169971C0A]) [    ] o.a.s.u.p.LogUpdateProcessorFactory [collection1]  webapp=null path=null params={}{add=[6]} 0 0
   [junit4]   2> 2244908 INFO  (TEST-SpellCheckComponentTest.testRebuildOnCommit-seed#[3834065169971C0A]) [    ] o.a.s.u.p.LogUpdateProcessorFactory [collection1]  webapp=null path=null params={}{add=[7]} 0 0
   [junit4]   2> 2244908 INFO  (TEST-SpellCheckComponentTest.testRebuildOnCommit-seed#[3834065169971C0A]) [    ] o.a.s.u.p.LogUpdateProcessorFactory [collection1]  webapp=null path=null params={}{add=[8]} 0 0
   [junit4]   2> 2244908 INFO  (TEST-SpellCheckComponentTest.testRebuildOnCommit-seed#[3834065169971C0A]) [    ] o.a.s.u.p.LogUpdateProcessorFactory [collection1]  webapp=null path=null params={}{add=[9]} 0 0
   [junit4]   2> 2244909 INFO  (TEST-SpellCheckComponentTest.testRebuildOnCommit-seed#[3834065169971C0A]) [    ] o.a.s.u.DirectUpdateHandler2 start commit{,optimize=false,openSearcher=true,waitSearcher=true,expungeDeletes=false,softCommit=false,prepareCommit=false}
   [junit4]   2> 2244911 INFO  (TEST-SpellCheckComponentTest.testRebuildOnCommit-seed#[3834065169971C0A]) [    ] o.a.s.c.SolrDeletionPolicy SolrDeletionPolicy.onCommit: commits: num=2
   [junit4]   2> 	commit{dir=MockDirectoryWrapper(RAMDirectory@459a5b10 lockFactory=org.apache.lucene.store.SingleInstanceLockFactory@5ebace85),segFN=segments_3,generation=3}
   [junit4]   2> 	commit{dir=MockDirectoryWrapper(RAMDirectory@459a5b10 lockFactory=org.apache.lucene.store.SingleInstanceLockFactory@5ebace85),segFN=segments_4,generation=4}
   [junit4]   2> 2244911 INFO  (TEST-SpellCheckComponentTest.testRebuildOnCommit-seed#[3834065169971C0A]) [    ] o.a.s.c.SolrDeletionPolicy newest commit generation = 4
   [junit4]   2> 2244912 INFO  (TEST-SpellCheckComponentTest.testRebuildOnCommit-seed#[3834065169971C0A]) [    ] o.a.s.s.SolrIndexSearcher Opening [Searcher@1af5120f[collection1] main]
   [junit4]   2> 2244912 INFO  (TEST-SpellCheckComponentTest.testRebuildOnCommit-seed#[3834065169971C0A]) [    ] o.a.s.u.DirectUpdateHandler2 end_commit_flush
   [junit4]   2> 2244914 INFO  (searcherExecutor-7529-thread-1) [    ] o.a.s.h.c.SpellCheckComponent Building spell index for spell checker: default
   [junit4]   2> 2245067 INFO  (searcherExecutor-7529-thread-1) [    ] o.a.s.h.c.SpellCheckComponent Building spell index for spell checker: default_teststop
   [junit4]   2> 2245093 INFO  (searcherExecutor-7529-thread-1) [    ] o.a.s.h.c.SpellCheckComponent Building spell index for spell checker: threshold
   [junit4]   2> 2245166 INFO  (searcherExecutor-7529-thread-1) [    ] o.a.s.h.c.SpellCheckComponent Building spell index for spell checker: threshold_direct
   [junit4]   2> 2245166 INFO  (searcherExecutor-7529-thread-1) [    ] o.a.s.h.c.SpellCheckComponent Building spell index for spell checker: multipleFields
   [junit4]   2> 2245257 INFO  (searcherExecutor-7529-thread-1) [    ] o.a.s.h.c.SpellCheckComponent Building spell index for spell checker: freq
   [junit4]   2> 2245311 INFO  (searcherExecutor-7529-thread-1) [    ] o.a.s.h.c.SpellCheckComponent Building spell index for spell checker: fqcn
   [junit4]   2> 2245355 INFO  (searcherExecutor-7529-thread-1) [    ] o.a.s.c.SolrCore [collection1] Registered new searcher Searcher@1af5120f[collection1] main{ExitableDirectoryReader(UninvertingDirectoryReader(Uninverting(_1(6.1.0):c10)))}
   [junit4]   2> 2245355 INFO  (TEST-SpellCheckComponentTest.testRebuildOnCommit-seed#[3834065169971C0A]) [    ] o.a.s.u.p.LogUpdateProcessorFactory [collection1]  webapp=null path=null params={}{commit=} 0 446
   [junit4]   2> 2245357 INFO  (TEST-SpellCheckComponentTest.testRebuildOnCommit-seed#[3834065169971C0A]) [    ] o.a.s.c.S.Request [collection1]  webapp=null path=null params={q=lowerfilt:lucenejavt&qt=spellCheckCompRH&spellcheck=true&wt=xml} hits=0 status=0 QTime=1
   [junit4]   2> 2245358 INFO  (TEST-SpellCheckComponentTest.testRebuildOnCommit-seed#[3834065169971C0A]) [    ] o.a.s.u.p.LogUpdateProcessorFactory [collection1]  webapp=null path=null params={}{add=[11231]} 0 0
   [junit4]   2> 2245358 INFO  (TEST-SpellCheckComponentTest.testRebuildOnCommit-seed#[3834065169971C0A]) [    ] o.a.s.u.DirectUpdateHandler2 start commit{,optimize=false,openSearcher=true,waitSearcher=true,expungeDeletes=false,softCommit=false,prepareCommit=false}
   [junit4]   2> 2245361 INFO  (TEST-SpellCheckComponentTest.testRebuildOnCommit-seed#[3834065169971C0A]) [    ] o.a.s.c.SolrDeletionPolicy SolrDeletionPolicy.onCommit: commits: num=2
   [junit4]   2> 	commit{dir=MockDirectoryWrapper(RAMDirectory@459a5b10 lockFactory=org.apache.lucene.store.SingleInstanceLockFactory@5ebace85),segFN=segments_4,generation=4}
   [junit4]   2> 	commit{dir=MockDirectoryWrapper(RAMDirectory@459a5b10 lockFactory=org.apache.lucene.store.SingleInstanceLockFactory@5ebace85),segFN=segments_5,generation=5}
   [junit4]   2> 2245361 INFO  (TEST-SpellCheckComponentTest.testRebuildOnCommit-seed#[3834065169971C0A]) [    ] o.a.s.c.SolrDeletionPolicy newest commit generation = 5
   [junit4]   2> 2245361 INFO  (TEST-SpellCheckComponentTest.testRebuildOnCommit-seed#[3834065169971C0A]) [    ] o.a.s.s.SolrIndexSearcher Opening [Searcher@5bbae45f[collection1] main]
   [junit4]   2> 2245361 INFO  (TEST-SpellCheckComponentTest.testRebuildOnCommit-seed#[3834065169971C0A]) [    ] o.a.s.u.DirectUpdateHandler2 end_commit_flush
   [junit4]   2> 2245361 INFO  (searcherExecutor-7529-thread-1) [    ] o.a.s.h.c.SpellCheckComponent Building spell index for spell checker: default
   [junit4]   2> 2245471 INFO  (searcherExecutor-7529-thread-1) [    ] o.a.s.h.c.SpellCheckComponent Building spell index for spell checker: default_teststop
   [junit4]   2> 2245504 INFO  (searcherExecutor-7529-thread-1) [    ] o.a.s.h.c.SpellCheckComponent Building spell index for spell checker: threshold
   [junit4]   2> 2245569 INFO  (searcherExecutor-7529-thread-1) [    ] o.a.s.h.c.SpellCheckComponent Building spell index for spell checker: threshold_direct
   [junit4]   2> 2245569 INFO  (searcherExecutor-7529-thread-1) [    ] o.a.s.h.c.SpellCheckComponent Building spell index for spell checker: multipleFields
   [junit4]   2> 2245672 INFO  (searcherExecutor-7529-thread-1) [    ] o.a.s.h.c.SpellCheckComponent Building spell index for spell checker: freq
   [junit4]   2> 2245911 INFO  (searcherExecutor-7529-thread-1) [    ] o.a.s.h.c.SpellCheckComponent Building spell index for spell checker: fqcn
   [junit4]   2> 2246110 INFO  (searcherExecutor-7529-thread-1) [    ] o.a.s.c.SolrCore [collection1] Registered new searcher Searcher@5bbae45f[collection1] main{ExitableDirectoryReader(UninvertingDirectoryReader(Uninverting(_1(6.1.0):c10) Uninverting(_2(6.1.0):c1)))}
   [junit4]   2> 2246110 INFO  (TEST-SpellCheckComponentTest.testRebuildOnCommit-seed#[3834065169971C0A]) [    ] o.a.s.u.p.LogUpdateProcessorFactory [collection1]  webapp=null path=null params={}{commit=} 0 752
   [junit4]   2> 2246111 INFO  (TEST-SpellCheckComponentTest.testRebuildOnCommit-seed#[3834065169971C0A]) [    ] o.a.s.c.S.Request [collection1]  webapp=null path=null params={q=lowerfilt:lucenejavt&qt=spellCheckCompRH&spellcheck=true&wt=xml} hits=0 status=0 QTime=755
   [junit4]   2> 2246112 INFO  (TEST-SpellCheckComponentTest.testRebuildOnCommit-seed#[3834065169971C0A]) [    ] o.a.s.SolrTestCaseJ4 ###Ending testRebuildOnCommit
   [junit4]   2> 2246112 INFO  (TEST-SpellCheckComponentTest.testRebuildOnCommit-seed#[3834065169971C0A]) [    ] o.a.s.u.DirectUpdateHandler2 [collection1] REMOVING ALL DOCUMENTS FROM INDEX
   [junit4]   2> 2246112 INFO  (TEST-SpellCheckComponentTest.testRebuildOnCommit-seed#[3834065169971C0A]) [    ] o.a.s.u.p.LogUpdateProcessorFactory [collection1]  webapp=null path=null params={}{deleteByQuery=*:*} 0 0
   [junit4]   2> 2246112 INFO  (TEST-SpellCheckComponentTest.testRebuildOnCommit-seed#[3834065169971C0A]) [    ] o.a.s.u.DirectUpdateHandler2 start commit{,optimize=false,openSearcher=true,waitSearcher=true,expungeDeletes=false,softCommit=false,prepareCommit=false}
   [junit4]   2> 2246112 INFO  (TEST-SpellCheckComponentTest.testRebuildOnCommit-seed#[3834065169971C0A]) [    ] o.a.s.c.SolrDeletionPolicy SolrDeletionPolicy.onCommit: commits: num=2
   [junit4]   2> 	commit{dir=MockDirectoryWrapper(RAMDirectory@459a5b10 lockFactory=org.apache.lucene.store.SingleInstanceLockFactory@5ebace85),segFN=segments_5,generation=5}
   [junit4]   2> 	commit{dir=MockDirectoryWrapper(RAMDirectory@459a5b10 lockFactory=org.apache.lucene.store.SingleInstanceLockFactory@5ebace85),segFN=segments_6,generation=6}
   [junit4]   2> 2246112 INFO  (TEST-SpellCheckComponentTest.testRebuildOnCommit-seed#[3834065169971C0A]) [    ] o.a.s.c.SolrDeletionPolicy newest commit generation = 6
   [junit4]   2> 2246112 INFO  (TEST-SpellCheckComponentTest.testRebuildOnCommit-seed#[3834065169971C0A]) [    ] o.a.s.s.SolrIndexSearcher Opening [Searcher@2120d223[collection1] main]
   [junit4]   2> 2246112 INFO  (TEST-SpellCheckComponentTest.testRebuildOnCommit-seed#[3834065169971C0A]) [    ] o.a.s.u.DirectUpdateHandler2 end_commit_flush
   [junit4]   2> 2246113 INFO  (searcherExecutor-7529-thread-1) [    ] o.a.s.h.c.SpellCheckComponent Building spell index for spell checker: default
   [junit4]   2> 2246155 INFO  (searcherExecutor-7529-thread-1) [    ] o.a.s.h.c.SpellCheckComponent Building spell index for spell checker: default_teststop
   [junit4]   2> 2246223 INFO  (searcherExecutor-7529-thread-1) [    ] o.a.s.h.c.SpellCheckComponent Building spell index for spell checker: threshold
   [junit4]   2> 2246278 INFO  (searcherExecutor-7529-thread-1) [    ] o.a.s.h.c.SpellCheckComponent Building spell index for spell checker: threshold_direct
   [junit4]   2> 2246278 INFO  (searcherExecutor-7529-thread-1) [    ] o.a.s.h.c.SpellCheckComponent Building spell index for spell checker: multipleFields
   [junit4]   2> 2246334 INFO  (searcherExecutor-7529-thread-1) [    ] o.a.s.h.c.SpellCheckComponent Building spell index for spell checker: freq
   [junit4]   2> 2246383 INFO  (searcherExecutor-7529-thread-1) [    ] o.a.s.h.c.SpellCheckComponent Building spell index for spell checker: fqcn
   [junit4]   2> 2246433 INFO  (searcherExecutor-7529-thread-1) [    ] o.a.s.c.SolrCore [collection1] Registered new searcher Searcher@2120d223[collection1] main{ExitableDirectoryReader(UninvertingDirectoryReader())}
   [junit4]   2> 2246433 INFO  (TEST-SpellCheckComponentTest.testRebuildOnCommit-seed#[3834065169971C0A]) [    ] o.a.s.u.p.LogUpdateProcessorFactory [collection1]  webapp=null path=null params={}{commit=} 0 321
   [junit4]   2> 2246436 INFO  (TEST-SpellCheckComponentTest.testCorrectSpelling-seed#[3834065169971C0A]) [    ] o.a.s.SolrTestCaseJ4 ###Starting testCorrectSpelling
   [junit4]   2> 2246436 INFO  (TEST-SpellCheckComponentTest.testCorrectSpelling-seed#[3834065169971C0A]) [    ] o.a.s.u.p.LogUpdateProcessorFactory [collection1]  webapp=null path=null params={}{add=[0]} 0 0
   [junit4]   2> 2246437 INFO  (TEST-SpellCheckComponentTest.testCorrectSpelling-seed#[3834065169971C0A]) [    ] o.a.s.u.p.LogUpdateProcessorFactory [collection1]  webapp=null path=null params={}{add=[1]} 0 0
   [junit4]   2> 2246437 INFO  (TEST-SpellCheckComponentTest.testCorrectSpelling-seed#[3834065169971C0A]) [    ] o.a.s.u.p.LogUpdateProcessorFactory [collection1]  webapp=null path=null params={}{add=[2]} 0 0
   [junit4]   2> 2246437 INFO  (TEST-SpellCheckComponentTest.testCorrectSpelling-seed#[3834065169971C0A]) [    ] o.a.s.u.p.LogUpdateProcessorFactory [collection1]  webapp=null path=null params={}{add=[3]} 0 0
   [junit4]   2> 2246437 INFO  (TEST-SpellCheckComponentTest.testCorrectSpelling-seed#[3834065169971C0A]) [    ] o.a.s.u.p.LogUpdateProcessorFactory [collection1]  webapp=null path=null params={}{add=[4]} 0 0
   [junit4]   2> 2246438 INFO  (TEST-SpellCheckComponentTest.testCorrectSpelling-seed#[3834065169971C0A]) [    ] o.a.s.u.p.LogUpdateProcessorFactory [collection1]  webapp=null path=null params={}{add=[5]} 0 0
   [junit4]   2> 2246438 INFO  (TEST-SpellCheckComponentTest.testCorrectSpelling-seed#[3834065169971C0A]) [    ] o.a.s.u.p.LogUpdateProcessorFactory [collection1]  webapp=null path=null params={}{add=[6]} 0 0
   [junit4]   2> 2246438 INFO  (TEST-SpellCheckComponentTest.testCorrectSpelling-seed#[3834065169971C0A]) [    ] o.a.s.u.p.LogUpdateProcessorFactory [collection1]  webapp=null path=null params={}{add=[7]} 0 0
   [junit4]   2> 2246438 INFO  (TEST-SpellCheckComponentTest.testCorrectSpelling-seed#[3834065169971C0A]) [    ] o.a.s.u.p.LogUpdateProcessorFactory [collection1]  webapp=null path=null params={}{add=[8]} 0 0
   [junit4]   2> 2246439 INFO  (TEST-SpellCheckComponentTest.testCorrectSpelling-seed#[3834065169971C0A]) [    ] o.a.s.u.p.LogUpdateProcessorFactory [collection1]  webapp=null path=null params={}{add=[9]} 0 0
   [junit4]   2> 2246439 INFO  (TEST-SpellCheckComponentTest.testCorrectSpelling-seed#[3834065169971C0A]) [    ] o.a.s.u.DirectUpdateHandler2 start commit{,optimize=false,openSearcher=true,waitSearcher=true,expungeDeletes=false,softCommit=false,prepareCommit=false}
   [junit4]   2> 2246441 INFO  (TEST-SpellCheckComponentTest.testCorrectSpelling-seed#[3834065169971C0A]) [    ] o.a.s.c.SolrDeletionPolicy SolrDeletionPolicy.onCommit: commits: num=2
   [junit4]   2> 	commit{dir=MockDirectoryWrapper(RAMDirectory@459a5b10 lockFactory=org.apache.lucene.store.SingleInstanceLockFactory@5ebace85),segFN=segments_6,generation=6}
   [junit4]   2> 	commit{dir=MockDirectoryWrapper(RAMDirectory@459a5b10 lockFactory=org.apache.lucene.store.SingleInstanceLockFactory@5ebace85),segFN=segments_7,generation=7}
   [junit4]   2> 2246441 INFO  (TEST-SpellCheckComponentTest.testCorrectSpelling-seed#[3834065169971C0A]) [    ] o.a.s.c.SolrDeletionPolicy newest commit generation = 7
   [junit4]   2> 2246442 INFO  (TEST-SpellCheckComponentTest.testCorrectSpelling-seed#[3834065169971C0A]) [    ] o.a.s.s.SolrIndexSearcher Opening [Searcher@4748262a[collection1] main]
   [junit4]   2> 2246442 INFO  (TEST-SpellCheckComponentTest.testCorrectSpelling-seed#[3834065169971C0A]) [    ] o.a.s.u.DirectUpdateHandler2 end_commit_flush
   [junit4]   2> 2246442 INFO  (searcherExecutor-7529-thread-1) [    ] o.a.s.h.c.SpellCheckComponent Building spell index for spell checker: default
   [junit4]   2> 2246605 INFO  (searcherExecutor-7529-thread-1) [    ] o.a.s.h.c.SpellCheckComponent Building spell index for spell checker: default_teststop
   [junit4]   2> 2246637 INFO  (searcherExecutor-7529-thread-1) [    ] o.a.s.h.c.SpellCheckComponent Building spell index for spell checker: threshold
   [junit4]   2> 2246800 INFO  (searcherExecutor-7529-thread-1) [    ] o.a.s.h.c.SpellCheckComponent Building spell index for spell checker: threshold_direct
   [junit4]   2> 2246800 INFO  (searcherExecutor-7529-thread-1) [    ] o.a.s.h.c.SpellCheckComponent Building spell index for spell checker: multipleFields
   [junit4]   2> 2246953 INFO  (searcherExecutor-7529-thread-1) [    ] o.a.s.h.c.SpellCheckComponent Building spell index for spell checker: freq
   [junit4]   2> 2247059 INFO  (searcherExecutor-7529-thread-1) [    ] o.a.s.h.c.SpellCheckComponent Building spell index for spell checker: fqcn
   [junit4]   2> 2247199 INFO  (searcherExecutor-7529-thread-1) [    ] o.a.s.c.SolrCore [collection1] Registered new searcher Searcher@4748262a[collection1] main{ExitableDirectoryReader(UninvertingDirectoryReader(Uninverting(_3(6.1.0):c10)))}
   [junit4]   2> 2247200 INFO  (TEST-SpellCheckComponentTest.testCorrectSpelling-seed#[3834065169971C0A]) [    ] o.a.s.u.p.LogUpdateProcessorFactory [collection1]  webapp=null path=null params={}{commit=} 0 760
   [junit4]   2> 2247200 INFO  (TEST-SpellCheckComponentTest.testCorrectSpelling-seed#[3834065169971C0A]) [    ] o.a.s.c.S.Request [collection1]  webapp=null path=null params={q=lowerfilt:lazy+lowerfilt:brown&qt=spellCheckCompRH&json.nl=map&spellcheck=true&wt=xml&spellcheck.extendedResults=true} hits=1 status=0 QTime=0
   [junit4]   2> 2247201 INFO  (TEST-SpellCheckComponentTest.testCorrectSpelling-seed#[3834065169971C0A]) [    ] o.a.s.c.S.Request [collection1]  webapp=null path=null params={q=lowerfilt:lazy+lowerfilt:brown&qt=spellCheckCompRH&spellcheck.dictionary=direct_lowerfilt&json.nl=map&spellcheck=true&wt=xml&spellcheck.extendedResults=true} hits=1 status=0 QTime=0
   [junit4]   2> 2247202 INFO  (TEST-SpellCheckComponentTest.testCorrectSpelling-seed#[3834065169971C0A]) [    ] o.a.s.c.S.Request [collection1]  webapp=null path=null params={q=lakkle&qt=spellCheckCompRH&spellcheck.dictionary=direct_lowerfilt&json.nl=map&spellcheck=true&wt=xml&spellcheck.extendedResults=true} hits=0 status=0 QTime=0
   [junit4]   2> 2247202 INFO  (TEST-SpellCheckComponentTest.testCorrectSpelling-seed#[3834065169971C0A]) [    ] o.a.s.SolrTestCaseJ4 ###Ending testCorrectSpelling
   [junit4]   2> 2247202 INFO  (TEST-SpellCheckComponentTest.testCorrectSpelling-seed#[3834065169971C0A]) [    ] o.a.s.u.DirectUpdateHandler2 [collection1] REMOVING ALL DOCUMENTS FROM INDEX
   [junit4]   2> 2247202 INFO  (TEST-SpellCheckComponentTest.testCorrectSpelling-seed#[3834065169971C0A]) [    ] o.a.s.u.p.LogUpdateProcessorFactory [collection1]  webapp=null path=null params={}{deleteByQuery=*:*} 0 0
   [junit4]   2> 2247203 INFO  (TEST-SpellCheckComponentTest.testCorrectSpelling-seed#[3834065169971C0A]) [    ] o.a.s.u.DirectUpdateHandler2 start commit{,optimize=false,openSearcher=true,waitSearcher=true,expungeDeletes=false,softCommit=false,prepareCommit=false}
   [junit4]   2> 2247203 INFO  (TEST-SpellCheckComponentTest.testCorrectSpelling-seed#[3834065169971C0A]) [    ] o.a.s.c.SolrDeletionPolicy SolrDeletionPolicy.onCommit: commits: num=2
   [junit4]   2> 	commit{dir=MockDirectoryWrapper(RAMDirectory@459a5b10 lockFactory=org.apache.lucene.store.SingleInstanceLockFactory@5ebace85),segFN=segments_7,generation=7}
   [junit4]   2> 	commit{dir=MockDirectoryWrapper(RAMDirectory@459a5b10 lockFactory=org.apache.lucene.store.SingleInstanceLockFactory@5ebace85),segFN=segments_8,generation=8}
   [junit4]   2> 2247203 INFO  (TEST-SpellCheckComponentTest.testCorrectSpelling-seed#[3834065169971C0A]) [    ] o.a.s.c.SolrDeletionPolicy newest commit generation = 8
   [junit4]   2> 2247203 INFO  (TEST-SpellCheckComponentTest.testCorrectSpelling-seed#[3834065169971C0A]) [    ] o.a.s.s.SolrIndexSearcher Opening [Searcher@2c86e6e6[collection1] main]
   [junit4]   2> 2247203 INFO  (TEST-SpellCheckComponentTest.testCorrectSpelling-seed#[3834065169971C0A]) [    ] o.a.s.u.DirectUpdateHandler2 end_commit_flush
   [junit4]   2> 2247203 INFO  (searcherExecutor-7529-thread-1) [    ] o.a.s.h.c.SpellCheckComponent Building spell index for spell checker: default
   [junit4]   2> 2247240 INFO  (searcherExecutor-7529-thread-1) [    ] o.a.s.h.c.SpellCheckComponent Building spell index for spell checker: default_teststop
   [junit4]   2> 2247287 INFO  (searcherExecutor-7529-thread-1) [    ] o.a.s.h.c.SpellCheckComponent Building spell index for spell checker: threshold
   [junit4]   2> 2247322 INFO  (searcherExecutor-7529-thread-1) [    ] o.a.s.h.c.SpellCheckComponent Building spell index for spell checker: threshold_direct
   [junit4]   2> 2247323 INFO  (searcherExecutor-7529-thread-1) [    ] o.a.s.h.c.SpellCheckComponent Building spell index for spell checker: multipleFields
   [junit4]   2> 2247353 INFO  (searcherExecutor-7529-thread-1) [    ] o.a.s.h.c.SpellCheckComponent Building spell index for spell checker: freq
   [junit4]   2> 2247385 INFO  (searcherExecutor-7529-thread-1) [    ] o.a.s.h.c.SpellCheckComponent Building spell index for spell checker: fqcn
   [junit4]   2> 2247433 INFO  (searcherExecutor-7529-thread-1) [    ] o.a.s.c.SolrCore [collection1] Registered new searcher Searcher@2c86e6e6[collection1] main{ExitableDirectoryReader(UninvertingDirectoryReader())}
   [junit4]   2> 2247433 INFO  (TEST-SpellCheckComponentTest.testCorrectSpelling-seed#[3834065169971C0A]) [    ] o.a.s.u.p.LogUpdateProcessorFactory [collection1]  webapp=null path=null params={}{commit=} 0 230
   [junit4]   2> 2247436 INFO  (TEST-SpellCheckComponentTest.testRelativeIndexDirLocation-seed#[3834065169971C0A]) [    ] o.a.s.SolrTestCaseJ4 ###Starting testRelativeIndexDirLocation
   [junit4]   2> 2247437 INFO  (TEST-SpellCheckComponentTest.testRelativeIndexDirLocation-seed#[3834065169971C0A]) [    ] o.a.s.u.p.LogUpdateProcessorFactory [collection1]  webapp=null path=null params={}{add=[0]} 0 0
   [junit4]   2> 2247437 INFO  (TEST-SpellCheckComponentTest.testRelativeIndexDirLocation-seed#[3834065169971C0A]) [    ] o.a.s.u.p.LogUpdateProcessorFactory [collection1]  webapp=null path=null params={}{add=[1]} 0 0
   [junit4]   2> 2247438 INFO  (TEST-SpellCheckComponentTest.testRelativeIndexDirLocation-seed#[3834065169971C0A]) [    ] o.a.s.u.p.LogUpdateProcessorFactory [collection1]  webapp=null path=null params={}{add=[2]} 0 0
   [junit4]   2> 2247438 INFO  (TEST-SpellCheckComponentTest.testRelativeIndexDirLocation-seed#[3834065169971C0A]) [    ] o.a.s.u.p.LogUpdateProcessorFactory [collection1]  webapp=null path=null params={}{add=[3]} 0 0
   [junit4]   2> 2247438 INFO  (TEST-SpellCheckComponentTest.testRelativeIndexDirLocation-seed#[3834065169971C0A]) [    ] o.a.s.u.p.LogUpdateProcessorFactory [collection1]  webapp=null path=null params={}{add=[4]} 0 0
   [junit4]   2> 2247439 INFO  (TEST-SpellCheckComponentTest.testRelativeIndexDirLocation-seed#[3834065169971C0A]) [    ] o.a.s.u.p.LogUpdateProcessorFactory [collection1]  webapp=null path=null params={}{add=[5]} 0 0
   [junit4]   2> 2247439 INFO  (TEST-SpellCheckComponentTest.testRelativeIndexDirLocation-seed#[3834065169971C0A]) [    ] o.a.s.u.p.LogUpdateProcessorFactory [collection1]  webapp=null path=null params={}{add=[6]} 0 0
   [junit4]   2> 2247439 INFO  (TEST-SpellCheckComponentTest.testRelativeIndexDirLocation-seed#[3834065169971C0A]) [    ] o.a.s.u.p.LogUpdateProcessorFactory [collection1]  webapp=null path=null params={}{add=[7]} 0 0
   [junit4]   2> 2247439 INFO  (TEST-SpellCheckComponentTest.testRelativeIndexDirLocation-seed#[3834065169971C0A]) [    ] o.a.s.u.p.LogUpdateProcessorFactory [collection1]  webapp=null path=null params={}{add=[8]} 0 0
   [junit4]   2> 2247440 INFO  (TEST-SpellCheckComponentTest.testRelativeIndexDirLocation-seed#[3834065169971C0A]) [    ] o.a.s.u.p.LogUpdateProcessorFactory [collection1]  webapp=null path=null params={}{add=[9]} 0 0
   [junit4]   2> 2247440 INFO  (TEST-SpellCheckComponentTest.testRelativeIndexDirLocation-seed#[3834065169971C0A]) [    ] o.a.s.u.DirectUpdateHandler2 start commit{,optimize=false,openSearcher=true,waitSearcher=true,expungeDeletes=false,softCommit=false,prepareCommit=false}
   [junit4]   2> 2247442 INFO  (TEST-SpellCheckComponentTest.testRelativeIndexDirLocation-seed#[3834065169971C0A]) [    ] o.a.s.c.SolrDeletionPolicy SolrDeletionPolicy.onCommit: commits: num=2
   [junit4]   2> 	commit{dir=MockDirectoryWrapper(RAMDirectory@459a5b10 lockFactory=org.apache.lucene.store.SingleInstanceLockFactory@5ebace85),segFN=segments_8,generation=8}
   [junit4]   2> 	commit{dir=MockDirectoryWrapper(RAMDirectory@459a5b10 lockFactory=org.apache.lucene.store.SingleInstanceLockFactory@5ebace85),segFN=segments_9,generation=9}
   [junit4]   2> 2247442 INFO  (TEST-SpellCheckComponentTest.testRelativeIndexDirLocation-seed#[3834065169971C0A]) [    ] o.a.s.c.SolrDeletionPolicy newest commit generation = 9
   [junit4]   2> 2247443 INFO  (TEST-SpellCheckComponentTest.testRelativeIndexDirLocation-seed#[3834065169971C0A]) [    ] o.a.s.s.SolrIndexSearcher Opening [Searcher@749c24fb[collection1] main]
   [junit4]   2> 2247443 INFO  (TEST-SpellCheckComponentTest.testRelativeIndexDirLocation-seed#[3834065169971C0A]) [    ] o.a.s.u.DirectUpdateHandler2 end_commit_flush
   [junit4]   2> 2247443 INFO  (searcherExecutor-7529-thread-1) [    ] o.a.s.h.c.SpellCheckComponent Building spell index for spell checker: default
   [junit4]   2> 2247634 INFO  (searcherExecutor-7529-thread-1) [    ] o.a.s.h.c.SpellCheckComponent Building spell index for spell checker: default_teststop
   [junit4]   2> 2247664 INFO  (searcherExecutor-7529-thread-1) [    ] o.a.s.h.c.SpellCheckComponent Building spell index for spell checker: threshold
   [junit4]   2> 2247781 INFO  (searcherExecutor-7529-thread-1) [    ] o.a.s.h.c.SpellCheckComponent Building spell index for spell checker: threshold_direct
   [junit4]   2> 2247782 INFO  (searcherExecutor-7529-thread-1) [    ] o.a.s.h.c.SpellCheckComponent Building spell index for spell checker: multipleFields
   [junit4]   2> 2247988 INFO  (searcherExecutor-7529-thread-1) [    ] o.a.s.h.c.SpellCheckComponent Building spell index for spell checker: freq
   [junit4]   2> 2248174 INFO  (searcherExecutor-7529-thread-1) [    ] o.a.s.h.c.SpellCheckComponent Building spell index for spell checker: fqcn
   [junit4]   2> 2248368 INFO  (searcherExecutor-7529-thread-1) [    ] o.a.s.c.SolrCore [collection1] Registered new searcher Searcher@749c24fb[collection1] main{ExitableDirectoryReader(UninvertingDirectoryReader(Uninverting(_4(6.1.0):c10)))}
   [junit4]   2> 2248369 INFO  (TEST-SpellCheckComponentTest.testRelativeIndexDirLocation-seed#[3834065169971C0A]) [    ] o.a.s.u.p.LogUpdateProcessorFactory [collection1]  webapp=null path=null params={}{commit=} 0 929
   [junit4]   2> 2248369 INFO  (TEST-SpellCheckComponentTest.testRelativeIndexDirLocation-seed#[3834065169971C0A]) [    ] o.a.s.SolrTestCaseJ4 ###Ending testRelativeIndexDirLocation
   [junit4]   2> 2248369 INFO  (TEST-SpellCheckComponentTest.testRelativeIndexDirLocation-seed#[3834065169971C0A]) [    ] o.a.s.u.DirectUpdateHandler2 [collection1] REMOVING ALL DOCUMENTS FROM INDEX
   [junit4]   2> 2248369 INFO  (TEST-SpellCheckComponentTest.testRelativeIndexDirLocation-seed#[3834065169971C0A]) [    ] o.a.s.u.p.LogUpdateProcessorFactory [collection1]  webapp=null path=null params={}{deleteByQuery=*:*} 0 0
   [junit4]   2> 2248370 INFO  (TEST-SpellCheckComponentTest.testRelativeIndexDirLocation-seed#[3834065169971C0A]) [    ] o.a.s.u.DirectUpdateHandler2 start commit{,optimize=false,openSearcher=true,waitSearcher=true,expungeDeletes=false,softCommit=false,prepareCommit=false}
   [junit4]   2> 2248370 INFO  (TEST-SpellCheckComponentTest.testRelativeIndexDirLocation-seed#[3834065169971C0A]) [    ] o.a.s.c.SolrDeletionPolicy SolrDeletionPolicy.onCommit: commits: num=2
   [junit4]   2> 	commit{dir=MockDirectoryWrapper(RAMDirectory@459a5b10 lockFactory=org.apache.lucene.store.SingleInstanceLockFactory@5ebace85),segFN=segments_9,generation=9}
   [junit4]   2> 	commit{dir=MockDirectoryWrapper(RAMDirectory@459a5b10 lockFactory=org.apache.lucene.store.SingleInstanceLockFactory@5ebace85),segFN=segments_a,generation=10}
   [junit4]   2> 2248370 INFO  (TEST-SpellCheckComponentTest.testRelativeIndexDirLocation-seed#[3834065169971C0A]) [    ] o.a.s.c.SolrDeletionPolicy newest commit generation = 10
   [junit4]   2> 2248371 INFO  (TEST-SpellCheckComponentTest.testRelativeIndexDirLocation-seed#[3834065169971C0A]) [    ] o.a.s.s.SolrIndexSearcher Opening [Searcher@5e08f545[collection1] main]
   [junit4]   2> 2248371 INFO  (TEST-SpellCheckComponentTest.testRelativeIndexDirLocation-seed#[3834065169971C0A]) [    ] o.a.s.u.DirectUpdateHandler2 end_commit_flush
   [junit4]   2> 2248371 INFO  (searcherExecutor-7529-thread-1) [    ] o.a.s.h.c.SpellCheckComponent Building spell index for spell checker: default
   [junit4]   2> 2248429 INFO  (searcherExecutor-7529-thread-1) [    ] o.a.s.h.c.SpellCheckComponent Building spell index for spell checker: default_teststop
   [junit4]   2> 2248470 INFO  (searcherExecutor-7529-thread-1) [    ] o.a.s.h.c.SpellCheckComponent Building spell index for spell checker: threshold
   [junit4]   2> 2248523 INFO  (searcherExecutor-7529-thread-1) [    ] o.a.s.h.c.SpellCheckComponent Building spell index for spell checker: threshold_direct
   [junit4]   2> 2248523 INFO  (searcherExecutor-7529-thread-1) [    ] o.a.s.h.c.SpellCheckComponent Building spell index for spell checker: multipleFields
   [junit4]   2> 2248587 INFO  (searcherExecutor-7529-thread-1) [    ] o.a.s.h.c.SpellCheckComponent Building spell index for spell checker: freq
   [junit4]   2> 2248633 INFO  (searcherExecutor-7529-thread-1) [    ] o.a.s.h.c.SpellCheckComponent Building spell index for spell checker: fqcn
   [junit4]   2> 2248684 INFO  (searcherExecutor-7529-thread-1) [    ] o.a.s.c.SolrCore [collection1] Registered new searcher Searcher@5e08f545[collection1] main{ExitableDirectoryReader(UninvertingDirectoryReader())}
   [junit4]   2> 2248684 INFO  (TEST-SpellCheckComponentTest.testRelativeIndexDirLocation-seed#[3834065169971C0A]) [    ] o.a.s.u.p.LogUpdateProcessorFactory [collection1]  webapp=null path=null params={}{commit=} 0 314
   [junit4]   2> 2248687 INFO  (TEST-SpellCheckComponentTest.testMaximumResultsForSuggest-seed#[3834065169971C0A]) [    ] o.a.s.SolrTestCaseJ4 ###Starting testMaximumResultsForSuggest
   [junit4]   2> 2248687 INFO  (TEST-SpellCheckComponentTest.testMaximumResultsForSuggest-seed#[3834065169971C0A]) [    ] o.a.s.u.p.LogUpdateProcessorFactory [collection1]  webapp=null path=null params={}{add=[0]} 0 0
   [junit4]   2> 2248688 INFO  (TEST-SpellCheckComponentTest.testMaximumResultsForSuggest-seed#[3834065169971C0A]) [    ] o.a.s.u.p.LogUpdateProcessorFactory [collection1]  webapp=null path=null params={}{add=[1]} 0 0
   [junit4]   2> 2248688 INFO  (TEST-SpellCheckComponentTest.testMaximumResultsForSuggest-seed#[3834065169971C0A]) [    ] o.a.s.u.p.LogUpdateProcessorFactory [collection1]  webapp=null path=null params={}{add=[2]} 0 0
   [junit4]   2> 2248688 INFO  (TEST-SpellCheckComponentTest.testMaximumResultsForSuggest-seed#[3834065169971C0A]) [    ] o.a.s.u.p.LogUpdateProcessorFactory [collection1]  webapp=null path=null params={}{add=[3]} 0 0
   [junit4]   2> 2248689 INFO  (TEST-SpellCheckComponentTest.testMaximumResultsForSuggest-seed#[3834065169971C0A]) [    ] o.a.s.u.p.LogUpdateProcessorFactory [collection1]  webapp=null path=null params={}{add=[4]} 0 0
   [junit4]   2> 2248689 INFO  (TEST-SpellCheckComponentTest.testMaximumResultsForSuggest-seed#[3834065169971C0A]) [    ] o.a.s.u.p.LogUpdateProcessorFactory [collection1]  webapp=null path=null params={}{add=[5]} 0 0
   [junit4]   2> 2248689 INFO  (TEST-SpellCheckComponentTest.testMaximumResultsForSuggest-seed#[3834065169971C0A]) [    ] o.a.s.u.p.LogUpdateProcessorFactory [collection1]  webapp=null path=null params={}{add=[6]} 0 0
   [junit4]   2> 2248689 INFO  (TEST-SpellCheckComponentTest.testMaximumResultsForSuggest-seed#[3834065169971C0A]) [    ] o.a.s.u.p.LogUpdateProcessorFactory [collection1]  webapp=null path=null params={}{add=[7]} 0 0
   [junit4]   2> 2248689 INFO  (TEST-SpellCheckComponentTest.testMaximumResultsForSuggest-seed#[3834065169971C0A]) [    ] o.a.s.u.p.LogUpdateProcessorFactory [collection1]  webapp=null path=null params={}{add=[8]} 0 0
   [junit4]   2> 2248690 INFO  (TEST-SpellCheckComponentTest.testMaximumResultsForSuggest-seed#[3834065169971C0A]) [    ] o.a.s.u.p.LogUpdateProcessorFactory [collection1]  webapp=null path=null params={}{add=[9]} 0 0
   [junit4]   2> 2248690 INFO  (TEST-SpellCheckComponentTest.testMaximumResultsForSuggest-seed#[3834065169971C0A]) [    ] o.a.s.u.DirectUpdateHandler2 start commit{,optimize=false,openSearcher=true,waitSearcher=true,expungeDeletes=false,softCommit=false,prepareCommit=false}
   [junit4]   2> 2248692 INFO  (TEST-SpellCheckComponentTest.testMaximumResultsForSuggest-seed#[3834065169971C0A]) [    ] o.a.s.c.SolrDeletionPolicy SolrDeletionPolicy.onCommit: commits: num=2
   [junit4]   2> 	commit{dir=MockDirectoryWrapper(RAMDirectory@459a5b10 lockFactory=org.apache.lucene.store.SingleInstanceLockFactory@5ebace85),segFN=segments_a,generation=10}
   [junit4]   2> 	commit{dir=MockDirectoryWrapper(RAMDirectory@459a5b10 lockFactory=org.apache.lucene.store.SingleInstanceLockFactory@5ebace85),segFN=segments_b,generation=11}
   [junit4]   2> 2248692 INFO  (TEST-SpellCheckComponentTest.testMaximumResultsForSuggest-seed#[3834065169971C0A]) [    ] o.a.s.c.SolrDeletionPolicy newest commit generation = 11
   [junit4]   2> 2248693 INFO  (TEST-SpellCheckComponentTest.testMaximumResultsForSuggest-seed#[3834065169971C0A]) [    ] o.a.s.s.SolrIndexSearcher Opening [Searcher@102631a1[collection1] main]
   [junit4]   2> 2248693 INFO  (TEST-SpellCheckComponentTest.testMaximumResultsForSuggest-seed#[3834065169971C0A]) [    ] o.a.s.u.DirectUpdateHandler2 end_commit_flush
   [junit4]   2> 2248693 INFO  (searcherExecutor-7529-thread-1) [    ] o.a.s.h.c.SpellCheckComponent Building spell index for spell checker: default
   [junit4]   2> 2248883 INFO  (searcherExecutor-7529-thread-1) [    ] o.a.s.h.c.SpellCheckComponent Building spell index for spell checker: default_teststop
   [junit4]   2> 2248925 INFO  (searcherExecutor-7529-thread-1) [    ] o.a.s.h.c.SpellCheckComponent Building spell index for spell checker: threshold
   [junit4]   2> 2249065 INFO  (searcherExecutor-7529-thread-1) [    ] o.a.s.h.c.SpellCheckComponent Building spell index for spell checker: threshold_direct
   [junit4]   2> 2249065 INFO  (searcherExecutor-7529-thread-1) [    ] o.a.s.h.c.SpellCheckComponent Building spell index for spell checker: multipleFields
   [junit4]   2> 2249189 INFO  (searcherExecutor-7529-thread-1) [    ] o.a.s.h.c.SpellCheckComponent Building spell index for spell checker: freq
   [junit4]   2> 2249291 INFO  (searcherExecutor-7529-thread-1) [    ] o.a.s.h.c.SpellCheckComponent Building spell index for spell checker: fqcn
   [junit4]   2> 2249387 INFO  (searcherExecutor-7529-thread-1) [    ] o.a.s.c.SolrCore [collection1] Registered new searcher Searcher@102631a1[collection1] main{ExitableDirectoryReader(UninvertingDirectoryReader(Uninverting(_5(6.1.0):c10)))}
   [junit4]   2> 2249387 INFO  (TEST-SpellCheckComponentTest.testMaximumResultsForSuggest-seed#[3834065169971C0A]) [    ] o.a.s.u.p.LogUpdateProcessorFactory [collection1]  webapp=null path=null params={}{commit=} 0 697
   [junit4]   2> 2249453 INFO  (TEST-SpellCheckComponentTest.testMaximumResultsForSuggest-seed#[3834065169971C0A]) [    ] o.a.s.c.S.Request [collection1]  webapp=null path=null params={q=lowerfilt:(this+OR+brwn)&spellcheck.maxResultsForSuggest=7&qt=spellCheckCompRH&spellcheck=true&spellcheck.count=5&wt=xml&spellcheck.build=true&spellcheck.extendedResults=false} hits=7 status=0 QTime=65
   [junit4]   2> 2249521 INFO  (TEST-SpellCheckComponentTest.testMaximumResultsForSuggest-seed#[3834065169971C0A]) [    ] o.a.s.c.S.Request [collection1]  webapp=null path=null params={q=lowerfilt:(this+OR+brwn)&spellcheck.maxResultsForSuggest=6&qt=spellCheckCompRH&spellcheck=true&spellcheck.count=5&wt=xml&spellcheck.build=true&spellcheck.extendedResults=false} hits=7 status=0 QTime=66
   [junit4]   2> 2249522 ERROR (TEST-SpellCheckComponentTest.testMaximumResultsForSuggest-seed#[3834065169971C0A]) [    ] o.a.s.SolrTestCaseJ4 query failed JSON validation. error=Path not found: /spellcheck/suggestions/[1]/numFound
   [junit4]   2>  expected =/spellcheck/suggestions/[1]/numFound==1
   [junit4]   2>  response = {
   [junit4]   2>   "responseHeader":{
   [junit4]   2>     "status":0,
   [junit4]   2>     "QTime":66},
   [junit4]   2>   "command":"build",
   [junit4]   2>   "response":{"numFound":7,"start":0,"docs":[
   [junit4]   2>       {
   [junit4]   2>         "id":4,
   [junit4]   2>         "range_facet_l":[4],
   [junit4]   2>         "range_facet_l_dv":[4],
   [junit4]   2>         "range_facet_i_dv":[4],
   [junit4]   2>         "lowerfilt":["this blue"],
   [junit4]   2>         "lowerfilt1and2":["this blue"],
   [junit4]   2>         "multiDefault":["muLti-Default"],
   [junit4]   2>         "intDefault":42,
   [junit4]   2>         "timestamp":"2016-04-09T06:06:27.203Z"},
   [junit4]   2>       {
   [junit4]   2>         "id":5,
   [junit4]   2>         "range_facet_l":[5],
   [junit4]   2>         "range_facet_l_dv":[5],
   [junit4]   2>         "range_facet_i_dv":[5],
   [junit4]   2>         "lowerfilt":["this blud"],
   [junit4]   2>         "lowerfilt1and2":["this blud"],
   [junit4]   2>         "multiDefault":["muLti-Default"],
   [junit4]   2>         "intDefault":42,
   [junit4]   2>         "timestamp":"2016-04-09T06:06:27.204Z"},
   [junit4]   2>       {
   [junit4]   2>         "id":6,
   [junit4]   2>         "range_facet_l":[6],
   [junit4]   2>         "range_facet_l_dv":[6],
   [junit4]   2>         "range_facet_i_dv":[6],
   [junit4]   2>         "lowerfilt":["this boue"],
   [junit4]   2>         "lowerfilt1and2":["this boue"],
   [junit4]   2>         "multiDefault":["muLti-Default"],
   [junit4]   2>         "intDefault":42,
   [junit4]   2>         "timestamp":"2016-04-09T06:06:27.204Z"},
   [junit4]   2>       {
   [junit4]   2>         "id":7,
   [junit4]   2>         "range_facet_l":[7],
   [junit4]   2>         "range_facet_l_dv":[7],
   [junit4]   2>         "range_facet_i_dv":[7],
   [junit4]   2>         "lowerfilt":["this glue"],
   [junit4]   2>         "lowerfilt1and2":["this glue"],
   [junit4]   2>         "multiDefault":["muLti-Default"],
   [junit4]   2>         "intDefault":42,
   [junit4]   2>         "timestamp":"2016-04-09T06:06:27.204Z"},
   [junit4]   2>       {
   [junit4]   2>         "id":8,
   [junit4]   2>         "range_facet_l":[8],
   [junit4]   2>         "range_facet_l_dv":[8],
   [junit4]   2>         "range_facet_i_dv":[8],
   [junit4]   2>         "lowerfilt":["this blee"],
   [junit4]   2>         "lowerfilt1and2":["this blee"],
   [junit4]   2>         "multiDefault":["muLti-Default"],
   [junit4]   2>         "intDefault":42,
   [junit4]   2>         "timestamp":"2016-04-09T06:06:27.204Z"},
   [junit4]   2>       {
   [junit4]   2>         "id":0,
   [junit4]   2>         "range_facet_l":[0],
   [junit4]   2>         "range_facet_l_dv":[0],
   [junit4]   2>         "range_facet_i_dv":[0],
   [junit4]   2>         "lowerfilt":["This is a title"],
   [junit4]   2>         "lowerfilt1and2":["This is a title"],
   [junit4]   2>         "multiDefault":["muLti-Default"],
   [junit4]   2>         "intDefault":42,
   [junit4]   2>         "timestamp":"2016-04-09T06:06:27.202Z"},
   [junit4]   2>       {
   [junit4]   2>         "id":2,
   [junit4]   2>         "range_facet_l":[2],
   [junit4]   2>         "range_facet_l_dv":[2],
   [junit4]   2>         "range_facet_i_dv":[2],
   [junit4]   2>         "lowerfilt":["This is a document"],
   [junit4]   2>         "lowerfilt1and2":["This is a document"],
   [junit4]   2>         "multiDefault":["muLti-Default"],
   [junit4]   2>         "intDefault":42,
   [junit4]   2>         "timestamp":"2016-04-09T06:06:27.203Z"}]
   [junit4]   2>   },
   [junit4]   2>   "spellcheck":{
   [junit4]   2>     "suggestions":[]}}
   [junit4]   2> 
   [junit4]   2>  request = q=lowerfilt:(this+OR+brwn)&spellcheck.maxResultsForSuggest=6&qt=spellCheckCompRH&spellcheck=true&spellcheck.count=5&wt=xml&spellcheck.build=true&spellcheck.extendedResults=false
   [junit4]   2> 2249607 INFO  (TEST-SpellCheckComponentTest.testMaximumResultsForSuggest-seed#[3834065169971C0A]) [    ] o.a.s.c.S.Request [collection1]  webapp=null path=null params={q=lowerfilt:(this+OR+brwn)&spellcheck.maxResultsForSuggest=.90&qt=spellCheckCompRH&spellcheck=true&fq=id:[0+TO+9]&fq=lowerfilt:th*&spellcheck.count=5&wt=xml&spellcheck.build=true&spellcheck.extendedResults=false} hits=7 status=0 QTime=84
   [junit4]   2> 2249698 INFO  (TEST-SpellCheckComponentTest.testMaximumResultsForSuggest-seed#[3834065169971C0A]) [    ] o.a.s.c.S.Request [collection1]  webapp=null path=null params={q=lowerfilt:(this+OR+brwn)&spellcheck.maxResultsForSuggest=.80&qt=spellCheckCompRH&spellcheck=true&fq=id:[0+TO+9]&fq=lowerfilt:th*&spellcheck.count=5&wt=xml&spellcheck.build=true&spellcheck.extendedResults=false} hits=7 status=0 QTime=90
   [junit4]   2> 2249698 ERROR (TEST-SpellCheckComponentTest.testMaximumResultsForSuggest-seed#[3834065169971C0A]) [    ] o.a.s.SolrTestCaseJ4 query failed JSON validation. error=Path not found: /spellcheck/suggestions/[1]/numFound
   [junit4]   2>  expected =/spellcheck/suggestions/[1]/numFound==1
   [junit4]   2>  response = {
   [junit4]   2>   "responseHeader":{
   [junit4]   2>     "status":0,
   [junit4]   2>     "QTime":90},
   [junit4]   2>   "command":"build",
   [junit4]   2>   "response":{"numFound":7,"start":0,"docs":[
   [junit4]   2>       {
   [junit4]   2>         "id":4,
   [junit4]   2>         "range_facet_l":[4],
   [junit4]   2>         "range_facet_l_dv":[4],
   [junit4]   2>         "range_facet_i_dv":[4],
   [junit4]   2>         "lowerfilt":["this blue"],
   [junit4]   2>         "lowerfilt1and2":["this blue"],
   [junit4]   2>         "multiDefault":["muLti-Default"],
   [junit4]   2>         "intDefault":42,
   [junit4]   2>         "timestamp":"2016-04-09T06:06:27.203Z"},
   [junit4]   2>       {
   [junit4]   2>         "id":5,
   [junit4]   2>         "range_facet_l":[5],
   [junit4]   2>         "range_facet_l_dv":[5],
   [junit4]   2>         "range_facet_i_dv":[5],
   [junit4]   2>         "lowerfilt":["this blud"],
   [junit4]   2>         "lowerfilt1and2":["this blud"],
   [junit4]   2>         "multiDefault":["muLti-Default"],
   [junit4]   2>         "intDefault":42,
   [junit4]   2>         "timestamp":"2016-04-09T06:06:27.204Z"},
   [junit4]   2>       {
   [junit4]   2>         "id":6,
   [junit4]   2>         "range_facet_l":[6],
   [junit4]   2>         "range_facet_l_dv":[6],
   [junit4]   2>         "range_facet_i_dv":[6],
   [junit4]   2>         "lowerfilt":["this boue"],
   [junit4]   2>         "lowerfilt1and2":["this boue"],
   [junit4]   2>         "multiDefault":["muLti-Default"],
   [junit4]   2>         "intDefault":42,
   [junit4]   2>         "timestamp":"2016-04-09T06:06:27.204Z"},
   [junit4]   2>       {
   [junit4]   2>         "id":7,
   [junit4]   2>         "range_facet_l":[7],
   [junit4]   2>         "range_facet_l_dv":[7],
   [junit4]   2>         "range_facet_i_dv":[7],
   [junit4]   2>         "lowerfilt":["this glue"],
   [junit4]   2>         "lowerfilt1and2":["this glue"],
   [junit4]   2>         "multiDefault":["muLti-Default"],
   [junit4]   2>         "intDefault":42,
   [junit4]   2>         "timestamp":"2016-04-09T06:06:27.204Z"},
   [junit4]   2>       {
   [junit4]   2>         "id":8,
   [junit4]   2>         "range_facet_l":[8],
   [junit4]   2>         "range_facet_l_dv":[8],
   [junit4]   2>         "range_facet_i_dv":[8],
   [junit4]   2>         "lowerfilt":["this blee"],
   [junit4]   2>         "lowerfilt1and2":["this blee"],
   [junit4]   2>         "multiDefault":["muLti-Default"],
   [junit4]   2>         "intDefault":42,
   [junit4]   2>         "timestamp":"2016-04-09T06:06:27.204Z"},
   [junit4]   2>       {
   [junit4]   2>         "id":0,
   [junit4]   2>         "range_facet_l":[0],
   [junit4]   2>         "range_facet_l_dv":[0],
   [junit4]   2>         "range_facet_i_dv":[0],
   [junit4]   2>         "lowerfilt":["This is a title"],
   [junit4]   2>         "lowerfilt1and2":["This is a title"],
   [junit4]   2>         "multiDefault":["muLti-Default"],
   [junit4]   2>         "intDefault":42,
   [junit4]   2>         "timestamp":"2016-04-09T06:06:27.202Z"},
   [junit4]   2>       {
   [junit4]   2>         "id":2,
   [junit4]   2>         "range_facet_l":[2],
   [junit4]   2>         "range_facet_l_dv":[2],
   [junit4]   2>         "range_facet_i_dv":[2],
   [junit4]   2>         "lowerfilt":["This is a document"],
   [junit4]   2>         "lowerfilt1and2":["This is a document"],
   [junit4]   2>         "multiDefault":["muLti-Default"],
   [junit4]   2>         "intDefault":42,
   [junit4]   2>         "timestamp":"2016-04-09T06:06:27.203Z"}]
   [junit4]   2>   },
   [junit4]   2>   "spellcheck":{
   [junit4]   2>     "suggestions":[]}}
   [junit4]   2> 
   [junit4]   2>  request = q=lowerfilt:(this+OR+brwn)&spellcheck.maxResultsForSuggest=.80&qt=spellCheckCompRH&spellcheck=true&fq=id:[0+TO+9]&fq=lowerfilt:th*&spellcheck.count=5&wt=xml&spellcheck.build=true&spellcheck.extendedResults=false
   [junit4]   2> 2249747 INFO  (TEST-SpellCheckComponentTest.testMaximumResultsForSuggest-seed#[3834065169971C0A]) [    ] o.a.s.c.S.Request [collection1]  webapp=null path=null params={q=lowerfilt:(this+OR+brwn)&spellcheck.maxResultsForSuggest=.70&qt=spellCheckCompRH&spellcheck=true&fq=id:[0+TO+9]&spellcheck.count=5&wt=xml&spellcheck.build=true&spellcheck.maxResultsForSuggest.fq=id:[0+TO+9]&spellcheck.extendedResults=false} hits=7 status=0 QTime=48
   [junit4]   2> 2249792 INFO  (TEST-SpellCheckComponentTest.testMaximumResultsForSuggest-seed#[3834065169971C0A]) [    ] o.a.s.c.S.Request [collection1]  webapp=null path=null params={q=lowerfilt:(this+OR+brwn)&spellcheck.maxResultsForSuggest=.64&qt=spellCheckCompRH&spellcheck=true&fq=id:[0+TO+9]&spellcheck.count=5&wt=xml&spellcheck.build=true&spellcheck.maxResultsForSuggest.fq=lowerfilt:th*&spellcheck.extendedResults=false} hits=7 status=0 QTime=44
   [junit4]   2> 2249792 ERROR (TEST-SpellCheckComponentTest.testMaximumResultsForSuggest-seed#[3834065169971C0A]) [    ] o.a.s.SolrTestCaseJ4 query failed JSON validation. error=Path not found: /spellcheck/suggestions/[1]/numFound
   [junit4]   2>  expected =/spellcheck/suggestions/[1]/numFound==1
   [junit4]   2>  response = {
   [junit4]   2>   "responseHeader":{
   [junit4]   2>     "status":0,
   [junit4]   2>     "QTime":44},
   [junit4]   2>   "command":"build",
   [junit4]   2>   "response":{"numFound":7,"start":0,"docs":[
   [junit4]   2>       {
   [junit4]   2>         "id":4,
   [junit4]   2>         "range_facet_l":[4],
   [junit4]   2>         "range_facet_l_dv":[4],
   [junit4]   2>         "range_facet_i_dv":[4],
   [junit4]   2>         "lowerfilt":["this blue"],
   [junit4]   2>         "lowerfilt1and2":["this blue"],
   [junit4]   2>         "multiDefault":["muLti-Default"],
   [junit4]   2>         "intDefault":42,
   [junit4]   2>         "timestamp":"2016-04-09T06:06:27.203Z"},
   [junit4]   2>       {
   [junit4]   2>         "id":5,
   [junit4]   2>         "range_facet_l":[5],
   [junit4]   2>         "range_facet_l_dv":[5],
   [junit4]   2>         "range_facet_i_dv":[5],
   [junit4]   2>         "lowerfilt":["this blud"],
   [junit4]   2>         "lowerfilt1and2":["this blud"],
   [junit4]   2>         "multiDefault":["muLti-Default"],
   [junit4]   2>         "intDefault":42,
   [junit4]   2>         "timestamp":"2016-04-09T06:06:27.204Z"},
   [junit4]   2>       {
   [junit4]   2>         "id":6,
   [junit4]   2>         "range_facet_l":[6],
   [junit4]   2>         "range_facet_l_dv":[6],
   [junit4]   2>         "range_facet_i_dv":[6],
   [junit4]   2>         "lowerfilt":["this boue"],
   [junit4]   2>         "lowerfilt1and2":["this boue"],
   [junit4]   2>         "multiDefault":["muLti-Default"],
   [junit4]   2>         "intDefault":42,
   [junit4]   2>         "timestamp":"2016-04-09T06:06:27.204Z"},
   [junit4]   2>       {
   [junit4]   2>         "id":7,
   [junit4]   2>         "range_facet_l":[7],
   [junit4]   2>         "range_facet_l_dv":[7],
   [junit4]   2>         "range_facet_i_dv":[7],
   [junit4]   2>         "lowerfilt":["this glue"],
   [junit4]   2>         "lowerfilt1and2":["this glue"],
   [junit4]   2>         "multiDefault":["muLti-Default"],
   [junit4]   2>         "intDefault":42,
   [junit4]   2>         "timestamp":"2016-04-09T06:06:27.204Z"},
   [junit4]   2>       {
   [junit4]   2>         "id":8,
   [junit4]   2>         "range_facet_l":[8],
   [junit4]   2>         "range_facet_l_dv":[8],
   [junit4]   2>         "range_facet_i_dv":[8],
   [junit4]   2>         "lowerfilt":["this blee"],
   [junit4]   2>         "lowerfilt1and2":["this blee"],
   [junit4]   2>         "multiDefault":["muLti-Default"],
   [junit4]   2>         "intDefault":42,
   [junit4]   2>         "timestamp":"2016-04-09T06:06:27.204Z"},
   [junit4]   2>       {
   [junit4]   2>         "id":0,
   [junit4]   2>         "range_facet_l":[0],
   [junit4]   2>         "range_facet_l_dv":[0],
   [junit4]   2>         "range_facet_i_dv":[0],
   [junit4]   2>         "lowerfilt":["This is a title"],
   [junit4]   2>         "lowerfilt1and2":["This is a title"],
   [junit4]   2>         "multiDefault":["muLti-Default"],
   [junit4]   2>         "intDefault":42,
   [junit4]   2>         "timestamp":"2016-04-09T06:06:27.202Z"},
   [junit4]   2>       {
   [junit4]   2>         "id":2,
   [junit4]   2>         "range_facet_l":[2],
   [junit4]   2>         "range_facet_l_dv":[2],
   [junit4]   2>         "range_facet_i_dv":[2],
   [junit4]   2>         "lowerfilt":["This is a document"],
   [junit4]   2>         "lowerfilt1and2":["This is a document"],
   [junit4]   2>         "multiDefault":["muLti-Default"],
   [junit4]   2>         "intDefault":42,
   [junit4]   2>         "timestamp":"2016-04-09T06:06:27.203Z"}]
   [junit4]   2>   },
   [junit4]   2>   "spellcheck":{
   [junit4]   2>     "suggestions":[]}}
   [junit4]   2> 
   [junit4]   2>  request = q=lowerfilt:(this+OR+brwn)&spellcheck.maxResultsForSuggest=.64&qt=spellCheckCompRH&spellcheck=true&fq=id:[0+TO+9]&spellcheck.count=5&wt=xml&spellcheck.build=true&spellcheck.maxResultsForSuggest.fq=lowerfilt:th*&spellcheck.extendedResults=false
   [junit4]   2> 2249793 INFO  (TEST-SpellCheckComponentTest.testMaximumResultsForSuggest-seed#[3834065169971C0A]) [    ] o.a.s.SolrTestCaseJ4 ###Ending testMaximumResultsForSuggest
   [junit4]   2> 2249793 INFO  (TEST-SpellCheckComponentTest.testMaximumResultsForSuggest-seed#[3834065169971C0A]) [    ] o.a.s.u.DirectUpdateHandler2 [collection1] REMOVING ALL DOCUMENTS FROM INDEX
   [junit4]   2> 2249793 INFO  (TEST-SpellCheckComponentTest.testMaximumResultsForSuggest-seed#[3834065169971C0A]) [    ] o.a.s.u.p.LogUpdateProcessorFactory [collection1]  webapp=null path=null params={}{deleteByQuery=*:*} 0 0
   [junit4]   2> 2249793 INFO  (TEST-SpellCheckComponentTest.testMaximumResultsForSuggest-

[...truncated too long message...]

expungeDeletes=0,docsPending=0,adds=0,deletesById=0,deletesByQuery=0,errors=0,cumulative_adds=112,cumulative_deletesById=0,cumulative_deletesByQuery=11,cumulative_errors=0}
   [junit4]   2> 2253929 INFO  (coreCloseExecutor-7533-thread-1) [    x:collection1] o.a.s.u.SolrCoreState Closing SolrCoreState
   [junit4]   2> 2253929 INFO  (coreCloseExecutor-7533-thread-1) [    x:collection1] o.a.s.u.DefaultSolrCoreState SolrCoreState ref count has reached 0 - closing IndexWriter
   [junit4]   2> 2253929 INFO  (coreCloseExecutor-7533-thread-1) [    x:collection1] o.a.s.u.DefaultSolrCoreState closing IndexWriter with IndexWriterCloser
   [junit4]   2> 2253929 INFO  (coreCloseExecutor-7533-thread-1) [    x:collection1] o.a.s.c.SolrCore [collection1] Closing main searcher on request.
   [junit4]   2> 2253929 INFO  (coreCloseExecutor-7533-thread-1) [    x:collection1] o.a.s.c.CachingDirectoryFactory Closing MockDirectoryFactory - 2 directories currently being tracked
   [junit4]   2> 2253929 INFO  (coreCloseExecutor-7533-thread-1) [    x:collection1] o.a.s.c.CachingDirectoryFactory looking to close /export/home/jenkins/workspace/Lucene-Solr-6.x-Solaris/solr/build/solr-core/test/J1/temp/solr.handler.component.SpellCheckComponentTest_3834065169971C0A-001/init-core-data-001/index [CachedDir<<refCount=0;path=/export/home/jenkins/workspace/Lucene-Solr-6.x-Solaris/solr/build/solr-core/test/J1/temp/solr.handler.component.SpellCheckComponentTest_3834065169971C0A-001/init-core-data-001/index;done=false>>]
   [junit4]   2> 2253929 INFO  (coreCloseExecutor-7533-thread-1) [    x:collection1] o.a.s.c.CachingDirectoryFactory Closing directory, CoreContainer#isShutdown=true
   [junit4]   2> 2253929 INFO  (coreCloseExecutor-7533-thread-1) [    x:collection1] o.a.s.c.CachingDirectoryFactory Closing directory: /export/home/jenkins/workspace/Lucene-Solr-6.x-Solaris/solr/build/solr-core/test/J1/temp/solr.handler.component.SpellCheckComponentTest_3834065169971C0A-001/init-core-data-001/index
   [junit4]   2> 2253929 INFO  (coreCloseExecutor-7533-thread-1) [    x:collection1] o.a.s.c.CachingDirectoryFactory looking to close /export/home/jenkins/workspace/Lucene-Solr-6.x-Solaris/solr/build/solr-core/test/J1/temp/solr.handler.component.SpellCheckComponentTest_3834065169971C0A-001/init-core-data-001 [CachedDir<<refCount=0;path=/export/home/jenkins/workspace/Lucene-Solr-6.x-Solaris/solr/build/solr-core/test/J1/temp/solr.handler.component.SpellCheckComponentTest_3834065169971C0A-001/init-core-data-001;done=false>>]
   [junit4]   2> 2253929 INFO  (coreCloseExecutor-7533-thread-1) [    x:collection1] o.a.s.c.CachingDirectoryFactory Closing directory, CoreContainer#isShutdown=true
   [junit4]   2> 2253929 INFO  (coreCloseExecutor-7533-thread-1) [    x:collection1] o.a.s.c.CachingDirectoryFactory Closing directory: /export/home/jenkins/workspace/Lucene-Solr-6.x-Solaris/solr/build/solr-core/test/J1/temp/solr.handler.component.SpellCheckComponentTest_3834065169971C0A-001/init-core-data-001
   [junit4]   2> NOTE: leaving temporary files on disk at: /export/home/jenkins/workspace/Lucene-Solr-6.x-Solaris/solr/build/solr-core/test/J1/temp/solr.handler.component.SpellCheckComponentTest_3834065169971C0A-001
   [junit4]   2> NOTE: test params are: codec=Asserting(Lucene60): {start1=TestBloomFilteredLucenePostings(BloomFilteringPostingsFormat(Lucene50(blocksize=128))), range_facet_l_dv=TestBloomFilteredLucenePostings(BloomFilteringPostingsFormat(Lucene50(blocksize=128))), multiDefault=PostingsFormat(name=Memory doPackFST= true), intDefault=BlockTreeOrds(blocksize=128), range_facet_l=PostingsFormat(name=Memory doPackFST= true), lowerfilt1and2=PostingsFormat(name=Memory doPackFST= true), end4=FSTOrd50, end3=BlockTreeOrds(blocksize=128), end2=TestBloomFilteredLucenePostings(BloomFilteringPostingsFormat(Lucene50(blocksize=128))), end1=PostingsFormat(name=Memory doPackFST= true), lowerfilt=PostingsFormat(name=Memory doPackFST= true), gram1=PostingsFormat(name=Memory doPackFST= true), id=TestBloomFilteredLucenePostings(BloomFilteringPostingsFormat(Lucene50(blocksize=128))), range_facet_i_dv=PostingsFormat(name=Memory doPackFST= true), gram2=TestBloomFilteredLucenePostings(BloomFilteringPostingsFormat(Lucene50(blocksize=128))), gram3=BlockTreeOrds(blocksize=128), start3=FSTOrd50, gram4=FSTOrd50, start2=PostingsFormat(name=Memory doPackFST= true), word=PostingsFormat(name=Memory doPackFST= true), timestamp=PostingsFormat(name=Memory doPackFST= true), start4=BlockTreeOrds(blocksize=128)}, docValues:{range_facet_l_dv=DocValuesFormat(name=Memory), range_facet_i_dv=DocValuesFormat(name=Lucene54), timestamp=DocValuesFormat(name=Lucene54)}, maxPointsInLeafNode=590, maxMBSortInHeap=5.051773466758563, sim=RandomSimilarity(queryNorm=false,coord=yes): {}, locale=id-ID, timezone=America/Bogota
   [junit4]   2> NOTE: SunOS 5.11 amd64/Oracle Corporation 1.8.0_72 (64-bit)/cpus=3,threads=1,free=100119112,total=518979584
   [junit4]   2> NOTE: All tests run in this JVM: [HighlighterMaxOffsetTest, SpatialHeatmapFacetsTest, TestNRTOpen, ExplicitHLLTest, CloudMLTQParserTest, DistributedFacetPivotSmallTest, OutOfBoxZkACLAndCredentialsProvidersTest, CacheHeaderTest, QueryParsingTest, FullSolrCloudDistribCmdsTest, EchoParamsTest, OverseerStatusTest, BlockJoinFacetRandomTest, DataDrivenBlockJoinTest, TestZkChroot, DirectoryFactoryTest, TestTolerantUpdateProcessorRandomCloud, DistributedMLTComponentTest, TestPKIAuthenticationPlugin, TestManagedSynonymFilterFactory, NotRequiredUniqueKeyTest, DistributedTermsComponentTest, TestFieldTypeResource, TestClassicSimilarityFactory, DebugComponentTest, DeleteLastCustomShardedReplicaTest, DateMathParserTest, HdfsCollectionsAPIDistributedZkTest, TestSQLHandler, TestTrackingShardHandlerFactory, ConfigSetsAPITest, HttpPartitionTest, TestRestManager, TestValueSourceCache, SharedFSAutoReplicaFailoverTest, FieldMutatingUpdateProcessorTest, TestManagedResource, GraphQueryTest, VersionInfoTest, CollectionTooManyReplicasTest, TestRebalanceLeaders, AutoCommitTest, ZkSolrClientTest, FileUtilsTest, SuggesterWFSTTest, TestConfigReload, TestSolrQueryResponse, TestPerFieldSimilarityWithDefaultOverride, TestNonDefinedSimilarityFactory, TestUseDocValuesAsStored, TestRandomFaceting, TestIndexSearcher, RequestLoggingTest, NoCacheHeaderTest, SpellCheckCollatorTest, TestSolrDeletionPolicy2, DateFieldTest, TestRealTimeGet, TestAtomicUpdateErrorCases, TestCrossCoreJoin, BaseCdcrDistributedZkTest, TestInfoStreamLogging, BigEndianAscendingWordSerializerTest, ShardRoutingCustomTest, TestReloadDeadlock, TestRangeQuery, BasicDistributedZk2Test, TestManagedSchema, CdcrReplicationHandlerTest, ConnectionReuseTest, TestSimpleQParserPlugin, TestCloudSchemaless, SpellingQueryConverterTest, TestSuggestSpellingConverter, TestLRUStatsCache, IndexSchemaRuntimeFieldTest, TestCustomSort, TestSolrJ, AnalysisErrorHandlingTest, TermVectorComponentDistributedTest, ConvertedLegacyTest, TestCloudManagedSchema, DeleteShardTest, CustomCollectionTest, TestSimpleTrackingShardHandler, SuggestComponentTest, PKIAuthenticationIntegrationTest, TestSolrQueryParser, CheckHdfsIndexTest, TestBinaryField, TestDefaultStatsCache, IgnoreCommitOptimizeUpdateProcessorFactoryTest, SolrPluginUtilsTest, SmileWriterTest, AtomicUpdatesTest, TestWriterPerf, TestOmitPositions, TestScoreJoinQPScore, TestInitQParser, TestRandomCollapseQParserPlugin, SynonymTokenizerTest, TestJoin, HdfsDirectoryFactoryTest, TestJettySolrRunner, SpellPossibilityIteratorTest, TestConfigOverlay, TestSolrConfigHandlerConcurrent, DocValuesMissingTest, TestPerFieldSimilarity, CurrencyFieldOpenExchangeTest, TestSchemaResource, TestRTGBase, TestExceedMaxTermLength, CollectionsAPIDistributedZkTest, BasicFunctionalityTest, RulesTest, TestExactSharedStatsCache, MigrateRouteKeyTest, LoggingHandlerTest, DistributedSuggestComponentTest, TestSolrIndexConfig, DistributedIntervalFacetingTest, SuggesterTSTTest, StressHdfsTest, TermVectorComponentTest, AsyncCallRequestStatusResponseTest, TestLMJelinekMercerSimilarityFactory, SolrCmdDistributorTest, TestSchemaVersionResource, TestSolr4Spatial, CloneFieldUpdateProcessorFactoryTest, DirectSolrConnectionTest, TestMissingGroups, CoreAdminHandlerTest, CollectionsAPISolrJTest, BinaryUpdateRequestHandlerTest, OutputWriterTest, TestExclusionRuleCollectionAccess, TestCustomDocTransformer, SegmentsInfoRequestHandlerTest, TestSolr4Spatial2, TestRequestForwarding, TestOrdValues, LeaderElectionTest, TestRandomDVFaceting, ZkCLITest, TestDistributedGrouping, TestRecovery, DistributedSpellCheckComponentTest, TestStressReorder, SolrCoreTest, SpellCheckComponentTest]
   [junit4] Completed [315/585 (1!)] on J1 in 9.57s, 11 tests, 1 error <<< FAILURES!

[...truncated 887 lines...]
BUILD FAILED
/export/home/jenkins/workspace/Lucene-Solr-6.x-Solaris/build.xml:740: The following error occurred while executing this line:
/export/home/jenkins/workspace/Lucene-Solr-6.x-Solaris/build.xml:684: The following error occurred while executing this line:
/export/home/jenkins/workspace/Lucene-Solr-6.x-Solaris/build.xml:59: The following error occurred while executing this line:
/export/home/jenkins/workspace/Lucene-Solr-6.x-Solaris/solr/build.xml:233: The following error occurred while executing this line:
/export/home/jenkins/workspace/Lucene-Solr-6.x-Solaris/solr/common-build.xml:529: The following error occurred while executing this line:
/export/home/jenkins/workspace/Lucene-Solr-6.x-Solaris/lucene/common-build.xml:1457: The following error occurred while executing this line:
/export/home/jenkins/workspace/Lucene-Solr-6.x-Solaris/lucene/common-build.xml:1014: There were test failures: 585 suites (10 ignored), 2363 tests, 1 error, 85 ignored (70 assumptions) [seed: 3834065169971C0A]

Total time: 74 minutes 49 seconds
Build step 'Invoke Ant' marked build as failure
Archiving artifacts
[WARNINGS] Skipping publisher since build result is FAILURE
Recording test results
Email was triggered for: Failure - Any
Sending email for trigger: Failure - Any



Mime
View raw message