lucene-dev mailing list archives

Site index · List index
Message view « Date » · « Thread »
Top « Date » · « Thread »
From Policeman Jenkins Server <jenk...@thetaphi.de>
Subject [JENKINS] Lucene-Solr-master-MacOSX (64bit/jdk1.8.0) - Build # 3180 - Failure!
Date Fri, 01 Apr 2016 02:47:35 GMT
Build: http://jenkins.thetaphi.de/job/Lucene-Solr-master-MacOSX/3180/
Java: 64bit/jdk1.8.0 -XX:-UseCompressedOops -XX:+UseParallelGC

1 tests failed.
FAILED:  org.apache.solr.handler.TestReqParamsAPI.test

Error Message:
Could not get expected value  'CY val' for path 'params/c' full output: {   "responseHeader":{     "status":0,     "QTime":0},   "params":{     "a":"A val",     "b":"B val",     "wt":"json",     "useParams":""},   "context":{     "webapp":"/z_us/j",     "path":"/dump1",     "httpMethod":"GET"}}

Stack Trace:
java.lang.AssertionError: Could not get expected value  'CY val' for path 'params/c' full output: {
  "responseHeader":{
    "status":0,
    "QTime":0},
  "params":{
    "a":"A val",
    "b":"B val",
    "wt":"json",
    "useParams":""},
  "context":{
    "webapp":"/z_us/j",
    "path":"/dump1",
    "httpMethod":"GET"}}
	at __randomizedtesting.SeedInfo.seed([EA92395D959EC658:62C606873B62ABA0]:0)
	at org.junit.Assert.fail(Assert.java:93)
	at org.junit.Assert.assertTrue(Assert.java:43)
	at org.apache.solr.core.TestSolrConfigHandler.testForResponseElement(TestSolrConfigHandler.java:458)
	at org.apache.solr.handler.TestReqParamsAPI.testReqParams(TestReqParamsAPI.java:177)
	at org.apache.solr.handler.TestReqParamsAPI.test(TestReqParamsAPI.java:67)
	at sun.reflect.NativeMethodAccessorImpl.invoke0(Native Method)
	at sun.reflect.NativeMethodAccessorImpl.invoke(NativeMethodAccessorImpl.java:62)
	at sun.reflect.DelegatingMethodAccessorImpl.invoke(DelegatingMethodAccessorImpl.java:43)
	at java.lang.reflect.Method.invoke(Method.java:498)
	at com.carrotsearch.randomizedtesting.RandomizedRunner.invoke(RandomizedRunner.java:1764)
	at com.carrotsearch.randomizedtesting.RandomizedRunner$8.evaluate(RandomizedRunner.java:871)
	at com.carrotsearch.randomizedtesting.RandomizedRunner$9.evaluate(RandomizedRunner.java:907)
	at com.carrotsearch.randomizedtesting.RandomizedRunner$10.evaluate(RandomizedRunner.java:921)
	at org.apache.solr.BaseDistributedSearchTestCase$ShardsRepeatRule$ShardsFixedStatement.callStatement(BaseDistributedSearchTestCase.java:992)
	at org.apache.solr.BaseDistributedSearchTestCase$ShardsRepeatRule$ShardsStatement.evaluate(BaseDistributedSearchTestCase.java:967)
	at com.carrotsearch.randomizedtesting.rules.SystemPropertiesRestoreRule$1.evaluate(SystemPropertiesRestoreRule.java:57)
	at org.apache.lucene.util.TestRuleSetupTeardownChained$1.evaluate(TestRuleSetupTeardownChained.java:49)
	at org.apache.lucene.util.AbstractBeforeAfterRule$1.evaluate(AbstractBeforeAfterRule.java:45)
	at org.apache.lucene.util.TestRuleThreadAndTestName$1.evaluate(TestRuleThreadAndTestName.java:48)
	at org.apache.lucene.util.TestRuleIgnoreAfterMaxFailures$1.evaluate(TestRuleIgnoreAfterMaxFailures.java:64)
	at org.apache.lucene.util.TestRuleMarkFailure$1.evaluate(TestRuleMarkFailure.java:47)
	at com.carrotsearch.randomizedtesting.rules.StatementAdapter.evaluate(StatementAdapter.java:36)
	at com.carrotsearch.randomizedtesting.ThreadLeakControl$StatementRunner.run(ThreadLeakControl.java:367)
	at com.carrotsearch.randomizedtesting.ThreadLeakControl.forkTimeoutingTask(ThreadLeakControl.java:809)
	at com.carrotsearch.randomizedtesting.ThreadLeakControl$3.evaluate(ThreadLeakControl.java:460)
	at com.carrotsearch.randomizedtesting.RandomizedRunner.runSingleTest(RandomizedRunner.java:880)
	at com.carrotsearch.randomizedtesting.RandomizedRunner$5.evaluate(RandomizedRunner.java:781)
	at com.carrotsearch.randomizedtesting.RandomizedRunner$6.evaluate(RandomizedRunner.java:816)
	at com.carrotsearch.randomizedtesting.RandomizedRunner$7.evaluate(RandomizedRunner.java:827)
	at com.carrotsearch.randomizedtesting.rules.StatementAdapter.evaluate(StatementAdapter.java:36)
	at com.carrotsearch.randomizedtesting.rules.SystemPropertiesRestoreRule$1.evaluate(SystemPropertiesRestoreRule.java:57)
	at org.apache.lucene.util.AbstractBeforeAfterRule$1.evaluate(AbstractBeforeAfterRule.java:45)
	at com.carrotsearch.randomizedtesting.rules.StatementAdapter.evaluate(StatementAdapter.java:36)
	at org.apache.lucene.util.TestRuleStoreClassName$1.evaluate(TestRuleStoreClassName.java:41)
	at com.carrotsearch.randomizedtesting.rules.NoShadowingOrOverridesOnMethodsRule$1.evaluate(NoShadowingOrOverridesOnMethodsRule.java:40)
	at com.carrotsearch.randomizedtesting.rules.NoShadowingOrOverridesOnMethodsRule$1.evaluate(NoShadowingOrOverridesOnMethodsRule.java:40)
	at com.carrotsearch.randomizedtesting.rules.StatementAdapter.evaluate(StatementAdapter.java:36)
	at com.carrotsearch.randomizedtesting.rules.StatementAdapter.evaluate(StatementAdapter.java:36)
	at com.carrotsearch.randomizedtesting.rules.StatementAdapter.evaluate(StatementAdapter.java:36)
	at org.apache.lucene.util.TestRuleAssertionsRequired$1.evaluate(TestRuleAssertionsRequired.java:53)
	at org.apache.lucene.util.TestRuleMarkFailure$1.evaluate(TestRuleMarkFailure.java:47)
	at org.apache.lucene.util.TestRuleIgnoreAfterMaxFailures$1.evaluate(TestRuleIgnoreAfterMaxFailures.java:64)
	at org.apache.lucene.util.TestRuleIgnoreTestSuites$1.evaluate(TestRuleIgnoreTestSuites.java:54)
	at com.carrotsearch.randomizedtesting.rules.StatementAdapter.evaluate(StatementAdapter.java:36)
	at com.carrotsearch.randomizedtesting.ThreadLeakControl$StatementRunner.run(ThreadLeakControl.java:367)
	at java.lang.Thread.run(Thread.java:745)




Build Log:
[...truncated 11114 lines...]
   [junit4] Suite: org.apache.solr.handler.TestReqParamsAPI
   [junit4]   2> Creating dataDir: /Users/jenkins/workspace/Lucene-Solr-master-MacOSX/solr/build/solr-core/test/J1/temp/solr.handler.TestReqParamsAPI_EA92395D959EC658-001/init-core-data-001
   [junit4]   2> 1054390 INFO  (SUITE-TestReqParamsAPI-seed#[EA92395D959EC658]-worker) [    ] o.a.s.SolrTestCaseJ4 Randomized ssl (false) and clientAuth (false)
   [junit4]   2> 1054390 INFO  (SUITE-TestReqParamsAPI-seed#[EA92395D959EC658]-worker) [    ] o.a.s.BaseDistributedSearchTestCase Setting hostContext system property: /z_us/j
   [junit4]   2> 1054391 INFO  (TEST-TestReqParamsAPI.test-seed#[EA92395D959EC658]) [    ] o.a.s.c.ZkTestServer STARTING ZK TEST SERVER
   [junit4]   2> 1054392 INFO  (Thread-2872) [    ] o.a.s.c.ZkTestServer client port:0.0.0.0/0.0.0.0:0
   [junit4]   2> 1054392 INFO  (Thread-2872) [    ] o.a.s.c.ZkTestServer Starting server
   [junit4]   2> 1054498 INFO  (TEST-TestReqParamsAPI.test-seed#[EA92395D959EC658]) [    ] o.a.s.c.ZkTestServer start zk server on port:55700
   [junit4]   2> 1054498 INFO  (TEST-TestReqParamsAPI.test-seed#[EA92395D959EC658]) [    ] o.a.s.c.c.SolrZkClient Using default ZkCredentialsProvider
   [junit4]   2> 1054498 INFO  (TEST-TestReqParamsAPI.test-seed#[EA92395D959EC658]) [    ] o.a.s.c.c.ConnectionManager Waiting for client to connect to ZooKeeper
   [junit4]   2> 1054507 INFO  (zkCallback-1258-thread-1) [    ] o.a.s.c.c.ConnectionManager Watcher org.apache.solr.common.cloud.ConnectionManager@7ccbfde9 name:ZooKeeperConnection Watcher:127.0.0.1:55700 got event WatchedEvent state:SyncConnected type:None path:null path:null type:None
   [junit4]   2> 1054507 INFO  (TEST-TestReqParamsAPI.test-seed#[EA92395D959EC658]) [    ] o.a.s.c.c.ConnectionManager Client is connected to ZooKeeper
   [junit4]   2> 1054507 INFO  (TEST-TestReqParamsAPI.test-seed#[EA92395D959EC658]) [    ] o.a.s.c.c.SolrZkClient Using default ZkACLProvider
   [junit4]   2> 1054508 INFO  (TEST-TestReqParamsAPI.test-seed#[EA92395D959EC658]) [    ] o.a.s.c.c.SolrZkClient makePath: /solr
   [junit4]   2> 1054511 INFO  (TEST-TestReqParamsAPI.test-seed#[EA92395D959EC658]) [    ] o.a.s.c.c.SolrZkClient Using default ZkCredentialsProvider
   [junit4]   2> 1054512 INFO  (TEST-TestReqParamsAPI.test-seed#[EA92395D959EC658]) [    ] o.a.s.c.c.ConnectionManager Waiting for client to connect to ZooKeeper
   [junit4]   2> 1054513 INFO  (zkCallback-1259-thread-1) [    ] o.a.s.c.c.ConnectionManager Watcher org.apache.solr.common.cloud.ConnectionManager@76e39539 name:ZooKeeperConnection Watcher:127.0.0.1:55700/solr got event WatchedEvent state:SyncConnected type:None path:null path:null type:None
   [junit4]   2> 1054513 INFO  (TEST-TestReqParamsAPI.test-seed#[EA92395D959EC658]) [    ] o.a.s.c.c.ConnectionManager Client is connected to ZooKeeper
   [junit4]   2> 1054513 INFO  (TEST-TestReqParamsAPI.test-seed#[EA92395D959EC658]) [    ] o.a.s.c.c.SolrZkClient Using default ZkACLProvider
   [junit4]   2> 1054513 INFO  (TEST-TestReqParamsAPI.test-seed#[EA92395D959EC658]) [    ] o.a.s.c.c.SolrZkClient makePath: /collections/collection1
   [junit4]   2> 1054516 INFO  (TEST-TestReqParamsAPI.test-seed#[EA92395D959EC658]) [    ] o.a.s.c.c.SolrZkClient makePath: /collections/collection1/shards
   [junit4]   2> 1054518 INFO  (TEST-TestReqParamsAPI.test-seed#[EA92395D959EC658]) [    ] o.a.s.c.c.SolrZkClient makePath: /collections/control_collection
   [junit4]   2> 1054521 INFO  (TEST-TestReqParamsAPI.test-seed#[EA92395D959EC658]) [    ] o.a.s.c.c.SolrZkClient makePath: /collections/control_collection/shards
   [junit4]   2> 1054523 INFO  (TEST-TestReqParamsAPI.test-seed#[EA92395D959EC658]) [    ] o.a.s.c.AbstractZkTestCase put /Users/jenkins/workspace/Lucene-Solr-master-MacOSX/solr/core/src/test-files/solr/collection1/conf/solrconfig-tlog.xml to /configs/conf1/solrconfig.xml
   [junit4]   2> 1054524 INFO  (TEST-TestReqParamsAPI.test-seed#[EA92395D959EC658]) [    ] o.a.s.c.c.SolrZkClient makePath: /configs/conf1/solrconfig.xml
   [junit4]   2> 1054528 INFO  (TEST-TestReqParamsAPI.test-seed#[EA92395D959EC658]) [    ] o.a.s.c.AbstractZkTestCase put /Users/jenkins/workspace/Lucene-Solr-master-MacOSX/solr/core/src/test-files/solr/collection1/conf/schema.xml to /configs/conf1/schema.xml
   [junit4]   2> 1054528 INFO  (TEST-TestReqParamsAPI.test-seed#[EA92395D959EC658]) [    ] o.a.s.c.c.SolrZkClient makePath: /configs/conf1/schema.xml
   [junit4]   2> 1054531 INFO  (TEST-TestReqParamsAPI.test-seed#[EA92395D959EC658]) [    ] o.a.s.c.AbstractZkTestCase put /Users/jenkins/workspace/Lucene-Solr-master-MacOSX/solr/core/src/test-files/solr/collection1/conf/solrconfig.snippet.randomindexconfig.xml to /configs/conf1/solrconfig.snippet.randomindexconfig.xml
   [junit4]   2> 1054531 INFO  (TEST-TestReqParamsAPI.test-seed#[EA92395D959EC658]) [    ] o.a.s.c.c.SolrZkClient makePath: /configs/conf1/solrconfig.snippet.randomindexconfig.xml
   [junit4]   2> 1054533 INFO  (TEST-TestReqParamsAPI.test-seed#[EA92395D959EC658]) [    ] o.a.s.c.AbstractZkTestCase put /Users/jenkins/workspace/Lucene-Solr-master-MacOSX/solr/core/src/test-files/solr/collection1/conf/stopwords.txt to /configs/conf1/stopwords.txt
   [junit4]   2> 1054534 INFO  (TEST-TestReqParamsAPI.test-seed#[EA92395D959EC658]) [    ] o.a.s.c.c.SolrZkClient makePath: /configs/conf1/stopwords.txt
   [junit4]   2> 1054536 INFO  (TEST-TestReqParamsAPI.test-seed#[EA92395D959EC658]) [    ] o.a.s.c.AbstractZkTestCase put /Users/jenkins/workspace/Lucene-Solr-master-MacOSX/solr/core/src/test-files/solr/collection1/conf/protwords.txt to /configs/conf1/protwords.txt
   [junit4]   2> 1054537 INFO  (TEST-TestReqParamsAPI.test-seed#[EA92395D959EC658]) [    ] o.a.s.c.c.SolrZkClient makePath: /configs/conf1/protwords.txt
   [junit4]   2> 1054539 INFO  (TEST-TestReqParamsAPI.test-seed#[EA92395D959EC658]) [    ] o.a.s.c.AbstractZkTestCase put /Users/jenkins/workspace/Lucene-Solr-master-MacOSX/solr/core/src/test-files/solr/collection1/conf/currency.xml to /configs/conf1/currency.xml
   [junit4]   2> 1054540 INFO  (TEST-TestReqParamsAPI.test-seed#[EA92395D959EC658]) [    ] o.a.s.c.c.SolrZkClient makePath: /configs/conf1/currency.xml
   [junit4]   2> 1054542 INFO  (TEST-TestReqParamsAPI.test-seed#[EA92395D959EC658]) [    ] o.a.s.c.AbstractZkTestCase put /Users/jenkins/workspace/Lucene-Solr-master-MacOSX/solr/core/src/test-files/solr/collection1/conf/enumsConfig.xml to /configs/conf1/enumsConfig.xml
   [junit4]   2> 1054543 INFO  (TEST-TestReqParamsAPI.test-seed#[EA92395D959EC658]) [    ] o.a.s.c.c.SolrZkClient makePath: /configs/conf1/enumsConfig.xml
   [junit4]   2> 1054545 INFO  (TEST-TestReqParamsAPI.test-seed#[EA92395D959EC658]) [    ] o.a.s.c.AbstractZkTestCase put /Users/jenkins/workspace/Lucene-Solr-master-MacOSX/solr/core/src/test-files/solr/collection1/conf/open-exchange-rates.json to /configs/conf1/open-exchange-rates.json
   [junit4]   2> 1054545 INFO  (TEST-TestReqParamsAPI.test-seed#[EA92395D959EC658]) [    ] o.a.s.c.c.SolrZkClient makePath: /configs/conf1/open-exchange-rates.json
   [junit4]   2> 1054548 INFO  (TEST-TestReqParamsAPI.test-seed#[EA92395D959EC658]) [    ] o.a.s.c.AbstractZkTestCase put /Users/jenkins/workspace/Lucene-Solr-master-MacOSX/solr/core/src/test-files/solr/collection1/conf/mapping-ISOLatin1Accent.txt to /configs/conf1/mapping-ISOLatin1Accent.txt
   [junit4]   2> 1054548 INFO  (TEST-TestReqParamsAPI.test-seed#[EA92395D959EC658]) [    ] o.a.s.c.c.SolrZkClient makePath: /configs/conf1/mapping-ISOLatin1Accent.txt
   [junit4]   2> 1054551 INFO  (TEST-TestReqParamsAPI.test-seed#[EA92395D959EC658]) [    ] o.a.s.c.AbstractZkTestCase put /Users/jenkins/workspace/Lucene-Solr-master-MacOSX/solr/core/src/test-files/solr/collection1/conf/old_synonyms.txt to /configs/conf1/old_synonyms.txt
   [junit4]   2> 1054551 INFO  (TEST-TestReqParamsAPI.test-seed#[EA92395D959EC658]) [    ] o.a.s.c.c.SolrZkClient makePath: /configs/conf1/old_synonyms.txt
   [junit4]   2> 1054554 INFO  (TEST-TestReqParamsAPI.test-seed#[EA92395D959EC658]) [    ] o.a.s.c.AbstractZkTestCase put /Users/jenkins/workspace/Lucene-Solr-master-MacOSX/solr/core/src/test-files/solr/collection1/conf/synonyms.txt to /configs/conf1/synonyms.txt
   [junit4]   2> 1054554 INFO  (TEST-TestReqParamsAPI.test-seed#[EA92395D959EC658]) [    ] o.a.s.c.c.SolrZkClient makePath: /configs/conf1/synonyms.txt
   [junit4]   2> 1054900 INFO  (TEST-TestReqParamsAPI.test-seed#[EA92395D959EC658]) [    ] o.a.s.SolrTestCaseJ4 Writing core.properties file to /Users/jenkins/workspace/Lucene-Solr-master-MacOSX/solr/build/solr-core/test/J1/temp/solr.handler.TestReqParamsAPI_EA92395D959EC658-001/control-001/cores/collection1
   [junit4]   2> 1054902 INFO  (TEST-TestReqParamsAPI.test-seed#[EA92395D959EC658]) [    ] o.e.j.s.Server jetty-9.3.8.v20160314
   [junit4]   2> 1054904 INFO  (TEST-TestReqParamsAPI.test-seed#[EA92395D959EC658]) [    ] o.e.j.s.h.ContextHandler Started o.e.j.s.ServletContextHandler@388d83df{/z_us/j,null,AVAILABLE}
   [junit4]   2> 1054905 INFO  (TEST-TestReqParamsAPI.test-seed#[EA92395D959EC658]) [    ] o.e.j.s.ServerConnector Started ServerConnector@3e625b89{HTTP/1.1,[http/1.1]}{127.0.0.1:55703}
   [junit4]   2> 1054905 INFO  (TEST-TestReqParamsAPI.test-seed#[EA92395D959EC658]) [    ] o.e.j.s.Server Started @1060036ms
   [junit4]   2> 1054905 INFO  (TEST-TestReqParamsAPI.test-seed#[EA92395D959EC658]) [    ] o.a.s.c.s.e.JettySolrRunner Jetty properties: {solr.data.dir=/Users/jenkins/workspace/Lucene-Solr-master-MacOSX/solr/build/solr-core/test/J1/temp/solr.handler.TestReqParamsAPI_EA92395D959EC658-001/tempDir-001/control/data, hostContext=/z_us/j, hostPort=55703, coreRootDirectory=/Users/jenkins/workspace/Lucene-Solr-master-MacOSX/solr/build/solr-core/test/J1/../../../../../../../../../Users/jenkins/workspace/Lucene-Solr-master-MacOSX/solr/build/solr-core/test/J1/temp/solr.handler.TestReqParamsAPI_EA92395D959EC658-001/control-001/cores}
   [junit4]   2> 1054905 INFO  (TEST-TestReqParamsAPI.test-seed#[EA92395D959EC658]) [    ] o.a.s.s.SolrDispatchFilter SolrDispatchFilter.init(): sun.misc.Launcher$AppClassLoader@4554617c
   [junit4]   2> 1054905 INFO  (TEST-TestReqParamsAPI.test-seed#[EA92395D959EC658]) [    ] o.a.s.c.SolrResourceLoader new SolrResourceLoader for directory: '/Users/jenkins/workspace/Lucene-Solr-master-MacOSX/solr/build/solr-core/test/J1/temp/solr.handler.TestReqParamsAPI_EA92395D959EC658-001/control-001'
   [junit4]   2> 1054905 INFO  (TEST-TestReqParamsAPI.test-seed#[EA92395D959EC658]) [    ] o.a.s.c.SolrResourceLoader JNDI not configured for solr (NoInitialContextEx)
   [junit4]   2> 1054905 INFO  (TEST-TestReqParamsAPI.test-seed#[EA92395D959EC658]) [    ] o.a.s.c.SolrResourceLoader solr home defaulted to 'solr/' (could not find system property or JNDI)
   [junit4]   2> 1054906 INFO  (TEST-TestReqParamsAPI.test-seed#[EA92395D959EC658]) [    ] o.a.s.c.c.SolrZkClient Using default ZkCredentialsProvider
   [junit4]   2> 1054906 INFO  (TEST-TestReqParamsAPI.test-seed#[EA92395D959EC658]) [    ] o.a.s.c.c.ConnectionManager Waiting for client to connect to ZooKeeper
   [junit4]   2> 1054907 INFO  (zkCallback-1260-thread-1) [    ] o.a.s.c.c.ConnectionManager Watcher org.apache.solr.common.cloud.ConnectionManager@53236a44 name:ZooKeeperConnection Watcher:127.0.0.1:55700/solr got event WatchedEvent state:SyncConnected type:None path:null path:null type:None
   [junit4]   2> 1054907 INFO  (TEST-TestReqParamsAPI.test-seed#[EA92395D959EC658]) [    ] o.a.s.c.c.ConnectionManager Client is connected to ZooKeeper
   [junit4]   2> 1054908 INFO  (TEST-TestReqParamsAPI.test-seed#[EA92395D959EC658]) [    ] o.a.s.c.c.SolrZkClient Using default ZkACLProvider
   [junit4]   2> 1054909 INFO  (TEST-TestReqParamsAPI.test-seed#[EA92395D959EC658]) [    ] o.a.s.s.SolrDispatchFilter Loading solr.xml from SolrHome (not found in ZooKeeper)
   [junit4]   2> 1054909 INFO  (TEST-TestReqParamsAPI.test-seed#[EA92395D959EC658]) [    ] o.a.s.c.SolrXmlConfig Loading container configuration from /Users/jenkins/workspace/Lucene-Solr-master-MacOSX/solr/build/solr-core/test/J1/temp/solr.handler.TestReqParamsAPI_EA92395D959EC658-001/control-001/solr.xml
   [junit4]   2> 1054970 INFO  (TEST-TestReqParamsAPI.test-seed#[EA92395D959EC658]) [    ] o.a.s.c.CorePropertiesLocator Config-defined core root directory: /Users/jenkins/workspace/Lucene-Solr-master-MacOSX/solr/build/solr-core/test/J1/../../../../../../../../../Users/jenkins/workspace/Lucene-Solr-master-MacOSX/solr/build/solr-core/test/J1/temp/solr.handler.TestReqParamsAPI_EA92395D959EC658-001/control-001/cores
   [junit4]   2> 1054971 INFO  (TEST-TestReqParamsAPI.test-seed#[EA92395D959EC658]) [    ] o.a.s.c.CoreContainer New CoreContainer 140567516
   [junit4]   2> 1054971 INFO  (TEST-TestReqParamsAPI.test-seed#[EA92395D959EC658]) [    ] o.a.s.c.CoreContainer Loading cores into CoreContainer [instanceDir=/Users/jenkins/workspace/Lucene-Solr-master-MacOSX/solr/build/solr-core/test/J1/temp/solr.handler.TestReqParamsAPI_EA92395D959EC658-001/control-001]
   [junit4]   2> 1054971 WARN  (TEST-TestReqParamsAPI.test-seed#[EA92395D959EC658]) [    ] o.a.s.c.CoreContainer Couldn't add files from /Users/jenkins/workspace/Lucene-Solr-master-MacOSX/solr/build/solr-core/test/J1/temp/solr.handler.TestReqParamsAPI_EA92395D959EC658-001/control-001/lib to classpath: /Users/jenkins/workspace/Lucene-Solr-master-MacOSX/solr/build/solr-core/test/J1/temp/solr.handler.TestReqParamsAPI_EA92395D959EC658-001/control-001/lib
   [junit4]   2> 1054971 INFO  (TEST-TestReqParamsAPI.test-seed#[EA92395D959EC658]) [    ] o.a.s.h.c.HttpShardHandlerFactory created with socketTimeout : 90000,urlScheme : ,connTimeout : 15000,maxConnectionsPerHost : 20,maxConnections : 10000,corePoolSize : 0,maximumPoolSize : 2147483647,maxThreadIdleTime : 5,sizeOfQueue : -1,fairnessPolicy : false,useRetries : false,
   [junit4]   2> 1054975 INFO  (TEST-TestReqParamsAPI.test-seed#[EA92395D959EC658]) [    ] o.a.s.u.UpdateShardHandler Creating UpdateShardHandler HTTP client with params: socketTimeout=340000&connTimeout=45000&retry=true
   [junit4]   2> 1054975 INFO  (TEST-TestReqParamsAPI.test-seed#[EA92395D959EC658]) [    ] o.a.s.l.LogWatcher SLF4J impl is org.slf4j.impl.Log4jLoggerFactory
   [junit4]   2> 1054975 INFO  (TEST-TestReqParamsAPI.test-seed#[EA92395D959EC658]) [    ] o.a.s.l.LogWatcher Registering Log Listener [Log4j (org.slf4j.impl.Log4jLoggerFactory)]
   [junit4]   2> 1054975 INFO  (TEST-TestReqParamsAPI.test-seed#[EA92395D959EC658]) [    ] o.a.s.c.ZkContainer Zookeeper client=127.0.0.1:55700/solr
   [junit4]   2> 1054975 INFO  (TEST-TestReqParamsAPI.test-seed#[EA92395D959EC658]) [    ] o.a.s.c.ZkController zkHost includes chroot
   [junit4]   2> 1054975 INFO  (TEST-TestReqParamsAPI.test-seed#[EA92395D959EC658]) [    ] o.a.s.c.c.SolrZkClient Using default ZkCredentialsProvider
   [junit4]   2> 1054976 INFO  (TEST-TestReqParamsAPI.test-seed#[EA92395D959EC658]) [    ] o.a.s.c.c.ConnectionManager Waiting for client to connect to ZooKeeper
   [junit4]   2> 1054977 INFO  (zkCallback-1263-thread-1) [    ] o.a.s.c.c.ConnectionManager Watcher org.apache.solr.common.cloud.ConnectionManager@70bc4627 name:ZooKeeperConnection Watcher:127.0.0.1:55700 got event WatchedEvent state:SyncConnected type:None path:null path:null type:None
   [junit4]   2> 1054977 INFO  (TEST-TestReqParamsAPI.test-seed#[EA92395D959EC658]) [    ] o.a.s.c.c.ConnectionManager Client is connected to ZooKeeper
   [junit4]   2> 1054978 INFO  (TEST-TestReqParamsAPI.test-seed#[EA92395D959EC658]) [    ] o.a.s.c.c.SolrZkClient Using default ZkACLProvider
   [junit4]   2> 1054980 INFO  (TEST-TestReqParamsAPI.test-seed#[EA92395D959EC658]) [n:127.0.0.1:55703_z_us%2Fj    ] o.a.s.c.c.ConnectionManager Waiting for client to connect to ZooKeeper
   [junit4]   2> 1054981 INFO  (zkCallback-1264-thread-1-processing-n:127.0.0.1:55703_z_us%2Fj) [n:127.0.0.1:55703_z_us%2Fj    ] o.a.s.c.c.ConnectionManager Watcher org.apache.solr.common.cloud.ConnectionManager@7ca0f85d name:ZooKeeperConnection Watcher:127.0.0.1:55700/solr got event WatchedEvent state:SyncConnected type:None path:null path:null type:None
   [junit4]   2> 1054981 INFO  (TEST-TestReqParamsAPI.test-seed#[EA92395D959EC658]) [n:127.0.0.1:55703_z_us%2Fj    ] o.a.s.c.c.ConnectionManager Client is connected to ZooKeeper
   [junit4]   2> 1054982 INFO  (TEST-TestReqParamsAPI.test-seed#[EA92395D959EC658]) [n:127.0.0.1:55703_z_us%2Fj    ] o.a.s.c.c.SolrZkClient makePath: /overseer/queue
   [junit4]   2> 1054985 INFO  (TEST-TestReqParamsAPI.test-seed#[EA92395D959EC658]) [n:127.0.0.1:55703_z_us%2Fj    ] o.a.s.c.c.SolrZkClient makePath: /overseer/collection-queue-work
   [junit4]   2> 1054990 INFO  (TEST-TestReqParamsAPI.test-seed#[EA92395D959EC658]) [n:127.0.0.1:55703_z_us%2Fj    ] o.a.s.c.c.SolrZkClient makePath: /overseer/collection-map-running
   [junit4]   2> 1054992 INFO  (TEST-TestReqParamsAPI.test-seed#[EA92395D959EC658]) [n:127.0.0.1:55703_z_us%2Fj    ] o.a.s.c.c.SolrZkClient makePath: /overseer/collection-map-completed
   [junit4]   2> 1054995 INFO  (TEST-TestReqParamsAPI.test-seed#[EA92395D959EC658]) [n:127.0.0.1:55703_z_us%2Fj    ] o.a.s.c.c.SolrZkClient makePath: /overseer/collection-map-failure
   [junit4]   2> 1054998 INFO  (TEST-TestReqParamsAPI.test-seed#[EA92395D959EC658]) [n:127.0.0.1:55703_z_us%2Fj    ] o.a.s.c.c.SolrZkClient makePath: /live_nodes
   [junit4]   2> 1055001 INFO  (TEST-TestReqParamsAPI.test-seed#[EA92395D959EC658]) [n:127.0.0.1:55703_z_us%2Fj    ] o.a.s.c.c.SolrZkClient makePath: /aliases.json
   [junit4]   2> 1055003 INFO  (TEST-TestReqParamsAPI.test-seed#[EA92395D959EC658]) [n:127.0.0.1:55703_z_us%2Fj    ] o.a.s.c.c.SolrZkClient makePath: /clusterstate.json
   [junit4]   2> 1055005 INFO  (TEST-TestReqParamsAPI.test-seed#[EA92395D959EC658]) [n:127.0.0.1:55703_z_us%2Fj    ] o.a.s.c.c.SolrZkClient makePath: /security.json
   [junit4]   2> 1055006 INFO  (TEST-TestReqParamsAPI.test-seed#[EA92395D959EC658]) [n:127.0.0.1:55703_z_us%2Fj    ] o.a.s.c.c.ZkStateReader Updating cluster state from ZooKeeper... 
   [junit4]   2> 1055008 INFO  (TEST-TestReqParamsAPI.test-seed#[EA92395D959EC658]) [n:127.0.0.1:55703_z_us%2Fj    ] o.a.s.c.c.ZkStateReader Updated live nodes from ZooKeeper... (0) -> (0)
   [junit4]   2> 1055011 INFO  (TEST-TestReqParamsAPI.test-seed#[EA92395D959EC658]) [n:127.0.0.1:55703_z_us%2Fj    ] o.a.s.c.c.SolrZkClient makePath: /overseer_elect
   [junit4]   2> 1055013 INFO  (TEST-TestReqParamsAPI.test-seed#[EA92395D959EC658]) [n:127.0.0.1:55703_z_us%2Fj    ] o.a.s.c.c.SolrZkClient makePath: /overseer_elect/election
   [junit4]   2> 1055015 INFO  (TEST-TestReqParamsAPI.test-seed#[EA92395D959EC658]) [n:127.0.0.1:55703_z_us%2Fj    ] o.a.s.c.Overseer Overseer (id=null) closing
   [junit4]   2> 1055016 INFO  (TEST-TestReqParamsAPI.test-seed#[EA92395D959EC658]) [n:127.0.0.1:55703_z_us%2Fj    ] o.a.s.c.LeaderElector Joined leadership election with path: /overseer_elect/election/95648261315624964-127.0.0.1:55703_z_us%2Fj-n_0000000000
   [junit4]   2> 1055016 INFO  (TEST-TestReqParamsAPI.test-seed#[EA92395D959EC658]) [n:127.0.0.1:55703_z_us%2Fj    ] o.a.s.c.OverseerElectionContext I am going to be the leader 127.0.0.1:55703_z_us%2Fj
   [junit4]   2> 1055016 INFO  (TEST-TestReqParamsAPI.test-seed#[EA92395D959EC658]) [n:127.0.0.1:55703_z_us%2Fj    ] o.a.s.c.c.SolrZkClient makePath: /overseer_elect/leader
   [junit4]   2> 1055018 INFO  (TEST-TestReqParamsAPI.test-seed#[EA92395D959EC658]) [n:127.0.0.1:55703_z_us%2Fj    ] o.a.s.c.Overseer Overseer (id=95648261315624964-127.0.0.1:55703_z_us%2Fj-n_0000000000) starting
   [junit4]   2> 1055021 INFO  (TEST-TestReqParamsAPI.test-seed#[EA92395D959EC658]) [n:127.0.0.1:55703_z_us%2Fj    ] o.a.s.c.c.SolrZkClient makePath: /overseer/queue-work
   [junit4]   2> 1055031 INFO  (TEST-TestReqParamsAPI.test-seed#[EA92395D959EC658]) [n:127.0.0.1:55703_z_us%2Fj    ] o.a.s.c.OverseerAutoReplicaFailoverThread Starting OverseerAutoReplicaFailoverThread autoReplicaFailoverWorkLoopDelay=10000 autoReplicaFailoverWaitAfterExpiration=30000 autoReplicaFailoverBadNodeExpiration=60000
   [junit4]   2> 1055031 INFO  (OverseerCollectionConfigSetProcessor-95648261315624964-127.0.0.1:55703_z_us%2Fj-n_0000000000) [n:127.0.0.1:55703_z_us%2Fj    ] o.a.s.c.OverseerTaskProcessor Process current queue of overseer operations
   [junit4]   2> 1055032 INFO  (OverseerStateUpdate-95648261315624964-127.0.0.1:55703_z_us%2Fj-n_0000000000) [n:127.0.0.1:55703_z_us%2Fj    ] o.a.s.c.Overseer Starting to work on the main queue
   [junit4]   2> 1055033 INFO  (TEST-TestReqParamsAPI.test-seed#[EA92395D959EC658]) [n:127.0.0.1:55703_z_us%2Fj    ] o.a.s.c.ZkController Register node as live in ZooKeeper:/live_nodes/127.0.0.1:55703_z_us%2Fj
   [junit4]   2> 1055034 INFO  (TEST-TestReqParamsAPI.test-seed#[EA92395D959EC658]) [n:127.0.0.1:55703_z_us%2Fj    ] o.a.s.c.c.SolrZkClient makePath: /live_nodes/127.0.0.1:55703_z_us%2Fj
   [junit4]   2> 1055035 INFO  (OverseerStateUpdate-95648261315624964-127.0.0.1:55703_z_us%2Fj-n_0000000000) [n:127.0.0.1:55703_z_us%2Fj    ] o.a.s.c.c.ZkStateReader Updated live nodes from ZooKeeper... (0) -> (0)
   [junit4]   2> 1055036 INFO  (zkCallback-1264-thread-1-processing-n:127.0.0.1:55703_z_us%2Fj) [n:127.0.0.1:55703_z_us%2Fj    ] o.a.s.c.c.ZkStateReader A live node change: [WatchedEvent state:SyncConnected type:NodeChildrenChanged path:/live_nodes], has occurred - updating... (live nodes size: [0])
   [junit4]   2> 1055037 INFO  (zkCallback-1264-thread-1-processing-n:127.0.0.1:55703_z_us%2Fj) [n:127.0.0.1:55703_z_us%2Fj    ] o.a.s.c.c.ZkStateReader Updated live nodes from ZooKeeper... (0) -> (1)
   [junit4]   2> 1055052 INFO  (TEST-TestReqParamsAPI.test-seed#[EA92395D959EC658]) [n:127.0.0.1:55703_z_us%2Fj    ] o.a.s.c.CoreContainer Security conf doesn't exist. Skipping setup for authorization module.
   [junit4]   2> 1055052 INFO  (TEST-TestReqParamsAPI.test-seed#[EA92395D959EC658]) [n:127.0.0.1:55703_z_us%2Fj    ] o.a.s.c.CoreContainer No authentication plugin used.
   [junit4]   2> 1055053 INFO  (TEST-TestReqParamsAPI.test-seed#[EA92395D959EC658]) [n:127.0.0.1:55703_z_us%2Fj    ] o.a.s.c.CorePropertiesLocator Looking for core definitions underneath /Users/jenkins/workspace/Lucene-Solr-master-MacOSX/solr/build/solr-core/test/J1/../../../../../../../../../Users/jenkins/workspace/Lucene-Solr-master-MacOSX/solr/build/solr-core/test/J1/temp/solr.handler.TestReqParamsAPI_EA92395D959EC658-001/control-001/cores
   [junit4]   2> 1055055 INFO  (TEST-TestReqParamsAPI.test-seed#[EA92395D959EC658]) [n:127.0.0.1:55703_z_us%2Fj    ] o.a.s.c.CoreDescriptor Created CoreDescriptor: {name=collection1, config=solrconfig.xml, transient=false, schema=schema.xml, loadOnStartup=true, configSetProperties=configsetprops.json, collection=control_collection, coreNodeName=, dataDir=data/, shard=}
   [junit4]   2> 1055055 INFO  (TEST-TestReqParamsAPI.test-seed#[EA92395D959EC658]) [n:127.0.0.1:55703_z_us%2Fj    ] o.a.s.c.CorePropertiesLocator Found core collection1 in /Users/jenkins/workspace/Lucene-Solr-master-MacOSX/solr/build/solr-core/test/J1/../../../../../../../../../Users/jenkins/workspace/Lucene-Solr-master-MacOSX/solr/build/solr-core/test/J1/temp/solr.handler.TestReqParamsAPI_EA92395D959EC658-001/control-001/cores/collection1
   [junit4]   2> 1055055 INFO  (TEST-TestReqParamsAPI.test-seed#[EA92395D959EC658]) [n:127.0.0.1:55703_z_us%2Fj    ] o.a.s.c.CorePropertiesLocator Found 1 core definitions
   [junit4]   2> 1055057 INFO  (coreLoadExecutor-3998-thread-1-processing-n:127.0.0.1:55703_z_us%2Fj) [n:127.0.0.1:55703_z_us%2Fj c:control_collection   x:collection1] o.a.s.c.ZkController publishing state=down
   [junit4]   2> 1055057 INFO  (coreLoadExecutor-3998-thread-1-processing-n:127.0.0.1:55703_z_us%2Fj) [n:127.0.0.1:55703_z_us%2Fj c:control_collection   x:collection1] o.a.s.c.ZkController numShards not found on descriptor - reading it from system property
   [junit4]   2> 1055057 INFO  (TEST-TestReqParamsAPI.test-seed#[EA92395D959EC658]) [n:127.0.0.1:55703_z_us%2Fj    ] o.a.s.s.SolrDispatchFilter user.dir=/Users/jenkins/workspace/Lucene-Solr-master-MacOSX/solr/build/solr-core/test/J1
   [junit4]   2> 1055057 INFO  (TEST-TestReqParamsAPI.test-seed#[EA92395D959EC658]) [n:127.0.0.1:55703_z_us%2Fj    ] o.a.s.s.SolrDispatchFilter SolrDispatchFilter.init() done
   [junit4]   2> 1055059 INFO  (OverseerStateUpdate-95648261315624964-127.0.0.1:55703_z_us%2Fj-n_0000000000) [n:127.0.0.1:55703_z_us%2Fj    ] o.a.s.c.Overseer processMessage: queueSize: 1, message = {
   [junit4]   2>   "core":"collection1",
   [junit4]   2>   "roles":null,
   [junit4]   2>   "base_url":"http://127.0.0.1:55703/z_us/j",
   [junit4]   2>   "node_name":"127.0.0.1:55703_z_us%2Fj",
   [junit4]   2>   "numShards":"1",
   [junit4]   2>   "state":"down",
   [junit4]   2>   "shard":null,
   [junit4]   2>   "collection":"control_collection",
   [junit4]   2>   "operation":"state"} current state version: 0
   [junit4]   2> 1055060 INFO  (coreLoadExecutor-3998-thread-1-processing-n:127.0.0.1:55703_z_us%2Fj) [n:127.0.0.1:55703_z_us%2Fj c:control_collection   x:collection1] o.a.s.c.ZkController look for our core node name
   [junit4]   2> 1055060 INFO  (OverseerStateUpdate-95648261315624964-127.0.0.1:55703_z_us%2Fj-n_0000000000) [n:127.0.0.1:55703_z_us%2Fj    ] o.a.s.c.o.ReplicaMutator Update state numShards=1 message={
   [junit4]   2>   "core":"collection1",
   [junit4]   2>   "roles":null,
   [junit4]   2>   "base_url":"http://127.0.0.1:55703/z_us/j",
   [junit4]   2>   "node_name":"127.0.0.1:55703_z_us%2Fj",
   [junit4]   2>   "numShards":"1",
   [junit4]   2>   "state":"down",
   [junit4]   2>   "shard":null,
   [junit4]   2>   "collection":"control_collection",
   [junit4]   2>   "operation":"state"}
   [junit4]   2> 1055060 INFO  (OverseerStateUpdate-95648261315624964-127.0.0.1:55703_z_us%2Fj-n_0000000000) [n:127.0.0.1:55703_z_us%2Fj    ] o.a.s.c.o.ClusterStateMutator building a new cName: control_collection
   [junit4]   2> 1055061 INFO  (OverseerStateUpdate-95648261315624964-127.0.0.1:55703_z_us%2Fj-n_0000000000) [n:127.0.0.1:55703_z_us%2Fj    ] o.a.s.c.o.ReplicaMutator Assigning new node to shard shard=shard1
   [junit4]   2> 1055063 INFO  (zkCallback-1264-thread-1-processing-n:127.0.0.1:55703_z_us%2Fj) [n:127.0.0.1:55703_z_us%2Fj    ] o.a.s.c.c.ZkStateReader A cluster state change: [WatchedEvent state:SyncConnected type:NodeDataChanged path:/clusterstate.json], has occurred - updating... (live nodes size: [1])
   [junit4]   2> 1056061 INFO  (coreLoadExecutor-3998-thread-1-processing-n:127.0.0.1:55703_z_us%2Fj) [n:127.0.0.1:55703_z_us%2Fj c:control_collection   x:collection1] o.a.s.c.ZkController waiting to find shard id in clusterstate for collection1
   [junit4]   2> 1056061 INFO  (coreLoadExecutor-3998-thread-1-processing-n:127.0.0.1:55703_z_us%2Fj) [n:127.0.0.1:55703_z_us%2Fj c:control_collection   x:collection1] o.a.s.c.ZkController Check for collection zkNode:control_collection
   [junit4]   2> 1056062 INFO  (coreLoadExecutor-3998-thread-1-processing-n:127.0.0.1:55703_z_us%2Fj) [n:127.0.0.1:55703_z_us%2Fj c:control_collection   x:collection1] o.a.s.c.ZkController Collection zkNode exists
   [junit4]   2> 1056062 INFO  (coreLoadExecutor-3998-thread-1-processing-n:127.0.0.1:55703_z_us%2Fj) [n:127.0.0.1:55703_z_us%2Fj c:control_collection   x:collection1] o.a.s.c.c.ZkStateReader Load collection config from: [/collections/control_collection]
   [junit4]   2> 1056063 INFO  (coreLoadExecutor-3998-thread-1-processing-n:127.0.0.1:55703_z_us%2Fj) [n:127.0.0.1:55703_z_us%2Fj c:control_collection   x:collection1] o.a.s.c.c.ZkStateReader path=[/collections/control_collection] [configName]=[conf1] specified config exists in ZooKeeper
   [junit4]   2> 1056063 INFO  (coreLoadExecutor-3998-thread-1-processing-n:127.0.0.1:55703_z_us%2Fj) [n:127.0.0.1:55703_z_us%2Fj c:control_collection   x:collection1] o.a.s.c.SolrResourceLoader new SolrResourceLoader for directory: '/Users/jenkins/workspace/Lucene-Solr-master-MacOSX/solr/build/solr-core/test/J1/temp/solr.handler.TestReqParamsAPI_EA92395D959EC658-001/control-001/cores/collection1'
   [junit4]   2> 1056063 INFO  (coreLoadExecutor-3998-thread-1-processing-n:127.0.0.1:55703_z_us%2Fj) [n:127.0.0.1:55703_z_us%2Fj c:control_collection   x:collection1] o.a.s.c.SolrResourceLoader JNDI not configured for solr (NoInitialContextEx)
   [junit4]   2> 1056063 INFO  (coreLoadExecutor-3998-thread-1-processing-n:127.0.0.1:55703_z_us%2Fj) [n:127.0.0.1:55703_z_us%2Fj c:control_collection   x:collection1] o.a.s.c.SolrResourceLoader solr home defaulted to 'solr/' (could not find system property or JNDI)
   [junit4]   2> 1056065 INFO  (coreLoadExecutor-3998-thread-1-processing-n:127.0.0.1:55703_z_us%2Fj) [n:127.0.0.1:55703_z_us%2Fj c:control_collection   x:collection1] o.a.s.c.Config loaded config solrconfig.xml with version 0 
   [junit4]   2> 1056071 INFO  (coreLoadExecutor-3998-thread-1-processing-n:127.0.0.1:55703_z_us%2Fj) [n:127.0.0.1:55703_z_us%2Fj c:control_collection   x:collection1] o.a.s.c.SolrConfig current version of requestparams : -1
   [junit4]   2> 1056074 INFO  (coreLoadExecutor-3998-thread-1-processing-n:127.0.0.1:55703_z_us%2Fj) [n:127.0.0.1:55703_z_us%2Fj c:control_collection   x:collection1] o.a.s.c.SolrConfig Using Lucene MatchVersion: 7.0.0
   [junit4]   2> 1056080 INFO  (coreLoadExecutor-3998-thread-1-processing-n:127.0.0.1:55703_z_us%2Fj) [n:127.0.0.1:55703_z_us%2Fj c:control_collection   x:collection1] o.a.s.c.SolrConfig Loaded SolrConfig: solrconfig.xml
   [junit4]   2> 1056084 INFO  (coreLoadExecutor-3998-thread-1-processing-n:127.0.0.1:55703_z_us%2Fj) [n:127.0.0.1:55703_z_us%2Fj c:control_collection   x:collection1] o.a.s.s.IndexSchema [collection1] Schema name=test
   [junit4]   2> 1056164 INFO  (coreLoadExecutor-3998-thread-1-processing-n:127.0.0.1:55703_z_us%2Fj) [n:127.0.0.1:55703_z_us%2Fj c:control_collection   x:collection1] o.a.s.s.OpenExchangeRatesOrgProvider Initialized with rates=open-exchange-rates.json, refreshInterval=1440.
   [junit4]   2> 1056172 INFO  (coreLoadExecutor-3998-thread-1-processing-n:127.0.0.1:55703_z_us%2Fj) [n:127.0.0.1:55703_z_us%2Fj c:control_collection   x:collection1] o.a.s.s.IndexSchema default search field in schema is text
   [junit4]   2> 1056173 INFO  (coreLoadExecutor-3998-thread-1-processing-n:127.0.0.1:55703_z_us%2Fj) [n:127.0.0.1:55703_z_us%2Fj c:control_collection   x:collection1] o.a.s.s.IndexSchema unique key field: id
   [junit4]   2> 1056185 INFO  (coreLoadExecutor-3998-thread-1-processing-n:127.0.0.1:55703_z_us%2Fj) [n:127.0.0.1:55703_z_us%2Fj c:control_collection   x:collection1] o.a.s.s.FileExchangeRateProvider Reloading exchange rates from file currency.xml
   [junit4]   2> 1056188 INFO  (coreLoadExecutor-3998-thread-1-processing-n:127.0.0.1:55703_z_us%2Fj) [n:127.0.0.1:55703_z_us%2Fj c:control_collection   x:collection1] o.a.s.s.FileExchangeRateProvider Reloading exchange rates from file currency.xml
   [junit4]   2> 1056190 INFO  (coreLoadExecutor-3998-thread-1-processing-n:127.0.0.1:55703_z_us%2Fj) [n:127.0.0.1:55703_z_us%2Fj c:control_collection   x:collection1] o.a.s.s.OpenExchangeRatesOrgProvider Reloading exchange rates from open-exchange-rates.json
   [junit4]   2> 1056191 INFO  (coreLoadExecutor-3998-thread-1-processing-n:127.0.0.1:55703_z_us%2Fj) [n:127.0.0.1:55703_z_us%2Fj c:control_collection   x:collection1] o.a.s.s.OpenExchangeRatesOrgProvider Reloading exchange rates from open-exchange-rates.json
   [junit4]   2> 1056194 INFO  (coreLoadExecutor-3998-thread-1-processing-n:127.0.0.1:55703_z_us%2Fj) [n:127.0.0.1:55703_z_us%2Fj c:control_collection   x:collection1] o.a.s.c.ConfigSetProperties Did not find ConfigSet properties, assuming default properties: Can't find resource 'configsetprops.json' in classpath or '/configs/conf1', cwd=/Users/jenkins/workspace/Lucene-Solr-master-MacOSX/solr/build/solr-core/test/J1
   [junit4]   2> 1056194 INFO  (coreLoadExecutor-3998-thread-1-processing-n:127.0.0.1:55703_z_us%2Fj) [n:127.0.0.1:55703_z_us%2Fj c:control_collection   x:collection1] o.a.s.c.CoreContainer Creating SolrCore 'collection1' using configuration from collection control_collection
   [junit4]   2> 1056194 INFO  (coreLoadExecutor-3998-thread-1-processing-n:127.0.0.1:55703_z_us%2Fj) [n:127.0.0.1:55703_z_us%2Fj c:control_collection s:shard1 r:core_node1 x:collection1] o.a.s.c.SolrCore org.apache.solr.core.MockDirectoryFactory
   [junit4]   2> 1056194 INFO  (coreLoadExecutor-3998-thread-1-processing-n:127.0.0.1:55703_z_us%2Fj) [n:127.0.0.1:55703_z_us%2Fj c:control_collection s:shard1 r:core_node1 x:collection1] o.a.s.c.SolrCore [[collection1] ] Opening new SolrCore at [/Users/jenkins/workspace/Lucene-Solr-master-MacOSX/solr/build/solr-core/test/J1/temp/solr.handler.TestReqParamsAPI_EA92395D959EC658-001/control-001/cores/collection1], dataDir=[/Users/jenkins/workspace/Lucene-Solr-master-MacOSX/solr/build/solr-core/test/J1/../../../../../../../../../Users/jenkins/workspace/Lucene-Solr-master-MacOSX/solr/build/solr-core/test/J1/temp/solr.handler.TestReqParamsAPI_EA92395D959EC658-001/control-001/cores/collection1/data/]
   [junit4]   2> 1056194 INFO  (coreLoadExecutor-3998-thread-1-processing-n:127.0.0.1:55703_z_us%2Fj) [n:127.0.0.1:55703_z_us%2Fj c:control_collection s:shard1 r:core_node1 x:collection1] o.a.s.c.JmxMonitoredMap JMX monitoring is enabled. Adding Solr mbeans to JMX Server: com.sun.jmx.mbeanserver.JmxMBeanServer@7b85be07
   [junit4]   2> 1056195 INFO  (coreLoadExecutor-3998-thread-1-processing-n:127.0.0.1:55703_z_us%2Fj) [n:127.0.0.1:55703_z_us%2Fj c:control_collection s:shard1 r:core_node1 x:collection1] o.a.s.c.CachingDirectoryFactory return new directory for /Users/jenkins/workspace/Lucene-Solr-master-MacOSX/solr/build/solr-core/test/J1/../../../../../../../../../Users/jenkins/workspace/Lucene-Solr-master-MacOSX/solr/build/solr-core/test/J1/temp/solr.handler.TestReqParamsAPI_EA92395D959EC658-001/control-001/cores/collection1/data
   [junit4]   2> 1056195 INFO  (coreLoadExecutor-3998-thread-1-processing-n:127.0.0.1:55703_z_us%2Fj) [n:127.0.0.1:55703_z_us%2Fj c:control_collection s:shard1 r:core_node1 x:collection1] o.a.s.c.SolrCore New index directory detected: old=null new=/Users/jenkins/workspace/Lucene-Solr-master-MacOSX/solr/build/solr-core/test/J1/../../../../../../../../../Users/jenkins/workspace/Lucene-Solr-master-MacOSX/solr/build/solr-core/test/J1/temp/solr.handler.TestReqParamsAPI_EA92395D959EC658-001/control-001/cores/collection1/data/index/
   [junit4]   2> 1056195 WARN  (coreLoadExecutor-3998-thread-1-processing-n:127.0.0.1:55703_z_us%2Fj) [n:127.0.0.1:55703_z_us%2Fj c:control_collection s:shard1 r:core_node1 x:collection1] o.a.s.c.SolrCore [collection1] Solr index directory '/Users/jenkins/workspace/Lucene-Solr-master-MacOSX/solr/build/solr-core/test/J1/../../../../../../../../../Users/jenkins/workspace/Lucene-Solr-master-MacOSX/solr/build/solr-core/test/J1/temp/solr.handler.TestReqParamsAPI_EA92395D959EC658-001/control-001/cores/collection1/data/index' doesn't exist. Creating new index...
   [junit4]   2> 1056195 INFO  (coreLoadExecutor-3998-thread-1-processing-n:127.0.0.1:55703_z_us%2Fj) [n:127.0.0.1:55703_z_us%2Fj c:control_collection s:shard1 r:core_node1 x:collection1] o.a.s.c.CachingDirectoryFactory return new directory for /Users/jenkins/workspace/Lucene-Solr-master-MacOSX/solr/build/solr-core/test/J1/../../../../../../../../../Users/jenkins/workspace/Lucene-Solr-master-MacOSX/solr/build/solr-core/test/J1/temp/solr.handler.TestReqParamsAPI_EA92395D959EC658-001/control-001/cores/collection1/data/index
   [junit4]   2> 1056196 INFO  (coreLoadExecutor-3998-thread-1-processing-n:127.0.0.1:55703_z_us%2Fj) [n:127.0.0.1:55703_z_us%2Fj c:control_collection s:shard1 r:core_node1 x:collection1] o.a.s.u.RandomMergePolicy RandomMergePolicy wrapping class org.apache.lucene.index.LogByteSizeMergePolicy: [LogByteSizeMergePolicy: minMergeSize=1677721, mergeFactor=45, maxMergeSize=2147483648, maxMergeSizeForForcedMerge=9223372036854775807, calibrateSizeByDeletes=true, maxMergeDocs=2147483647, maxCFSSegmentSizeMB=8.796093022207999E12, noCFSRatio=1.0]
   [junit4]   2> 1056196 INFO  (coreLoadExecutor-3998-thread-1-processing-n:127.0.0.1:55703_z_us%2Fj) [n:127.0.0.1:55703_z_us%2Fj c:control_collection s:shard1 r:core_node1 x:collection1] o.a.s.c.SolrDeletionPolicy SolrDeletionPolicy.onCommit: commits: num=1
   [junit4]   2> 	commit{dir=MockDirectoryWrapper(RAMDirectory@3a71b2b0 lockFactory=org.apache.lucene.store.SingleInstanceLockFactory@31f6c154),segFN=segments_1,generation=1}
   [junit4]   2> 1056196 INFO  (coreLoadExecutor-3998-thread-1-processing-n:127.0.0.1:55703_z_us%2Fj) [n:127.0.0.1:55703_z_us%2Fj c:control_collection s:shard1 r:core_node1 x:collection1] o.a.s.c.SolrDeletionPolicy newest commit generation = 1
   [junit4]   2> 1056197 INFO  (OldIndexDirectoryCleanupThreadForCore-collection1) [n:127.0.0.1:55703_z_us%2Fj c:control_collection s:shard1 r:core_node1 x:collection1] o.a.s.c.SolrCore Looking for old index directories to cleanup for core collection1 in /Users/jenkins/workspace/Lucene-Solr-master-MacOSX/solr/build/solr-core/test/J1/../../../../../../../../../Users/jenkins/workspace/Lucene-Solr-master-MacOSX/solr/build/solr-core/test/J1/temp/solr.handler.TestReqParamsAPI_EA92395D959EC658-001/control-001/cores/collection1/data/
   [junit4]   2> 1056197 WARN  (OldIndexDirectoryCleanupThreadForCore-collection1) [n:127.0.0.1:55703_z_us%2Fj c:control_collection s:shard1 r:core_node1 x:collection1] o.a.s.c.DirectoryFactory /Users/jenkins/workspace/Lucene-Solr-master-MacOSX/solr/build/solr-core/test/J1/../../../../../../../../../Users/jenkins/workspace/Lucene-Solr-master-MacOSX/solr/build/solr-core/test/J1/temp/solr.handler.TestReqParamsAPI_EA92395D959EC658-001/control-001/cores/collection1/data/ does not point to a valid data directory; skipping clean-up of old index directories.
   [junit4]   2> 1056199 INFO  (coreLoadExecutor-3998-thread-1-processing-n:127.0.0.1:55703_z_us%2Fj) [n:127.0.0.1:55703_z_us%2Fj c:control_collection s:shard1 r:core_node1 x:collection1] o.a.s.u.p.UpdateRequestProcessorChain creating updateRequestProcessorChain "nodistrib"
   [junit4]   2> 1056200 INFO  (coreLoadExecutor-3998-thread-1-processing-n:127.0.0.1:55703_z_us%2Fj) [n:127.0.0.1:55703_z_us%2Fj c:control_collection s:shard1 r:core_node1 x:collection1] o.a.s.u.p.UpdateRequestProcessorChain creating updateRequestProcessorChain "dedupe"
   [junit4]   2> 1056200 INFO  (coreLoadExecutor-3998-thread-1-processing-n:127.0.0.1:55703_z_us%2Fj) [n:127.0.0.1:55703_z_us%2Fj c:control_collection s:shard1 r:core_node1 x:collection1] o.a.s.u.p.UpdateRequestProcessorChain inserting DistributedUpdateProcessorFactory into updateRequestProcessorChain "dedupe"
   [junit4]   2> 1056200 INFO  (coreLoadExecutor-3998-thread-1-processing-n:127.0.0.1:55703_z_us%2Fj) [n:127.0.0.1:55703_z_us%2Fj c:control_collection s:shard1 r:core_node1 x:collection1] o.a.s.u.p.UpdateRequestProcessorChain creating updateRequestProcessorChain "stored_sig"
   [junit4]   2> 1056200 INFO  (coreLoadExecutor-3998-thread-1-processing-n:127.0.0.1:55703_z_us%2Fj) [n:127.0.0.1:55703_z_us%2Fj c:control_collection s:shard1 r:core_node1 x:collection1] o.a.s.u.p.UpdateRequestProcessorChain inserting DistributedUpdateProcessorFactory into updateRequestProcessorChain "stored_sig"
   [junit4]   2> 1056200 INFO  (coreLoadExecutor-3998-thread-1-processing-n:127.0.0.1:55703_z_us%2Fj) [n:127.0.0.1:55703_z_us%2Fj c:control_collection s:shard1 r:core_node1 x:collection1] o.a.s.u.p.UpdateRequestProcessorChain creating updateRequestProcessorChain "distrib-dup-test-chain-explicit"
   [junit4]   2> 1056200 INFO  (coreLoadExecutor-3998-thread-1-processing-n:127.0.0.1:55703_z_us%2Fj) [n:127.0.0.1:55703_z_us%2Fj c:control_collection s:shard1 r:core_node1 x:collection1] o.a.s.u.p.UpdateRequestProcessorChain creating updateRequestProcessorChain "distrib-dup-test-chain-implicit"
   [junit4]   2> 1056200 INFO  (coreLoadExecutor-3998-thread-1-processing-n:127.0.0.1:55703_z_us%2Fj) [n:127.0.0.1:55703_z_us%2Fj c:control_collection s:shard1 r:core_node1 x:collection1] o.a.s.u.p.UpdateRequestProcessorChain inserting DistributedUpdateProcessorFactory into updateRequestProcessorChain "distrib-dup-test-chain-implicit"
   [junit4]   2> 1056200 INFO  (coreLoadExecutor-3998-thread-1-processing-n:127.0.0.1:55703_z_us%2Fj) [n:127.0.0.1:55703_z_us%2Fj c:control_collection s:shard1 r:core_node1 x:collection1] o.a.s.c.SolrCore no updateRequestProcessorChain defined as default, creating implicit default
   [junit4]   2> 1056200 WARN  (coreLoadExecutor-3998-thread-1-processing-n:127.0.0.1:55703_z_us%2Fj) [n:127.0.0.1:55703_z_us%2Fj c:control_collection s:shard1 r:core_node1 x:collection1] o.a.s.c.RequestHandlers INVALID paramSet a in requestHandler {type = requestHandler,name = /dump,class = DumpRequestHandler,args = {defaults={a=A,b=B}}}
   [junit4]   2> 1056204 INFO  (coreLoadExecutor-3998-thread-1-processing-n:127.0.0.1:55703_z_us%2Fj) [n:127.0.0.1:55703_z_us%2Fj c:control_collection s:shard1 r:core_node1 x:collection1] o.a.s.h.l.XMLLoader xsltCacheLifetimeSeconds=60
   [junit4]   2> 1056205 INFO  (coreLoadExecutor-3998-thread-1-processing-n:127.0.0.1:55703_z_us%2Fj) [n:127.0.0.1:55703_z_us%2Fj c:control_collection s:shard1 r:core_node1 x:collection1] o.a.s.h.l.XMLLoader xsltCacheLifetimeSeconds=60
   [junit4]   2> 1056205 INFO  (coreLoadExecutor-3998-thread-1-processing-n:127.0.0.1:55703_z_us%2Fj) [n:127.0.0.1:55703_z_us%2Fj c:control_collection s:shard1 r:core_node1 x:collection1] o.a.s.h.l.XMLLoader xsltCacheLifetimeSeconds=60
   [junit4]   2> 1056206 INFO  (coreLoadExecutor-3998-thread-1-processing-n:127.0.0.1:55703_z_us%2Fj) [n:127.0.0.1:55703_z_us%2Fj c:control_collection s:shard1 r:core_node1 x:collection1] o.a.s.h.l.XMLLoader xsltCacheLifetimeSeconds=60
   [junit4]   2> 1056209 INFO  (coreLoadExecutor-3998-thread-1-processing-n:127.0.0.1:55703_z_us%2Fj) [n:127.0.0.1:55703_z_us%2Fj c:control_collection s:shard1 r:core_node1 x:collection1] o.a.s.c.RequestHandlers Registered paths: /admin/mbeans,standard,/dump,/update/csv,/sql,/update/json/docs,/admin/luke,/export,/admin/segments,/get,/admin/system,/replication,/admin/properties,/config,/stream,/schema,/admin/plugins,/admin/logging,/update/json,/admin/ping,/admin/threads,/update,/admin/file
   [junit4]   2> 1056209 INFO  (coreLoadExecutor-3998-thread-1-processing-n:127.0.0.1:55703_z_us%2Fj) [n:127.0.0.1:55703_z_us%2Fj c:control_collection s:shard1 r:core_node1 x:collection1] o.a.s.c.SolrCore Using default statsCache cache: org.apache.solr.search.stats.LocalStatsCache
   [junit4]   2> 1056210 INFO  (coreLoadExecutor-3998-thread-1-processing-n:127.0.0.1:55703_z_us%2Fj) [n:127.0.0.1:55703_z_us%2Fj c:control_collection s:shard1 r:core_node1 x:collection1] o.a.s.u.UpdateHandler Using UpdateLog implementation: org.apache.solr.update.UpdateLog
   [junit4]   2> 1056210 INFO  (coreLoadExecutor-3998-thread-1-processing-n:127.0.0.1:55703_z_us%2Fj) [n:127.0.0.1:55703_z_us%2Fj c:control_collection s:shard1 r:core_node1 x:collection1] o.a.s.u.UpdateLog Initializing UpdateLog: dataDir= defaultSyncLevel=FLUSH numRecordsToKeep=100 maxNumLogsToKeep=10 numVersionBuckets=65536
   [junit4]   2> 1056211 INFO  (coreLoadExecutor-3998-thread-1-processing-n:127.0.0.1:55703_z_us%2Fj) [n:127.0.0.1:55703_z_us%2Fj c:control_collection s:shard1 r:core_node1 x:collection1] o.a.s.u.CommitTracker Hard AutoCommit: disabled
   [junit4]   2> 1056211 INFO  (coreLoadExecutor-3998-thread-1-processing-n:127.0.0.1:55703_z_us%2Fj) [n:127.0.0.1:55703_z_us%2Fj c:control_collection s:shard1 r:core_node1 x:collection1] o.a.s.u.CommitTracker Soft AutoCommit: disabled
   [junit4]   2> 1056212 INFO  (coreLoadExecutor-3998-thread-1-processing-n:127.0.0.1:55703_z_us%2Fj) [n:127.0.0.1:55703_z_us%2Fj c:control_collection s:shard1 r:core_node1 x:collection1] o.a.s.u.RandomMergePolicy RandomMergePolicy wrapping class org.apache.lucene.index.LogByteSizeMergePolicy: [LogByteSizeMergePolicy: minMergeSize=1677721, mergeFactor=39, maxMergeSize=2147483648, maxMergeSizeForForcedMerge=9223372036854775807, calibrateSizeByDeletes=false, maxMergeDocs=2147483647, maxCFSSegmentSizeMB=8.796093022207999E12, noCFSRatio=1.0]
   [junit4]   2> 1056212 INFO  (coreLoadExecutor-3998-thread-1-processing-n:127.0.0.1:55703_z_us%2Fj) [n:127.0.0.1:55703_z_us%2Fj c:control_collection s:shard1 r:core_node1 x:collection1] o.a.s.c.SolrDeletionPolicy SolrDeletionPolicy.onInit: commits: num=1
   [junit4]   2> 	commit{dir=MockDirectoryWrapper(RAMDirectory@3a71b2b0 lockFactory=org.apache.lucene.store.SingleInstanceLockFactory@31f6c154),segFN=segments_1,generation=1}
   [junit4]   2> 1056212 INFO  (coreLoadExecutor-3998-thread-1-processing-n:127.0.0.1:55703_z_us%2Fj) [n:127.0.0.1:55703_z_us%2Fj c:control_collection s:shard1 r:core_node1 x:collection1] o.a.s.c.SolrDeletionPolicy newest commit generation = 1
   [junit4]   2> 1056212 INFO  (coreLoadExecutor-3998-thread-1-processing-n:127.0.0.1:55703_z_us%2Fj) [n:127.0.0.1:55703_z_us%2Fj c:control_collection s:shard1 r:core_node1 x:collection1] o.a.s.s.SolrIndexSearcher Opening [Searcher@d9141[collection1] main]
   [junit4]   2> 1056212 INFO  (coreLoadExecutor-3998-thread-1-processing-n:127.0.0.1:55703_z_us%2Fj) [n:127.0.0.1:55703_z_us%2Fj c:control_collection s:shard1 r:core_node1 x:collection1] o.a.s.c.c.ZkStateReader Load collection config from: [/collections/control_collection]
   [junit4]   2> 1056213 INFO  (coreLoadExecutor-3998-thread-1-processing-n:127.0.0.1:55703_z_us%2Fj) [n:127.0.0.1:55703_z_us%2Fj c:control_collection s:shard1 r:core_node1 x:collection1] o.a.s.c.c.ZkStateReader path=[/collections/control_collection] [configName]=[conf1] specified config exists in ZooKeeper
   [junit4]   2> 1056214 INFO  (coreLoadExecutor-3998-thread-1-processing-n:127.0.0.1:55703_z_us%2Fj) [n:127.0.0.1:55703_z_us%2Fj c:control_collection s:shard1 r:core_node1 x:collection1] o.a.s.r.ManagedResourceStorage Setting up ZooKeeper-based storage for the RestManager with znodeBase: /configs/conf1
   [junit4]   2> 1056214 INFO  (coreLoadExecutor-3998-thread-1-processing-n:127.0.0.1:55703_z_us%2Fj) [n:127.0.0.1:55703_z_us%2Fj c:control_collection s:shard1 r:core_node1 x:collection1] o.a.s.r.ManagedResourceStorage Configured ZooKeeperStorageIO with znodeBase: /configs/conf1
   [junit4]   2> 1056214 INFO  (coreLoadExecutor-3998-thread-1-processing-n:127.0.0.1:55703_z_us%2Fj) [n:127.0.0.1:55703_z_us%2Fj c:control_collection s:shard1 r:core_node1 x:collection1] o.a.s.r.RestManager Initializing RestManager with initArgs: {}
   [junit4]   2> 1056214 INFO  (coreLoadExecutor-3998-thread-1-processing-n:127.0.0.1:55703_z_us%2Fj) [n:127.0.0.1:55703_z_us%2Fj c:control_collection s:shard1 r:core_node1 x:collection1] o.a.s.r.ManagedResourceStorage Reading _rest_managed.json using ZooKeeperStorageIO:path=/configs/conf1
   [junit4]   2> 1056215 INFO  (coreLoadExecutor-3998-thread-1-processing-n:127.0.0.1:55703_z_us%2Fj) [n:127.0.0.1:55703_z_us%2Fj c:control_collection s:shard1 r:core_node1 x:collection1] o.a.s.r.ManagedResourceStorage No data found for znode /configs/conf1/_rest_managed.json
   [junit4]   2> 1056215 INFO  (coreLoadExecutor-3998-thread-1-processing-n:127.0.0.1:55703_z_us%2Fj) [n:127.0.0.1:55703_z_us%2Fj c:control_collection s:shard1 r:core_node1 x:collection1] o.a.s.r.ManagedResourceStorage Loaded null at path _rest_managed.json using ZooKeeperStorageIO:path=/configs/conf1
   [junit4]   2> 1056215 INFO  (coreLoadExecutor-3998-thread-1-processing-n:127.0.0.1:55703_z_us%2Fj) [n:127.0.0.1:55703_z_us%2Fj c:control_collection s:shard1 r:core_node1 x:collection1] o.a.s.r.RestManager Initializing 0 registered ManagedResources
   [junit4]   2> 1056215 INFO  (coreLoadExecutor-3998-thread-1-processing-n:127.0.0.1:55703_z_us%2Fj) [n:127.0.0.1:55703_z_us%2Fj c:control_collection s:shard1 r:core_node1 x:collection1] o.a.s.h.ReplicationHandler Commits will be reserved for  10000
   [junit4]   2> 1056215 INFO  (searcherExecutor-3999-thread-1-processing-n:127.0.0.1:55703_z_us%2Fj x:collection1 s:shard1 c:control_collection r:core_node1) [n:127.0.0.1:55703_z_us%2Fj c:control_collection s:shard1 r:core_node1 x:collection1] o.a.s.c.SolrCore [collection1] Registered new searcher Searcher@d9141[collection1] main{ExitableDirectoryReader(UninvertingDirectoryReader())}
   [junit4]   2> 1056216 INFO  (coreLoadExecutor-3998-thread-1-processing-n:127.0.0.1:55703_z_us%2Fj) [n:127.0.0.1:55703_z_us%2Fj c:control_collection s:shard1 r:core_node1 x:collection1] o.a.s.u.UpdateLog Looking up max value of version field to seed version buckets
   [junit4]   2> 1056216 INFO  (coreLoadExecutor-3998-thread-1-processing-n:127.0.0.1:55703_z_us%2Fj) [n:127.0.0.1:55703_z_us%2Fj c:control_collection s:shard1 r:core_node1 x:collection1] o.a.s.u.VersionInfo Refreshing highest value of _version_ for 65536 version buckets from index
   [junit4]   2> 1056216 INFO  (coreLoadExecutor-3998-thread-1-processing-n:127.0.0.1:55703_z_us%2Fj) [n:127.0.0.1:55703_z_us%2Fj c:control_collection s:shard1 r:core_node1 x:collection1] o.a.s.u.VersionInfo No terms found for _version_, cannot seed version bucket highest value from index
   [junit4]   2> 1056216 INFO  (coreLoadExecutor-3998-thread-1-processing-n:127.0.0.1:55703_z_us%2Fj) [n:127.0.0.1:55703_z_us%2Fj c:control_collection s:shard1 r:core_node1 x:collection1] o.a.s.u.UpdateLog Could not find max version in index or recent updates, using new clock 1530372182960504832
   [junit4]   2> 1056217 INFO  (coreLoadExecutor-3998-thread-1-processing-n:127.0.0.1:55703_z_us%2Fj) [n:127.0.0.1:55703_z_us%2Fj c:control_collection s:shard1 r:core_node1 x:collection1] o.a.s.u.UpdateLog Took 1.0ms to seed version buckets with highest version 1530372182960504832
   [junit4]   2> 1056217 INFO  (coreLoadExecutor-3998-thread-1-processing-n:127.0.0.1:55703_z_us%2Fj) [n:127.0.0.1:55703_z_us%2Fj c:control_collection s:shard1 r:core_node1 x:collection1] o.a.s.c.ZkController watch zkdir /configs/conf1
   [junit4]   2> 1056218 INFO  (coreLoadExecutor-3998-thread-1-processing-n:127.0.0.1:55703_z_us%2Fj) [n:127.0.0.1:55703_z_us%2Fj c:control_collection s:shard1 r:core_node1 x:collection1] o.a.s.c.CoreContainer registering core: collection1
   [junit4]   2> 1056218 INFO  (coreZkRegister-3992-thread-1-processing-n:127.0.0.1:55703_z_us%2Fj x:collection1 s:shard1 c:control_collection r:core_node1) [n:127.0.0.1:55703_z_us%2Fj c:control_collection s:shard1 r:core_node1 x:collection1] o.a.s.c.ZkController Register replica - core:collection1 address:http://127.0.0.1:55703/z_us/j collection:control_collection shard:shard1
   [junit4]   2> 1056219 INFO  (coreZkRegister-3992-thread-1-processing-n:127.0.0.1:55703_z_us%2Fj x:collection1 s:shard1 c:control_collection r:core_node1) [n:127.0.0.1:55703_z_us%2Fj c:control_collection s:shard1 r:core_node1 x:collection1] o.a.s.c.c.SolrZkClient makePath: /collections/control_collection/leader_elect/shard1/election
   [junit4]   2> 1056224 INFO  (coreZkRegister-3992-thread-1-processing-n:127.0.0.1:55703_z_us%2Fj x:collection1 s:shard1 c:control_collection r:core_node1) [n:127.0.0.1:55703_z_us%2Fj c:control_collection s:shard1 r:core_node1 x:collection1] o.a.s.c.LeaderElector Joined leadership election with path: /collections/control_collection/leader_elect/shard1/election/95648261315624964-core_node1-n_0000000000
   [junit4]   2> 1056225 INFO  (coreZkRegister-3992-thread-1-processing-n:127.0.0.1:55703_z_us%2Fj x:collection1 s:shard1 c:control_collection r:core_node1) [n:127.0.0.1:55703_z_us%2Fj c:control_collection s:shard1 r:core_node1 x:collection1] o.a.s.c.ShardLeaderElectionContext Running the leader process for shard=shard1 and weAreReplacement=false and leaderVoteWait=10000
   [junit4]   2> 1056227 INFO  (coreZkRegister-3992-thread-1-processing-n:127.0.0.1:55703_z_us%2Fj x:collection1 s:shard1 c:control_collection r:core_node1) [n:127.0.0.1:55703_z_us%2Fj c:control_collection s:shard1 r:core_node1 x:collection1] o.a.s.c.ShardLeaderElectionContext Enough replicas found to continue.
   [junit4]   2> 1056227 INFO  (coreZkRegister-3992-thread-1-processing-n:127.0.0.1:55703_z_us%2Fj x:collection1 s:shard1 c:control_collection r:core_node1) [n:127.0.0.1:55703_z_us%2Fj c:control_collection s:shard1 r:core_node1 x:collection1] o.a.s.c.ShardLeaderElectionContext I may be the new leader - try and sync
   [junit4]   2> 1056227 INFO  (coreZkRegister-3992-thread-1-processing-n:127.0.0.1:55703_z_us%2Fj x:collection1 s:shard1 c:control_collection r:core_node1) [n:127.0.0.1:55703_z_us%2Fj c:control_collection s:shard1 r:core_node1 x:collection1] o.a.s.c.SyncStrategy Sync replicas to http://127.0.0.1:55703/z_us/j/collection1/
   [junit4]   2> 1056228 INFO  (coreZkRegister-3992-thread-1-processing-n:127.0.0.1:55703_z_us%2Fj x:collection1 s:shard1 c:control_collection r:core_node1) [n:127.0.0.1:55703_z_us%2Fj c:control_collection s:shard1 r:core_node1 x:collection1] o.a.s.c.SyncStrategy Sync Success - now sync replicas to me
   [junit4]   2> 1056228 INFO  (coreZkRegister-3992-thread-1-processing-n:127.0.0.1:55703_z_us%2Fj x:collection1 s:shard1 c:control_collection r:core_node1) [n:127.0.0.1:55703_z_us%2Fj c:control_collection s:shard1 r:core_node1 x:collection1] o.a.s.c.SyncStrategy http://127.0.0.1:55703/z_us/j/collection1/ has no replicas
   [junit4]   2> 1056228 INFO  (OverseerStateUpdate-95648261315624964-127.0.0.1:55703_z_us%2Fj-n_0000000000) [n:127.0.0.1:55703_z_us%2Fj    ] o.a.s.c.Overseer processMessage: queueSize: 1, message = {
   [junit4]   2>   "operation":"leader",
   [junit4]   2>   "shard":"shard1",
   [junit4]   2>   "collection":"control_collection"} current state version: 1
   [junit4]   2> 1056229 INFO  (coreZkRegister-3992-thread-1-processing-n:127.0.0.1:55703_z_us%2Fj x:collection1 s:shard1 c:control_collection r:core_node1) [n:127.0.0.1:55703_z_us%2Fj c:control_collection s:shard1 r:core_node1 x:collection1] o.a.s.c.c.SolrZkClient makePath: /collections/control_collection/leaders/shard1
   [junit4]   2> 1056232 INFO  (coreZkRegister-3992-thread-1-processing-n:127.0.0.1:55703_z_us%2Fj x:collection1 s:shard1 c:control_collection r:core_node1) [n:127.0.0.1:55703_z_us%2Fj c:control_collection s:shard1 r:core_node1 x:collection1] o.a.s.c.ShardLeaderElectionContextBase Creating leader registration node /collections/control_collection/leaders/shard1/leader after winning as /collections/control_collection/leader_elect/shard1/election/95648261315624964-core_node1-n_0000000000
   [junit4]   2> 1056235 INFO  (coreZkRegister-3992-thread-1-processing-n:127.0.0.1:55703_z_us%2Fj x:collection1 s:shard1 c:control_collection r:core_node1) [n:127.0.0.1:55703_z_us%2Fj c:control_collection s:shard1 r:core_node1 x:collection1] o.a.s.c.ShardLeaderElectionContext I am the new leader: http://127.0.0.1:55703/z_us/j/collection1/ shard1
   [junit4]   2> 1056236 INFO  (OverseerStateUpdate-95648261315624964-127.0.0.1:55703_z_us%2Fj-n_0000000000) [n:127.0.0.1:55703_z_us%2Fj    ] o.a.s.c.Overseer processMessage: queueSize: 1, message = {
   [junit4]   2>   "operation":"leader",
   [junit4]   2>   "shard":"shard1",
   [junit4]   2>   "collection":"control_collection",
   [junit4]   2>   "base_url":"http://127.0.0.1:55703/z_us/j",
   [junit4]   2>   "core":"collection1",
   [junit4]   2>   "state":"active"} current state version: 1
   [junit4]   2> 1056345 INFO  (zkCallback-1264-thread-1-processing-n:127.0.0.1:55703_z_us%2Fj) [n:127.0.0.1:55703_z_us%2Fj    ] o.a.s.c.c.ZkStateReader A cluster state change: [WatchedEvent state:SyncConnected type:NodeDataChanged path:/clusterstate.json], has occurred - updating... (live nodes size: [1])
   [junit4]   2> 1056390 INFO  (coreZkRegister-3992-thread-1-processing-n:127.0.0.1:55703_z_us%2Fj x:collection1 s:shard1 c:control_collection r:core_node1) [n:127.0.0.1:55703_z_us%2Fj c:control_collection s:shard1 r:core_node1 x:collection1] o.a.s.c.ZkController We are http://127.0.0.1:55703/z_us/j/collection1/ and leader is http://127.0.0.1:55703/z_us/j/collection1/
   [junit4]   2> 1056390 INFO  (coreZkRegister-3992-thread-1-processing-n:127.0.0.1:55703_z_us%2Fj x:collection1 s:shard1 c:control_collection r:core_node1) [n:127.0.0.1:55703_z_us%2Fj c:control_collection s:shard1 r:core_node1 x:collection1] o.a.s.c.ZkController No LogReplay needed for core=collection1 baseURL=http://127.0.0.1:55703/z_us/j
   [junit4]   2> 1056390 INFO  (coreZkRegister-3992-thread-1-processing-n:127.0.0.1:55703_z_us%2Fj x:collection1 s:shard1 c:control_collection r:core_node1) [n:127.0.0.1:55703_z_us%2Fj c:control_collection s:shard1 r:core_node1 x:collection1] o.a.s.c.ZkController I am the leader, no recovery necessary
   [junit4]   2> 1056390 INFO  (coreZkRegister-3992-thread-1-processing-n:127.0.0.1:55703_z_us%2Fj x:collection1 s:shard1 c:control_collection r:core_node1) [n:127.0.0.1:55703_z_us%2Fj c:control_collection s:shard1 r:core_node1 x:collection1] o.a.s.c.ZkController publishing state=active
   [junit4]   2> 1056390 INFO  (coreZkRegister-3992-thread-1-processing-n:127.0.0.1:55703_z_us%2Fj x:collection1 s:shard1 c:control_collection r:core_node1) [n:127.0.0.1:55703_z_us%2Fj c:control_collection s:shard1 r:core_node1 x:collection1] o.a.s.c.ZkController numShards not found on descriptor - reading it from system property
   [junit4]   2> 1056393 INFO  (OverseerStateUpdate-95648261315624964-127.0.0.1:55703_z_us%2Fj-n_0000000000) [n:127.0.0.1:55703_z_us%2Fj    ] o.a.s.c.Overseer processMessage: queueSize: 1, message = {
   [junit4]   2>   "core":"collection1",
   [junit4]   2>   "core_node_name":"core_node1",
   [junit4]   2>   "roles":null,
   [junit4]   2>   "base_url":"http://127.0.0.1:55703/z_us/j",
   [junit4]   2>   "node_name":"127.0.0.1:55703_z_us%2Fj",
   [junit4]   2>   "numShards":"1",
   [junit4]   2>   "state":"active",
   [junit4]   2>   "shard":"shard1",
   [junit4]   2>   "collection":"control_collection",
   [junit4]   2>   "operation":"state"} current state version: 2
   [junit4]   2> 1056393 INFO  (OverseerStateUpdate-95648261315624964-127.0.0.1:55703_z_us%2Fj-n_0000000000) [n:127.0.0.1:55703_z_us%2Fj    ] o.a.s.c.o.ReplicaMutator Update state numShards=1 message={
   [junit4]   2>   "core":"collection1",
   [junit4]   2>   "core_node_name":"core_node1",
   [junit4]   2>   "roles":null,
   [junit4]   2>   "base_url":"http://127.0.0.1:55703/z_us/j",
   [junit4]   2>   "node_name":"127.0.0.1:55703_z_us%2Fj",
   [junit4]   2>   "numShards":"1",
   [junit4]   2>   "state":"active",
   [junit4]   2>   "shard":"shard1",
   [junit4]   2>   "collection":"control_collection",
   [junit4]   2>   "operation":"state"}
   [junit4]   2> 1056499 INFO  (zkCallback-1264-thread-1-processing-n:127.0.0.1:55703_z_us%2Fj) [n:127.0.0.1:55703_z_us%2Fj    ] o.a.s.c.c.ZkStateReader A cluster state change: [WatchedEvent state:SyncConnected type:NodeDataChanged path:/clusterstate.json], has occurred - updating... (live nodes size: [1])
   [junit4]   2> 1056561 INFO  (TEST-TestReqParamsAPI.test-seed#[EA92395D959EC658]) [    ] o.a.s.c.c.SolrZkClient Using default ZkCredentialsProvider
   [junit4]   2> 1056562 INFO  (TEST-TestReqParamsAPI.test-seed#[EA92395D959EC658]) [    ] o.a.s.c.c.ConnectionManager Waiting for client to connect to ZooKeeper
   [junit4]   2> 1056563 INFO  (zkCallback-1266-thread-1) [    ] o.a.s.c.c.ConnectionManager Watcher org.apache.solr.common.cloud.ConnectionManager@4b9627db name:ZooKeeperConnection Watcher:127.0.0.1:55700/solr got event WatchedEvent state:SyncConnected type:None path:null path:null type:None
   [junit4]   2> 1056563 INFO  (TEST-TestReqParamsAPI.test-seed#[EA92395D959EC658]) [    ] o.a.s.c.c.ConnectionManager Client is connected to ZooKeeper
   [junit4]   2> 1056563 INFO  (TEST-TestReqParamsAPI.test-seed#[EA92395D959EC658]) [    ] o.a.s.c.c.SolrZkClient Using default ZkACLProvider
   [junit4]   2> 1056564 INFO  (TEST-TestReqParamsAPI.test-seed#[EA92395D959EC658]) [    ] o.a.s.c.c.ZkStateReader Updating cluster state from ZooKeeper... 
   [junit4]   2> 1056566 INFO  (TEST-TestReqParamsAPI.test-seed#[EA92395D959EC658]) [    ] o.a.s.c.c.ZkStateReader Updated live nodes from ZooKeeper... (0) -> (1)
   [junit4]   2> 1056567 INFO  (TEST-TestReqParamsAPI.test-seed#[EA92395D959EC658]) [    ] o.a.s.c.ChaosMonkey monkey: init - expire sessions:false cause connection loss:false
   [junit4]   2> 1056567 INFO  (TEST-TestReqParamsAPI.test-seed#[EA92395D959EC658]) [    ] o.a.s.c.AbstractFullDistribZkTestBase Creating collection1 with stateFormat=2
   [junit4]   2> 1056567 INFO  (TEST-TestReqParamsAPI.test-seed#[EA92395D959EC658]) [    ] o.a.s.c.c.SolrZkClient Using default ZkCredentialsProvider
   [junit4]   2> 1056567 INFO  (TEST-TestReqParamsAPI.test-seed#[EA92395D959EC658]) [    ] o.a.s.c.c.ConnectionManager Waiting for client to connect to ZooKeeper
   [junit4]   2> 1056569 INFO  (zkCallback-1267-thread-1) [    ] o.a.s.c.c.ConnectionManager Watcher org.apache.solr.common.cloud.ConnectionManager@5ccc0e42 name:ZooKeeperConnection Watcher:127.0.0.1:55700/solr got event WatchedEvent state:SyncConnected type:None path:null path:null type:None
   [junit4]   2> 1056569 INFO  (TEST-TestReqParamsAPI.test-seed#[EA92395D959EC658]) [    ] o.a.s.c.c.ConnectionManager Client is connected to ZooKeeper
   [junit4]   2> 1056569 INFO  (TEST-TestReqParamsAPI.test-seed#[EA92395D959EC658]) [    ] o.a.s.c.c.SolrZkClient Using default ZkACLProvider
   [junit4]   2> 1056572 INFO  (OverseerStateUpdate-95648261315624964-127.0.0.1:55703_z_us%2Fj-n_0000000000) [n:127.0.0.1:55703_z_us%2Fj    ] o.a.s.c.Overseer processMessage: queueSize: 1, message = {
   [junit4]   2>   "operation":"create",
   [junit4]   2>   "name":"collection1",
   [junit4]   2>   "numShards":"2",
   [junit4]   2>   "stateFormat":"2"} current state version: 3
   [junit4]   2> 1056572 INFO  (OverseerStateUpdate-95648261315624964-127.0.0.1:55703_z_us%2Fj-n_0000000000) [n:127.0.0.1:55703_z_us%2Fj    ] o.a.s.c.o.ClusterStateMutator building a new cName: collection1
   [junit4]   2> 1056677 INFO  (OverseerStateUpdate-95648261315624964-127.0.0.1:55703_z_us%2Fj-n_0000000000) [n:127.0.0.1:55703_z_us%2Fj    ] o.a.s.c.o.ZkStateWriter going to create_collection /collections/collection1/state.json
   [junit4]   2> 1056859 INFO  (TEST-TestReqParamsAPI.test-seed#[EA92395D959EC658]) [    ] o.a.s.SolrTestCaseJ4 Writing core.properties file to /Users/jenkins/workspace/Lucene-Solr-master-MacOSX/solr/build/solr-core/test/J1/temp/solr.handler.TestReqParamsAPI_EA92395D959EC658-001/shard-1-001/cores/collection1
   [junit4]   2> 1056861 INFO  (TEST-TestReqParamsAPI.test-seed#[EA92395D959EC658]) [    ] o.a.s.c.AbstractFullDistribZkTestBase create jetty 1 in directory /Users/jenkins/workspace/Lucene-Solr-master-MacOSX/solr/build/solr-core/test/J1/temp/solr.handler.TestReqParamsAPI_EA92395D959EC658-001/shard-1-001
   [junit4]   2> 1056862 INFO  (TEST-TestReqParamsAPI.test-seed#[EA92395D959EC658]) [    ] o.e.j.s.Server jetty-9.3.8.v20160314
   [junit4]   2> 1056865 INFO  (TEST-TestReqParamsAPI.test-seed#[EA92395D959EC658]) [    ] o.e.j.s.h.ContextHandler Started o.e.j.s.ServletContextHandler@1dbb027f{/z_us/j,null,AVAILABLE}
   [junit4]   2> 1056866 INFO  (TEST-TestReqParamsAPI.test-seed#[EA92395D959EC658]) [    ] o.e.j.s.ServerConnector Started ServerConnector@248ee3e8{HTTP/1.1,[http/1.1]}{127.0.0.1:55714}
   [junit4]   2> 1056866 INFO  (TEST-TestReqParamsAPI.test-seed#[EA92395D959EC658]) [    ] o.e.j.s.Server Started @1061997ms
   [junit4]   2> 1056866 INFO  (TEST-TestReqParamsAPI.test-seed#[EA92395D959EC658]) [    ] o.a.s.c.s.e.JettySolrRunner Jetty properties: {solr.data.dir=/Users/jenkins/workspace/Lucene-Solr-master-MacOSX/solr/build/solr-core/test/J1/temp/solr.handler.TestReqParamsAPI_EA92395D959EC658-001/tempDir-001/jetty1, solrconfig=solrconfig.xml, hostContext=/z_us/j, hostPort=55714, coreRootDirectory=/Users/jenkins/workspace/Lucene-Solr-master-MacOSX/solr/build/solr-core/test/J1/../../../../../../../../../Users/jenkins/workspace/Lucene-Solr-master-MacOSX/solr/build/solr-core/test/J1/temp/solr.handler.TestReqParamsAPI_EA92395D959EC658-001/shard-1-001/cores}
   [junit4]   2> 1056867 INFO  (TEST-TestReqParamsAPI.test-seed#[EA92395D959EC658]) [    ] o.a.s.s.SolrDispatchFilter SolrDispatchFilter.init(): sun.misc.Launcher$AppClassLoader@4554617c
   [junit4]   2> 1056867 INFO  (TEST-TestReqParamsAPI.test-seed#[EA92395D959EC658]) [    ] o.a.s.c.SolrResourceLoader new SolrResourceLoader for directory: '/Users/jenkins/workspace/Lucene-Solr-master-MacOSX/solr/build/solr-core/test/J1/temp/solr.handler.TestReqParamsAPI_EA92395D959EC658-001/shard-1-001'
   [junit4]   2> 1056867 INFO  (TEST-TestReqParamsAPI.test-seed#[EA92395D959EC658]) [    ] o.a.s.c.SolrResourceLoader JNDI not configured for solr (NoInitialContextEx)
   [junit4]   2> 1056867 INFO  (TEST-TestReqParamsAPI.test-seed#[EA92395D959EC658]) [    ] o.a.s.c.SolrResourceLoader solr home defaulted to 'solr/' (could not find system property or JNDI)
   [junit4]   2> 1056867 INFO  (TEST-TestReqParamsAPI.test-seed#[EA92395D959EC658]) [    ] o.a.s.c.c.SolrZkClient Using default ZkCredentialsProvider
   [junit4]   2> 1056884 INFO  (zkCallback-1268-thread-1) [    ] o.a.s.c.c.ConnectionManager Watcher org.apache.solr.common.cloud.ConnectionManager@1fae84d9 name:ZooKeeperConnection Watcher:127.0.0.1:55700/solr got event WatchedEvent state:SyncConnected type:None path:null path:null type:None
   [junit4]   2> 1056884 INFO  (TEST-TestReqParamsAPI.test-seed#[EA92395D959EC658]) [    ] o.a.s.c.c.ConnectionManager Waiting for client to connect to ZooKeeper
   [junit4]   2> 1056884 INFO  (TEST-TestReqParamsAPI.test-seed#[EA92395D959EC658]) [    ] o.a.s.c.c.ConnectionManager Client is connected to ZooKeeper
   [junit4]   2> 1056886 INFO  (TEST-TestReqParamsAPI.test-seed#[EA92395D959EC658]) [    ] o.a.s.c.c.SolrZkClient Using default ZkACLProvider
   [junit4]   2> 1056888 INFO  (TEST-TestReqParamsAPI.test-seed#[EA92395D959EC658]) [    ] o.a.s.s.SolrDispatchFilter Loading solr.xml from SolrHome (not found in ZooKeeper)
   [junit4]   2> 1056888 INFO  (TEST-TestReqParamsAPI.test-seed#[EA92395D959EC658]) [    ] o.a.s.c.SolrXmlConfig Loading container configuration from /Users/jenkins/workspace/Lucene-Solr-master-MacOSX/solr/build/solr-core/test/J1/temp/solr.handler.TestReqParamsAPI_EA92395D959EC658-001/shard-1-001/solr.xml
   [junit4]   2> 1056896 INFO  (TEST-TestReqParamsAPI.test-seed#[EA92395D959EC658]) [    ] o.a.s.c.CorePropertiesLocator Config-defined core root directory: /Users/jenkins/workspace/Lucene-Solr-master-MacOSX/solr/build/solr-core/test/J1/../../../../../../../../../Users/jenkins/workspace/Lucene-Solr-master-MacOSX/solr/build/solr-core/test/J1/temp/solr.handler.TestReqParamsAPI_EA92395D959EC658-001/shard-1-001/cores
   [junit4]   2> 1056896 INFO  (TEST-TestReqParamsAPI.test-seed#[EA92395D959EC658]) [    ] o.a.s.c.CoreContainer New CoreContainer 1964183979
   [junit4]   2> 1056896 INFO  (TEST-TestReqParamsAPI.test-seed#[EA92395D959EC658]) [    ] o.a.s.c.CoreContainer Loading cores into CoreContainer [instanceDir=/Users/jenkins/workspace/Lucene-Solr-master-MacOSX/solr/build/solr-core/test/J1/temp/solr.handler.TestReqParamsAPI_EA92395D959EC658-001/shard-1-001]
   [junit4]   2> 1056896 WARN  (TEST-TestReqParamsAPI.test-seed#[EA92395D959EC658]) [    ] o.a.s.c.CoreContainer Couldn't add files from /Users/jenkins/workspace/Lucene-Solr-master-MacOSX/solr/build/solr-core/test/J1/temp/solr.handler.TestReqParamsAPI_EA92395D959EC658-001/shard-1-001/lib to classpath: /Users/jenkins/workspace/Lucene-Solr-master-MacOSX/solr/build/solr-core/test/J1/temp/solr.handler.TestReqParamsAPI_EA92395D959EC658-001/shard-1-001/lib
   [junit4]   2> 1056897 INFO  (TEST-TestReqParamsAPI.test-seed#[EA92395D959EC658]) [    ] o.a.s.h.c.HttpShardHandlerFactory created with socketTimeout : 90000,urlScheme : ,connTimeout : 15000,maxConnectionsPerHost : 20,maxConnections : 10000,corePoolSize : 0,maximumPoolSize : 2147483647,maxThreadIdleTime : 5,sizeOfQueue : -1,fairnessPolicy : false,useRetries : false,
   [junit4]   2> 1056899 INFO  (TEST-TestReqParamsAPI.test-seed#[EA92395D959EC658]) [    ] o.a.s.u.UpdateShardHandler Creating UpdateShardHandler HTTP client with params: socketTimeout=340000&connTimeout=45000&retry=true
   [junit4]   2> 1056900 INFO  (TEST-TestReqParamsAPI.test-seed#[EA92395D959EC658]) [    ] o.a.s.l.LogWatcher SLF4J impl is org.slf4j.impl.Log4jLoggerFactory
   [junit4]   2> 1056900 INFO  (TEST-TestReqParamsAPI.test-seed#[EA92395D959EC658]) [    ] o.a.s.l.LogWatcher Registering Log Listener [Log4j (org.slf4j.impl.Log4jLoggerFactory)]
   [junit4]   2> 1056900 INFO  (TEST-TestReqParamsAPI.test-seed#[EA92395D959EC658]) [    ] o.a.s.c.ZkContainer Zookeeper client=127.0.0.1:55700/solr
   [junit4]   2> 1056900 INFO  (TEST-TestReqParamsAPI.test-seed#[EA92395D959EC658]) [    ] o.a.s.c.ZkController zkHost includes chroot
   [junit4]   2> 1056900 INFO  (TEST-TestReqParamsAPI.test-seed#[EA92395D959EC658]) [    ] o.a.s.c.c.SolrZkClient Using default ZkCredentialsProvider
   [junit4]   2> 1056901 INFO  (TEST-TestReqParamsAPI.test-seed#[EA92395D959EC658]) [    ] o.a.s.c.c.ConnectionManager Waiting for client to connect to ZooKeeper
   [junit4]   2> 1056902 INFO  (zkCallback-1271-thread-1) [    ] o.a.s.c.c.ConnectionManager Watcher org.apache.solr.common.cloud.ConnectionManager@2865ec2b name:ZooKeeperConnection Watcher:127.0.0.1:55700 got event WatchedEvent state:SyncConnected type:None path:null path:null type:None
   [junit4]   2> 1056902 INFO  (TEST-TestReqParamsAPI.test-seed#[EA92395D959EC658]) [    ] o.a.s.c.c.ConnectionManager Client is connected to ZooKeeper
   [junit4]   2> 1056903 INFO  (TEST-TestReqParamsAPI.test-seed#[EA92395D959EC658]) [    ] o.a.s.c.c.SolrZkClient Using default ZkACLProvider
   [junit4]   2> 1056905 INFO  (TEST-TestReqParamsAPI.test-seed#[EA92395D959EC658]) [n:127.0.0.1:55714_z_us%2Fj    ] o.a.s.c.c.ConnectionManager Waiting for client to connect to ZooKeeper
   [junit4]   2> 1056906 INFO  (zkCallback-1272-thread-1-processing-n:127.0.0.1:55714_z_us%2Fj) [n:127.0.0.1:55714_z_us%2Fj    ] o.a.s.c.c.ConnectionManager Watcher org.apache.solr.common.cloud.ConnectionManager@21ada5f6 name:ZooKeeperConnection Watcher:127.0.0.1:55700/solr got event WatchedEvent state:SyncConnected type:None path:null path:null type:None
   [junit4]   2> 1056906 INFO  (TEST-TestReqParamsAPI.test-seed#[EA92395D959EC658]) [n:127.0.0.1:55714_z_us%2Fj    ] o.a.s.c.c.ConnectionManager Client is connected to ZooKeeper
   [junit4]   2> 1056918 INFO  (TEST-TestReqParamsAPI.test-seed#[EA92395D959EC658]) [n:127.0.0.1:55714_z_us%2Fj    ] o.a.s.c.c.ZkStateReader Updating cluster state from ZooKeeper... 
   [junit4]   2> 1056920 INFO  (TEST-TestReqParamsAPI.test-seed#[EA92395D959EC658]) [n:127.0.0.1:55714_z_us%2Fj    ] o.a.s.c.c.ZkStateReader Updated live nodes from ZooKeeper... (0) -> (1)
   [junit4]   2> 1056924 INFO  (TEST-TestReqParamsAPI.test-seed#[EA92395D959EC658]) [n:127.0.0.1:55714_z_us%2Fj    ] o.a.s.c.Overseer Overseer (id=null) closing
   [junit4]   2> 1056924 INFO  (TEST-TestReqParamsAPI.test-seed#[EA92395D959EC658]) [n:127.0.0.1:55714_z_us%2Fj    ] o.a.s.c.LeaderElector Joined leadership election with path: /overseer_elect/election/95648261315624969-127.0.0.1:55714_z_us%2Fj-n_0000000001
   [junit4]   2> 1056925 INFO  (TEST-TestReqParamsAPI.test-seed#[EA92395D959EC658]) [n:127.0.0.1:55714_z_us%2Fj    ] o.a.s.c.LeaderElector Watching path /overseer_elect/election/95648261315624964-127.0.0.1:55703_z_us%2Fj-n_0000000000 to know if I could be the leader
   [junit4]   2> 1056926 INFO  (TEST-TestReqParamsAPI.test-seed#[EA92395D959EC658]) [n:127.0.0.1:55714_z_us%2Fj    ] o.a.s.c.ZkController Publish node=127.0.0.1:55714_z_us%2Fj as DOWN
   [junit4]   2> 1056930 INFO  (OverseerStateUpdate-95648261315624964-127.0.0.1:55703_z_us%2Fj-n_0000000000) [n:127.0.0.1:55703_z_us%2Fj    ] o.a.s.c.Overseer processMessage: queueSize: 1, message = {
   [junit4]   2>   "operation":"downnode",
   [junit4]   2>   "node_name":"127.0.0.1:55714_z_us%2Fj"} current state version: 3
   [junit4]   2> 1056930 INFO  (OverseerStateUpdate-95648261315624964-127.0.0.1:55703_z_us%2Fj-n_0000000000) [n:127.0.0.1:55703_z_us%2Fj    ] o.a.s.c.o.NodeMutator DownNode state invoked for node: 127.0.0.1:55714_z_us%2Fj
   [junit4]   2> 1056931 INFO  (OverseerStateUpdate-95648261315624964-127.0.0.1:55703_z_us%2Fj-n_0000000000) [n:127.0.0.1:55703_z_us%2Fj    ] o.a.s.c.o.ZkStateWriter going to update_collection /collections/collection1/state.json version: 0
   [junit4]   2> 1057037 INFO  (zkCallback-1266-thread-1) [    ] o.a.s.c.c.ZkStateReader A cluster state change: [WatchedEvent state:SyncConnected type:NodeDataChanged path:/clusterstate.json], has occurred - updating... (live nodes size: [1])
   [junit4]   2> 1057037 INFO  (zkCallback-1272-thread-1-processing-n:127.0.0.1:55714_z_us%2Fj) [n:127.0.0.1:55714_z_us%2Fj    ] o.a.s.c.c.ZkStateReader A cluster state change: [WatchedEvent state:SyncConnected type:NodeDataChanged path:/clusterstate.json], has occurred - updating... (live nodes size: [1])
   [junit4]   2> 1057037 INFO  (zkCallback-1264-thread-1-processing-n:127.0.0.1:55703_z_us%2Fj) [n:127.0.0.1:55703_z_us%2Fj    ] o.a.s.c.c.ZkStateReader A cluster state change: [WatchedEvent state:SyncConnected type:NodeDataChanged path:/clusterstate.json], has occurred - updating... (live nodes size: [1])
   [junit4]   2> 1057931 INFO  (TEST-TestReqParamsAPI.test-seed#[EA92395D959EC658]) [n:127.0.0.1:55714_z_us%2Fj    ] o.a.s.c.ZkController Register node as live in ZooKeeper:/live_nodes/127.0.0.1:55714_z_us%2Fj
   [junit4]   2> 1057932 INFO  (TEST-TestReqParamsAPI.test-seed#[EA92395D959EC658]) [n:127.0.0.1:55714_z_us%2Fj    ] o.a.s.c.c.SolrZkClient makePath: /live_nodes/127.0.0.1:55714_z_us%2Fj
   [junit4]   2> 1057934 INFO  (zkCallback-1266-thread-1) [    ] o.a.s.c.c.ZkStateReader A live node change: [WatchedEvent state:SyncConnected type:NodeChildrenChanged path:/live_nodes], has occurred - updating... (live nodes size: [1])
   [junit4]   2> 1057934 INFO  (zkCallback-1272-thread-1-processing-n:127.0.0.1:55714_z_us%2Fj) [n:127.0.0.1:55714_z_us%2Fj    ] o.a.s.c.c.ZkStateReader A live node change: [WatchedEvent state:SyncConnected type:NodeChildrenChanged path:/live_nodes], has occurred - updating... (live nodes size: [1])
   [junit4]   2> 1057934 INFO  (zkCallback-1264-thread-1-processing-n:127.0.0.1:55703_z_us%2Fj) [n:127.0.0.1:55703_z_us%2Fj    ] o.a.s.c.c.ZkStateReader A live node change: [WatchedEvent state:SyncConnected type:NodeChildrenChanged path:/live_nodes], has occurred - updating... (live nodes size: [1])
   [junit4]   2> 1057935 INFO  (zkCallback-1266-thread-1) [    ] o.a.s.c.c.ZkStateReader Updated live nodes from ZooKeeper... (1) -> (2)
   [junit4]   2> 1057935 INFO  (zkCallback-1272-thread-1-processing-n:127.0.0.1:55714_z_us%2Fj) [n:127.0.0.1:55714_z_us%2Fj    ] o.a.s.c.c.ZkStateReader Updated live nodes from ZooKeeper... (1) -> (2)
   [junit4]   2> 1057935 INFO  (zkCallback-1264-thread-1-processing-n:127.0.0.1:55703_z_us%2Fj) [n:127.0.0.1:55703_z_us%2Fj    ] o.a.s.c.c.ZkStateReader Updated live nodes from ZooKeeper... (1) -> (2)
   [junit4]   2> 1057942 INFO  (TEST-TestReqParamsAPI.test-seed#[EA92395D959EC658]) [n:127.0.0.1:55714_z_us%2Fj    ] o.a.s.c.CoreContainer Security conf doesn't exist. Skipping setup for authorization module.
   [junit4]   2> 1057942 INFO  (TEST-TestReqParamsAPI.test-seed#[EA92395D959EC658]) [n:127.0.0.1:55714_z_us%2Fj    ] o.a.s.c.CoreContainer No authentication plugin used.
   [junit4]   2> 1057946 INFO  (TEST-TestReqParamsAPI.test-seed#[EA92395D959EC658]) [n:127.0.0.1:55714_z_us%2Fj    ] o.a.s.c.CorePropertiesLocator Looking for core definitions underneath /Users/jenkins/workspace/Lucene-Solr-master-MacOSX/solr/build/solr-core/test/J1/../../../../../../../../../Users/jenkins/workspace/Lucene-Solr-master-MacOSX/solr/build/solr-core/test/J1/temp/solr.handler.TestReqParamsAPI_EA92395D959EC658-001/shard-1-001/cores
   [junit4]   2> 1057947 INFO  (TEST-TestReqParamsAPI.test-seed#[EA92395D959EC658]) [n:127.0.0.1:55714_z_us%2Fj    ] o.a.s.c.CoreDescriptor Created CoreDescriptor: {name=collection1, config=solrconfig.xml, transient=false, schema=schema.xml, loadOnStartup=true, configSetProperties=configsetprops.json, collection=collection1, coreNodeName=, dataDir=data/, shard=}
   [junit4]   2> 1057947 INFO  (TEST-TestReqParamsAPI.test-seed#[EA92395D959EC658]) [n:127.0.0.1:55714_z_us%2Fj    ] o.a.s.c.CorePropertiesLocator Found core collection1 in /Users/jenkins/workspace/Lucene-Solr-master-MacOSX/solr/build/solr-core/test/J1/../../../../../../../../../Users/jenkins/workspace/Lucene-Solr-master-MacOSX/solr/build/solr-core/test/J1/temp/solr.handler.TestReqParamsAPI_EA92395D959EC658-001/shard-1-001/cores/collection1
   [junit4]   2> 1057947 INFO  (TEST-TestReqParamsAPI.test-seed#[EA92395D959EC658]) [n:127.0.0.1:55714_z_us%2Fj    ] o.a.s.c.CorePropertiesLocator Found 1 core definitions
   [junit4]   2> 1057949 INFO  (TEST-TestReqParamsAPI.test-seed#[EA92395D959EC658]) [n:127.0.0.1:55714_z_us%2Fj    ] o.a.s.s.SolrDispatchFilter user.dir=/Users/jenkins/workspace/Lucene-Solr-master-MacOSX/solr/build/solr-core/test/J1
   [junit4]   2> 1057949 INFO  (TEST-TestReqParamsAPI.test-seed#[EA92395D959EC658]) [n:127.0.0.1:55714_z_us%2Fj    ] o.a.s.s.SolrDispatchFilter SolrDispatchFilter.init() done
   [junit4]   2> 1057950 INFO  (coreLoadExecutor-4009-thread-1-processing-n:127.0.0.1:55714_z_us%2Fj) [n:127.0.0.1:55714_z_us%2Fj c:collection1   x:collection1] o.a.s.c.ZkController publishing state=down
   [junit4]   2> 1057950 INFO  (coreLoadExecutor-4009-thread-1-processing-n:127.0.0.1:55714_z_us%2Fj) [n:127.0.0.1:55714_z_us%2Fj c:collection1   x:collection1] o.a.s.c.ZkController numShards not found on descriptor - reading it from system property
   [junit4]   2> 1057951 INFO  (coreLoadExecutor-4009-thread-1-processing-n:127.0.0.1:55714_z_us%2Fj) [n:127.0.0.1:55714_z_us%2Fj c:collection1   x:collection1] o.a.s.c.ZkController Registering watch for collection collection1
   [junit4]   2> 1057951 INFO  (coreLoadExecutor-4009-thread-1-processing-n:127.0.0.1:55714_z_us%2Fj) [n:127.0.0.1:55714_z_us%2Fj c:collection1   x:collection1] o.a.s.c.c.ZkStateReader addZkWatch [collection1]
   [junit4]   2> 1057952 INFO  (coreLoadExecutor-4009-thread-1-processing-n:127.0.0.1:55714_z_us%2Fj) [n:127.0.0.1:55714_z_us%2Fj c:collection1   x:collection1] o.a.s.c.c.ZkStateReader Add data for [collection1] ver [1]
   [junit4]   2> 1057952 INFO  (coreLoadExecutor-4009-thread-1-processing-n:127.0.0.1:55714_z_us%2Fj) [n:127.0.0.1:55714_z_us%2Fj c:collection1   x:collection1] o.a.s.c.ZkController look for our core node name
   [junit4]   2> 1057952 INFO  (OverseerStateUpdate-95648261315624964-127.0.0.1:55703_z_us%2Fj-n_0000000000) [n:127.0.0.1:55703_z_us%2Fj    ] o.a.s.c.Overseer processMessage: queueSize: 1, message = {
   [junit4]   2>   "core":"collection1",
   [junit4]   2>   "roles":null,
   [junit4]   2>   "base_url":"http://127.0.0.1:55714/z_us/j",
   [junit4]   2>   "node_name":"127.0.0.1:55714_z_us%2Fj",
   [junit4]   2>   "numShards":"2",
   [junit4]   2>   "state":"down",
   [junit4]   2>   "shard":null,
   [junit4]   2>   "collection":"collection1",
   [junit4]   2>   "operation":"state"} current state version: 4
   [junit4]   2> 1057953 INFO  (OverseerStateUpdate-95648261315624964-127.0.0.1:55703_z_us%2Fj-n_0000000000) [n:127.0.0.1:55703_z_us%2Fj    ] o.a.s.c.o.ReplicaMutator Update state numShards=2 message={
   [junit4]   2>   "core":"collection1",
   [junit4]   2>   "roles":null,
   [junit4]   2>   "base_url":"http://127.0.0.1:55714/z_us/j",
   [junit4]   2>   "node_name":"127.0.0.1:55714_z_us%2Fj",
   [junit4]   2>   "numShards":"2",
   [junit4]   2>   "state":"down",
   [junit4]   2>   "shard":null,
   [junit4]   2>   "collection":"collection1",
   [junit4]   2>   "operation":"state"}
   [junit4]   2> 1057953 INFO  (OverseerStateUpdate-95648261315624964-127.0.0.1:55703_z_us%2Fj-n_0000000000) [n:127.0.0.1:55703_z_us%2Fj    ] o.a.s.c.o.ReplicaMutator Collection already exists with numShards=2
   [junit4]   2> 1057953 INFO  (OverseerStateUpdate-95648261315624964-127.0.0.1:55703_z_us%2Fj-n_0000000000) [n:127.0.0.1:55703_z_us%2Fj    ] o.a.s.c.o.ReplicaMutator Assigning new node to shard shard=shard2
   [junit4]   2> 1058057 INFO  (OverseerStateUpdate-95648261315624964-127.0.0.1:55703_z_us%2Fj-n_0000000000) [n:127.0.0.1:55703_z_us%2Fj    ] o.a.s.c.o.ZkStateWriter going to update_collection /collections/collection1/state.json version: 1
   [junit4]   2> 1058058 INFO  (zkCallback-1272-thread-1-processing-n:127.0.0.1:55714_z_us%2Fj) [n:127.0.0.1:55714_z_us%2Fj    ] o.a.s.c.c.ZkStateReader A cluster state change: [WatchedEvent state:SyncConnected type:NodeDataChanged path:/collections/collection1/state.json] for collection [collection1] has occurred - updating... (live nodes size: [2])
   [junit4]   2> 1058058 INFO  (zkCallback-1272-thread-1-processing-n:127.0.0.1:55714_z_us%2Fj) [n:127.0.0.1:55714_z_us%2Fj    ] o.a.s.c.c.ZkStateReader Updating data for [collection1] from [1] to [2]
   [junit4]   2> 1058953 INFO  (coreLoadExecutor-4009-thread-1-processing-n:127.0.0.1:55714_z_us%2Fj) [n:127.0.0.1:55714_z_us%2Fj c:collection1   x:collection1] o.a.s.c.ZkController waiting to find shard id in clusterstate for collection1
   [junit4]   2> 1058953 INFO  (coreLoadExecutor-4009-thread-1-processing-n:127.0.0.1:55714_z_us%2Fj) [n:127.0.0.1:55714_z_us%2Fj c:collection1   x:collection1] o.a.s.c.ZkController Check for collection zkNode:collection1
   [junit4]   2> 1058954 INFO  (coreLoadExecutor-4009-thread-1-processing-n:127.0.0.1:55714_z_us%2Fj) [n:127.0.0.1:55714_z_us%2Fj c:collection1   x:collection1] o.a.s.c.ZkController Collection zkNode exists
   [junit4]   2> 1058954 INFO  (coreLoadExecutor-4009-thread-1-processing-n:127.0.0.1:55714_z_us%2Fj) [n:127.0.0.1:55714_z_us%2Fj c:collection1   x:collection1] o.a.s.c.c.ZkStateReader Load collection config from: [/collections/collection1]
   [junit4]   2> 1058955 INFO  (coreLoadExecutor-4009-thread-1-processing-n:127.0.0.1:55714_z_us%2Fj) [n:127.0.0.1:55714_z_us%2Fj c:collection1   x:collection1] o.a.s.c.c.ZkStateReader path=[/collections/collection1] [configName]=[conf1] specified config exists in ZooKeeper
   [junit4]   2> 1058955 INFO  (coreLoadExecutor-4009-thread-1-processing-n:127.0.0.1:55714_z_us%2Fj) [n:127.0.0.1:55714_z_us%2Fj c:collection1   x:collection1] o.a.s.c.SolrResourceLoader new SolrResourceLoader for directory: '/Users/jenkins/workspace/Lucene-Solr-master-MacOSX/solr/build/solr-core/test/J1/temp/solr.handler.TestReqParamsAPI_EA92395D959EC658-001/shard-1-001/cores/collection1'
   [junit4]   2> 1058955 INFO  (coreLoadExecutor-4009-thread-1-processing-n:127.0.0.1:55714_z_us%2Fj) [n:127.0.0.1:55714_z_us%2Fj c:collection1   x:collection1] o.a.s.c.SolrResourceLoader JNDI not configured for solr (NoInitialContextEx)
   [junit4]   2> 1058955 INFO  (coreLoadExecutor-4009-thread-1-processing-n:127.0.0.1:55714_z_us%2Fj) [n:127.0.0.1:55714_z_us%2Fj c:collection1   x:collection1] o.a.s.c.SolrResourceLoader solr home defaulted to 'solr/' (could not find system property or JNDI)
   [junit4]   2> 1058957 INFO  (coreLoadExecutor-4009-thread-1-processing-n:127.0.0.1:55714_z_us%2Fj) [n:127.0.0.1:55714_z_us%2Fj c:collection1   x:collection1] o.a.s.c.Config loaded config solrconfig.xml with version 0 
   [junit4]   2> 1058962 INFO  (coreLoadExecutor-4009-thread-1-processing-n:127.0.0.1:55714_z_us%2Fj) [n:127.0.0.1:55714_z_us%2Fj c:collection1   x:collection1] o.a.s.c.SolrConfig current version of requestparams : -1
   [junit4]   2> 1058965 INFO  (coreLoadExecutor-4009-thread-1-processing-n:127.0.0.1:55714_z_us%2Fj) [n:127.0.0.1:55714_z_us%2Fj c:collection1   x:collection1] o.a.s.c.SolrConfig Using Lucene MatchVersion: 7.0.0
   [junit4]   2> 1058972 INFO  (coreLoadExecutor-4009-thread-1-processing-n:127.0.0.1:55714_z_us%2Fj) [n:127.0.0.1:55714_z_us%2Fj c:collection1   x:collection1] o.a.s.c.SolrConfig Loaded SolrConfig: solrconfig.xml
   [junit4]   2> 1058976 INFO  (coreLoadExecutor-4009-thread-1-processing-n:127.0.0.1:55714_z_us%2Fj) [n:127.0.0.1:55714_z_us%2Fj c:collection1   x:collection1] o.a.s.s.IndexSchema [collection1] Schema name=test
   [junit4]   2> 1059043 INFO  (coreLoadExecutor-4009-thread-1-processing-n:127.0.0.1:55714_z_us%2Fj) [n:127.0.0.1:55714_z_us%2Fj c:collection1   x:collection1] o.a.s.s.OpenExchangeRatesOrgProvider Initialized with rates=open-exchange-rates.json, refreshInterval=1440.
   [junit4]   2> 1059049 INFO  (coreLoadExecutor-4009-thread-1-processi

[...truncated too long message...]

rg.apache.zookeeper.KeeperException.create(KeeperException.java:127)
   [junit4]   2> 	at org.apache.zookeeper.KeeperException.create(KeeperException.java:51)
   [junit4]   2> 	at org.apache.zookeeper.ZooKeeper.delete(ZooKeeper.java:873)
   [junit4]   2> 	at org.apache.solr.common.cloud.SolrZkClient$2.execute(SolrZkClient.java:244)
   [junit4]   2> 	at org.apache.solr.common.cloud.SolrZkClient$2.execute(SolrZkClient.java:241)
   [junit4]   2> 	at org.apache.solr.common.cloud.ZkCmdExecutor.retryOperation(ZkCmdExecutor.java:60)
   [junit4]   2> 	at org.apache.solr.common.cloud.SolrZkClient.delete(SolrZkClient.java:241)
   [junit4]   2> 	at org.apache.solr.cloud.ElectionContext.cancelElection(ElectionContext.java:86)
   [junit4]   2> 	at org.apache.solr.cloud.ShardLeaderElectionContextBase.cancelElection(ElectionContext.java:143)
   [junit4]   2> 	at org.apache.solr.cloud.ShardLeaderElectionContext.cancelElection(ElectionContext.java:279)
   [junit4]   2> 	at org.apache.solr.cloud.ShardLeaderElectionContext.runLeaderProcess(ElectionContext.java:455)
   [junit4]   2> 	at org.apache.solr.cloud.LeaderElector.runIamLeaderProcess(LeaderElector.java:170)
   [junit4]   2> 	at org.apache.solr.cloud.LeaderElector.checkIfIamLeader(LeaderElector.java:135)
   [junit4]   2> 	at org.apache.solr.cloud.LeaderElector.access$200(LeaderElector.java:56)
   [junit4]   2> 	at org.apache.solr.cloud.LeaderElector$ElectionWatcher.process(LeaderElector.java:348)
   [junit4]   2> 	at org.apache.solr.common.cloud.SolrZkClient$3.lambda$process$0(SolrZkClient.java:266)
   [junit4]   2> 	at java.util.concurrent.Executors$RunnableAdapter.call(Executors.java:511)
   [junit4]   2> 	at java.util.concurrent.FutureTask.run(FutureTask.java:266)
   [junit4]   2> 	at org.apache.solr.common.util.ExecutorUtil$MDCAwareThreadPoolExecutor.lambda$execute$0(ExecutorUtil.java:229)
   [junit4]   2> 	at java.util.concurrent.ThreadPoolExecutor.runWorker(ThreadPoolExecutor.java:1142)
   [junit4]   2> 	at java.util.concurrent.ThreadPoolExecutor$Worker.run(ThreadPoolExecutor.java:617)
   [junit4]   2> 	at java.lang.Thread.run(Thread.java:745)
   [junit4]   2> 1079024 INFO  (TEST-TestReqParamsAPI.test-seed#[EA92395D959EC658]) [    ] o.e.j.s.ServerConnector Stopped ServerConnector@19602456{HTTP/1.1,[http/1.1]}{127.0.0.1:0}
   [junit4]   2> 1079024 INFO  (TEST-TestReqParamsAPI.test-seed#[EA92395D959EC658]) [    ] o.e.j.s.h.ContextHandler Stopped o.e.j.s.ServletContextHandler@348fadfc{/z_us/j,null,UNAVAILABLE}
   [junit4]   2> 1079026 INFO  (TEST-TestReqParamsAPI.test-seed#[EA92395D959EC658]) [    ] o.a.s.c.ZkTestServer connecting to 127.0.0.1:55700 55700
   [junit4]   2> 1079043 INFO  (Thread-2872) [    ] o.a.s.c.ZkTestServer connecting to 127.0.0.1:55700 55700
   [junit4]   2> 1080474 WARN  (Thread-2872) [    ] o.a.s.c.ZkTestServer Watch limit violations: 
   [junit4]   2> Maximum concurrent create/delete watches above limit:
   [junit4]   2> 
   [junit4]   2> 	25	/solr/configs/conf1
   [junit4]   2> 	6	/solr/aliases.json
   [junit4]   2> 	5	/solr/security.json
   [junit4]   2> 
   [junit4]   2> Maximum concurrent data watches above limit:
   [junit4]   2> 
   [junit4]   2> 	6	/solr/clusterstate.json
   [junit4]   2> 	4	/solr/collections/collection1/state.json
   [junit4]   2> 
   [junit4]   2> Maximum concurrent children watches above limit:
   [junit4]   2> 
   [junit4]   2> 	6	/solr/live_nodes
   [junit4]   2> 	6	/solr/collections
   [junit4]   2> 	3	/solr/overseer/queue
   [junit4]   2> 	3	/solr/overseer/collection-queue-work
   [junit4]   2> 	3	/solr/overseer/queue-work
   [junit4]   2> 
   [junit4]   2> NOTE: reproduce with: ant test  -Dtestcase=TestReqParamsAPI -Dtests.method=test -Dtests.seed=EA92395D959EC658 -Dtests.slow=true -Dtests.locale=pl -Dtests.timezone=Africa/Mogadishu -Dtests.asserts=true -Dtests.file.encoding=ISO-8859-1
   [junit4] FAILURE 26.1s J1 | TestReqParamsAPI.test <<<
   [junit4]    > Throwable #1: java.lang.AssertionError: Could not get expected value  'CY val' for path 'params/c' full output: {
   [junit4]    >   "responseHeader":{
   [junit4]    >     "status":0,
   [junit4]    >     "QTime":0},
   [junit4]    >   "params":{
   [junit4]    >     "a":"A val",
   [junit4]    >     "b":"B val",
   [junit4]    >     "wt":"json",
   [junit4]    >     "useParams":""},
   [junit4]    >   "context":{
   [junit4]    >     "webapp":"/z_us/j",
   [junit4]    >     "path":"/dump1",
   [junit4]    >     "httpMethod":"GET"}}
   [junit4]    > 	at __randomizedtesting.SeedInfo.seed([EA92395D959EC658:62C606873B62ABA0]:0)
   [junit4]    > 	at org.apache.solr.core.TestSolrConfigHandler.testForResponseElement(TestSolrConfigHandler.java:458)
   [junit4]    > 	at org.apache.solr.handler.TestReqParamsAPI.testReqParams(TestReqParamsAPI.java:177)
   [junit4]    > 	at org.apache.solr.handler.TestReqParamsAPI.test(TestReqParamsAPI.java:67)
   [junit4]    > 	at org.apache.solr.BaseDistributedSearchTestCase$ShardsRepeatRule$ShardsFixedStatement.callStatement(BaseDistributedSearchTestCase.java:992)
   [junit4]    > 	at org.apache.solr.BaseDistributedSearchTestCase$ShardsRepeatRule$ShardsStatement.evaluate(BaseDistributedSearchTestCase.java:967)
   [junit4]    > 	at java.lang.Thread.run(Thread.java:745)
   [junit4]   2> 1080478 INFO  (SUITE-TestReqParamsAPI-seed#[EA92395D959EC658]-worker) [    ] o.a.s.SolrTestCaseJ4 ###deleteCore
   [junit4]   2> NOTE: leaving temporary files on disk at: /Users/jenkins/workspace/Lucene-Solr-master-MacOSX/solr/build/solr-core/test/J1/temp/solr.handler.TestReqParamsAPI_EA92395D959EC658-001
   [junit4]   2> NOTE: test params are: codec=FastDecompressionCompressingStoredFields(storedFieldsFormat=CompressingStoredFieldsFormat(compressionMode=FAST_DECOMPRESSION, chunkSize=6225, maxDocsPerChunk=7, blockSize=10), termVectorsFormat=CompressingTermVectorsFormat(compressionMode=FAST_DECOMPRESSION, chunkSize=6225, blockSize=10)), sim=RandomSimilarity(queryNorm=true,coord=crazy): {}, locale=pl, timezone=Africa/Mogadishu
   [junit4]   2> NOTE: Mac OS X 10.11.3 x86_64/Oracle Corporation 1.8.0_72 (64-bit)/cpus=3,threads=1,free=167118000,total=417857536
   [junit4]   2> NOTE: All tests run in this JVM: [TestSolrDynamicMBean, AnalyticsMergeStrategyTest, CdcrReplicationHandlerTest, TestJsonFacets, DefaultValueUpdateProcessorTest, TestCloudManagedSchema, OverseerStatusTest, TestSQLHandler, BinaryUpdateRequestHandlerTest, SignatureUpdateProcessorFactoryTest, TestValueSourceCache, TestSolrIndexConfig, ResponseLogComponentTest, SpatialHeatmapFacetsTest, ResponseHeaderTest, TestCloudDeleteByQuery, TestSolrQueryParserDefaultOperatorResource, TestSchemaVersionResource, TriLevelCompositeIdRoutingTest, LeaderInitiatedRecoveryOnCommitTest, TestDynamicFieldResource, ChangedSchemaMergeTest, SmileWriterTest, TestTolerantUpdateProcessorRandomCloud, TestConfigSetsAPI, TestClassicSimilarityFactory, AutoCommitTest, TestMissingGroups, TestCloudPivotFacet, BasicDistributedZk2Test, TestBinaryField, HighlighterConfigTest, BaseCdcrDistributedZkTest, TestBM25SimilarityFactory, TermVectorComponentTest, UUIDUpdateProcessorFallbackTest, SuggesterTSTTest, SuggestComponentTest, DistributedFacetPivotSmallTest, SolrCoreCheckLockOnStartupTest, BlockDirectoryTest, TestSchemaResource, TestCloudSchemaless, CoreAdminHandlerTest, TestNamedUpdateProcessors, CustomCollectionTest, TestOmitPositions, TestLMJelinekMercerSimilarityFactory, PluginInfoTest, TestOverriddenPrefixQueryForCustomFieldType, DistributedSuggestComponentTest, TestTrie, ClassificationUpdateProcessorFactoryTest, TestShortCircuitedRequests, LeaderElectionIntegrationTest, TestStressRecovery, TestLeaderInitiatedRecoveryThread, TestQueryTypes, FileUtilsTest, TestCollapseQParserPlugin, HdfsUnloadDistributedZkTest, TestReload, TestOrdValues, TestDistributedGrouping, OverseerCollectionConfigSetProcessorTest, TestAnalyzeInfixSuggestions, TestSuggestSpellingConverter, HdfsCollectionsAPIDistributedZkTest, TestZkChroot, TestMacros, TestRequestForwarding, MigrateRouteKeyTest, CoreAdminRequestStatusTest, SuggesterWFSTTest, CollectionsAPISolrJTest, TestObjectReleaseTracker, DocValuesMissingTest, DistributedQueryComponentCustomSortTest, MultiTermTest, TestSimpleTrackingShardHandler, SpellPossibilityIteratorTest, TestPerFieldSimilarity, FieldMutatingUpdateProcessorTest, TestCollationField, TestUseDocValuesAsStored, TestExactStatsCache, TestUtils, NotRequiredUniqueKeyTest, TestJoin, StatsComponentTest, TestHighFrequencyDictionaryFactory, SegmentsInfoRequestHandlerTest, DeleteLastCustomShardedReplicaTest, CurrencyFieldOpenExchangeTest, TestTrackingShardHandlerFactory, TestFiltering, TestReqParamsAPI]
   [junit4] Completed [191/584 (1!)] on J1 in 26.11s, 1 test, 1 failure <<< FAILURES!

[...truncated 1289 lines...]
BUILD FAILED
/Users/jenkins/workspace/Lucene-Solr-master-MacOSX/build.xml:740: The following error occurred while executing this line:
/Users/jenkins/workspace/Lucene-Solr-master-MacOSX/build.xml:684: The following error occurred while executing this line:
/Users/jenkins/workspace/Lucene-Solr-master-MacOSX/build.xml:59: The following error occurred while executing this line:
/Users/jenkins/workspace/Lucene-Solr-master-MacOSX/solr/build.xml:233: The following error occurred while executing this line:
/Users/jenkins/workspace/Lucene-Solr-master-MacOSX/solr/common-build.xml:529: The following error occurred while executing this line:
/Users/jenkins/workspace/Lucene-Solr-master-MacOSX/lucene/common-build.xml:1457: The following error occurred while executing this line:
/Users/jenkins/workspace/Lucene-Solr-master-MacOSX/lucene/common-build.xml:1014: There were test failures: 584 suites (10 ignored), 2353 tests, 1 failure, 119 ignored (69 assumptions) [seed: EA92395D959EC658]

Total time: 75 minutes 44 seconds
Build step 'Invoke Ant' marked build as failure
Archiving artifacts
[WARNINGS] Skipping publisher since build result is FAILURE
Recording test results
Email was triggered for: Failure - Any
Sending email for trigger: Failure - Any



Mime
View raw message