lucene-dev mailing list archives

Site index · List index
Message view « Date » · « Thread »
Top « Date » · « Thread »
From Policeman Jenkins Server <jenk...@thetaphi.de>
Subject [JENKINS] Lucene-Solr-master-Solaris (64bit/jdk1.8.0) - Build # 501 - Still Failing!
Date Tue, 05 Apr 2016 23:10:28 GMT
Build: http://jenkins.thetaphi.de/job/Lucene-Solr-master-Solaris/501/
Java: 64bit/jdk1.8.0 -XX:-UseCompressedOops -XX:+UseParallelGC

2 tests failed.
FAILED:  org.apache.solr.cloud.hdfs.StressHdfsTest.test

Error Message:
Could not load collection from ZK: delete_data_dir

Stack Trace:
org.apache.solr.common.SolrException: Could not load collection from ZK: delete_data_dir
	at __randomizedtesting.SeedInfo.seed([E6501D2B240C7E7D:6E0422F18AF01385]:0)
	at org.apache.solr.common.cloud.ZkStateReader.getCollectionLive(ZkStateReader.java:1015)
	at org.apache.solr.common.cloud.ZkStateReader$LazyCollectionRef.get(ZkStateReader.java:565)
	at org.apache.solr.common.cloud.ClusterState.getCollectionOrNull(ClusterState.java:189)
	at org.apache.solr.common.cloud.ClusterState.hasCollection(ClusterState.java:119)
	at org.apache.solr.client.solrj.impl.CloudSolrClient.getCollectionNames(CloudSolrClient.java:1171)
	at org.apache.solr.client.solrj.impl.CloudSolrClient.requestWithRetryOnStaleState(CloudSolrClient.java:893)
	at org.apache.solr.client.solrj.impl.CloudSolrClient.request(CloudSolrClient.java:866)
	at org.apache.solr.client.solrj.SolrRequest.process(SolrRequest.java:149)
	at org.apache.solr.client.solrj.SolrClient.commit(SolrClient.java:484)
	at org.apache.solr.client.solrj.SolrClient.commit(SolrClient.java:463)
	at org.apache.solr.cloud.hdfs.StressHdfsTest.createAndDeleteCollection(StressHdfsTest.java:196)
	at org.apache.solr.cloud.hdfs.StressHdfsTest.test(StressHdfsTest.java:99)
	at sun.reflect.NativeMethodAccessorImpl.invoke0(Native Method)
	at sun.reflect.NativeMethodAccessorImpl.invoke(NativeMethodAccessorImpl.java:62)
	at sun.reflect.DelegatingMethodAccessorImpl.invoke(DelegatingMethodAccessorImpl.java:43)
	at java.lang.reflect.Method.invoke(Method.java:498)
	at com.carrotsearch.randomizedtesting.RandomizedRunner.invoke(RandomizedRunner.java:1764)
	at com.carrotsearch.randomizedtesting.RandomizedRunner$8.evaluate(RandomizedRunner.java:871)
	at com.carrotsearch.randomizedtesting.RandomizedRunner$9.evaluate(RandomizedRunner.java:907)
	at com.carrotsearch.randomizedtesting.RandomizedRunner$10.evaluate(RandomizedRunner.java:921)
	at org.apache.solr.BaseDistributedSearchTestCase$ShardsRepeatRule$ShardsFixedStatement.callStatement(BaseDistributedSearchTestCase.java:985)
	at org.apache.solr.BaseDistributedSearchTestCase$ShardsRepeatRule$ShardsStatement.evaluate(BaseDistributedSearchTestCase.java:960)
	at com.carrotsearch.randomizedtesting.rules.SystemPropertiesRestoreRule$1.evaluate(SystemPropertiesRestoreRule.java:57)
	at org.apache.lucene.util.TestRuleSetupTeardownChained$1.evaluate(TestRuleSetupTeardownChained.java:49)
	at org.apache.lucene.util.AbstractBeforeAfterRule$1.evaluate(AbstractBeforeAfterRule.java:45)
	at org.apache.lucene.util.TestRuleThreadAndTestName$1.evaluate(TestRuleThreadAndTestName.java:48)
	at org.apache.lucene.util.TestRuleIgnoreAfterMaxFailures$1.evaluate(TestRuleIgnoreAfterMaxFailures.java:64)
	at org.apache.lucene.util.TestRuleMarkFailure$1.evaluate(TestRuleMarkFailure.java:47)
	at com.carrotsearch.randomizedtesting.rules.StatementAdapter.evaluate(StatementAdapter.java:36)
	at com.carrotsearch.randomizedtesting.ThreadLeakControl$StatementRunner.run(ThreadLeakControl.java:367)
	at com.carrotsearch.randomizedtesting.ThreadLeakControl.forkTimeoutingTask(ThreadLeakControl.java:809)
	at com.carrotsearch.randomizedtesting.ThreadLeakControl$3.evaluate(ThreadLeakControl.java:460)
	at com.carrotsearch.randomizedtesting.RandomizedRunner.runSingleTest(RandomizedRunner.java:880)
	at com.carrotsearch.randomizedtesting.RandomizedRunner$5.evaluate(RandomizedRunner.java:781)
	at com.carrotsearch.randomizedtesting.RandomizedRunner$6.evaluate(RandomizedRunner.java:816)
	at com.carrotsearch.randomizedtesting.RandomizedRunner$7.evaluate(RandomizedRunner.java:827)
	at com.carrotsearch.randomizedtesting.rules.StatementAdapter.evaluate(StatementAdapter.java:36)
	at com.carrotsearch.randomizedtesting.rules.SystemPropertiesRestoreRule$1.evaluate(SystemPropertiesRestoreRule.java:57)
	at org.apache.lucene.util.AbstractBeforeAfterRule$1.evaluate(AbstractBeforeAfterRule.java:45)
	at com.carrotsearch.randomizedtesting.rules.StatementAdapter.evaluate(StatementAdapter.java:36)
	at org.apache.lucene.util.TestRuleStoreClassName$1.evaluate(TestRuleStoreClassName.java:41)
	at com.carrotsearch.randomizedtesting.rules.NoShadowingOrOverridesOnMethodsRule$1.evaluate(NoShadowingOrOverridesOnMethodsRule.java:40)
	at com.carrotsearch.randomizedtesting.rules.NoShadowingOrOverridesOnMethodsRule$1.evaluate(NoShadowingOrOverridesOnMethodsRule.java:40)
	at com.carrotsearch.randomizedtesting.rules.StatementAdapter.evaluate(StatementAdapter.java:36)
	at com.carrotsearch.randomizedtesting.rules.StatementAdapter.evaluate(StatementAdapter.java:36)
	at com.carrotsearch.randomizedtesting.rules.StatementAdapter.evaluate(StatementAdapter.java:36)
	at org.apache.lucene.util.TestRuleAssertionsRequired$1.evaluate(TestRuleAssertionsRequired.java:53)
	at org.apache.lucene.util.TestRuleMarkFailure$1.evaluate(TestRuleMarkFailure.java:47)
	at org.apache.lucene.util.TestRuleIgnoreAfterMaxFailures$1.evaluate(TestRuleIgnoreAfterMaxFailures.java:64)
	at org.apache.lucene.util.TestRuleIgnoreTestSuites$1.evaluate(TestRuleIgnoreTestSuites.java:54)
	at com.carrotsearch.randomizedtesting.rules.StatementAdapter.evaluate(StatementAdapter.java:36)
	at com.carrotsearch.randomizedtesting.ThreadLeakControl$StatementRunner.run(ThreadLeakControl.java:367)
	at java.lang.Thread.run(Thread.java:745)
Caused by: org.apache.zookeeper.KeeperException$SessionExpiredException: KeeperErrorCode = Session expired for /collections/delete_data_dir/state.json
	at org.apache.zookeeper.KeeperException.create(KeeperException.java:127)
	at org.apache.zookeeper.KeeperException.create(KeeperException.java:51)
	at org.apache.zookeeper.ZooKeeper.getData(ZooKeeper.java:1155)
	at org.apache.solr.common.cloud.SolrZkClient$7.execute(SolrZkClient.java:348)
	at org.apache.solr.common.cloud.SolrZkClient$7.execute(SolrZkClient.java:345)
	at org.apache.solr.common.cloud.ZkCmdExecutor.retryOperation(ZkCmdExecutor.java:60)
	at org.apache.solr.common.cloud.SolrZkClient.getData(SolrZkClient.java:345)
	at org.apache.solr.common.cloud.ZkStateReader.fetchCollectionState(ZkStateReader.java:1026)
	at org.apache.solr.common.cloud.ZkStateReader.getCollectionLive(ZkStateReader.java:1013)
	... 52 more


FAILED:  org.apache.solr.cloud.overseer.ZkStateReaderTest.testStateFormatUpdateWithExplicitRefreshLazy

Error Message:
Could not find collection : c1

Stack Trace:
org.apache.solr.common.SolrException: Could not find collection : c1
	at __randomizedtesting.SeedInfo.seed([E6501D2B240C7E7D:8D1FBD565D03A347]:0)
	at org.apache.solr.common.cloud.ClusterState.getCollection(ClusterState.java:170)
	at org.apache.solr.cloud.overseer.ZkStateReaderTest.testStateFormatUpdate(ZkStateReaderTest.java:134)
	at org.apache.solr.cloud.overseer.ZkStateReaderTest.testStateFormatUpdateWithExplicitRefreshLazy(ZkStateReaderTest.java:45)
	at sun.reflect.NativeMethodAccessorImpl.invoke0(Native Method)
	at sun.reflect.NativeMethodAccessorImpl.invoke(NativeMethodAccessorImpl.java:62)
	at sun.reflect.DelegatingMethodAccessorImpl.invoke(DelegatingMethodAccessorImpl.java:43)
	at java.lang.reflect.Method.invoke(Method.java:498)
	at com.carrotsearch.randomizedtesting.RandomizedRunner.invoke(RandomizedRunner.java:1764)
	at com.carrotsearch.randomizedtesting.RandomizedRunner$8.evaluate(RandomizedRunner.java:871)
	at com.carrotsearch.randomizedtesting.RandomizedRunner$9.evaluate(RandomizedRunner.java:907)
	at com.carrotsearch.randomizedtesting.RandomizedRunner$10.evaluate(RandomizedRunner.java:921)
	at com.carrotsearch.randomizedtesting.rules.SystemPropertiesRestoreRule$1.evaluate(SystemPropertiesRestoreRule.java:57)
	at org.apache.lucene.util.TestRuleSetupTeardownChained$1.evaluate(TestRuleSetupTeardownChained.java:49)
	at org.apache.lucene.util.AbstractBeforeAfterRule$1.evaluate(AbstractBeforeAfterRule.java:45)
	at org.apache.lucene.util.TestRuleThreadAndTestName$1.evaluate(TestRuleThreadAndTestName.java:48)
	at org.apache.lucene.util.TestRuleIgnoreAfterMaxFailures$1.evaluate(TestRuleIgnoreAfterMaxFailures.java:64)
	at org.apache.lucene.util.TestRuleMarkFailure$1.evaluate(TestRuleMarkFailure.java:47)
	at com.carrotsearch.randomizedtesting.rules.StatementAdapter.evaluate(StatementAdapter.java:36)
	at com.carrotsearch.randomizedtesting.ThreadLeakControl$StatementRunner.run(ThreadLeakControl.java:367)
	at com.carrotsearch.randomizedtesting.ThreadLeakControl.forkTimeoutingTask(ThreadLeakControl.java:809)
	at com.carrotsearch.randomizedtesting.ThreadLeakControl$3.evaluate(ThreadLeakControl.java:460)
	at com.carrotsearch.randomizedtesting.RandomizedRunner.runSingleTest(RandomizedRunner.java:880)
	at com.carrotsearch.randomizedtesting.RandomizedRunner$5.evaluate(RandomizedRunner.java:781)
	at com.carrotsearch.randomizedtesting.RandomizedRunner$6.evaluate(RandomizedRunner.java:816)
	at com.carrotsearch.randomizedtesting.RandomizedRunner$7.evaluate(RandomizedRunner.java:827)
	at com.carrotsearch.randomizedtesting.rules.StatementAdapter.evaluate(StatementAdapter.java:36)
	at com.carrotsearch.randomizedtesting.rules.SystemPropertiesRestoreRule$1.evaluate(SystemPropertiesRestoreRule.java:57)
	at org.apache.lucene.util.AbstractBeforeAfterRule$1.evaluate(AbstractBeforeAfterRule.java:45)
	at com.carrotsearch.randomizedtesting.rules.StatementAdapter.evaluate(StatementAdapter.java:36)
	at org.apache.lucene.util.TestRuleStoreClassName$1.evaluate(TestRuleStoreClassName.java:41)
	at com.carrotsearch.randomizedtesting.rules.NoShadowingOrOverridesOnMethodsRule$1.evaluate(NoShadowingOrOverridesOnMethodsRule.java:40)
	at com.carrotsearch.randomizedtesting.rules.NoShadowingOrOverridesOnMethodsRule$1.evaluate(NoShadowingOrOverridesOnMethodsRule.java:40)
	at com.carrotsearch.randomizedtesting.rules.StatementAdapter.evaluate(StatementAdapter.java:36)
	at com.carrotsearch.randomizedtesting.rules.StatementAdapter.evaluate(StatementAdapter.java:36)
	at com.carrotsearch.randomizedtesting.rules.StatementAdapter.evaluate(StatementAdapter.java:36)
	at org.apache.lucene.util.TestRuleAssertionsRequired$1.evaluate(TestRuleAssertionsRequired.java:53)
	at org.apache.lucene.util.TestRuleMarkFailure$1.evaluate(TestRuleMarkFailure.java:47)
	at org.apache.lucene.util.TestRuleIgnoreAfterMaxFailures$1.evaluate(TestRuleIgnoreAfterMaxFailures.java:64)
	at org.apache.lucene.util.TestRuleIgnoreTestSuites$1.evaluate(TestRuleIgnoreTestSuites.java:54)
	at com.carrotsearch.randomizedtesting.rules.StatementAdapter.evaluate(StatementAdapter.java:36)
	at com.carrotsearch.randomizedtesting.ThreadLeakControl$StatementRunner.run(ThreadLeakControl.java:367)
	at java.lang.Thread.run(Thread.java:745)




Build Log:
[...truncated 10782 lines...]
   [junit4] Suite: org.apache.solr.cloud.overseer.ZkStateReaderTest
   [junit4]   2> Creating dataDir: /export/home/jenkins/workspace/Lucene-Solr-master-Solaris/solr/build/solr-core/test/J1/temp/solr.cloud.overseer.ZkStateReaderTest_E6501D2B240C7E7D-001/init-core-data-001
   [junit4]   2> 307119 INFO  (SUITE-ZkStateReaderTest-seed#[E6501D2B240C7E7D]-worker) [    ] o.a.s.SolrTestCaseJ4 Randomized ssl (false) and clientAuth (true)
   [junit4]   2> 307124 INFO  (TEST-ZkStateReaderTest.testExternalCollectionWatchedNotWatched-seed#[E6501D2B240C7E7D]) [    ] o.a.s.SolrTestCaseJ4 ###Starting testExternalCollectionWatchedNotWatched
   [junit4]   2> 307125 INFO  (TEST-ZkStateReaderTest.testExternalCollectionWatchedNotWatched-seed#[E6501D2B240C7E7D]) [    ] o.a.s.c.ZkTestServer STARTING ZK TEST SERVER
   [junit4]   2> 307125 INFO  (Thread-1060) [    ] o.a.s.c.ZkTestServer client port:0.0.0.0/0.0.0.0:0
   [junit4]   2> 307125 INFO  (Thread-1060) [    ] o.a.s.c.ZkTestServer Starting server
   [junit4]   2> 307225 INFO  (TEST-ZkStateReaderTest.testExternalCollectionWatchedNotWatched-seed#[E6501D2B240C7E7D]) [    ] o.a.s.c.ZkTestServer start zk server on port:52335
   [junit4]   2> 307225 INFO  (TEST-ZkStateReaderTest.testExternalCollectionWatchedNotWatched-seed#[E6501D2B240C7E7D]) [    ] o.a.s.c.c.SolrZkClient Using default ZkCredentialsProvider
   [junit4]   2> 307226 INFO  (TEST-ZkStateReaderTest.testExternalCollectionWatchedNotWatched-seed#[E6501D2B240C7E7D]) [    ] o.a.s.c.c.ConnectionManager Waiting for client to connect to ZooKeeper
   [junit4]   2> 307230 INFO  (zkCallback-511-thread-1) [    ] o.a.s.c.c.ConnectionManager Watcher org.apache.solr.common.cloud.ConnectionManager@f67330d name:ZooKeeperConnection Watcher:127.0.0.1:52335 got event WatchedEvent state:SyncConnected type:None path:null path:null type:None
   [junit4]   2> 307231 INFO  (TEST-ZkStateReaderTest.testExternalCollectionWatchedNotWatched-seed#[E6501D2B240C7E7D]) [    ] o.a.s.c.c.ConnectionManager Client is connected to ZooKeeper
   [junit4]   2> 307231 INFO  (TEST-ZkStateReaderTest.testExternalCollectionWatchedNotWatched-seed#[E6501D2B240C7E7D]) [    ] o.a.s.c.c.SolrZkClient Using default ZkACLProvider
   [junit4]   2> 307232 INFO  (TEST-ZkStateReaderTest.testExternalCollectionWatchedNotWatched-seed#[E6501D2B240C7E7D]) [    ] o.a.s.c.c.SolrZkClient Using default ZkCredentialsProvider
   [junit4]   2> 307233 INFO  (TEST-ZkStateReaderTest.testExternalCollectionWatchedNotWatched-seed#[E6501D2B240C7E7D]) [    ] o.a.s.c.c.ConnectionManager Waiting for client to connect to ZooKeeper
   [junit4]   2> 307237 INFO  (zkCallback-512-thread-1) [    ] o.a.s.c.c.ConnectionManager Watcher org.apache.solr.common.cloud.ConnectionManager@368f734b name:ZooKeeperConnection Watcher:127.0.0.1:52335 got event WatchedEvent state:SyncConnected type:None path:null path:null type:None
   [junit4]   2> 307237 INFO  (TEST-ZkStateReaderTest.testExternalCollectionWatchedNotWatched-seed#[E6501D2B240C7E7D]) [    ] o.a.s.c.c.ConnectionManager Client is connected to ZooKeeper
   [junit4]   2> 307237 INFO  (TEST-ZkStateReaderTest.testExternalCollectionWatchedNotWatched-seed#[E6501D2B240C7E7D]) [    ] o.a.s.c.c.SolrZkClient Using default ZkACLProvider
   [junit4]   2> 307237 INFO  (TEST-ZkStateReaderTest.testExternalCollectionWatchedNotWatched-seed#[E6501D2B240C7E7D]) [    ] o.a.s.c.c.SolrZkClient makePath: /solr
   [junit4]   2> 307246 INFO  (TEST-ZkStateReaderTest.testExternalCollectionWatchedNotWatched-seed#[E6501D2B240C7E7D]) [    ] o.a.s.c.c.SolrZkClient Using default ZkCredentialsProvider
   [junit4]   2> 307246 INFO  (TEST-ZkStateReaderTest.testExternalCollectionWatchedNotWatched-seed#[E6501D2B240C7E7D]) [    ] o.a.s.c.c.ConnectionManager Waiting for client to connect to ZooKeeper
   [junit4]   2> 307250 INFO  (zkCallback-513-thread-1) [    ] o.a.s.c.c.ConnectionManager Watcher org.apache.solr.common.cloud.ConnectionManager@60ba6b83 name:ZooKeeperConnection Watcher:127.0.0.1:52335/solr got event WatchedEvent state:SyncConnected type:None path:null path:null type:None
   [junit4]   2> 307250 INFO  (TEST-ZkStateReaderTest.testExternalCollectionWatchedNotWatched-seed#[E6501D2B240C7E7D]) [    ] o.a.s.c.c.ConnectionManager Client is connected to ZooKeeper
   [junit4]   2> 307251 INFO  (TEST-ZkStateReaderTest.testExternalCollectionWatchedNotWatched-seed#[E6501D2B240C7E7D]) [    ] o.a.s.c.c.SolrZkClient Using default ZkACLProvider
   [junit4]   2> 307251 INFO  (TEST-ZkStateReaderTest.testExternalCollectionWatchedNotWatched-seed#[E6501D2B240C7E7D]) [    ] o.a.s.c.c.SolrZkClient makePath: /live_nodes
   [junit4]   2> 307253 INFO  (TEST-ZkStateReaderTest.testExternalCollectionWatchedNotWatched-seed#[E6501D2B240C7E7D]) [    ] o.a.s.c.c.SolrZkClient makePath: /collections
   [junit4]   2> 307255 INFO  (TEST-ZkStateReaderTest.testExternalCollectionWatchedNotWatched-seed#[E6501D2B240C7E7D]) [    ] o.a.s.c.c.SolrZkClient makePath: /aliases.json
   [junit4]   2> 307257 INFO  (TEST-ZkStateReaderTest.testExternalCollectionWatchedNotWatched-seed#[E6501D2B240C7E7D]) [    ] o.a.s.c.c.SolrZkClient makePath: /clusterstate.json
   [junit4]   2> 307259 INFO  (TEST-ZkStateReaderTest.testExternalCollectionWatchedNotWatched-seed#[E6501D2B240C7E7D]) [    ] o.a.s.c.c.SolrZkClient makePath: /security.json
   [junit4]   2> 307260 INFO  (TEST-ZkStateReaderTest.testExternalCollectionWatchedNotWatched-seed#[E6501D2B240C7E7D]) [    ] o.a.s.c.c.ZkStateReader Updating cluster state from ZooKeeper... 
   [junit4]   2> 307263 INFO  (TEST-ZkStateReaderTest.testExternalCollectionWatchedNotWatched-seed#[E6501D2B240C7E7D]) [    ] o.a.s.c.c.ZkStateReader Updated live nodes from ZooKeeper... (0) -> (0)
   [junit4]   2> 307264 INFO  (TEST-ZkStateReaderTest.testExternalCollectionWatchedNotWatched-seed#[E6501D2B240C7E7D]) [    ] o.a.s.c.c.SolrZkClient makePath: /collections/c1
   [junit4]   2> 307265 INFO  (zkCallback-513-thread-1) [    ] o.a.s.c.c.ZkStateReader A collections change: [WatchedEvent state:SyncConnected type:NodeChildrenChanged path:/collections], has occurred - updating...
   [junit4]   2> 307267 INFO  (TEST-ZkStateReaderTest.testExternalCollectionWatchedNotWatched-seed#[E6501D2B240C7E7D]) [    ] o.a.s.c.o.ZkStateWriter going to create_collection /collections/c1/state.json
   [junit4]   2> 307268 INFO  (TEST-ZkStateReaderTest.testExternalCollectionWatchedNotWatched-seed#[E6501D2B240C7E7D]) [    ] o.a.s.c.c.ZkStateReader addZkWatch [c1]
   [junit4]   2> 307269 INFO  (TEST-ZkStateReaderTest.testExternalCollectionWatchedNotWatched-seed#[E6501D2B240C7E7D]) [    ] o.a.s.c.c.ZkStateReader Add data for [c1] ver [0]
   [junit4]   2> 307270 INFO  (TEST-ZkStateReaderTest.testExternalCollectionWatchedNotWatched-seed#[E6501D2B240C7E7D]) [    ] o.a.s.c.c.ZkStateReader Removing watch for uninteresting collection [c1]
   [junit4]   2> 307273 INFO  (TEST-ZkStateReaderTest.testExternalCollectionWatchedNotWatched-seed#[E6501D2B240C7E7D]) [    ] o.a.s.c.ZkTestServer connecting to 127.0.0.1:52335 52335
   [junit4]   2> 307301 INFO  (Thread-1060) [    ] o.a.s.c.ZkTestServer connecting to 127.0.0.1:52335 52335
   [junit4]   2> 307318 INFO  (TEST-ZkStateReaderTest.testExternalCollectionWatchedNotWatched-seed#[E6501D2B240C7E7D]) [    ] o.a.s.SolrTestCaseJ4 ###Ending testExternalCollectionWatchedNotWatched
   [junit4]   2> 307332 INFO  (TEST-ZkStateReaderTest.testStateFormatUpdateWithTimeDelay-seed#[E6501D2B240C7E7D]) [    ] o.a.s.SolrTestCaseJ4 ###Starting testStateFormatUpdateWithTimeDelay
   [junit4]   2> 307333 INFO  (TEST-ZkStateReaderTest.testStateFormatUpdateWithTimeDelay-seed#[E6501D2B240C7E7D]) [    ] o.a.s.c.ZkTestServer STARTING ZK TEST SERVER
   [junit4]   2> 307333 INFO  (Thread-1061) [    ] o.a.s.c.ZkTestServer client port:0.0.0.0/0.0.0.0:0
   [junit4]   2> 307333 INFO  (Thread-1061) [    ] o.a.s.c.ZkTestServer Starting server
   [junit4]   2> 307434 INFO  (TEST-ZkStateReaderTest.testStateFormatUpdateWithTimeDelay-seed#[E6501D2B240C7E7D]) [    ] o.a.s.c.ZkTestServer start zk server on port:64841
   [junit4]   2> 307434 INFO  (TEST-ZkStateReaderTest.testStateFormatUpdateWithTimeDelay-seed#[E6501D2B240C7E7D]) [    ] o.a.s.c.c.SolrZkClient Using default ZkCredentialsProvider
   [junit4]   2> 307434 INFO  (TEST-ZkStateReaderTest.testStateFormatUpdateWithTimeDelay-seed#[E6501D2B240C7E7D]) [    ] o.a.s.c.c.ConnectionManager Waiting for client to connect to ZooKeeper
   [junit4]   2> 307445 INFO  (zkCallback-514-thread-1) [    ] o.a.s.c.c.ConnectionManager Watcher org.apache.solr.common.cloud.ConnectionManager@6a38dcfb name:ZooKeeperConnection Watcher:127.0.0.1:64841 got event WatchedEvent state:SyncConnected type:None path:null path:null type:None
   [junit4]   2> 307445 INFO  (TEST-ZkStateReaderTest.testStateFormatUpdateWithTimeDelay-seed#[E6501D2B240C7E7D]) [    ] o.a.s.c.c.ConnectionManager Client is connected to ZooKeeper
   [junit4]   2> 307445 INFO  (TEST-ZkStateReaderTest.testStateFormatUpdateWithTimeDelay-seed#[E6501D2B240C7E7D]) [    ] o.a.s.c.c.SolrZkClient Using default ZkACLProvider
   [junit4]   2> 307451 INFO  (TEST-ZkStateReaderTest.testStateFormatUpdateWithTimeDelay-seed#[E6501D2B240C7E7D]) [    ] o.a.s.c.c.SolrZkClient Using default ZkCredentialsProvider
   [junit4]   2> 307451 INFO  (TEST-ZkStateReaderTest.testStateFormatUpdateWithTimeDelay-seed#[E6501D2B240C7E7D]) [    ] o.a.s.c.c.ConnectionManager Waiting for client to connect to ZooKeeper
   [junit4]   2> 307452 INFO  (zkCallback-515-thread-1) [    ] o.a.s.c.c.ConnectionManager Watcher org.apache.solr.common.cloud.ConnectionManager@4314a2d1 name:ZooKeeperConnection Watcher:127.0.0.1:64841 got event WatchedEvent state:SyncConnected type:None path:null path:null type:None
   [junit4]   2> 307453 INFO  (TEST-ZkStateReaderTest.testStateFormatUpdateWithTimeDelay-seed#[E6501D2B240C7E7D]) [    ] o.a.s.c.c.ConnectionManager Client is connected to ZooKeeper
   [junit4]   2> 307453 INFO  (TEST-ZkStateReaderTest.testStateFormatUpdateWithTimeDelay-seed#[E6501D2B240C7E7D]) [    ] o.a.s.c.c.SolrZkClient Using default ZkACLProvider
   [junit4]   2> 307453 INFO  (TEST-ZkStateReaderTest.testStateFormatUpdateWithTimeDelay-seed#[E6501D2B240C7E7D]) [    ] o.a.s.c.c.SolrZkClient makePath: /solr
   [junit4]   2> 307463 INFO  (TEST-ZkStateReaderTest.testStateFormatUpdateWithTimeDelay-seed#[E6501D2B240C7E7D]) [    ] o.a.s.c.c.SolrZkClient Using default ZkCredentialsProvider
   [junit4]   2> 307463 INFO  (TEST-ZkStateReaderTest.testStateFormatUpdateWithTimeDelay-seed#[E6501D2B240C7E7D]) [    ] o.a.s.c.c.ConnectionManager Waiting for client to connect to ZooKeeper
   [junit4]   2> 307466 INFO  (zkCallback-516-thread-1) [    ] o.a.s.c.c.ConnectionManager Watcher org.apache.solr.common.cloud.ConnectionManager@383ab22c name:ZooKeeperConnection Watcher:127.0.0.1:64841/solr got event WatchedEvent state:SyncConnected type:None path:null path:null type:None
   [junit4]   2> 307466 INFO  (TEST-ZkStateReaderTest.testStateFormatUpdateWithTimeDelay-seed#[E6501D2B240C7E7D]) [    ] o.a.s.c.c.ConnectionManager Client is connected to ZooKeeper
   [junit4]   2> 307466 INFO  (TEST-ZkStateReaderTest.testStateFormatUpdateWithTimeDelay-seed#[E6501D2B240C7E7D]) [    ] o.a.s.c.c.SolrZkClient Using default ZkACLProvider
   [junit4]   2> 307467 INFO  (TEST-ZkStateReaderTest.testStateFormatUpdateWithTimeDelay-seed#[E6501D2B240C7E7D]) [    ] o.a.s.c.c.SolrZkClient makePath: /live_nodes
   [junit4]   2> 307468 INFO  (TEST-ZkStateReaderTest.testStateFormatUpdateWithTimeDelay-seed#[E6501D2B240C7E7D]) [    ] o.a.s.c.c.SolrZkClient makePath: /collections
   [junit4]   2> 307470 INFO  (TEST-ZkStateReaderTest.testStateFormatUpdateWithTimeDelay-seed#[E6501D2B240C7E7D]) [    ] o.a.s.c.c.SolrZkClient makePath: /aliases.json
   [junit4]   2> 307471 INFO  (TEST-ZkStateReaderTest.testStateFormatUpdateWithTimeDelay-seed#[E6501D2B240C7E7D]) [    ] o.a.s.c.c.SolrZkClient makePath: /clusterstate.json
   [junit4]   2> 307472 INFO  (TEST-ZkStateReaderTest.testStateFormatUpdateWithTimeDelay-seed#[E6501D2B240C7E7D]) [    ] o.a.s.c.c.SolrZkClient makePath: /security.json
   [junit4]   2> 307474 INFO  (TEST-ZkStateReaderTest.testStateFormatUpdateWithTimeDelay-seed#[E6501D2B240C7E7D]) [    ] o.a.s.c.c.ZkStateReader Updating cluster state from ZooKeeper... 
   [junit4]   2> 307476 INFO  (TEST-ZkStateReaderTest.testStateFormatUpdateWithTimeDelay-seed#[E6501D2B240C7E7D]) [    ] o.a.s.c.c.ZkStateReader Updated live nodes from ZooKeeper... (0) -> (0)
   [junit4]   2> 307477 INFO  (TEST-ZkStateReaderTest.testStateFormatUpdateWithTimeDelay-seed#[E6501D2B240C7E7D]) [    ] o.a.s.c.c.ZkStateReader addZkWatch [c1]
   [junit4]   2> 307477 INFO  (TEST-ZkStateReaderTest.testStateFormatUpdateWithTimeDelay-seed#[E6501D2B240C7E7D]) [    ] o.a.s.c.c.ZkStateReader Deleting data for [c1]
   [junit4]   2> 307478 INFO  (TEST-ZkStateReaderTest.testStateFormatUpdateWithTimeDelay-seed#[E6501D2B240C7E7D]) [    ] o.a.s.c.c.ZkStateReader Deleting data for [c1]
   [junit4]   2> 307478 INFO  (TEST-ZkStateReaderTest.testStateFormatUpdateWithTimeDelay-seed#[E6501D2B240C7E7D]) [    ] o.a.s.c.c.SolrZkClient makePath: /collections/c1
   [junit4]   2> 307481 INFO  (zkCallback-516-thread-1) [    ] o.a.s.c.c.ZkStateReader A collections change: [WatchedEvent state:SyncConnected type:NodeChildrenChanged path:/collections], has occurred - updating...
   [junit4]   2> 307482 INFO  (zkCallback-516-thread-1) [    ] o.a.s.c.c.ZkStateReader Deleting data for [c1]
   [junit4]   2> 307483 INFO  (zkCallback-516-thread-2) [    ] o.a.s.c.c.ZkStateReader A cluster state change: [WatchedEvent state:SyncConnected type:NodeDataChanged path:/clusterstate.json], has occurred - updating... (live nodes size: [0])
   [junit4]   2> 307534 INFO  (TEST-ZkStateReaderTest.testStateFormatUpdateWithTimeDelay-seed#[E6501D2B240C7E7D]) [    ] o.a.s.c.o.ZkStateWriter going to create_collection /collections/c1/state.json
   [junit4]   2> 307536 INFO  (zkCallback-516-thread-2) [    ] o.a.s.c.c.ZkStateReader A cluster state change: [WatchedEvent state:SyncConnected type:NodeDataChanged path:/clusterstate.json], has occurred - updating... (live nodes size: [0])
   [junit4]   2> 307537 INFO  (zkCallback-516-thread-2) [    ] o.a.s.c.c.ZkStateReader Add data for [c1] ver [0]
   [junit4]   2> 307539 INFO  (TEST-ZkStateReaderTest.testStateFormatUpdateWithTimeDelay-seed#[E6501D2B240C7E7D]) [    ] o.a.s.c.ZkTestServer connecting to 127.0.0.1:64841 64841
   [junit4]   2> 307575 INFO  (Thread-1061) [    ] o.a.s.c.ZkTestServer connecting to 127.0.0.1:64841 64841
   [junit4]   2> 307576 INFO  (TEST-ZkStateReaderTest.testStateFormatUpdateWithTimeDelay-seed#[E6501D2B240C7E7D]) [    ] o.a.s.SolrTestCaseJ4 ###Ending testStateFormatUpdateWithTimeDelay
   [junit4]   2> 307579 INFO  (TEST-ZkStateReaderTest.testStateFormatUpdateWithExplicitRefreshLazy-seed#[E6501D2B240C7E7D]) [    ] o.a.s.SolrTestCaseJ4 ###Starting testStateFormatUpdateWithExplicitRefreshLazy
   [junit4]   2> 307579 INFO  (TEST-ZkStateReaderTest.testStateFormatUpdateWithExplicitRefreshLazy-seed#[E6501D2B240C7E7D]) [    ] o.a.s.c.ZkTestServer STARTING ZK TEST SERVER
   [junit4]   2> 307579 INFO  (Thread-1062) [    ] o.a.s.c.ZkTestServer client port:0.0.0.0/0.0.0.0:0
   [junit4]   2> 307579 INFO  (Thread-1062) [    ] o.a.s.c.ZkTestServer Starting server
   [junit4]   2> 307679 INFO  (TEST-ZkStateReaderTest.testStateFormatUpdateWithExplicitRefreshLazy-seed#[E6501D2B240C7E7D]) [    ] o.a.s.c.ZkTestServer start zk server on port:64641
   [junit4]   2> 307679 INFO  (TEST-ZkStateReaderTest.testStateFormatUpdateWithExplicitRefreshLazy-seed#[E6501D2B240C7E7D]) [    ] o.a.s.c.c.SolrZkClient Using default ZkCredentialsProvider
   [junit4]   2> 307680 INFO  (TEST-ZkStateReaderTest.testStateFormatUpdateWithExplicitRefreshLazy-seed#[E6501D2B240C7E7D]) [    ] o.a.s.c.c.ConnectionManager Waiting for client to connect to ZooKeeper
   [junit4]   2> 307683 INFO  (zkCallback-517-thread-1) [    ] o.a.s.c.c.ConnectionManager Watcher org.apache.solr.common.cloud.ConnectionManager@3f6c3e6f name:ZooKeeperConnection Watcher:127.0.0.1:64641 got event WatchedEvent state:SyncConnected type:None path:null path:null type:None
   [junit4]   2> 307683 INFO  (TEST-ZkStateReaderTest.testStateFormatUpdateWithExplicitRefreshLazy-seed#[E6501D2B240C7E7D]) [    ] o.a.s.c.c.ConnectionManager Client is connected to ZooKeeper
   [junit4]   2> 307683 INFO  (TEST-ZkStateReaderTest.testStateFormatUpdateWithExplicitRefreshLazy-seed#[E6501D2B240C7E7D]) [    ] o.a.s.c.c.SolrZkClient Using default ZkACLProvider
   [junit4]   2> 307685 INFO  (TEST-ZkStateReaderTest.testStateFormatUpdateWithExplicitRefreshLazy-seed#[E6501D2B240C7E7D]) [    ] o.a.s.c.c.SolrZkClient Using default ZkCredentialsProvider
   [junit4]   2> 307685 INFO  (TEST-ZkStateReaderTest.testStateFormatUpdateWithExplicitRefreshLazy-seed#[E6501D2B240C7E7D]) [    ] o.a.s.c.c.ConnectionManager Waiting for client to connect to ZooKeeper
   [junit4]   2> 307686 INFO  (zkCallback-518-thread-1) [    ] o.a.s.c.c.ConnectionManager Watcher org.apache.solr.common.cloud.ConnectionManager@49caa9df name:ZooKeeperConnection Watcher:127.0.0.1:64641 got event WatchedEvent state:SyncConnected type:None path:null path:null type:None
   [junit4]   2> 307687 INFO  (TEST-ZkStateReaderTest.testStateFormatUpdateWithExplicitRefreshLazy-seed#[E6501D2B240C7E7D]) [    ] o.a.s.c.c.ConnectionManager Client is connected to ZooKeeper
   [junit4]   2> 307687 INFO  (TEST-ZkStateReaderTest.testStateFormatUpdateWithExplicitRefreshLazy-seed#[E6501D2B240C7E7D]) [    ] o.a.s.c.c.SolrZkClient Using default ZkACLProvider
   [junit4]   2> 307687 INFO  (TEST-ZkStateReaderTest.testStateFormatUpdateWithExplicitRefreshLazy-seed#[E6501D2B240C7E7D]) [    ] o.a.s.c.c.SolrZkClient makePath: /solr
   [junit4]   2> 307691 INFO  (TEST-ZkStateReaderTest.testStateFormatUpdateWithExplicitRefreshLazy-seed#[E6501D2B240C7E7D]) [    ] o.a.s.c.c.SolrZkClient Using default ZkCredentialsProvider
   [junit4]   2> 307692 INFO  (TEST-ZkStateReaderTest.testStateFormatUpdateWithExplicitRefreshLazy-seed#[E6501D2B240C7E7D]) [    ] o.a.s.c.c.ConnectionManager Waiting for client to connect to ZooKeeper
   [junit4]   2> 307693 INFO  (zkCallback-519-thread-1) [    ] o.a.s.c.c.ConnectionManager Watcher org.apache.solr.common.cloud.ConnectionManager@437fc4 name:ZooKeeperConnection Watcher:127.0.0.1:64641/solr got event WatchedEvent state:SyncConnected type:None path:null path:null type:None
   [junit4]   2> 307693 INFO  (TEST-ZkStateReaderTest.testStateFormatUpdateWithExplicitRefreshLazy-seed#[E6501D2B240C7E7D]) [    ] o.a.s.c.c.ConnectionManager Client is connected to ZooKeeper
   [junit4]   2> 307693 INFO  (TEST-ZkStateReaderTest.testStateFormatUpdateWithExplicitRefreshLazy-seed#[E6501D2B240C7E7D]) [    ] o.a.s.c.c.SolrZkClient Using default ZkACLProvider
   [junit4]   2> 307694 INFO  (TEST-ZkStateReaderTest.testStateFormatUpdateWithExplicitRefreshLazy-seed#[E6501D2B240C7E7D]) [    ] o.a.s.c.c.SolrZkClient makePath: /live_nodes
   [junit4]   2> 307696 INFO  (TEST-ZkStateReaderTest.testStateFormatUpdateWithExplicitRefreshLazy-seed#[E6501D2B240C7E7D]) [    ] o.a.s.c.c.SolrZkClient makePath: /collections
   [junit4]   2> 307698 INFO  (TEST-ZkStateReaderTest.testStateFormatUpdateWithExplicitRefreshLazy-seed#[E6501D2B240C7E7D]) [    ] o.a.s.c.c.SolrZkClient makePath: /aliases.json
   [junit4]   2> 307699 INFO  (TEST-ZkStateReaderTest.testStateFormatUpdateWithExplicitRefreshLazy-seed#[E6501D2B240C7E7D]) [    ] o.a.s.c.c.SolrZkClient makePath: /clusterstate.json
   [junit4]   2> 307702 INFO  (TEST-ZkStateReaderTest.testStateFormatUpdateWithExplicitRefreshLazy-seed#[E6501D2B240C7E7D]) [    ] o.a.s.c.c.SolrZkClient makePath: /security.json
   [junit4]   2> 307703 INFO  (TEST-ZkStateReaderTest.testStateFormatUpdateWithExplicitRefreshLazy-seed#[E6501D2B240C7E7D]) [    ] o.a.s.c.c.ZkStateReader Updating cluster state from ZooKeeper... 
   [junit4]   2> 307704 INFO  (TEST-ZkStateReaderTest.testStateFormatUpdateWithExplicitRefreshLazy-seed#[E6501D2B240C7E7D]) [    ] o.a.s.c.c.ZkStateReader Updated live nodes from ZooKeeper... (0) -> (0)
   [junit4]   2> 307705 INFO  (TEST-ZkStateReaderTest.testStateFormatUpdateWithExplicitRefreshLazy-seed#[E6501D2B240C7E7D]) [    ] o.a.s.c.c.SolrZkClient makePath: /collections/c1
   [junit4]   2> 307708 INFO  (TEST-ZkStateReaderTest.testStateFormatUpdateWithExplicitRefreshLazy-seed#[E6501D2B240C7E7D]) [    ] o.a.s.c.o.ZkStateWriter going to create_collection /collections/c1/state.json
   [junit4]   2> 307711 INFO  (zkCallback-519-thread-1) [    ] o.a.s.c.c.ZkStateReader A collections change: [WatchedEvent state:SyncConnected type:NodeChildrenChanged path:/collections], has occurred - updating...
   [junit4]   2> 307712 INFO  (zkCallback-519-thread-2) [    ] o.a.s.c.c.ZkStateReader A cluster state change: [WatchedEvent state:SyncConnected type:NodeDataChanged path:/clusterstate.json], has occurred - updating... (live nodes size: [0])
   [junit4]   2> 307713 WARN  (zkCallback-519-thread-2) [    ] o.a.s.c.c.ZkStateReader ZooKeeper watch triggered, but Solr cannot talk to ZK: [KeeperErrorCode = Session expired for /clusterstate.json]
   [junit4]   2> 309212 WARN  (zkCallback-519-thread-1) [    ] o.a.s.c.c.ZkStateReader ZooKeeper watch triggered, but Solr cannot talk to ZK: [KeeperErrorCode = Session expired for /collections]
   [junit4]   2> 309213 INFO  (TEST-ZkStateReaderTest.testStateFormatUpdateWithExplicitRefreshLazy-seed#[E6501D2B240C7E7D]) [    ] o.a.s.c.ZkTestServer connecting to 127.0.0.1:64641 64641
   [junit4]   2> 309252 INFO  (Thread-1062) [    ] o.a.s.c.ZkTestServer connecting to 127.0.0.1:64641 64641
   [junit4]   2> 309254 INFO  (TEST-ZkStateReaderTest.testStateFormatUpdateWithExplicitRefreshLazy-seed#[E6501D2B240C7E7D]) [    ] o.a.s.SolrTestCaseJ4 ###Ending testStateFormatUpdateWithExplicitRefreshLazy
   [junit4]   2> NOTE: reproduce with: ant test  -Dtestcase=ZkStateReaderTest -Dtests.method=testStateFormatUpdateWithExplicitRefreshLazy -Dtests.seed=E6501D2B240C7E7D -Dtests.slow=true -Dtests.locale=de-GR -Dtests.timezone=Pacific/Norfolk -Dtests.asserts=true -Dtests.file.encoding=UTF-8
   [junit4] ERROR   1.68s J1 | ZkStateReaderTest.testStateFormatUpdateWithExplicitRefreshLazy <<<
   [junit4]    > Throwable #1: org.apache.solr.common.SolrException: Could not find collection : c1
   [junit4]    > 	at __randomizedtesting.SeedInfo.seed([E6501D2B240C7E7D:8D1FBD565D03A347]:0)
   [junit4]    > 	at org.apache.solr.common.cloud.ClusterState.getCollection(ClusterState.java:170)
   [junit4]    > 	at org.apache.solr.cloud.overseer.ZkStateReaderTest.testStateFormatUpdate(ZkStateReaderTest.java:134)
   [junit4]    > 	at org.apache.solr.cloud.overseer.ZkStateReaderTest.testStateFormatUpdateWithExplicitRefreshLazy(ZkStateReaderTest.java:45)
   [junit4]    > 	at java.lang.Thread.run(Thread.java:745)
   [junit4]   2> 309261 INFO  (TEST-ZkStateReaderTest.testStateFormatUpdateWithTimeDelayLazy-seed#[E6501D2B240C7E7D]) [    ] o.a.s.SolrTestCaseJ4 ###Starting testStateFormatUpdateWithTimeDelayLazy
   [junit4]   2> 309262 INFO  (TEST-ZkStateReaderTest.testStateFormatUpdateWithTimeDelayLazy-seed#[E6501D2B240C7E7D]) [    ] o.a.s.c.ZkTestServer STARTING ZK TEST SERVER
   [junit4]   2> 309262 INFO  (Thread-1063) [    ] o.a.s.c.ZkTestServer client port:0.0.0.0/0.0.0.0:0
   [junit4]   2> 309262 INFO  (Thread-1063) [    ] o.a.s.c.ZkTestServer Starting server
   [junit4]   2> 309362 INFO  (TEST-ZkStateReaderTest.testStateFormatUpdateWithTimeDelayLazy-seed#[E6501D2B240C7E7D]) [    ] o.a.s.c.ZkTestServer start zk server on port:49054
   [junit4]   2> 309362 INFO  (TEST-ZkStateReaderTest.testStateFormatUpdateWithTimeDelayLazy-seed#[E6501D2B240C7E7D]) [    ] o.a.s.c.c.SolrZkClient Using default ZkCredentialsProvider
   [junit4]   2> 309362 INFO  (TEST-ZkStateReaderTest.testStateFormatUpdateWithTimeDelayLazy-seed#[E6501D2B240C7E7D]) [    ] o.a.s.c.c.ConnectionManager Waiting for client to connect to ZooKeeper
   [junit4]   2> 309365 INFO  (zkCallback-520-thread-1) [    ] o.a.s.c.c.ConnectionManager Watcher org.apache.solr.common.cloud.ConnectionManager@3caeca0f name:ZooKeeperConnection Watcher:127.0.0.1:49054 got event WatchedEvent state:SyncConnected type:None path:null path:null type:None
   [junit4]   2> 309365 INFO  (TEST-ZkStateReaderTest.testStateFormatUpdateWithTimeDelayLazy-seed#[E6501D2B240C7E7D]) [    ] o.a.s.c.c.ConnectionManager Client is connected to ZooKeeper
   [junit4]   2> 309365 INFO  (TEST-ZkStateReaderTest.testStateFormatUpdateWithTimeDelayLazy-seed#[E6501D2B240C7E7D]) [    ] o.a.s.c.c.SolrZkClient Using default ZkACLProvider
   [junit4]   2> 309367 INFO  (TEST-ZkStateReaderTest.testStateFormatUpdateWithTimeDelayLazy-seed#[E6501D2B240C7E7D]) [    ] o.a.s.c.c.SolrZkClient Using default ZkCredentialsProvider
   [junit4]   2> 309367 INFO  (TEST-ZkStateReaderTest.testStateFormatUpdateWithTimeDelayLazy-seed#[E6501D2B240C7E7D]) [    ] o.a.s.c.c.ConnectionManager Waiting for client to connect to ZooKeeper
   [junit4]   2> 309368 INFO  (zkCallback-521-thread-1) [    ] o.a.s.c.c.ConnectionManager Watcher org.apache.solr.common.cloud.ConnectionManager@7401d3f9 name:ZooKeeperConnection Watcher:127.0.0.1:49054 got event WatchedEvent state:SyncConnected type:None path:null path:null type:None
   [junit4]   2> 309369 INFO  (TEST-ZkStateReaderTest.testStateFormatUpdateWithTimeDelayLazy-seed#[E6501D2B240C7E7D]) [    ] o.a.s.c.c.ConnectionManager Client is connected to ZooKeeper
   [junit4]   2> 309369 INFO  (TEST-ZkStateReaderTest.testStateFormatUpdateWithTimeDelayLazy-seed#[E6501D2B240C7E7D]) [    ] o.a.s.c.c.SolrZkClient Using default ZkACLProvider
   [junit4]   2> 309369 INFO  (TEST-ZkStateReaderTest.testStateFormatUpdateWithTimeDelayLazy-seed#[E6501D2B240C7E7D]) [    ] o.a.s.c.c.SolrZkClient makePath: /solr
   [junit4]   2> 309373 INFO  (TEST-ZkStateReaderTest.testStateFormatUpdateWithTimeDelayLazy-seed#[E6501D2B240C7E7D]) [    ] o.a.s.c.c.SolrZkClient Using default ZkCredentialsProvider
   [junit4]   2> 309373 INFO  (TEST-ZkStateReaderTest.testStateFormatUpdateWithTimeDelayLazy-seed#[E6501D2B240C7E7D]) [    ] o.a.s.c.c.ConnectionManager Waiting for client to connect to ZooKeeper
   [junit4]   2> 309375 INFO  (zkCallback-522-thread-1) [    ] o.a.s.c.c.ConnectionManager Watcher org.apache.solr.common.cloud.ConnectionManager@697a4855 name:ZooKeeperConnection Watcher:127.0.0.1:49054/solr got event WatchedEvent state:SyncConnected type:None path:null path:null type:None
   [junit4]   2> 309375 INFO  (TEST-ZkStateReaderTest.testStateFormatUpdateWithTimeDelayLazy-seed#[E6501D2B240C7E7D]) [    ] o.a.s.c.c.ConnectionManager Client is connected to ZooKeeper
   [junit4]   2> 309375 INFO  (TEST-ZkStateReaderTest.testStateFormatUpdateWithTimeDelayLazy-seed#[E6501D2B240C7E7D]) [    ] o.a.s.c.c.SolrZkClient Using default ZkACLProvider
   [junit4]   2> 309375 INFO  (TEST-ZkStateReaderTest.testStateFormatUpdateWithTimeDelayLazy-seed#[E6501D2B240C7E7D]) [    ] o.a.s.c.c.SolrZkClient makePath: /live_nodes
   [junit4]   2> 309377 INFO  (TEST-ZkStateReaderTest.testStateFormatUpdateWithTimeDelayLazy-seed#[E6501D2B240C7E7D]) [    ] o.a.s.c.c.SolrZkClient makePath: /collections
   [junit4]   2> 309379 INFO  (TEST-ZkStateReaderTest.testStateFormatUpdateWithTimeDelayLazy-seed#[E6501D2B240C7E7D]) [    ] o.a.s.c.c.SolrZkClient makePath: /aliases.json
   [junit4]   2> 309381 INFO  (TEST-ZkStateReaderTest.testStateFormatUpdateWithTimeDelayLazy-seed#[E6501D2B240C7E7D]) [    ] o.a.s.c.c.SolrZkClient makePath: /clusterstate.json
   [junit4]   2> 309383 INFO  (TEST-ZkStateReaderTest.testStateFormatUpdateWithTimeDelayLazy-seed#[E6501D2B240C7E7D]) [    ] o.a.s.c.c.SolrZkClient makePath: /security.json
   [junit4]   2> 309385 INFO  (TEST-ZkStateReaderTest.testStateFormatUpdateWithTimeDelayLazy-seed#[E6501D2B240C7E7D]) [    ] o.a.s.c.c.ZkStateReader Updating cluster state from ZooKeeper... 
   [junit4]   2> 309387 INFO  (TEST-ZkStateReaderTest.testStateFormatUpdateWithTimeDelayLazy-seed#[E6501D2B240C7E7D]) [    ] o.a.s.c.c.ZkStateReader Updated live nodes from ZooKeeper... (0) -> (0)
   [junit4]   2> 309388 INFO  (TEST-ZkStateReaderTest.testStateFormatUpdateWithTimeDelayLazy-seed#[E6501D2B240C7E7D]) [    ] o.a.s.c.c.SolrZkClient makePath: /collections/c1
   [junit4]   2> 309389 INFO  (zkCallback-522-thread-1) [    ] o.a.s.c.c.ZkStateReader A collections change: [WatchedEvent state:SyncConnected type:NodeChildrenChanged path:/collections], has occurred - updating...
   [junit4]   2> 309391 INFO  (zkCallback-522-thread-1) [    ] o.a.s.c.c.ZkStateReader A cluster state change: [WatchedEvent state:SyncConnected type:NodeDataChanged path:/clusterstate.json], has occurred - updating... (live nodes size: [0])
   [junit4]   2> 309393 INFO  (TEST-ZkStateReaderTest.testStateFormatUpdateWithTimeDelayLazy-seed#[E6501D2B240C7E7D]) [    ] o.a.s.c.o.ZkStateWriter going to create_collection /collections/c1/state.json
   [junit4]   2> 309394 INFO  (zkCallback-522-thread-1) [    ] o.a.s.c.c.ZkStateReader A cluster state change: [WatchedEvent state:SyncConnected type:NodeDataChanged path:/clusterstate.json], has occurred - updating... (live nodes size: [0])
   [junit4]   2> 309398 INFO  (TEST-ZkStateReaderTest.testStateFormatUpdateWithTimeDelayLazy-seed#[E6501D2B240C7E7D]) [    ] o.a.s.c.ZkTestServer connecting to 127.0.0.1:49054 49054
   [junit4]   2> 309422 INFO  (Thread-1063) [    ] o.a.s.c.ZkTestServer connecting to 127.0.0.1:49054 49054
   [junit4]   2> 309423 INFO  (TEST-ZkStateReaderTest.testStateFormatUpdateWithTimeDelayLazy-seed#[E6501D2B240C7E7D]) [    ] o.a.s.SolrTestCaseJ4 ###Ending testStateFormatUpdateWithTimeDelayLazy
   [junit4]   2> 309427 INFO  (TEST-ZkStateReaderTest.testStateFormatUpdateWithExplicitRefresh-seed#[E6501D2B240C7E7D]) [    ] o.a.s.SolrTestCaseJ4 ###Starting testStateFormatUpdateWithExplicitRefresh
   [junit4]   2> 309427 INFO  (TEST-ZkStateReaderTest.testStateFormatUpdateWithExplicitRefresh-seed#[E6501D2B240C7E7D]) [    ] o.a.s.c.ZkTestServer STARTING ZK TEST SERVER
   [junit4]   2> 309428 INFO  (Thread-1064) [    ] o.a.s.c.ZkTestServer client port:0.0.0.0/0.0.0.0:0
   [junit4]   2> 309428 INFO  (Thread-1064) [    ] o.a.s.c.ZkTestServer Starting server
   [junit4]   2> 309528 INFO  (TEST-ZkStateReaderTest.testStateFormatUpdateWithExplicitRefresh-seed#[E6501D2B240C7E7D]) [    ] o.a.s.c.ZkTestServer start zk server on port:40328
   [junit4]   2> 309528 INFO  (TEST-ZkStateReaderTest.testStateFormatUpdateWithExplicitRefresh-seed#[E6501D2B240C7E7D]) [    ] o.a.s.c.c.SolrZkClient Using default ZkCredentialsProvider
   [junit4]   2> 309528 INFO  (TEST-ZkStateReaderTest.testStateFormatUpdateWithExplicitRefresh-seed#[E6501D2B240C7E7D]) [    ] o.a.s.c.c.ConnectionManager Waiting for client to connect to ZooKeeper
   [junit4]   2> 309531 INFO  (zkCallback-523-thread-1) [    ] o.a.s.c.c.ConnectionManager Watcher org.apache.solr.common.cloud.ConnectionManager@42b3bf68 name:ZooKeeperConnection Watcher:127.0.0.1:40328 got event WatchedEvent state:SyncConnected type:None path:null path:null type:None
   [junit4]   2> 309531 INFO  (TEST-ZkStateReaderTest.testStateFormatUpdateWithExplicitRefresh-seed#[E6501D2B240C7E7D]) [    ] o.a.s.c.c.ConnectionManager Client is connected to ZooKeeper
   [junit4]   2> 309532 INFO  (TEST-ZkStateReaderTest.testStateFormatUpdateWithExplicitRefresh-seed#[E6501D2B240C7E7D]) [    ] o.a.s.c.c.SolrZkClient Using default ZkACLProvider
   [junit4]   2> 309533 INFO  (TEST-ZkStateReaderTest.testStateFormatUpdateWithExplicitRefresh-seed#[E6501D2B240C7E7D]) [    ] o.a.s.c.c.SolrZkClient Using default ZkCredentialsProvider
   [junit4]   2> 309534 INFO  (TEST-ZkStateReaderTest.testStateFormatUpdateWithExplicitRefresh-seed#[E6501D2B240C7E7D]) [    ] o.a.s.c.c.ConnectionManager Waiting for client to connect to ZooKeeper
   [junit4]   2> 309535 INFO  (zkCallback-524-thread-1) [    ] o.a.s.c.c.ConnectionManager Watcher org.apache.solr.common.cloud.ConnectionManager@1294de25 name:ZooKeeperConnection Watcher:127.0.0.1:40328 got event WatchedEvent state:SyncConnected type:None path:null path:null type:None
   [junit4]   2> 309535 INFO  (TEST-ZkStateReaderTest.testStateFormatUpdateWithExplicitRefresh-seed#[E6501D2B240C7E7D]) [    ] o.a.s.c.c.ConnectionManager Client is connected to ZooKeeper
   [junit4]   2> 309535 INFO  (TEST-ZkStateReaderTest.testStateFormatUpdateWithExplicitRefresh-seed#[E6501D2B240C7E7D]) [    ] o.a.s.c.c.SolrZkClient Using default ZkACLProvider
   [junit4]   2> 309535 INFO  (TEST-ZkStateReaderTest.testStateFormatUpdateWithExplicitRefresh-seed#[E6501D2B240C7E7D]) [    ] o.a.s.c.c.SolrZkClient makePath: /solr
   [junit4]   2> 309538 INFO  (TEST-ZkStateReaderTest.testStateFormatUpdateWithExplicitRefresh-seed#[E6501D2B240C7E7D]) [    ] o.a.s.c.c.SolrZkClient Using default ZkCredentialsProvider
   [junit4]   2> 309539 INFO  (TEST-ZkStateReaderTest.testStateFormatUpdateWithExplicitRefresh-seed#[E6501D2B240C7E7D]) [    ] o.a.s.c.c.ConnectionManager Waiting for client to connect to ZooKeeper
   [junit4]   2> 309543 INFO  (zkCallback-525-thread-1) [    ] o.a.s.c.c.ConnectionManager Watcher org.apache.solr.common.cloud.ConnectionManager@5c44befb name:ZooKeeperConnection Watcher:127.0.0.1:40328/solr got event WatchedEvent state:SyncConnected type:None path:null path:null type:None
   [junit4]   2> 309543 INFO  (TEST-ZkStateReaderTest.testStateFormatUpdateWithExplicitRefresh-seed#[E6501D2B240C7E7D]) [    ] o.a.s.c.c.ConnectionManager Client is connected to ZooKeeper
   [junit4]   2> 309543 INFO  (TEST-ZkStateReaderTest.testStateFormatUpdateWithExplicitRefresh-seed#[E6501D2B240C7E7D]) [    ] o.a.s.c.c.SolrZkClient Using default ZkACLProvider
   [junit4]   2> 309544 INFO  (TEST-ZkStateReaderTest.testStateFormatUpdateWithExplicitRefresh-seed#[E6501D2B240C7E7D]) [    ] o.a.s.c.c.SolrZkClient makePath: /live_nodes
   [junit4]   2> 309545 INFO  (TEST-ZkStateReaderTest.testStateFormatUpdateWithExplicitRefresh-seed#[E6501D2B240C7E7D]) [    ] o.a.s.c.c.SolrZkClient makePath: /collections
   [junit4]   2> 309547 INFO  (TEST-ZkStateReaderTest.testStateFormatUpdateWithExplicitRefresh-seed#[E6501D2B240C7E7D]) [    ] o.a.s.c.c.SolrZkClient makePath: /aliases.json
   [junit4]   2> 309550 INFO  (TEST-ZkStateReaderTest.testStateFormatUpdateWithExplicitRefresh-seed#[E6501D2B240C7E7D]) [    ] o.a.s.c.c.SolrZkClient makePath: /clusterstate.json
   [junit4]   2> 309552 INFO  (TEST-ZkStateReaderTest.testStateFormatUpdateWithExplicitRefresh-seed#[E6501D2B240C7E7D]) [    ] o.a.s.c.c.SolrZkClient makePath: /security.json
   [junit4]   2> 309554 INFO  (TEST-ZkStateReaderTest.testStateFormatUpdateWithExplicitRefresh-seed#[E6501D2B240C7E7D]) [    ] o.a.s.c.c.ZkStateReader Updating cluster state from ZooKeeper... 
   [junit4]   2> 309557 INFO  (TEST-ZkStateReaderTest.testStateFormatUpdateWithExplicitRefresh-seed#[E6501D2B240C7E7D]) [    ] o.a.s.c.c.ZkStateReader Updated live nodes from ZooKeeper... (0) -> (0)
   [junit4]   2> 309558 INFO  (TEST-ZkStateReaderTest.testStateFormatUpdateWithExplicitRefresh-seed#[E6501D2B240C7E7D]) [    ] o.a.s.c.c.ZkStateReader addZkWatch [c1]
   [junit4]   2> 309558 INFO  (TEST-ZkStateReaderTest.testStateFormatUpdateWithExplicitRefresh-seed#[E6501D2B240C7E7D]) [    ] o.a.s.c.c.ZkStateReader Deleting data for [c1]
   [junit4]   2> 309559 INFO  (TEST-ZkStateReaderTest.testStateFormatUpdateWithExplicitRefresh-seed#[E6501D2B240C7E7D]) [    ] o.a.s.c.c.ZkStateReader Deleting data for [c1]
   [junit4]   2> 309559 INFO  (TEST-ZkStateReaderTest.testStateFormatUpdateWithExplicitRefresh-seed#[E6501D2B240C7E7D]) [    ] o.a.s.c.c.SolrZkClient makePath: /collections/c1
   [junit4]   2> 309562 INFO  (zkCallback-525-thread-1) [    ] o.a.s.c.c.ZkStateReader A collections change: [WatchedEvent state:SyncConnected type:NodeChildrenChanged path:/collections], has occurred - updating...
   [junit4]   2> 309563 INFO  (zkCallback-525-thread-1) [    ] o.a.s.c.c.ZkStateReader Deleting data for [c1]
   [junit4]   2> 309564 INFO  (zkCallback-525-thread-2) [    ] o.a.s.c.c.ZkStateReader A cluster state change: [WatchedEvent state:SyncConnected type:NodeDataChanged path:/clusterstate.json], has occurred - updating... (live nodes size: [0])
   [junit4]   2> 309567 INFO  (TEST-ZkStateReaderTest.testStateFormatUpdateWithExplicitRefresh-seed#[E6501D2B240C7E7D]) [    ] o.a.s.c.o.ZkStateWriter going to create_collection /collections/c1/state.json
   [junit4]   2> 309569 INFO  (zkCallback-525-thread-2) [    ] o.a.s.c.c.ZkStateReader A cluster state change: [WatchedEvent state:SyncConnected type:NodeDataChanged path:/clusterstate.json], has occurred - updating... (live nodes size: [0])
   [junit4]   2> 309570 INFO  (zkCallback-525-thread-2) [    ] o.a.s.c.c.ZkStateReader Add data for [c1] ver [0]
   [junit4]   2> 309574 INFO  (TEST-ZkStateReaderTest.testStateFormatUpdateWithExplicitRefresh-seed#[E6501D2B240C7E7D]) [    ] o.a.s.c.ZkTestServer connecting to 127.0.0.1:40328 40328
   [junit4]   2> 314603 INFO  (Thread-1064) [    ] o.a.s.c.ZkTestServer connecting to 127.0.0.1:40328 40328
   [junit4]   2> 314605 INFO  (TEST-ZkStateReaderTest.testStateFormatUpdateWithExplicitRefresh-seed#[E6501D2B240C7E7D]) [    ] o.a.s.SolrTestCaseJ4 ###Ending testStateFormatUpdateWithExplicitRefresh
   [junit4]   2> 314606 INFO  (SUITE-ZkStateReaderTest-seed#[E6501D2B240C7E7D]-worker) [    ] o.a.s.SolrTestCaseJ4 ###deleteCore
   [junit4]   2> NOTE: leaving temporary files on disk at: /export/home/jenkins/workspace/Lucene-Solr-master-Solaris/solr/build/solr-core/test/J1/temp/solr.cloud.overseer.ZkStateReaderTest_E6501D2B240C7E7D-001
   [junit4]   2> NOTE: test params are: codec=FastCompressingStoredFields(storedFieldsFormat=CompressingStoredFieldsFormat(compressionMode=FAST, chunkSize=21390, maxDocsPerChunk=593, blockSize=714), termVectorsFormat=CompressingTermVectorsFormat(compressionMode=FAST, chunkSize=21390, blockSize=714)), sim=RandomSimilarity(queryNorm=true,coord=yes): {}, locale=de-GR, timezone=Pacific/Norfolk
   [junit4]   2> NOTE: SunOS 5.11 amd64/Oracle Corporation 1.8.0_72 (64-bit)/cpus=3,threads=1,free=86318560,total=346030080
   [junit4]   2> NOTE: All tests run in this JVM: [EchoParamsTest, TestBinaryResponseWriter, FileUtilsTest, TestMiniSolrCloudClusterSSL, DateFieldTest, SpellingQueryConverterTest, TestWriterPerf, TestHighFrequencyDictionaryFactory, TestShortCircuitedRequests, SegmentsInfoRequestHandlerTest, CloudMLTQParserTest, BlockJoinFacetRandomTest, OverseerCollectionConfigSetProcessorTest, HLLUtilTest, HdfsBasicDistributedZk2Test, TestRestManager, TestManagedResource, OpenExchangeRatesOrgProviderTest, TestCloudDeleteByQuery, TestFoldingMultitermQuery, ConvertedLegacyTest, CoreAdminRequestStatusTest, TestRecovery, TestExpandComponent, TestRawResponseWriter, NumericFieldsTest, BigEndianAscendingWordDeserializerTest, DefaultValueUpdateProcessorTest, TestUtils, CacheHeaderTest, CoreAdminHandlerTest, CursorMarkTest, AddSchemaFieldsUpdateProcessorFactoryTest, RollingRestartTest, TestDefaultSearchFieldResource, OutputWriterTest, TestZkChroot, CurrencyFieldOpenExchangeTest, TestSolrQueryResponse, TestReqParamsAPI, TestInitQParser, SynonymTokenizerTest, TestAnalyzeInfixSuggestions, CdcrUpdateLogTest, TestTolerantUpdateProcessorRandomCloud, TestExclusionRuleCollectionAccess, SuggesterTest, TestConfigSetsAPI, TestRuleBasedAuthorizationPlugin, ClassificationUpdateProcessorFactoryTest, HdfsDirectoryFactoryTest, ShowFileRequestHandlerTest, ZkStateReaderTest]
   [junit4] Completed [77/584 (1!)] on J1 in 7.51s, 5 tests, 1 error <<< FAILURES!

[...truncated 1286 lines...]
   [junit4] Suite: org.apache.solr.cloud.hdfs.StressHdfsTest
   [junit4]   2> Creating dataDir: /export/home/jenkins/workspace/Lucene-Solr-master-Solaris/solr/build/solr-core/test/J0/temp/solr.cloud.hdfs.StressHdfsTest_E6501D2B240C7E7D-001/init-core-data-001
   [junit4]   2> 2712810 INFO  (SUITE-StressHdfsTest-seed#[E6501D2B240C7E7D]-worker) [    ] o.a.s.BaseDistributedSearchTestCase Setting hostContext system property: /
   [junit4]   1> Formatting using clusterid: testClusterID
   [junit4]   2> 2712915 WARN  (SUITE-StressHdfsTest-seed#[E6501D2B240C7E7D]-worker) [    ] o.a.h.m.i.MetricsConfig Cannot locate configuration: tried hadoop-metrics2-namenode.properties,hadoop-metrics2.properties
   [junit4]   2> 2712925 WARN  (SUITE-StressHdfsTest-seed#[E6501D2B240C7E7D]-worker) [    ] o.a.h.h.HttpRequestLog Jetty request log can only be enabled using Log4j
   [junit4]   2> 2712927 INFO  (SUITE-StressHdfsTest-seed#[E6501D2B240C7E7D]-worker) [    ] o.m.log jetty-6.1.26
   [junit4]   2> 2712949 INFO  (SUITE-StressHdfsTest-seed#[E6501D2B240C7E7D]-worker) [    ] o.m.log Extract jar:file:/export/home/jenkins/.ivy2/cache/org.apache.hadoop/hadoop-hdfs/tests/hadoop-hdfs-2.6.0-tests.jar!/webapps/hdfs to ./temp/Jetty_solaris.vm_63356_hdfs____.wyn6lz/webapp
   [junit4]   2> 2713071 INFO  (SUITE-StressHdfsTest-seed#[E6501D2B240C7E7D]-worker) [    ] o.m.log NO JSP Support for /, did not find org.apache.jasper.servlet.JspServlet
   [junit4]   2> 2713536 INFO  (SUITE-StressHdfsTest-seed#[E6501D2B240C7E7D]-worker) [    ] o.m.log Started HttpServer2$SelectChannelConnectorWithSafeStartup@solaris-vm:63356
   [junit4]   2> 2713693 WARN  (SUITE-StressHdfsTest-seed#[E6501D2B240C7E7D]-worker) [    ] o.a.h.h.HttpRequestLog Jetty request log can only be enabled using Log4j
   [junit4]   2> 2713696 INFO  (SUITE-StressHdfsTest-seed#[E6501D2B240C7E7D]-worker) [    ] o.m.log jetty-6.1.26
   [junit4]   2> 2713710 INFO  (SUITE-StressHdfsTest-seed#[E6501D2B240C7E7D]-worker) [    ] o.m.log Extract jar:file:/export/home/jenkins/.ivy2/cache/org.apache.hadoop/hadoop-hdfs/tests/hadoop-hdfs-2.6.0-tests.jar!/webapps/datanode to ./temp/Jetty_solaris.vm_36386_datanode____.yd9tz7/webapp
   [junit4]   2> 2713816 INFO  (SUITE-StressHdfsTest-seed#[E6501D2B240C7E7D]-worker) [    ] o.m.log NO JSP Support for /, did not find org.apache.jasper.servlet.JspServlet
   [junit4]   2> 2714257 INFO  (SUITE-StressHdfsTest-seed#[E6501D2B240C7E7D]-worker) [    ] o.m.log Started HttpServer2$SelectChannelConnectorWithSafeStartup@solaris-vm:36386
   [junit4]   2> 2714345 WARN  (SUITE-StressHdfsTest-seed#[E6501D2B240C7E7D]-worker) [    ] o.a.h.h.HttpRequestLog Jetty request log can only be enabled using Log4j
   [junit4]   2> 2714357 INFO  (SUITE-StressHdfsTest-seed#[E6501D2B240C7E7D]-worker) [    ] o.m.log jetty-6.1.26
   [junit4]   2> 2714386 INFO  (SUITE-StressHdfsTest-seed#[E6501D2B240C7E7D]-worker) [    ] o.m.log Extract jar:file:/export/home/jenkins/.ivy2/cache/org.apache.hadoop/hadoop-hdfs/tests/hadoop-hdfs-2.6.0-tests.jar!/webapps/datanode to ./temp/Jetty_solaris.vm_48865_datanode____.op84hq/webapp
   [junit4]   2> 2714516 INFO  (SUITE-StressHdfsTest-seed#[E6501D2B240C7E7D]-worker) [    ] o.m.log NO JSP Support for /, did not find org.apache.jasper.servlet.JspServlet
   [junit4]   2> 2714669 INFO  (IPC Server handler 2 on 62309) [    ] BlockStateChange BLOCK* processReport: from storage DS-84a7d6e9-1f25-494c-80c9-7e4e43d29fcc node DatanodeRegistration(127.0.0.1, datanodeUuid=f3bab52c-3a36-4055-a2dd-d96430caf764, infoPort=36386, ipcPort=39987, storageInfo=lv=-56;cid=testClusterID;nsid=528625665;c=0), blocks: 0, hasStaleStorages: true, processing time: 0 msecs
   [junit4]   2> 2714669 INFO  (IPC Server handler 2 on 62309) [    ] BlockStateChange BLOCK* processReport: from storage DS-135a50e2-6cd5-47f7-bf3c-6cd99e7d55f6 node DatanodeRegistration(127.0.0.1, datanodeUuid=f3bab52c-3a36-4055-a2dd-d96430caf764, infoPort=36386, ipcPort=39987, storageInfo=lv=-56;cid=testClusterID;nsid=528625665;c=0), blocks: 0, hasStaleStorages: false, processing time: 0 msecs
   [junit4]   2> 2714940 INFO  (SUITE-StressHdfsTest-seed#[E6501D2B240C7E7D]-worker) [    ] o.m.log Started HttpServer2$SelectChannelConnectorWithSafeStartup@solaris-vm:48865
   [junit4]   2> 2715326 INFO  (IPC Server handler 0 on 62309) [    ] BlockStateChange BLOCK* processReport: from storage DS-28fbae67-d124-46c2-831c-c102be2b45e8 node DatanodeRegistration(127.0.0.1, datanodeUuid=d6fb3f7f-8093-4f94-8b08-4da19f2da0db, infoPort=48865, ipcPort=43154, storageInfo=lv=-56;cid=testClusterID;nsid=528625665;c=0), blocks: 0, hasStaleStorages: true, processing time: 0 msecs
   [junit4]   2> 2715327 INFO  (IPC Server handler 0 on 62309) [    ] BlockStateChange BLOCK* processReport: from storage DS-d5778340-d8df-4ada-95b2-adf9227761c1 node DatanodeRegistration(127.0.0.1, datanodeUuid=d6fb3f7f-8093-4f94-8b08-4da19f2da0db, infoPort=48865, ipcPort=43154, storageInfo=lv=-56;cid=testClusterID;nsid=528625665;c=0), blocks: 0, hasStaleStorages: false, processing time: 0 msecs
   [junit4]   2> 2715435 INFO  (TEST-StressHdfsTest.test-seed#[E6501D2B240C7E7D]) [    ] o.a.s.c.ZkTestServer STARTING ZK TEST SERVER
   [junit4]   2> 2715435 INFO  (Thread-10364) [    ] o.a.s.c.ZkTestServer client port:0.0.0.0/0.0.0.0:0
   [junit4]   2> 2715436 INFO  (Thread-10364) [    ] o.a.s.c.ZkTestServer Starting server
   [junit4]   2> 2715535 INFO  (TEST-StressHdfsTest.test-seed#[E6501D2B240C7E7D]) [    ] o.a.s.c.ZkTestServer start zk server on port:57144
   [junit4]   2> 2715535 INFO  (TEST-StressHdfsTest.test-seed#[E6501D2B240C7E7D]) [    ] o.a.s.c.c.SolrZkClient Using default ZkCredentialsProvider
   [junit4]   2> 2715536 INFO  (TEST-StressHdfsTest.test-seed#[E6501D2B240C7E7D]) [    ] o.a.s.c.c.ConnectionManager Waiting for client to connect to ZooKeeper
   [junit4]   2> 2715557 INFO  (zkCallback-3381-thread-1) [    ] o.a.s.c.c.ConnectionManager Watcher org.apache.solr.common.cloud.ConnectionManager@7c178622 name:ZooKeeperConnection Watcher:127.0.0.1:57144 got event WatchedEvent state:SyncConnected type:None path:null path:null type:None
   [junit4]   2> 2715557 INFO  (TEST-StressHdfsTest.test-seed#[E6501D2B240C7E7D]) [    ] o.a.s.c.c.ConnectionManager Client is connected to ZooKeeper
   [junit4]   2> 2715557 INFO  (TEST-StressHdfsTest.test-seed#[E6501D2B240C7E7D]) [    ] o.a.s.c.c.SolrZkClient Using default ZkACLProvider
   [junit4]   2> 2715557 INFO  (TEST-StressHdfsTest.test-seed#[E6501D2B240C7E7D]) [    ] o.a.s.c.c.SolrZkClient makePath: /solr
   [junit4]   2> 2715560 INFO  (TEST-StressHdfsTest.test-seed#[E6501D2B240C7E7D]) [    ] o.a.s.c.c.SolrZkClient Using default ZkCredentialsProvider
   [junit4]   2> 2715560 INFO  (TEST-StressHdfsTest.test-seed#[E6501D2B240C7E7D]) [    ] o.a.s.c.c.ConnectionManager Waiting for client to connect to ZooKeeper
   [junit4]   2> 2715562 INFO  (zkCallback-3382-thread-1) [    ] o.a.s.c.c.ConnectionManager Watcher org.apache.solr.common.cloud.ConnectionManager@55e1eae9 name:ZooKeeperConnection Watcher:127.0.0.1:57144/solr got event WatchedEvent state:SyncConnected type:None path:null path:null type:None
   [junit4]   2> 2715562 INFO  (TEST-StressHdfsTest.test-seed#[E6501D2B240C7E7D]) [    ] o.a.s.c.c.ConnectionManager Client is connected to ZooKeeper
   [junit4]   2> 2715562 INFO  (TEST-StressHdfsTest.test-seed#[E6501D2B240C7E7D]) [    ] o.a.s.c.c.SolrZkClient Using default ZkACLProvider
   [junit4]   2> 2715562 INFO  (TEST-StressHdfsTest.test-seed#[E6501D2B240C7E7D]) [    ] o.a.s.c.c.SolrZkClient makePath: /collections/collection1
   [junit4]   2> 2715565 INFO  (TEST-StressHdfsTest.test-seed#[E6501D2B240C7E7D]) [    ] o.a.s.c.c.SolrZkClient makePath: /collections/collection1/shards
   [junit4]   2> 2715568 INFO  (TEST-StressHdfsTest.test-seed#[E6501D2B240C7E7D]) [    ] o.a.s.c.c.SolrZkClient makePath: /collections/control_collection
   [junit4]   2> 2715570 INFO  (TEST-StressHdfsTest.test-seed#[E6501D2B240C7E7D]) [    ] o.a.s.c.c.SolrZkClient makePath: /collections/control_collection/shards
   [junit4]   2> 2715573 INFO  (TEST-StressHdfsTest.test-seed#[E6501D2B240C7E7D]) [    ] o.a.s.c.AbstractZkTestCase put /export/home/jenkins/workspace/Lucene-Solr-master-Solaris/solr/core/src/test-files/solr/collection1/conf/solrconfig-tlog.xml to /configs/conf1/solrconfig.xml
   [junit4]   2> 2715573 INFO  (TEST-StressHdfsTest.test-seed#[E6501D2B240C7E7D]) [    ] o.a.s.c.c.SolrZkClient makePath: /configs/conf1/solrconfig.xml
   [junit4]   2> 2715577 INFO  (TEST-StressHdfsTest.test-seed#[E6501D2B240C7E7D]) [    ] o.a.s.c.AbstractZkTestCase put /export/home/jenkins/workspace/Lucene-Solr-master-Solaris/solr/core/src/test-files/solr/collection1/conf/schema.xml to /configs/conf1/schema.xml
   [junit4]   2> 2715596 INFO  (TEST-StressHdfsTest.test-seed#[E6501D2B240C7E7D]) [    ] o.a.s.c.c.SolrZkClient makePath: /configs/conf1/schema.xml
   [junit4]   2> 2715598 INFO  (TEST-StressHdfsTest.test-seed#[E6501D2B240C7E7D]) [    ] o.a.s.c.AbstractZkTestCase put /export/home/jenkins/workspace/Lucene-Solr-master-Solaris/solr/core/src/test-files/solr/collection1/conf/solrconfig.snippet.randomindexconfig.xml to /configs/conf1/solrconfig.snippet.randomindexconfig.xml
   [junit4]   2> 2715599 INFO  (TEST-StressHdfsTest.test-seed#[E6501D2B240C7E7D]) [    ] o.a.s.c.c.SolrZkClient makePath: /configs/conf1/solrconfig.snippet.randomindexconfig.xml
   [junit4]   2> 2715601 INFO  (TEST-StressHdfsTest.test-seed#[E6501D2B240C7E7D]) [    ] o.a.s.c.AbstractZkTestCase put /export/home/jenkins/workspace/Lucene-Solr-master-Solaris/solr/core/src/test-files/solr/collection1/conf/stopwords.txt to /configs/conf1/stopwords.txt
   [junit4]   2> 2715601 INFO  (TEST-StressHdfsTest.test-seed#[E6501D2B240C7E7D]) [    ] o.a.s.c.c.SolrZkClient makePath: /configs/conf1/stopwords.txt
   [junit4]   2> 2715603 INFO  (TEST-StressHdfsTest.test-seed#[E6501D2B240C7E7D]) [    ] o.a.s.c.AbstractZkTestCase put /export/home/jenkins/workspace/Lucene-Solr-master-Solaris/solr/core/src/test-files/solr/collection1/conf/protwords.txt to /configs/conf1/protwords.txt
   [junit4]   2> 2715604 INFO  (TEST-StressHdfsTest.test-seed#[E6501D2B240C7E7D]) [    ] o.a.s.c.c.SolrZkClient makePath: /configs/conf1/protwords.txt
   [junit4]   2> 2715606 INFO  (TEST-StressHdfsTest.test-seed#[E6501D2B240C7E7D]) [    ] o.a.s.c.AbstractZkTestCase put /export/home/jenkins/workspace/Lucene-Solr-master-Solaris/solr/core/src/test-files/solr/collection1/conf/currency.xml to /configs/conf1/currency.xml
   [junit4]   2> 2715607 INFO  (TEST-StressHdfsTest.test-seed#[E6501D2B240C7E7D]) [    ] o.a.s.c.c.SolrZkClient makePath: /configs/conf1/currency.xml
   [junit4]   2> 2715609 INFO  (TEST-StressHdfsTest.test-seed#[E6501D2B240C7E7D]) [    ] o.a.s.c.AbstractZkTestCase put /export/home/jenkins/workspace/Lucene-Solr-master-Solaris/solr/core/src/test-files/solr/collection1/conf/enumsConfig.xml to /configs/conf1/enumsConfig.xml
   [junit4]   2> 2715610 INFO  (TEST-StressHdfsTest.test-seed#[E6501D2B240C7E7D]) [    ] o.a.s.c.c.SolrZkClient makePath: /configs/conf1/enumsConfig.xml
   [junit4]   2> 2715612 INFO  (TEST-StressHdfsTest.test-seed#[E6501D2B240C7E7D]) [    ] o.a.s.c.AbstractZkTestCase put /export/home/jenkins/workspace/Lucene-Solr-master-Solaris/solr/core/src/test-files/solr/collection1/conf/open-exchange-rates.json to /configs/conf1/open-exchange-rates.json
   [junit4]   2> 2715612 INFO  (TEST-StressHdfsTest.test-seed#[E6501D2B240C7E7D]) [    ] o.a.s.c.c.SolrZkClient makePath: /configs/conf1/open-exchange-rates.json
   [junit4]   2> 2715613 INFO  (TEST-StressHdfsTest.test-seed#[E6501D2B240C7E7D]) [    ] o.a.s.c.AbstractZkTestCase put /export/home/jenkins/workspace/Lucene-Solr-master-Solaris/solr/core/src/test-files/solr/collection1/conf/mapping-ISOLatin1Accent.txt to /configs/conf1/mapping-ISOLatin1Accent.txt
   [junit4]   2> 2715614 INFO  (TEST-StressHdfsTest.test-seed#[E6501D2B240C7E7D]) [    ] o.a.s.c.c.SolrZkClient makePath: /configs/conf1/mapping-ISOLatin1Accent.txt
   [junit4]   2> 2715616 INFO  (TEST-StressHdfsTest.test-seed#[E6501D2B240C7E7D]) [    ] o.a.s.c.AbstractZkTestCase put /export/home/jenkins/workspace/Lucene-Solr-master-Solaris/solr/core/src/test-files/solr/collection1/conf/old_synonyms.txt to /configs/conf1/old_synonyms.txt
   [junit4]   2> 2715616 INFO  (TEST-StressHdfsTest.test-seed#[E6501D2B240C7E7D]) [    ] o.a.s.c.c.SolrZkClient makePath: /configs/conf1/old_synonyms.txt
   [junit4]   2> 2715618 INFO  (TEST-StressHdfsTest.test-seed#[E6501D2B240C7E7D]) [    ] o.a.s.c.AbstractZkTestCase put /export/home/jenkins/workspace/Lucene-Solr-master-Solaris/solr/core/src/test-files/solr/collection1/conf/synonyms.txt to /configs/conf1/synonyms.txt
   [junit4]   2> 2715618 INFO  (TEST-StressHdfsTest.test-seed#[E6501D2B240C7E7D]) [    ] o.a.s.c.c.SolrZkClient makePath: /configs/conf1/synonyms.txt
   [junit4]   2> 2715832 INFO  (TEST-StressHdfsTest.test-seed#[E6501D2B240C7E7D]) [    ] o.a.s.SolrTestCaseJ4 Writing core.properties file to /export/home/jenkins/workspace/Lucene-Solr-master-Solaris/solr/build/solr-core/test/J0/temp/solr.cloud.hdfs.StressHdfsTest_E6501D2B240C7E7D-001/control-001/cores/collection1
   [junit4]   2> 2715833 INFO  (TEST-StressHdfsTest.test-seed#[E6501D2B240C7E7D]) [    ] o.e.j.s.Server jetty-9.3.8.v20160314
   [junit4]   2> 2715835 INFO  (TEST-StressHdfsTest.test-seed#[E6501D2B240C7E7D]) [    ] o.e.j.s.h.ContextHandler Started o.e.j.s.ServletContextHandler@100a03fb{/,null,AVAILABLE}
   [junit4]   2> 2715835 INFO  (TEST-StressHdfsTest.test-seed#[E6501D2B240C7E7D]) [    ] o.e.j.s.ServerConnector Started ServerConnector@e03bc47{HTTP/1.1,[http/1.1]}{127.0.0.1:57692}
   [junit4]   2> 2715835 INFO  (TEST-StressHdfsTest.test-seed#[E6501D2B240C7E7D]) [    ] o.e.j.s.Server Started @2719138ms
   [junit4]   2> 2715835 INFO  (TEST-StressHdfsTest.test-seed#[E6501D2B240C7E7D]) [    ] o.a.s.c.s.e.JettySolrRunner Jetty properties: {solr.data.dir=hdfs://solaris-vm:62309/hdfs__solaris-vm_62309__export_home_jenkins_workspace_Lucene-Solr-master-Solaris_solr_build_solr-core_test_J0_temp_solr.cloud.hdfs.StressHdfsTest_E6501D2B240C7E7D-001_tempDir-002_control_data, hostContext=/, hostPort=57692, coreRootDirectory=/export/home/jenkins/workspace/Lucene-Solr-master-Solaris/solr/build/solr-core/test/J0/../../../../../../../../../../export/home/jenkins/workspace/Lucene-Solr-master-Solaris/solr/build/solr-core/test/J0/temp/solr.cloud.hdfs.StressHdfsTest_E6501D2B240C7E7D-001/control-001/cores}
   [junit4]   2> 2715835 INFO  (TEST-StressHdfsTest.test-seed#[E6501D2B240C7E7D]) [    ] o.a.s.s.SolrDispatchFilter SolrDispatchFilter.init(): sun.misc.Launcher$AppClassLoader@6d06d69c
   [junit4]   2> 2715835 INFO  (TEST-StressHdfsTest.test-seed#[E6501D2B240C7E7D]) [    ] o.a.s.c.SolrResourceLoader new SolrResourceLoader for directory: '/export/home/jenkins/workspace/Lucene-Solr-master-Solaris/solr/build/solr-core/test/J0/temp/solr.cloud.hdfs.StressHdfsTest_E6501D2B240C7E7D-001/control-001'
   [junit4]   2> 2715835 INFO  (TEST-StressHdfsTest.test-seed#[E6501D2B240C7E7D]) [    ] o.a.s.c.SolrResourceLoader JNDI not configured for solr (NoInitialContextEx)
   [junit4]   2> 2715835 INFO  (TEST-StressHdfsTest.test-seed#[E6501D2B240C7E7D]) [    ] o.a.s.c.SolrResourceLoader solr home defaulted to 'solr/' (could not find system property or JNDI)
   [junit4]   2> 2715836 INFO  (TEST-StressHdfsTest.test-seed#[E6501D2B240C7E7D]) [    ] o.a.s.c.c.SolrZkClient Using default ZkCredentialsProvider
   [junit4]   2> 2715836 INFO  (TEST-StressHdfsTest.test-seed#[E6501D2B240C7E7D]) [    ] o.a.s.c.c.ConnectionManager Waiting for client to connect to ZooKeeper
   [junit4]   2> 2715838 INFO  (zkCallback-3383-thread-1) [    ] o.a.s.c.c.ConnectionManager Watcher org.apache.solr.common.cloud.ConnectionManager@109b2038 name:ZooKeeperConnection Watcher:127.0.0.1:57144/solr got event WatchedEvent state:SyncConnected type:None path:null path:null type:None
   [junit4]   2> 2715838 INFO  (TEST-StressHdfsTest.test-seed#[E6501D2B240C7E7D]) [    ] o.a.s.c.c.ConnectionManager Client is connected to ZooKeeper
   [junit4]   2> 2715839 INFO  (TEST-StressHdfsTest.test-seed#[E6501D2B240C7E7D]) [    ] o.a.s.c.c.SolrZkClient Using default ZkACLProvider
   [junit4]   2> 2715840 INFO  (TEST-StressHdfsTest.test-seed#[E6501D2B240C7E7D]) [    ] o.a.s.s.SolrDispatchFilter Loading solr.xml from SolrHome (not found in ZooKeeper)
   [junit4]   2> 2715840 INFO  (TEST-StressHdfsTest.test-seed#[E6501D2B240C7E7D]) [    ] o.a.s.c.SolrXmlConfig Loading container configuration from /export/home/jenkins/workspace/Lucene-Solr-master-Solaris/solr/build/solr-core/test/J0/temp/solr.cloud.hdfs.StressHdfsTest_E6501D2B240C7E7D-001/control-001/solr.xml
   [junit4]   2> 2715845 INFO  (TEST-StressHdfsTest.test-seed#[E6501D2B240C7E7D]) [    ] o.a.s.c.CorePropertiesLocator Config-defined core root directory: /export/home/jenkins/workspace/Lucene-Solr-master-Solaris/solr/build/solr-core/test/J0/../../../../../../../../../../export/home/jenkins/workspace/Lucene-Solr-master-Solaris/solr/build/solr-core/test/J0/temp/solr.cloud.hdfs.StressHdfsTest_E6501D2B240C7E7D-001/control-001/cores
   [junit4]   2> 2715845 INFO  (TEST-StressHdfsTest.test-seed#[E6501D2B240C7E7D]) [    ] o.a.s.c.CoreContainer New CoreContainer 1487792552
   [junit4]   2> 2715846 INFO  (TEST-StressHdfsTest.test-seed#[E6501D2B240C7E7D]) [    ] o.a.s.c.CoreContainer Loading cores into CoreContainer [instanceDir=/export/home/jenkins/workspace/Lucene-Solr-master-Solaris/solr/build/solr-core/test/J0/temp/solr.cloud.hdfs.StressHdfsTest_E6501D2B240C7E7D-001/control-001]
   [junit4]   2> 2715846 WARN  (TEST-StressHdfsTest.test-seed#[E6501D2B240C7E7D]) [    ] o.a.s.c.CoreContainer Couldn't add files from /export/home/jenkins/workspace/Lucene-Solr-master-Solaris/solr/build/solr-core/test/J0/temp/solr.cloud.hdfs.StressHdfsTest_E6501D2B240C7E7D-001/control-001/lib to classpath: /export/home/jenkins/workspace/Lucene-Solr-master-Solaris/solr/build/solr-core/test/J0/temp/solr.cloud.hdfs.StressHdfsTest_E6501D2B240C7E7D-001/control-001/lib
   [junit4]   2> 2715846 INFO  (TEST-StressHdfsTest.test-seed#[E6501D2B240C7E7D]) [    ] o.a.s.h.c.HttpShardHandlerFactory created with socketTimeout : 90000,urlScheme : ,connTimeout : 15000,maxConnectionsPerHost : 20,maxConnections : 10000,corePoolSize : 0,maximumPoolSize : 2147483647,maxThreadIdleTime : 5,sizeOfQueue : -1,fairnessPolicy : false,
   [junit4]   2> 2715848 INFO  (TEST-StressHdfsTest.test-seed#[E6501D2B240C7E7D]) [    ] o.a.s.u.UpdateShardHandler Creating UpdateShardHandler HTTP client with params: 
   [junit4]   2> 2715848 INFO  (TEST-StressHdfsTest.test-seed#[E6501D2B240C7E7D]) [    ] o.a.s.l.LogWatcher SLF4J impl is org.slf4j.impl.Log4jLoggerFactory
   [junit4]   2> 2715848 INFO  (TEST-StressHdfsTest.test-seed#[E6501D2B240C7E7D]) [    ] o.a.s.l.LogWatcher Registering Log Listener [Log4j (org.slf4j.impl.Log4jLoggerFactory)]
   [junit4]   2> 2715848 INFO  (TEST-StressHdfsTest.test-seed#[E6501D2B240C7E7D]) [    ] o.a.s.c.ZkContainer Zookeeper client=127.0.0.1:57144/solr
   [junit4]   2> 2715849 INFO  (TEST-StressHdfsTest.test-seed#[E6501D2B240C7E7D]) [    ] o.a.s.c.ZkController zkHost includes chroot
   [junit4]   2> 2715849 INFO  (TEST-StressHdfsTest.test-seed#[E6501D2B240C7E7D]) [    ] o.a.s.c.c.SolrZkClient Using default ZkCredentialsProvider
   [junit4]   2> 2715849 INFO  (TEST-StressHdfsTest.test-seed#[E6501D2B240C7E7D]) [    ] o.a.s.c.c.ConnectionManager Waiting for client to connect to ZooKeeper
   [junit4]   2> 2715851 INFO  (zkCallback-3386-thread-1) [    ] o.a.s.c.c.ConnectionManager Watcher org.apache.solr.common.cloud.ConnectionManager@18a4bff4 name:ZooKeeperConnection Watcher:127.0.0.1:57144 got event WatchedEvent state:SyncConnected type:None path:null path:null type:None
   [junit4]   2> 2715851 INFO  (TEST-StressHdfsTest.test-seed#[E6501D2B240C7E7D]) [    ] o.a.s.c.c.ConnectionManager Client is connected to ZooKeeper
   [junit4]   2> 2715852 INFO  (TEST-StressHdfsTest.test-seed#[E6501D2B240C7E7D]) [    ] o.a.s.c.c.SolrZkClient Using default ZkACLProvider
   [junit4]   2> 2715854 INFO  (TEST-StressHdfsTest.test-seed#[E6501D2B240C7E7D]) [n:127.0.0.1:57692_    ] o.a.s.c.c.ConnectionManager Waiting for client to connect to ZooKeeper
   [junit4]   2> 2715856 INFO  (zkCallback-3387-thread-1-processing-n:127.0.0.1:57692_) [n:127.0.0.1:57692_    ] o.a.s.c.c.ConnectionManager Watcher org.apache.solr.common.cloud.ConnectionManager@2694d7b5 name:ZooKeeperConnection Watcher:127.0.0.1:57144/solr got event WatchedEvent state:SyncConnected type:None path:null path:null type:None
   [junit4]   2> 2715857 INFO  (TEST-StressHdfsTest.test-seed#[E6501D2B240C7E7D]) [n:127.0.0.1:57692_    ] o.a.s.c.c.ConnectionManager Client is connected to ZooKeeper
   [junit4]   2> 2715859 INFO  (TEST-StressHdfsTest.test-seed#[E6501D2B240C7E7D]) [n:127.0.0.1:57692_    ] o.a.s.c.c.SolrZkClient makePath: /overseer/queue
   [junit4]   2> 2715862 INFO  (TEST-StressHdfsTest.test-seed#[E6501D2B240C7E7D]) [n:127.0.0.1:57692_    ] o.a.s.c.c.SolrZkClient makePath: /overseer/collection-queue-work
   [junit4]   2> 2715867 INFO  (TEST-StressHdfsTest.test-seed#[E6501D2B240C7E7D]) [n:127.0.0.1:57692_    ] o.a.s.c.c.SolrZkClient makePath: /overseer/collection-map-running
   [junit4]   2> 2715870 INFO  (TEST-StressHdfsTest.test-seed#[E6501D2B240C7E7D]) [n:127.0.0.1:57692_    ] o.a.s.c.c.SolrZkClient makePath: /overseer/collection-map-completed
   [junit4]   2> 2715873 INFO  (TEST-StressHdfsTest.test-seed#[E6501D2B240C7E7D]) [n:127.0.0.1:57692_    ] o.a.s.c.c.SolrZkClient makePath: /overseer/collection-map-failure
   [junit4]   2> 2715877 INFO  (TEST-StressHdfsTest.test-seed#[E6501D2B240C7E7D]) [n:127.0.0.1:57692_    ] o.a.s.c.c.SolrZkClient makePath: /live_nodes
   [junit4]   2> 2715880 INFO  (TEST-StressHdfsTest.test-seed#[E6501D2B240C7E7D]) [n:127.0.0.1:57692_    ] o.a.s.c.c.SolrZkClient makePath: /aliases.json
   [junit4]   2> 2715882 INFO  (TEST-StressHdfsTest.test-seed#[E6501D2B240C7E7D]) [n:127.0.0.1:57692_    ] o.a.s.c.c.SolrZkClient makePath: /clusterstate.json
   [junit4]   2> 2715885 INFO  (TEST-StressHdfsTest.test-seed#[E6501D2B240C7E7D]) [n:127.0.0.1:57692_    ] o.a.s.c.c.SolrZkClient makePath: /security.json
   [junit4]   2> 2715887 INFO  (TEST-StressHdfsTest.test-seed#[E6501D2B240C7E7D]) [n:127.0.0.1:57692_    ] o.a.s.c.c.ZkStateReader Updating cluster state from ZooKeeper... 
   [junit4]   2> 2715889 INFO  (TEST-StressHdfsTest.test-seed#[E6501D2B240C7E7D]) [n:127.0.0.1:57692_    ] o.a.s.c.c.ZkStateReader Updated live nodes from ZooKeeper... (0) -> (0)
   [junit4]   2> 2715892 INFO  (TEST-StressHdfsTest.test-seed#[E6501D2B240C7E7D]) [n:127.0.0.1:57692_    ] o.a.s.c.c.SolrZkClient makePath: /overseer_elect
   [junit4]   2> 2715894 INFO  (TEST-StressHdfsTest.test-seed#[E6501D2B240C7E7D]) [n:127.0.0.1:57692_    ] o.a.s.c.c.SolrZkClient makePath: /overseer_elect/election
   [junit4]   2> 2715895 INFO  (TEST-StressHdfsTest.test-seed#[E6501D2B240C7E7D]) [n:127.0.0.1:57692_    ] o.a.s.c.Overseer Overseer (id=null) closing
   [junit4]   2> 2715896 INFO  (TEST-StressHdfsTest.test-seed#[E6501D2B240C7E7D]) [n:127.0.0.1:57692_    ] o.a.s.c.LeaderElector Joined leadership election with path: /overseer_elect/election/95675826877431812-127.0.0.1:57692_-n_0000000000
   [junit4]   2> 2715897 INFO  (TEST-StressHdfsTest.test-seed#[E6501D2B240C7E7D]) [n:127.0.0.1:57692_    ] o.a.s.c.OverseerElectionContext I am going to be the leader 127.0.0.1:57692_
   [junit4]   2> 2715897 INFO  (TEST-StressHdfsTest.test-seed#[E6501D2B240C7E7D]) [n:127.0.0.1:57692_    ] o.a.s.c.c.SolrZkClient makePath: /overseer_elect/leader
   [junit4]   2> 2715899 INFO  (TEST-StressHdfsTest.test-seed#[E6501D2B240C7E7D]) [n:127.0.0.1:57692_    ] o.a.s.c.Overseer Overseer (id=95675826877431812-127.0.0.1:57692_-n_0000000000) starting
   [junit4]   2> 2715901 INFO  (TEST-StressHdfsTest.test-seed#[E6501D2B240C7E7D]) [n:127.0.0.1:57692_    ] o.a.s.c.c.SolrZkClient makePath: /overseer/queue-work
   [junit4]   2> 2715911 INFO  (TEST-StressHdfsTest.test-seed#[E6501D2B240C7E7D]) [n:127.0.0.1:57692_    ] o.a.s.c.OverseerAutoReplicaFailoverThread Starting OverseerAutoReplicaFailoverThread autoReplicaFailoverWorkLoopDelay=10000 autoReplicaFailoverWaitAfterExpiration=10000 autoReplicaFailoverBadNodeExpiration=60000
   [junit4]   2> 2715911 INFO  (OverseerCollectionConfigSetProcessor-95675826877431812-127.0.0.1:57692_-n_0000000000) [n:127.0.0.1:57692_    ] o.a.s.c.OverseerTaskProcessor Process current queue of overseer operations
   [junit4]   2> 2715912 INFO  (TEST-StressHdfsTest.test-seed#[E6501D2B240C7E7D]) [n:127.0.0.1:57692_    ] o.a.s.c.ZkController Register node as live in ZooKeeper:/live_nodes/127.0.0.1:57692_
   [junit4]   2> 2715912 INFO  (OverseerStateUpdate-95675826877431812-127.0.0.1:57692_-n_0000000000) [n:127.0.0.1:57692_    ] o.a.s.c.Overseer Starting to work on the main queue
   [junit4]   2> 2715913 INFO  (TEST-StressHdfsTest.test-seed#[E6501D2B240C7E7D]) [n:127.0.0.1:57692_    ] o.a.s.c.c.SolrZkClient makePath: /live_nodes/127.0.0.1:57692_
   [junit4]   2> 2715917 INFO  (OverseerStateUpdate-95675826877431812-127.0.0.1:57692_-n_0000000000) [n:127.0.0.1:57692_    ] o.a.s.c.c.ZkStateReader Updated live nodes from ZooKeeper... (0) -> (0)
   [junit4]   2> 2715918 INFO  (zkCallback-3387-thread-1-processing-n:127.0.0.1:57692_) [n:127.0.0.1:57692_    ] o.a.s.c.c.ZkStateReader A live node change: [WatchedEvent state:SyncConnected type:NodeChildrenChanged path:/live_nodes], has occurred - updating... (live nodes size: [0])
   [junit4]   2> 2715919 INFO  (zkCallback-3387-thread-1-processing-n:127.0.0.1:57692_) [n:127.0.0.1:57692_    ] o.a.s.c.c.ZkStateReader Updated live nodes from ZooKeeper... (0) -> (1)
   [junit4]   2> 2715947 INFO  (TEST-StressHdfsTest.test-seed#[E6501D2B240C7E7D]) [n:127.0.0.1:57692_    ] o.a.s.c.CoreContainer Security conf doesn't exist. Skipping setup for authorization module.
   [junit4]   2> 2715947 INFO  (TEST-StressHdfsTest.test-seed#[E6501D2B240C7E7D]) [n:127.0.0.1:57692_    ] o.a.s.c.CoreContainer No authentication plugin used.
   [junit4]   2> 2715948 INFO  (TEST-StressHdfsTest.test-seed#[E6501D2B240C7E7D]) [n:127.0.0.1:57692_    ] o.a.s.c.CorePropertiesLocator Looking for core definitions underneath /export/home/jenkins/workspace/Lucene-Solr-master-Solaris/solr/build/solr-core/test/J0/../../../../../../../../../../export/home/jenkins/workspace/Lucene-Solr-master-Solaris/solr/build/solr-core/test/J0/temp/solr.cloud.hdfs.StressHdfsTest_E6501D2B240C7E7D-001/control-001/cores
   [junit4]   2> 2715950 INFO  (TEST-StressHdfsTest.test-seed#[E6501D2B240C7E7D]) [n:127.0.0.1:57692_    ] o.a.s.c.CoreDescriptor Created CoreDescriptor: {name=collection1, config=solrconfig.xml, transient=false, schema=schema.xml, loadOnStartup=true, configSetProperties=configsetprops.json, collection=control_collection, coreNodeName=, dataDir=data/, shard=}
   [junit4]   2> 2715950 INFO  (TEST-StressHdfsTest.test-seed#[E6501D2B240C7E7D]) [n:127.0.0.1:57692_    ] o.a.s.c.CorePropertiesLocator Found core collection1 in /export/home/jenkins/workspace/Lucene-Solr-master-Solaris/solr/build/solr-core/test/J0/../../../../../../../../../../export/home/jenkins/workspace/Lucene-Solr-master-Solaris/solr/build/solr-core/test/J0/temp/solr.cloud.hdfs.StressHdfsTest_E6501D2B240C7E7D-001/control-001/cores/collection1
   [junit4]   2> 2715950 INFO  (TEST-StressHdfsTest.test-seed#[E6501D2B240C7E7D]) [n:127.0.0.1:57692_    ] o.a.s.c.CorePropertiesLocator Found 1 core definitions
   [junit4]   2> 2715952 INFO  (TEST-StressHdfsTest.test-seed#[E6501D2B240C7E7D]) [n:127.0.0.1:57692_    ] o.a.s.s.SolrDispatchFilter user.dir=/export/home/jenkins/workspace/Lucene-Solr-master-Solaris/solr/build/solr-core/test/J0
   [junit4]   2> 2715952 INFO  (TEST-StressHdfsTest.test-seed#[E6501D2B240C7E7D]) [n:127.0.0.1:57692_    ] o.a.s.s.SolrDispatchFilter SolrDispatchFilter.init() done
   [junit4]   2> 2715952 INFO  (coreLoadExecutor-9699-thread-1-processing-n:127.0.0.1:57692_) [n:127.0.0.1:57692_ c:control_collection   x:collection1] o.a.s.c.ZkController publishing state=down
   [junit4]   2> 2715952 INFO  (coreLoadExecutor-9699-thread-1-processing-n:127.0.0.1:57692_) [n:127.0.0.1:57692_ c:control_collection   x:collection1] o.a.s.c.ZkController numShards not found on descriptor - reading it from system property
   [junit4]   2> 2715956 INFO  (OverseerStateUpdate-95675826877431812-127.0.0.1:57692_-n_0000000000) [n:127.0.0.1:57692_    ] o.a.s.c.Overseer processMessage: queueSize: 1, message = {
   [junit4]   2>   "core":"collection1",
   [junit4]   2>   "roles":null,
   [junit4]   2>   "base_url":"http://127.0.0.1:57692",
   [junit4]   2>   "node_name":"127.0.0.1:57692_",
   [junit4]   2>   "numShards":"1",
   [junit4]   2>   "state":"down",
   [junit4]   2>   "shard":null,
   [junit4]   2>   "collection":"control_collection",
   [junit4]   2>   "operation":"state"} current state version: 0
   [junit4]   2> 2715956 INFO  (OverseerStateUpdate-95675826877431812-127.0.0.1:57692_-n_0000000000) [n:127.0.0.1:57692_    ] o.a.s.c.o.ReplicaMutator Update state numShards=1 message={
   [junit4]   2>   "core":"collection1",
   [junit4]   2>   "roles":null,
   [junit4]   2>   "base_url":"http://127.0.0.1:57692",
   [junit4]   2>   "node_name":"127.0.0.1:57692_",
   [junit4]   2>   "numShards":"1",
   [junit4]   2>   "state":"down",
   [junit4]   2>   "shard":null,
   [junit4]   2>   "collection":"control_collection",
   [junit4]   2>   "operation":"state"}
   [junit4]   2> 2715957 INFO  (coreLoadExecutor-9699-thread-1-processing-n:127.0.0.1:57692_) [n:127.0.0.1:57692_ c:control_collection   x:collection1] o.a.s.c.ZkController look for our core node name
   [junit4]   2> 2715957 INFO  (OverseerStateUpdate-95675826877431812-127.0.0.1:57692_-n_0000000000) [n:127.0.0.1:57692_    ] o.a.s.c.o.ClusterStateMutator building a new cName: control_collection
   [junit4]   2> 2715958 INFO  (OverseerStateUpdate-95675826877431812-127.0.0.1:57692_-n_0000000000) [n:127.0.0.1:57692_    ] o.a.s.c.o.ReplicaMutator Assigning new node to shard shard=shard1
   [junit4]   2> 2715960 INFO  (zkCallback-3387-thread-1-processing-n:127.0.0.1:57692_) [n:127.0.0.1:57692_    ] o.a.s.c.c.ZkStateReader A cluster state change: [WatchedEvent state:SyncConnected type:NodeDataChanged path:/clusterstate.json], has occurred - updating... (live nodes size: [1])
   [junit4]   2> 2716957 INFO  (coreLoadExecutor-9699-thread-1-processing-n:127.0.0.1:57692_) [n:127.0.0.1:57692_ c:control_collection   x:collection1] o.a.s.c.ZkController waiting to find shard id in clusterstate for collection1
   [junit4]   2> 2716958 INFO  (coreLoadExecutor-9699-thread-1-processing-n:127.0.0.1:57692_) [n:127.0.0.1:57692_ c:control_collection   x:collection1] o.a.s.c.ZkController Check for collection zkNode:control_collection
   [junit4]   2> 2716958 INFO  (coreLoadExecutor-9699-thread-1-processing-n:127.0.0.1:57692_) [n:127.0.0.1:57692_ c:control_collection   x:collection1] o.a.s.c.ZkController Collection zkNode exists
   [junit4]   2> 2716958 INFO  (coreLoadExecutor-9699-thread-1-processing-n:127.0.0.1:57692_) [n:127.0.0.1:57692_ c:control_collection   x:collection1] o.a.s.c.c.ZkStateReader Load collection config from: [/collections/control_collection]
   [junit4]   2> 2716960 INFO  (coreLoadExecutor-9699-thread-1-processing-n:127.0.0.1:57692_) [n:127.0.0.1:57692_ c:control_collection   x:collection1] o.a.s.c.c.ZkStateReader path=[/collections/control_collection] [configName]=[conf1] specified config exists in ZooKeeper
   [junit4]   2> 2716960 INFO  (coreLoadExecutor-9699-thread-1-processing-n:127.0.0.1:57692_) [n:127.0.0.1:57692_ c:control_collection   x:collection1] o.a.s.c.SolrResourceLoader new SolrResourceLoader for directory: '/export/home/jenkins/workspace/Lucene-Solr-master-Solaris/solr/build/solr-core/test/J0/temp/solr.cloud.hdfs.StressHdfsTest_E6501D2B240C7E7D-001/control-001/cores/collection1'
   [junit4]   2> 2716960 INFO  (coreLoadExecutor-9699-thread-1-processing-n:127.0.0.1:57692_) [n:127.0.0.1:57692_ c:control_collection   x:collection1] o.a.s.c.SolrResourceLoader JNDI not configured for solr (NoInitialContextEx)
   [junit4]   2> 2716960 INFO  (coreLoadExecutor-9699-thread-1-processing-n:127.0.0.1:57692_) [n:127.0.0.1:57692_ c:control_collection   x:collection1] o.a.s.c.SolrResourceLoader solr home defaulted to 'solr/' (could not find system property or JNDI)
   [junit4]   2> 2716962 INFO  (coreLoadExecutor-9699-thread-1-processing-n:127.0.0.1:57692_) [n:127.0.0.1:57692_ c:control_collection   x:collection1] o.a.s.c.Config loaded config solrconfig.xml with version 0 
   [junit4]   2> 2716968 INFO  (coreLoadExecutor-9699-thread-1-processing-n:127.0.0.1:57692_) [n:127.0.0.1:57692_ c:control_collection   x:collection1] o.a.s.c.SolrConfig current version of requestparams : -1
   [junit4]   2> 2716993 INFO  (coreLoadExecutor-9699-thread-1-processing-n:127.0.0.1:57692_) [n:127.0.0.1:57692_ c:control_collection   x:collection1] o.a.s.c.SolrConfig Using Lucene MatchVersion: 7.0.0
   [junit4]   2> 2717002 INFO  (coreLoadExecutor-9699-thread-1-processing-n:127.0.0.1:57692_) [n:127.0.0.1:57692_ c:control_collection   x:collection1] o.a.s.c.SolrConfig Loaded SolrConfig: solrconfig.xml
   [junit4]   2> 2717007 INFO  (coreLoadExecutor-9699-thread-1-processing-n:127.0.0.1:57692_) [n:127.0.0.1:57692_ c:control_collection   x:collection1] o.a.s.s.IndexSchema [collection1] Schema name=test
   [junit4]   2> 2717084 INFO  (coreLoadExecutor-9699-thread-1-processing-n:127.0.0.1:57692_) [n:127.0.0.1:57692_ c:control_collection   x:collection1] o.a.s.s.OpenExchangeRatesOrgProvider Initialized with rates=open-exchange-rates.json, refreshInterval=1440.
   [junit4]   2> 2717090 INFO  (coreLoadExecutor-9699-thread-1-processing-n:127.0.0.1:57692_) [n:127.0.0.1:57692_ c:control_collection   x:collection1] o.a.s.s.IndexSchema default search field in schema is text
   [junit4]   2> 2717091 INFO  (coreLoadExecutor-9699-thread-1-processing-n:127.0.0.1:57692_) [n:127.0.0.1:57692_ c:control_collection   x:collection1] o.a.s.s.IndexSchema unique key field: id
   [junit4]   2> 2717105 INFO  (coreLoadExecutor-9699-thread-1-processing-n:127.0.0.1:57692_) [n:127.0.0.1:57692_ c:control_collection   x:collection1] o.a.s.s.FileExchangeRateProvider Reloading exchange rates from file currency.xml
   [junit4]   2> 2717108 INFO  (coreLoadExecutor-9699-thread-1-processing-n:127.0.0.1:57692_) [n:127.0.0.1:57692_ c:control_collection   x:collection1] o.a.s.s.FileExchangeRateProvider Reloading exchange rates from file currency.xml
   [junit4]   2> 2717112 INFO  (coreLoadExecutor-9699-thread-1-processing-n:127.0.0.1:57692_) [n:127.0.0.1:57692_ c:control_collection   x:collection1] o.a.s.s.OpenExchangeRatesOrgProvider Reloading exchange rates from open-exchange-rates.json
   [junit4]   2> 2717113 INFO  (coreLoadExecutor-9699-thread-1-processing-n:127.0.0.1:57692_) [n:127.0.0.1:57692_ c:control_collection   x:collection1] o.a.s.s.OpenExchangeRatesOrgProvider Reloading exchange rates from open-exchange-rates.json
   [junit4]   2> 2717116 INFO  (coreLoadExecutor-9699-thread-1-processing-n:127.0.0.1:57692_) [n:127.0.0.1:57692_ c:control_collection   x:collection1] o.a.s.c.ConfigSetProperties Did not find ConfigSet properties, assuming default properties: Can't find resource 'configsetprops.json' in classpath or '/configs/conf1', cwd=/export/home/jenkins/workspace/Lucene-Solr-master-Solaris/solr/build/solr-core/test/J0
   [junit4]   2> 2717116 INFO  (coreLoadExecutor-9699-thread-1-processing-n:127.0.0.1:57692_) [n:127.0.0.1:57692_ c:control_collection   x:collection1] o.a.s.c.CoreContainer Creating SolrCore 'collection1' using configuration from collection control_collection
   [junit4]   2> 2717117 INFO  (coreLoadExecutor-9699-thread-1-processing-n:127.0.0.1:57692_) [n:127.0.0.1:57692_ c:control_collection s:shard1 r:core_node1 x:collection1] o.a.s.c.SolrCore org.apache.solr.core.HdfsDirectoryFactory
   [junit4]   2> 2717117 INFO  (coreLoadExecutor-9699-thread-1-processing-n:127.0.0.1:57692_) [n:127.0.0.1:57692_ c:control_collection s:shard1 r:core_node1 x:collection1] o.a.s.c.HdfsDirectoryFactory solr.hdfs.home=hdfs://solaris-vm:62309/solr_hdfs_home
   [junit4]   2> 2717117 INFO  (coreLoadExecutor-9699-thread-1-processing-n:127.0.0.1:57692_) [n:127.0.0.1:57692_ c:control_collection s:shard1 r:core_node1 x:collection1] o.a.s.c.HdfsDirectoryFactory Solr Kerberos Authentication disabled
   [junit4]   2> 2717117 INFO  (coreLoadExecutor-9699-thread-1-processing-n:127.0.0.1:57692_) [n:127.0.0.1:57692_ c:control_collection s:shard1 r:core_node1 x:collection1] o.a.s.c.SolrCore [[collection1] ] Opening new SolrCore at [/export/home/jenkins/workspace/Lucene-Solr-master-Solaris/solr/build/solr-core/test/J0/temp/solr.cloud.hdfs.StressHdfsTest_E6501D2B240C7E7D-001/control-001/cores/collection1], dataDir=[hdfs://solaris-vm:62309/solr_hdfs_home/control_collection/core_node1/data/]
   [junit4]   2> 2717117 INFO  (coreLoadExecutor-9699-thread-1-processing-n:127.0.0.1:57692_) [n:127.0.0.1:57692_ c:control_collection s:shard1 r:core_node1 x:collection1] o.a.s.c.JmxMonitoredMap JMX monitoring is enabled. Adding Solr mbeans to JMX Server: com.sun.jmx.mbeanserver.JmxMBeanServer@29f21da6
   [junit4]   2> 2717117 INFO  (coreLoadExecutor-9699-thread-1-processing-n:127.0.0.1:57692_) [n:127.0.0.1:57692_ c:control_collection s:shard1 r:core_node1 x:collection1] o.a.s.c.HdfsDirectoryFactory creating directory factory for path hdfs://solaris-vm:62309/solr_hdfs_home/control_collection/core_node1/data
   [junit4]   2> 2717136 INFO  (coreLoadExecutor-9699-thread-1-processing-n:127.0.0.1:57692_) [n:127.0.0.1:57692_ c:control_collection s:shard1 r:core_node1 x:collection1] o.a.s.c.CachingDirectoryFactory return new directory for hdfs://solaris-vm:62309/solr_hdfs_home/control_collection/core_node1/data
   [junit4]   2> 2717138 INFO  (coreLoadExecutor-9699-thread-1-processing-n:127.0.0.1:57692_) [n:127.0.0.1:57692_ c:control_collection s:shard1 r:core_node1 x:collection1] o.a.s.c.SolrCore New index directory detected: old=null new=hdfs://solaris-vm:62309/solr_hdfs_home/control_collection/core_node1/data/index/
   [junit4]   2> 2717147 WARN  (coreLoadExecutor-9699-thread-1-processing-n:127.0.0.1:57692_) [n:127.0.0.1:57692_ c:control_collection s:shard1 r:core_node1 x:collection1] o.a.s.c.SolrCore [collection1] Solr index directory 'hdfs:/solaris-vm:62309/solr_hdfs_home/control_collection/core_node1/data/index' doesn't exist. Creating new index...
   [junit4]   2> 2717147 INFO  (coreLoadExecutor-9699-thread-1-processing-n:127.0.0.1:57692_) [n:127.0.0.1:57692_ c:control_collection s:shard1 r:core_node1 x:collection1] o.a.s.c.HdfsDirectoryFactory creating directory factory for path hdfs://solaris-vm:62309/solr_hdfs_home/control_collection/core_node1/data/index
   [junit4]   2> 2717154 INFO  (coreLoadExecutor-9699-thread-1-processing-n:127.0.0.1:57692_) [n:127.0.0.1:57692_ c:control_collection s:shard1 r:core_node1 x:collection1] o.a.s.c.HdfsDirectoryFactory Number of slabs of block cache [1] with direct memory allocation set to [true]
   [junit4]   2> 2717154 INFO  (coreLoadExecutor-9699-thread-1-processing-n:127.0.0.1:57692_) [n:127.0.0.1:57692_ c:control_collection s:shard1 r:core_node1 x:collection1] o.a.s.c.HdfsDirectoryFactory Block cache target memory usage, slab size of [8388608] will allocate [1] slabs and use ~[8388608] bytes
   [junit4]   2> 2717158 INFO  (coreLoadExecutor-9699-thread-1-processing-n:127.0.0.1:57692_) [n:127.0.0.1:57692_ c:control_collecti

[...truncated too long message...]

toreClassName$1.evaluate(TestRuleStoreClassName.java:41)
   [junit4]   2> 	at com.carrotsearch.randomizedtesting.rules.NoShadowingOrOverridesOnMethodsRule$1.evaluate(NoShadowingOrOverridesOnMethodsRule.java:40)
   [junit4]   2> 	at com.carrotsearch.randomizedtesting.rules.NoShadowingOrOverridesOnMethodsRule$1.evaluate(NoShadowingOrOverridesOnMethodsRule.java:40)
   [junit4]   2> 	at com.carrotsearch.randomizedtesting.rules.StatementAdapter.evaluate(StatementAdapter.java:36)
   [junit4]   2> 	at com.carrotsearch.randomizedtesting.rules.StatementAdapter.evaluate(StatementAdapter.java:36)
   [junit4]   2> 	at com.carrotsearch.randomizedtesting.rules.StatementAdapter.evaluate(StatementAdapter.java:36)
   [junit4]   2> 	at org.apache.lucene.util.TestRuleAssertionsRequired$1.evaluate(TestRuleAssertionsRequired.java:53)
   [junit4]   2> 	at org.apache.lucene.util.TestRuleMarkFailure$1.evaluate(TestRuleMarkFailure.java:47)
   [junit4]   2> 	at org.apache.lucene.util.TestRuleIgnoreAfterMaxFailures$1.evaluate(TestRuleIgnoreAfterMaxFailures.java:64)
   [junit4]   2> 	at org.apache.lucene.util.TestRuleIgnoreTestSuites$1.evaluate(TestRuleIgnoreTestSuites.java:54)
   [junit4]   2> 	at com.carrotsearch.randomizedtesting.rules.StatementAdapter.evaluate(StatementAdapter.java:36)
   [junit4]   2> 	at com.carrotsearch.randomizedtesting.ThreadLeakControl$StatementRunner.run(ThreadLeakControl.java:367)
   [junit4]   2> 	at java.lang.Thread.run(Thread.java:745)
   [junit4]   2> Caused by: java.lang.NullPointerException
   [junit4]   2> 	at org.apache.hadoop.hdfs.server.blockmanagement.BlocksMap.size(BlocksMap.java:198)
   [junit4]   2> 	at org.apache.hadoop.hdfs.server.blockmanagement.BlockManager.getTotalBlocks(BlockManager.java:3291)
   [junit4]   2> 	at org.apache.hadoop.hdfs.server.namenode.FSNamesystem.getBlocksTotal(FSNamesystem.java:6223)
   [junit4]   2> 	... 54 more
   [junit4]   2> 2754390 INFO  (SUITE-StressHdfsTest-seed#[E6501D2B240C7E7D]-worker) [    ] o.a.s.SolrTestCaseJ4 ###deleteCore
   [junit4]   2> NOTE: leaving temporary files on disk at: /export/home/jenkins/workspace/Lucene-Solr-master-Solaris/solr/build/solr-core/test/J0/temp/solr.cloud.hdfs.StressHdfsTest_E6501D2B240C7E7D-001
   [junit4]   2> Apr 05, 2016 11:01:39 PM com.carrotsearch.randomizedtesting.ThreadLeakControl checkThreadLeaks
   [junit4]   2> WARNING: Will linger awaiting termination of 3 leaked thread(s).
   [junit4]   2> NOTE: test params are: codec=Asserting(Lucene60): {range_facet_l_dv=BlockTreeOrds(blocksize=128), _version_=FSTOrd50, multiDefault=PostingsFormat(name=MockRandom), intDefault=FSTOrd50, id=BlockTreeOrds(blocksize=128), range_facet_i_dv=PostingsFormat(name=MockRandom), text=FST50, range_facet_l=PostingsFormat(name=MockRandom), timestamp=PostingsFormat(name=MockRandom), txt_t=FST50}, docValues:{range_facet_l_dv=DocValuesFormat(name=Direct), range_facet_i_dv=DocValuesFormat(name=Lucene54), timestamp=DocValuesFormat(name=Lucene54)}, maxPointsInLeafNode=1912, maxMBSortInHeap=6.407782123137062, sim=ClassicSimilarity, locale=es-AR, timezone=Etc/GMT+1
   [junit4]   2> NOTE: SunOS 5.11 amd64/Oracle Corporation 1.8.0_72 (64-bit)/cpus=3,threads=2,free=192812944,total=513802240
   [junit4]   2> NOTE: All tests run in this JVM: [SampleTest, CircularListTest, TestMiniSolrCloudCluster, TestSolrQueryParserResource, SolrRequestParserTest, BlockCacheTest, TestReplicaProperties, TestReplicationHandlerBackup, TestMinMaxOnMultiValuedField, TestSurroundQueryParser, TestRemoteStreaming, RecoveryZkTest, SparseHLLTest, ZkCLITest, TestIntervalFaceting, TestFaceting, DocValuesMultiTest, TestPivotHelperCode, TestAuthenticationFramework, ReturnFieldsTest, CursorPagingTest, StandardRequestHandlerTest, JavabinLoaderTest, TestLFUCache, FacetPivotSmallTest, JSONWriterTest, DateRangeFieldTest, BigEndianAscendingWordSerializerTest, AtomicUpdatesTest, TimeZoneUtilsTest, TestSweetSpotSimilarityFactory, PingRequestHandlerTest, UpdateParamsTest, ShardRoutingTest, TestChildDocTransformer, TestCursorMarkWithoutUniqueKey, TestTolerantUpdateProcessorCloud, TestSerializedLuceneMatchVersion, SimpleFacetsTest, DocumentAnalysisRequestHandlerTest, SpatialFilterTest, EnumFieldTest, TestBlendedInfixSuggestions, DirectUpdateHandlerTest, TestSizeLimitedDistributedMap, FastVectorHighlighterTest, TestDownShardTolerantSearch, SuggesterFSTTest, TestCollectionAPI, TestPerFieldSimilarityWithDefaultOverride, VersionInfoTest, AlternateDirectoryTest, TestRestoreCore, HdfsWriteToMultipleCollectionsTest, TestLRUStatsCache, TestSearchPerf, TestInitParams, HdfsBasicDistributedZkTest, OverseerRolesTest, TestCloudInspectUtil, SoftAutoCommitTest, CdcrReplicationDistributedZkTest, ExternalFileFieldSortTest, PeerSyncTest, TestDFRSimilarityFactory, ActionThrottleTest, MergeStrategyTest, HdfsSyncSliceTest, URLClassifyProcessorTest, IndexSchemaTest, CloneFieldUpdateProcessorFactoryTest, DeleteInactiveReplicaTest, TestRecoveryHdfs, TestConfigSetsAPIExclusivity, TestPostingsSolrHighlighter, BadComponentTest, ChaosMonkeyNothingIsSafeTest, JsonLoaderTest, TestDefaultStatsCache, SystemInfoHandlerTest, TestManagedResourceStorage, TestHashQParserPlugin, TestDistributedStatsComponentCardinality, BufferStoreTest, SimplePostToolTest, SolrTestCaseJ4Test, LeaderFailoverAfterPartitionTest, TestLeaderElectionZkExpiry, DocumentBuilderTest, MBeansHandlerTest, DeleteStatusTest, ConjunctionSolrSpellCheckerTest, WrapperMergePolicyFactoryTest, TestReplicationHandler, TestImplicitCoreProperties, TestQuerySenderNoQuery, CoreAdminCreateDiscoverTest, DirectSolrSpellCheckerTest, TestSortingResponseWriter, OverseerTaskQueueTest, DistribDocExpirationUpdateProcessorTest, DeleteReplicaTest, TestUseDocValuesAsStored2, TlogReplayBufferedWhileIndexingTest, TestNoOpRegenerator, XmlUpdateRequestHandlerTest, TestBlobHandler, TestSolrConfigHandlerCloud, TestQueryWrapperFilter, StatelessScriptUpdateProcessorFactoryTest, TestCollationFieldDocValues, TestCSVLoader, TestCopyFieldCollectionResource, TestMaxScoreQueryParser, AsyncMigrateRouteKeyTest, TestLMDirichletSimilarityFactory, TestJmxMonitoredMap, TestStressUserVersions, TestFieldSortValues, TestFastLRUCache, TestTolerantSearch, CollectionStateFormat2Test, TestCoreContainer, LeaderElectionTest, DisMaxRequestHandlerTest, PreAnalyzedUpdateProcessorTest, TestRandomRequestDistribution, TestLazyCores, IndexBasedSpellCheckerTest, TestReloadAndDeleteDocs, TestTestInjection, ClusterStateTest, SolrCoreTest, MultiThreadedOCPTest, TestJsonRequest, HdfsChaosMonkeySafeLeaderTest, TestXmlQParser, TestPhraseSuggestions, DistributedQueryElevationComponentTest, TestDistributedSearch, MoreLikeThisHandlerTest, CollectionsAPIDistributedZkTest, FullSolrCloudDistribCmdsTest, TestDistributedGrouping, DistributedSpellCheckComponentTest, TestStressReorder, TestReload, HardAutoCommitTest, StatsComponentTest, TestGroupingSearch, SolrCmdDistributorTest, TestSort, BasicFunctionalityTest, TestIndexSearcher, CurrencyFieldXmlFileTest, TestCoreDiscovery, TestExtendedDismaxParser, DocValuesTest, TestQueryUtils, PrimitiveFieldTypeTest, FileBasedSpellCheckerTest, RequestHandlersTest, PathHierarchyTokenizerFactoryTest, TestIndexingPerformance, RequiredFieldsTest, TestArbitraryIndexDir, SolrPluginUtilsTest, TestCollationField, TestAnalyzedSuggestions, TestPHPSerializedResponseWriter, TestComponentsName, HighlighterConfigTest, SOLR749Test, TestQuerySenderListener, CopyFieldTest, SolrIndexConfigTest, TestStressRecovery, TestMergePolicyConfig, MultiTermTest, TestDocSet, TestElisionMultitermQuery, TestConfig, TestSolrCoreProperties, NotRequiredUniqueKeyTest, TestLuceneMatchVersion, SpellPossibilityIteratorTest, TestCharFilters, TestCodecSupport, TestXIncludeConfig, TestBM25SimilarityFactory, TestFastOutputStream, PluginInfoTest, PreAnalyzedFieldTest, DOMUtilTest, TestSolrJ, TestDocumentBuilder, SliceStateTest, TestRTGBase, TestCrossCoreJoin, TestDistributedMissingSort, ConnectionReuseTest, AssignTest, BaseCdcrDistributedZkTest, CdcrReplicationHandlerTest, CdcrRequestHandlerTest, CloudExitableDirectoryReaderTest, CollectionTooManyReplicasTest, ConcurrentDeleteAndCreateCollectionTest, ConnectionManagerTest, DeleteShardTest, ForceLeaderTest, SharedFSAutoReplicaFailoverTest, SharedFSAutoReplicaFailoverUtilsTest, SimpleCollectionCreateDeleteTest, SolrCloudExampleTest, SolrXmlInZkTest, TestCryptoKeys, TestDistribDocBasedVersion, TestLeaderInitiatedRecoveryThread, TestRequestStatusCollectionAPI, TestSolrCloudWithKerberosAlt, HdfsRecoveryZkTest, HdfsRestartWhileUpdatingTest, HdfsThreadLeakTest, HdfsTlogReplayBufferedWhileIndexingTest, StressHdfsTest]
   [junit4] Completed [475/584 (2!)] on J0 in 51.46s, 1 test, 1 error <<< FAILURES!

[...truncated 341 lines...]
BUILD FAILED
/export/home/jenkins/workspace/Lucene-Solr-master-Solaris/build.xml:740: The following error occurred while executing this line:
/export/home/jenkins/workspace/Lucene-Solr-master-Solaris/build.xml:684: The following error occurred while executing this line:
/export/home/jenkins/workspace/Lucene-Solr-master-Solaris/build.xml:59: The following error occurred while executing this line:
/export/home/jenkins/workspace/Lucene-Solr-master-Solaris/solr/build.xml:233: The following error occurred while executing this line:
/export/home/jenkins/workspace/Lucene-Solr-master-Solaris/solr/common-build.xml:529: The following error occurred while executing this line:
/export/home/jenkins/workspace/Lucene-Solr-master-Solaris/lucene/common-build.xml:1457: The following error occurred while executing this line:
/export/home/jenkins/workspace/Lucene-Solr-master-Solaris/lucene/common-build.xml:1014: There were test failures: 584 suites (10 ignored), 2354 tests, 2 errors, 85 ignored (70 assumptions) [seed: E6501D2B240C7E7D]

Total time: 76 minutes 28 seconds
Build step 'Invoke Ant' marked build as failure
Archiving artifacts
[WARNINGS] Skipping publisher since build result is FAILURE
Recording test results
Email was triggered for: Failure - Any
Sending email for trigger: Failure - Any



Mime
View raw message