lucene-dev mailing list archives

Site index · List index
Message view « Date » · « Thread »
Top « Date » · « Thread »
From Policeman Jenkins Server <jenk...@thetaphi.de>
Subject [JENKINS-EA] Lucene-Solr-master-Linux (64bit/jdk-9-ea+115) - Build # 16597 - Failure!
Date Wed, 27 Apr 2016 20:40:50 GMT
Build: http://jenkins.thetaphi.de/job/Lucene-Solr-master-Linux/16597/
Java: 64bit/jdk-9-ea+115 -XX:+UseCompressedOops -XX:+UseParallelGC

1 tests failed.
FAILED:  org.apache.solr.schema.TestManagedSchemaAPI.test

Error Message:
Error from server at http://127.0.0.1:39923/solr/testschemaapi_shard1_replica1: ERROR: [doc=2] unknown field 'myNewField1'

Stack Trace:
org.apache.solr.client.solrj.impl.CloudSolrClient$RouteException: Error from server at http://127.0.0.1:39923/solr/testschemaapi_shard1_replica1: ERROR: [doc=2] unknown field 'myNewField1'
	at __randomizedtesting.SeedInfo.seed([ADFDD54241CCA071:25A9EA98EF30CD89]:0)
	at org.apache.solr.client.solrj.impl.CloudSolrClient.directUpdate(CloudSolrClient.java:661)
	at org.apache.solr.client.solrj.impl.CloudSolrClient.sendRequest(CloudSolrClient.java:1073)
	at org.apache.solr.client.solrj.impl.CloudSolrClient.requestWithRetryOnStaleState(CloudSolrClient.java:962)
	at org.apache.solr.client.solrj.impl.CloudSolrClient.request(CloudSolrClient.java:898)
	at org.apache.solr.schema.TestManagedSchemaAPI.testAddFieldAndDocument(TestManagedSchemaAPI.java:86)
	at org.apache.solr.schema.TestManagedSchemaAPI.test(TestManagedSchemaAPI.java:55)
	at jdk.internal.reflect.NativeMethodAccessorImpl.invoke0(java.base@9-ea/Native Method)
	at jdk.internal.reflect.NativeMethodAccessorImpl.invoke(java.base@9-ea/NativeMethodAccessorImpl.java:62)
	at jdk.internal.reflect.DelegatingMethodAccessorImpl.invoke(java.base@9-ea/DelegatingMethodAccessorImpl.java:43)
	at java.lang.reflect.Method.invoke(java.base@9-ea/Method.java:531)
	at com.carrotsearch.randomizedtesting.RandomizedRunner.invoke(RandomizedRunner.java:1764)
	at com.carrotsearch.randomizedtesting.RandomizedRunner$8.evaluate(RandomizedRunner.java:871)
	at com.carrotsearch.randomizedtesting.RandomizedRunner$9.evaluate(RandomizedRunner.java:907)
	at com.carrotsearch.randomizedtesting.RandomizedRunner$10.evaluate(RandomizedRunner.java:921)
	at com.carrotsearch.randomizedtesting.rules.SystemPropertiesRestoreRule$1.evaluate(SystemPropertiesRestoreRule.java:57)
	at org.apache.lucene.util.TestRuleSetupTeardownChained$1.evaluate(TestRuleSetupTeardownChained.java:49)
	at org.apache.lucene.util.AbstractBeforeAfterRule$1.evaluate(AbstractBeforeAfterRule.java:45)
	at org.apache.lucene.util.TestRuleThreadAndTestName$1.evaluate(TestRuleThreadAndTestName.java:48)
	at org.apache.lucene.util.TestRuleIgnoreAfterMaxFailures$1.evaluate(TestRuleIgnoreAfterMaxFailures.java:64)
	at org.apache.lucene.util.TestRuleMarkFailure$1.evaluate(TestRuleMarkFailure.java:47)
	at com.carrotsearch.randomizedtesting.rules.StatementAdapter.evaluate(StatementAdapter.java:36)
	at com.carrotsearch.randomizedtesting.ThreadLeakControl$StatementRunner.run(ThreadLeakControl.java:367)
	at com.carrotsearch.randomizedtesting.ThreadLeakControl.forkTimeoutingTask(ThreadLeakControl.java:809)
	at com.carrotsearch.randomizedtesting.ThreadLeakControl$3.evaluate(ThreadLeakControl.java:460)
	at com.carrotsearch.randomizedtesting.RandomizedRunner.runSingleTest(RandomizedRunner.java:880)
	at com.carrotsearch.randomizedtesting.RandomizedRunner$5.evaluate(RandomizedRunner.java:781)
	at com.carrotsearch.randomizedtesting.RandomizedRunner$6.evaluate(RandomizedRunner.java:816)
	at com.carrotsearch.randomizedtesting.RandomizedRunner$7.evaluate(RandomizedRunner.java:827)
	at com.carrotsearch.randomizedtesting.rules.StatementAdapter.evaluate(StatementAdapter.java:36)
	at com.carrotsearch.randomizedtesting.rules.SystemPropertiesRestoreRule$1.evaluate(SystemPropertiesRestoreRule.java:57)
	at org.apache.lucene.util.AbstractBeforeAfterRule$1.evaluate(AbstractBeforeAfterRule.java:45)
	at com.carrotsearch.randomizedtesting.rules.StatementAdapter.evaluate(StatementAdapter.java:36)
	at org.apache.lucene.util.TestRuleStoreClassName$1.evaluate(TestRuleStoreClassName.java:41)
	at com.carrotsearch.randomizedtesting.rules.NoShadowingOrOverridesOnMethodsRule$1.evaluate(NoShadowingOrOverridesOnMethodsRule.java:40)
	at com.carrotsearch.randomizedtesting.rules.NoShadowingOrOverridesOnMethodsRule$1.evaluate(NoShadowingOrOverridesOnMethodsRule.java:40)
	at com.carrotsearch.randomizedtesting.rules.StatementAdapter.evaluate(StatementAdapter.java:36)
	at com.carrotsearch.randomizedtesting.rules.StatementAdapter.evaluate(StatementAdapter.java:36)
	at com.carrotsearch.randomizedtesting.rules.StatementAdapter.evaluate(StatementAdapter.java:36)
	at org.apache.lucene.util.TestRuleAssertionsRequired$1.evaluate(TestRuleAssertionsRequired.java:53)
	at org.apache.lucene.util.TestRuleMarkFailure$1.evaluate(TestRuleMarkFailure.java:47)
	at org.apache.lucene.util.TestRuleIgnoreAfterMaxFailures$1.evaluate(TestRuleIgnoreAfterMaxFailures.java:64)
	at org.apache.lucene.util.TestRuleIgnoreTestSuites$1.evaluate(TestRuleIgnoreTestSuites.java:54)
	at com.carrotsearch.randomizedtesting.rules.StatementAdapter.evaluate(StatementAdapter.java:36)
	at com.carrotsearch.randomizedtesting.ThreadLeakControl$StatementRunner.run(ThreadLeakControl.java:367)
	at java.lang.Thread.run(java.base@9-ea/Thread.java:804)
Caused by: org.apache.solr.client.solrj.impl.HttpSolrClient$RemoteSolrException: Error from server at http://127.0.0.1:39923/solr/testschemaapi_shard1_replica1: ERROR: [doc=2] unknown field 'myNewField1'
	at org.apache.solr.client.solrj.impl.HttpSolrClient.executeMethod(HttpSolrClient.java:606)
	at org.apache.solr.client.solrj.impl.HttpSolrClient.request(HttpSolrClient.java:259)
	at org.apache.solr.client.solrj.impl.HttpSolrClient.request(HttpSolrClient.java:248)
	at org.apache.solr.client.solrj.impl.LBHttpSolrClient.doRequest(LBHttpSolrClient.java:413)
	at org.apache.solr.client.solrj.impl.LBHttpSolrClient.request(LBHttpSolrClient.java:366)
	at org.apache.solr.client.solrj.impl.CloudSolrClient.lambda$directUpdate$0(CloudSolrClient.java:638)
	at java.util.concurrent.FutureTask.run(java.base@9-ea/FutureTask.java:266)
	at org.apache.solr.common.util.ExecutorUtil$MDCAwareThreadPoolExecutor.lambda$execute$0(ExecutorUtil.java:229)
	at java.util.concurrent.ThreadPoolExecutor.runWorker(java.base@9-ea/ThreadPoolExecutor.java:1158)
	at java.util.concurrent.ThreadPoolExecutor$Worker.run(java.base@9-ea/ThreadPoolExecutor.java:632)
	... 1 more




Build Log:
[...truncated 10810 lines...]
   [junit4] Suite: org.apache.solr.schema.TestManagedSchemaAPI
   [junit4]   2> Creating dataDir: /home/jenkins/workspace/Lucene-Solr-master-Linux/solr/build/solr-core/test/J1/temp/solr.schema.TestManagedSchemaAPI_ADFDD54241CCA071-001/init-core-data-001
   [junit4]   2> 390749 INFO  (SUITE-TestManagedSchemaAPI-seed#[ADFDD54241CCA071]-worker) [    ] o.a.s.SolrTestCaseJ4 Randomized ssl (false) and clientAuth (false)
   [junit4]   2> 390750 INFO  (SUITE-TestManagedSchemaAPI-seed#[ADFDD54241CCA071]-worker) [    ] o.a.s.c.ZkTestServer STARTING ZK TEST SERVER
   [junit4]   2> 390751 INFO  (Thread-709) [    ] o.a.s.c.ZkTestServer client port:0.0.0.0/0.0.0.0:0
   [junit4]   2> 390751 INFO  (Thread-709) [    ] o.a.s.c.ZkTestServer Starting server
   [junit4]   2> 390850 INFO  (SUITE-TestManagedSchemaAPI-seed#[ADFDD54241CCA071]-worker) [    ] o.a.s.c.ZkTestServer start zk server on port:40715
   [junit4]   2> 390851 INFO  (SUITE-TestManagedSchemaAPI-seed#[ADFDD54241CCA071]-worker) [    ] o.a.s.c.c.SolrZkClient Using default ZkCredentialsProvider
   [junit4]   2> 390851 INFO  (SUITE-TestManagedSchemaAPI-seed#[ADFDD54241CCA071]-worker) [    ] o.a.s.c.c.ConnectionManager Waiting for client to connect to ZooKeeper
   [junit4]   2> 390853 INFO  (zkCallback-276-thread-1) [    ] o.a.s.c.c.ConnectionManager Watcher org.apache.solr.common.cloud.ConnectionManager@4f4f3244 name:ZooKeeperConnection Watcher:127.0.0.1:40715 got event WatchedEvent state:SyncConnected type:None path:null path:null type:None
   [junit4]   2> 390853 INFO  (SUITE-TestManagedSchemaAPI-seed#[ADFDD54241CCA071]-worker) [    ] o.a.s.c.c.ConnectionManager Client is connected to ZooKeeper
   [junit4]   2> 390854 INFO  (SUITE-TestManagedSchemaAPI-seed#[ADFDD54241CCA071]-worker) [    ] o.a.s.c.c.SolrZkClient Using default ZkACLProvider
   [junit4]   2> 390854 INFO  (SUITE-TestManagedSchemaAPI-seed#[ADFDD54241CCA071]-worker) [    ] o.a.s.c.c.SolrZkClient makePath: /solr/solr.xml
   [junit4]   2> 390858 INFO  (jetty-launcher-275-thread-2) [    ] o.e.j.s.Server jetty-9.3.8.v20160314
   [junit4]   2> 390858 INFO  (jetty-launcher-275-thread-1) [    ] o.e.j.s.Server jetty-9.3.8.v20160314
   [junit4]   2> 390859 INFO  (jetty-launcher-275-thread-2) [    ] o.e.j.s.h.ContextHandler Started o.e.j.s.ServletContextHandler@62345777{/solr,null,AVAILABLE}
   [junit4]   2> 390859 INFO  (jetty-launcher-275-thread-1) [    ] o.e.j.s.h.ContextHandler Started o.e.j.s.ServletContextHandler@5cf0a623{/solr,null,AVAILABLE}
   [junit4]   2> 390861 INFO  (jetty-launcher-275-thread-1) [    ] o.e.j.s.ServerConnector Started ServerConnector@7122d342{HTTP/1.1,[http/1.1]}{127.0.0.1:39923}
   [junit4]   2> 390861 INFO  (jetty-launcher-275-thread-1) [    ] o.e.j.s.Server Started @392964ms
   [junit4]   2> 390861 INFO  (jetty-launcher-275-thread-2) [    ] o.e.j.s.ServerConnector Started ServerConnector@5a44f95f{HTTP/1.1,[http/1.1]}{127.0.0.1:39221}
   [junit4]   2> 390861 INFO  (jetty-launcher-275-thread-1) [    ] o.a.s.c.s.e.JettySolrRunner Jetty properties: {hostContext=/solr, hostPort=39923}
   [junit4]   2> 390861 INFO  (jetty-launcher-275-thread-2) [    ] o.e.j.s.Server Started @392964ms
   [junit4]   2> 390861 INFO  (jetty-launcher-275-thread-2) [    ] o.a.s.c.s.e.JettySolrRunner Jetty properties: {hostContext=/solr, hostPort=39221}
   [junit4]   2> 390861 INFO  (jetty-launcher-275-thread-1) [    ] o.a.s.s.SolrDispatchFilter SolrDispatchFilter.init(): jdk.internal.loader.ClassLoaders$AppClassLoader@28864e92
   [junit4]   2> 390861 INFO  (jetty-launcher-275-thread-2) [    ] o.a.s.s.SolrDispatchFilter SolrDispatchFilter.init(): jdk.internal.loader.ClassLoaders$AppClassLoader@28864e92
   [junit4]   2> 390861 INFO  (jetty-launcher-275-thread-1) [    ] o.a.s.c.SolrResourceLoader new SolrResourceLoader for directory: '/home/jenkins/workspace/Lucene-Solr-master-Linux/solr/build/solr-core/test/J1/temp/solr.schema.TestManagedSchemaAPI_ADFDD54241CCA071-001/tempDir-001/node1'
   [junit4]   2> 390861 INFO  (jetty-launcher-275-thread-2) [    ] o.a.s.c.SolrResourceLoader new SolrResourceLoader for directory: '/home/jenkins/workspace/Lucene-Solr-master-Linux/solr/build/solr-core/test/J1/temp/solr.schema.TestManagedSchemaAPI_ADFDD54241CCA071-001/tempDir-001/node2'
   [junit4]   2> 390861 INFO  (jetty-launcher-275-thread-2) [    ] o.a.s.c.SolrResourceLoader JNDI not configured for solr (NoInitialContextEx)
   [junit4]   2> 390861 INFO  (jetty-launcher-275-thread-1) [    ] o.a.s.c.SolrResourceLoader JNDI not configured for solr (NoInitialContextEx)
   [junit4]   2> 390861 INFO  (jetty-launcher-275-thread-2) [    ] o.a.s.c.SolrResourceLoader solr home defaulted to 'solr/' (could not find system property or JNDI)
   [junit4]   2> 390861 INFO  (jetty-launcher-275-thread-1) [    ] o.a.s.c.SolrResourceLoader solr home defaulted to 'solr/' (could not find system property or JNDI)
   [junit4]   2> 390861 INFO  (jetty-launcher-275-thread-2) [    ] o.a.s.c.c.SolrZkClient Using default ZkCredentialsProvider
   [junit4]   2> 390861 INFO  (jetty-launcher-275-thread-1) [    ] o.a.s.c.c.SolrZkClient Using default ZkCredentialsProvider
   [junit4]   2> 390862 INFO  (jetty-launcher-275-thread-2) [    ] o.a.s.c.c.ConnectionManager Waiting for client to connect to ZooKeeper
   [junit4]   2> 390862 INFO  (jetty-launcher-275-thread-1) [    ] o.a.s.c.c.ConnectionManager Waiting for client to connect to ZooKeeper
   [junit4]   2> 390862 INFO  (zkCallback-278-thread-1) [    ] o.a.s.c.c.ConnectionManager Watcher org.apache.solr.common.cloud.ConnectionManager@402a58ef name:ZooKeeperConnection Watcher:127.0.0.1:40715/solr got event WatchedEvent state:SyncConnected type:None path:null path:null type:None
   [junit4]   2> 390862 INFO  (jetty-launcher-275-thread-2) [    ] o.a.s.c.c.ConnectionManager Client is connected to ZooKeeper
   [junit4]   2> 390863 INFO  (jetty-launcher-275-thread-2) [    ] o.a.s.c.c.SolrZkClient Using default ZkACLProvider
   [junit4]   2> 390863 INFO  (zkCallback-277-thread-1) [    ] o.a.s.c.c.ConnectionManager Watcher org.apache.solr.common.cloud.ConnectionManager@120fe8c2 name:ZooKeeperConnection Watcher:127.0.0.1:40715/solr got event WatchedEvent state:SyncConnected type:None path:null path:null type:None
   [junit4]   2> 390863 INFO  (jetty-launcher-275-thread-2) [    ] o.a.s.s.SolrDispatchFilter solr.xml found in ZooKeeper. Loading...
   [junit4]   2> 390864 INFO  (jetty-launcher-275-thread-1) [    ] o.a.s.c.c.ConnectionManager Client is connected to ZooKeeper
   [junit4]   2> 390864 INFO  (jetty-launcher-275-thread-1) [    ] o.a.s.c.c.SolrZkClient Using default ZkACLProvider
   [junit4]   2> 390865 INFO  (jetty-launcher-275-thread-1) [    ] o.a.s.s.SolrDispatchFilter solr.xml found in ZooKeeper. Loading...
   [junit4]   2> 390868 INFO  (jetty-launcher-275-thread-2) [    ] o.a.s.c.CorePropertiesLocator Config-defined core root directory: /home/jenkins/workspace/Lucene-Solr-master-Linux/solr/build/solr-core/test/J1/temp/solr.schema.TestManagedSchemaAPI_ADFDD54241CCA071-001/tempDir-001/node2/.
   [junit4]   2> 390869 INFO  (jetty-launcher-275-thread-2) [    ] o.a.s.c.CoreContainer New CoreContainer 615183055
   [junit4]   2> 390869 INFO  (jetty-launcher-275-thread-1) [    ] o.a.s.c.CorePropertiesLocator Config-defined core root directory: /home/jenkins/workspace/Lucene-Solr-master-Linux/solr/build/solr-core/test/J1/temp/solr.schema.TestManagedSchemaAPI_ADFDD54241CCA071-001/tempDir-001/node1/.
   [junit4]   2> 390869 INFO  (jetty-launcher-275-thread-2) [    ] o.a.s.c.CoreContainer Loading cores into CoreContainer [instanceDir=/home/jenkins/workspace/Lucene-Solr-master-Linux/solr/build/solr-core/test/J1/temp/solr.schema.TestManagedSchemaAPI_ADFDD54241CCA071-001/tempDir-001/node2]
   [junit4]   2> 390869 INFO  (jetty-launcher-275-thread-1) [    ] o.a.s.c.CoreContainer New CoreContainer 920288740
   [junit4]   2> 390869 INFO  (jetty-launcher-275-thread-1) [    ] o.a.s.c.CoreContainer Loading cores into CoreContainer [instanceDir=/home/jenkins/workspace/Lucene-Solr-master-Linux/solr/build/solr-core/test/J1/temp/solr.schema.TestManagedSchemaAPI_ADFDD54241CCA071-001/tempDir-001/node1]
   [junit4]   2> 390869 WARN  (jetty-launcher-275-thread-2) [    ] o.a.s.c.CoreContainer Couldn't add files from /home/jenkins/workspace/Lucene-Solr-master-Linux/solr/build/solr-core/test/J1/temp/solr.schema.TestManagedSchemaAPI_ADFDD54241CCA071-001/tempDir-001/node2/lib to classpath: /home/jenkins/workspace/Lucene-Solr-master-Linux/solr/build/solr-core/test/J1/temp/solr.schema.TestManagedSchemaAPI_ADFDD54241CCA071-001/tempDir-001/node2/lib
   [junit4]   2> 390869 WARN  (jetty-launcher-275-thread-1) [    ] o.a.s.c.CoreContainer Couldn't add files from /home/jenkins/workspace/Lucene-Solr-master-Linux/solr/build/solr-core/test/J1/temp/solr.schema.TestManagedSchemaAPI_ADFDD54241CCA071-001/tempDir-001/node1/lib to classpath: /home/jenkins/workspace/Lucene-Solr-master-Linux/solr/build/solr-core/test/J1/temp/solr.schema.TestManagedSchemaAPI_ADFDD54241CCA071-001/tempDir-001/node1/lib
   [junit4]   2> 390869 INFO  (jetty-launcher-275-thread-2) [    ] o.a.s.h.c.HttpShardHandlerFactory created with socketTimeout : 90000,urlScheme : ,connTimeout : 15000,maxConnectionsPerHost : 20,maxConnections : 10000,corePoolSize : 0,maximumPoolSize : 2147483647,maxThreadIdleTime : 5,sizeOfQueue : -1,fairnessPolicy : false,
   [junit4]   2> 390869 INFO  (jetty-launcher-275-thread-1) [    ] o.a.s.h.c.HttpShardHandlerFactory created with socketTimeout : 90000,urlScheme : ,connTimeout : 15000,maxConnectionsPerHost : 20,maxConnections : 10000,corePoolSize : 0,maximumPoolSize : 2147483647,maxThreadIdleTime : 5,sizeOfQueue : -1,fairnessPolicy : false,
   [junit4]   2> 390871 INFO  (jetty-launcher-275-thread-2) [    ] o.a.s.u.UpdateShardHandler Creating UpdateShardHandler HTTP client with params: 
   [junit4]   2> 390871 INFO  (jetty-launcher-275-thread-1) [    ] o.a.s.u.UpdateShardHandler Creating UpdateShardHandler HTTP client with params: 
   [junit4]   2> 390871 INFO  (jetty-launcher-275-thread-2) [    ] o.a.s.l.LogWatcher SLF4J impl is org.slf4j.impl.Log4jLoggerFactory
   [junit4]   2> 390871 INFO  (jetty-launcher-275-thread-2) [    ] o.a.s.l.LogWatcher Registering Log Listener [Log4j (org.slf4j.impl.Log4jLoggerFactory)]
   [junit4]   2> 390871 INFO  (jetty-launcher-275-thread-2) [    ] o.a.s.c.ZkContainer Zookeeper client=127.0.0.1:40715/solr
   [junit4]   2> 390871 INFO  (jetty-launcher-275-thread-2) [    ] o.a.s.c.ZkController zkHost includes chroot
   [junit4]   2> 390871 INFO  (jetty-launcher-275-thread-1) [    ] o.a.s.l.LogWatcher SLF4J impl is org.slf4j.impl.Log4jLoggerFactory
   [junit4]   2> 390871 INFO  (jetty-launcher-275-thread-2) [    ] o.a.s.c.c.SolrZkClient Using default ZkCredentialsProvider
   [junit4]   2> 390875 INFO  (jetty-launcher-275-thread-1) [    ] o.a.s.l.LogWatcher Registering Log Listener [Log4j (org.slf4j.impl.Log4jLoggerFactory)]
   [junit4]   2> 390875 INFO  (jetty-launcher-275-thread-1) [    ] o.a.s.c.ZkContainer Zookeeper client=127.0.0.1:40715/solr
   [junit4]   2> 390875 INFO  (jetty-launcher-275-thread-1) [    ] o.a.s.c.ZkController zkHost includes chroot
   [junit4]   2> 390875 INFO  (jetty-launcher-275-thread-1) [    ] o.a.s.c.c.SolrZkClient Using default ZkCredentialsProvider
   [junit4]   2> 390877 INFO  (jetty-launcher-275-thread-2) [    ] o.a.s.c.c.ConnectionManager Waiting for client to connect to ZooKeeper
   [junit4]   2> 390877 INFO  (jetty-launcher-275-thread-1) [    ] o.a.s.c.c.ConnectionManager Waiting for client to connect to ZooKeeper
   [junit4]   2> 390878 INFO  (zkCallback-283-thread-1) [    ] o.a.s.c.c.ConnectionManager Watcher org.apache.solr.common.cloud.ConnectionManager@21d924d0 name:ZooKeeperConnection Watcher:127.0.0.1:40715 got event WatchedEvent state:SyncConnected type:None path:null path:null type:None
   [junit4]   2> 390878 INFO  (jetty-launcher-275-thread-2) [    ] o.a.s.c.c.ConnectionManager Client is connected to ZooKeeper
   [junit4]   2> 390881 INFO  (zkCallback-284-thread-1) [    ] o.a.s.c.c.ConnectionManager Watcher org.apache.solr.common.cloud.ConnectionManager@6431982d name:ZooKeeperConnection Watcher:127.0.0.1:40715 got event WatchedEvent state:SyncConnected type:None path:null path:null type:None
   [junit4]   2> 390881 INFO  (jetty-launcher-275-thread-2) [    ] o.a.s.c.c.SolrZkClient Using default ZkACLProvider
   [junit4]   2> 390881 INFO  (jetty-launcher-275-thread-1) [    ] o.a.s.c.c.ConnectionManager Client is connected to ZooKeeper
   [junit4]   2> 390882 INFO  (jetty-launcher-275-thread-1) [    ] o.a.s.c.c.SolrZkClient Using default ZkACLProvider
   [junit4]   2> 390883 INFO  (jetty-launcher-275-thread-2) [    ] o.a.s.c.ZkController Added new OnReconnect listener org.apache.solr.cloud.ZkController$$Lambda$125/1121259404@3c5b7a09
   [junit4]   2> 390883 WARN  (NIOServerCxn.Factory:0.0.0.0/0.0.0.0:0) [    ] o.a.z.s.NIOServerCnxn caught end of stream exception
   [junit4]   2> EndOfStreamException: Unable to read additional data from client sessionid 0x154595c41700004, likely client has closed socket
   [junit4]   2> 	at org.apache.zookeeper.server.NIOServerCnxn.doIO(NIOServerCnxn.java:228)
   [junit4]   2> 	at org.apache.zookeeper.server.NIOServerCnxnFactory.run(NIOServerCnxnFactory.java:208)
   [junit4]   2> 	at java.lang.Thread.run(java.base@9-ea/Thread.java:804)
   [junit4]   2> 390883 INFO  (jetty-launcher-275-thread-1) [    ] o.a.s.c.ZkController Added new OnReconnect listener org.apache.solr.cloud.ZkController$$Lambda$125/1121259404@3efff183
   [junit4]   2> 390883 INFO  (jetty-launcher-275-thread-2) [    ] o.a.s.c.c.ConnectionManager Waiting for client to connect to ZooKeeper
   [junit4]   2> 390883 INFO  (jetty-launcher-275-thread-1) [    ] o.a.s.c.c.ConnectionManager Waiting for client to connect to ZooKeeper
   [junit4]   2> 390884 INFO  (zkCallback-285-thread-1) [    ] o.a.s.c.c.ConnectionManager Watcher org.apache.solr.common.cloud.ConnectionManager@5e6fc173 name:ZooKeeperConnection Watcher:127.0.0.1:40715/solr got event WatchedEvent state:SyncConnected type:None path:null path:null type:None
   [junit4]   2> 390884 INFO  (jetty-launcher-275-thread-2) [    ] o.a.s.c.c.ConnectionManager Client is connected to ZooKeeper
   [junit4]   2> 390884 INFO  (zkCallback-286-thread-1) [    ] o.a.s.c.c.ConnectionManager Watcher org.apache.solr.common.cloud.ConnectionManager@7b69dcf4 name:ZooKeeperConnection Watcher:127.0.0.1:40715/solr got event WatchedEvent state:SyncConnected type:None path:null path:null type:None
   [junit4]   2> 390884 INFO  (jetty-launcher-275-thread-1) [    ] o.a.s.c.c.ConnectionManager Client is connected to ZooKeeper
   [junit4]   2> 390884 INFO  (jetty-launcher-275-thread-2) [    ] o.a.s.c.c.SolrZkClient makePath: /overseer/queue
   [junit4]   2> 390885 INFO  (jetty-launcher-275-thread-1) [    ] o.a.s.c.c.SolrZkClient makePath: /overseer/queue
   [junit4]   2> 390885 INFO  (jetty-launcher-275-thread-2) [    ] o.a.s.c.c.SolrZkClient makePath: /overseer/collection-queue-work
   [junit4]   2> 390886 INFO  (jetty-launcher-275-thread-1) [    ] o.a.s.c.c.SolrZkClient makePath: /overseer/collection-queue-work
   [junit4]   2> 390886 INFO  (jetty-launcher-275-thread-2) [    ] o.a.s.c.c.SolrZkClient makePath: /overseer/collection-map-running
   [junit4]   2> 390886 INFO  (jetty-launcher-275-thread-1) [    ] o.a.s.c.c.SolrZkClient makePath: /overseer/collection-map-running
   [junit4]   2> 390889 INFO  (jetty-launcher-275-thread-2) [    ] o.a.s.c.c.SolrZkClient makePath: /overseer/collection-map-completed
   [junit4]   2> 390890 INFO  (jetty-launcher-275-thread-2) [    ] o.a.s.c.c.SolrZkClient makePath: /overseer/collection-map-failure
   [junit4]   2> 390890 INFO  (jetty-launcher-275-thread-2) [    ] o.a.s.c.c.SolrZkClient makePath: /live_nodes
   [junit4]   2> 390891 INFO  (jetty-launcher-275-thread-2) [    ] o.a.s.c.c.SolrZkClient makePath: /collections
   [junit4]   2> 390891 INFO  (jetty-launcher-275-thread-2) [    ] o.a.s.c.c.SolrZkClient makePath: /aliases.json
   [junit4]   2> 390891 INFO  (jetty-launcher-275-thread-2) [    ] o.a.s.c.c.SolrZkClient makePath: /clusterstate.json
   [junit4]   2> 390892 INFO  (jetty-launcher-275-thread-2) [    ] o.a.s.c.c.SolrZkClient makePath: /security.json
   [junit4]   2> 390892 INFO  (jetty-launcher-275-thread-2) [    ] o.a.s.c.c.ZkStateReader Updating cluster state from ZooKeeper... 
   [junit4]   2> 390893 INFO  (jetty-launcher-275-thread-2) [    ] o.a.s.c.c.ZkStateReader Updated live nodes from ZooKeeper... (0) -> (0)
   [junit4]   2> 390893 INFO  (jetty-launcher-275-thread-1) [    ] o.a.s.c.c.ZkStateReader Updating cluster state from ZooKeeper... 
   [junit4]   2> 390893 INFO  (jetty-launcher-275-thread-1) [    ] o.a.s.c.c.ZkStateReader Updated live nodes from ZooKeeper... (0) -> (0)
   [junit4]   2> 390893 INFO  (jetty-launcher-275-thread-2) [    ] o.a.s.c.c.SolrZkClient makePath: /overseer_elect
   [junit4]   2> 390893 INFO  (jetty-launcher-275-thread-2) [    ] o.a.s.c.c.SolrZkClient makePath: /overseer_elect/election
   [junit4]   2> 390894 INFO  (jetty-launcher-275-thread-1) [    ] o.a.s.c.Overseer Overseer (id=null) closing
   [junit4]   2> 390894 INFO  (jetty-launcher-275-thread-2) [    ] o.a.s.c.Overseer Overseer (id=null) closing
   [junit4]   2> 390894 INFO  (jetty-launcher-275-thread-1) [    ] o.a.s.c.LeaderElector Joined leadership election with path: /overseer_elect/election/95799744851345414-127.0.0.1:39923_solr-n_0000000000
   [junit4]   2> 390894 INFO  (jetty-launcher-275-thread-2) [    ] o.a.s.c.LeaderElector Joined leadership election with path: /overseer_elect/election/95799744851345413-127.0.0.1:39221_solr-n_0000000001
   [junit4]   2> 390894 INFO  (jetty-launcher-275-thread-1) [    ] o.a.s.c.OverseerElectionContext I am going to be the leader 127.0.0.1:39923_solr
   [junit4]   2> 390894 INFO  (jetty-launcher-275-thread-1) [    ] o.a.s.c.c.SolrZkClient makePath: /overseer_elect/leader
   [junit4]   2> 390894 INFO  (jetty-launcher-275-thread-2) [    ] o.a.s.c.LeaderElector Watching path /overseer_elect/election/95799744851345414-127.0.0.1:39923_solr-n_0000000000 to know if I could be the leader
   [junit4]   2> 390894 INFO  (jetty-launcher-275-thread-2) [    ] o.a.s.c.ZkController Register node as live in ZooKeeper:/live_nodes/127.0.0.1:39221_solr
   [junit4]   2> 390894 INFO  (jetty-launcher-275-thread-2) [    ] o.a.s.c.c.SolrZkClient makePath: /live_nodes/127.0.0.1:39221_solr
   [junit4]   2> 390895 INFO  (jetty-launcher-275-thread-1) [    ] o.a.s.c.Overseer Overseer (id=95799744851345414-127.0.0.1:39923_solr-n_0000000000) starting
   [junit4]   2> 390895 INFO  (zkCallback-286-thread-1) [    ] o.a.s.c.c.ZkStateReader A live node change: [WatchedEvent state:SyncConnected type:NodeChildrenChanged path:/live_nodes], has occurred - updating... (live nodes size: [0])
   [junit4]   2> 390895 INFO  (zkCallback-285-thread-1) [    ] o.a.s.c.c.ZkStateReader A live node change: [WatchedEvent state:SyncConnected type:NodeChildrenChanged path:/live_nodes], has occurred - updating... (live nodes size: [0])
   [junit4]   2> 390896 INFO  (zkCallback-286-thread-1) [    ] o.a.s.c.c.ZkStateReader Updated live nodes from ZooKeeper... (0) -> (1)
   [junit4]   2> 390896 INFO  (zkCallback-285-thread-1) [    ] o.a.s.c.c.ZkStateReader Updated live nodes from ZooKeeper... (0) -> (1)
   [junit4]   2> 390896 INFO  (jetty-launcher-275-thread-1) [    ] o.a.s.c.c.SolrZkClient makePath: /overseer/queue-work
   [junit4]   2> 390898 INFO  (jetty-launcher-275-thread-1) [    ] o.a.s.c.OverseerAutoReplicaFailoverThread Starting OverseerAutoReplicaFailoverThread autoReplicaFailoverWorkLoopDelay=10000 autoReplicaFailoverWaitAfterExpiration=30000 autoReplicaFailoverBadNodeExpiration=60000
   [junit4]   2> 390899 INFO  (OverseerCollectionConfigSetProcessor-95799744851345414-127.0.0.1:39923_solr-n_0000000000) [    ] o.a.s.c.OverseerTaskProcessor Process current queue of overseer operations
   [junit4]   2> 390899 INFO  (OverseerStateUpdate-95799744851345414-127.0.0.1:39923_solr-n_0000000000) [    ] o.a.s.c.Overseer Starting to work on the main queue
   [junit4]   2> 390899 INFO  (jetty-launcher-275-thread-1) [    ] o.a.s.c.ZkController Publish node=127.0.0.1:39923_solr as DOWN
   [junit4]   2> 390899 INFO  (OverseerStateUpdate-95799744851345414-127.0.0.1:39923_solr-n_0000000000) [    ] o.a.s.c.c.ZkStateReader Updated live nodes from ZooKeeper... (1) -> (1)
   [junit4]   2> 390901 INFO  (OverseerStateUpdate-95799744851345414-127.0.0.1:39923_solr-n_0000000000) [    ] o.a.s.c.Overseer processMessage: queueSize: 1, message = {
   [junit4]   2>   "operation":"downnode",
   [junit4]   2>   "node_name":"127.0.0.1:39923_solr"} current state version: 0
   [junit4]   2> 390901 INFO  (OverseerStateUpdate-95799744851345414-127.0.0.1:39923_solr-n_0000000000) [    ] o.a.s.c.o.NodeMutator DownNode state invoked for node: 127.0.0.1:39923_solr
   [junit4]   2> 390902 INFO  (jetty-launcher-275-thread-2) [    ] o.a.s.c.CoreContainer Security conf doesn't exist. Skipping setup for authorization module.
   [junit4]   2> 390902 INFO  (jetty-launcher-275-thread-2) [    ] o.a.s.c.CoreContainer No authentication plugin used.
   [junit4]   2> 390902 INFO  (jetty-launcher-275-thread-2) [    ] o.a.s.c.CorePropertiesLocator Looking for core definitions underneath /home/jenkins/workspace/Lucene-Solr-master-Linux/solr/build/solr-core/test/J1/temp/solr.schema.TestManagedSchemaAPI_ADFDD54241CCA071-001/tempDir-001/node2/.
   [junit4]   2> 390902 INFO  (jetty-launcher-275-thread-2) [    ] o.a.s.c.CorePropertiesLocator Found 0 core definitions
   [junit4]   2> 390903 INFO  (jetty-launcher-275-thread-2) [    ] o.a.s.s.SolrDispatchFilter user.dir=/home/jenkins/workspace/Lucene-Solr-master-Linux/solr/build/solr-core/test/J1
   [junit4]   2> 390903 INFO  (jetty-launcher-275-thread-2) [    ] o.a.s.s.SolrDispatchFilter SolrDispatchFilter.init() done
   [junit4]   2> 391899 INFO  (jetty-launcher-275-thread-1) [    ] o.a.s.c.ZkController Register node as live in ZooKeeper:/live_nodes/127.0.0.1:39923_solr
   [junit4]   2> 391900 INFO  (jetty-launcher-275-thread-1) [    ] o.a.s.c.c.SolrZkClient makePath: /live_nodes/127.0.0.1:39923_solr
   [junit4]   2> 391900 INFO  (zkCallback-286-thread-1) [    ] o.a.s.c.c.ZkStateReader A live node change: [WatchedEvent state:SyncConnected type:NodeChildrenChanged path:/live_nodes], has occurred - updating... (live nodes size: [1])
   [junit4]   2> 391900 INFO  (zkCallback-285-thread-1) [    ] o.a.s.c.c.ZkStateReader A live node change: [WatchedEvent state:SyncConnected type:NodeChildrenChanged path:/live_nodes], has occurred - updating... (live nodes size: [1])
   [junit4]   2> 391900 INFO  (zkCallback-286-thread-1) [    ] o.a.s.c.c.ZkStateReader Updated live nodes from ZooKeeper... (1) -> (2)
   [junit4]   2> 391900 INFO  (zkCallback-285-thread-1) [    ] o.a.s.c.c.ZkStateReader Updated live nodes from ZooKeeper... (1) -> (2)
   [junit4]   2> 391905 INFO  (jetty-launcher-275-thread-1) [    ] o.a.s.c.CoreContainer Security conf doesn't exist. Skipping setup for authorization module.
   [junit4]   2> 391905 INFO  (jetty-launcher-275-thread-1) [    ] o.a.s.c.CoreContainer No authentication plugin used.
   [junit4]   2> 391905 INFO  (jetty-launcher-275-thread-1) [    ] o.a.s.c.CorePropertiesLocator Looking for core definitions underneath /home/jenkins/workspace/Lucene-Solr-master-Linux/solr/build/solr-core/test/J1/temp/solr.schema.TestManagedSchemaAPI_ADFDD54241CCA071-001/tempDir-001/node1/.
   [junit4]   2> 391905 INFO  (jetty-launcher-275-thread-1) [    ] o.a.s.c.CorePropertiesLocator Found 0 core definitions
   [junit4]   2> 391905 INFO  (jetty-launcher-275-thread-1) [    ] o.a.s.s.SolrDispatchFilter user.dir=/home/jenkins/workspace/Lucene-Solr-master-Linux/solr/build/solr-core/test/J1
   [junit4]   2> 391905 INFO  (jetty-launcher-275-thread-1) [    ] o.a.s.s.SolrDispatchFilter SolrDispatchFilter.init() done
   [junit4]   2> 391906 INFO  (SUITE-TestManagedSchemaAPI-seed#[ADFDD54241CCA071]-worker) [    ] o.a.s.c.c.SolrZkClient Using default ZkCredentialsProvider
   [junit4]   2> 391906 INFO  (SUITE-TestManagedSchemaAPI-seed#[ADFDD54241CCA071]-worker) [    ] o.a.s.c.c.ConnectionManager Waiting for client to connect to ZooKeeper
   [junit4]   2> 391907 INFO  (zkCallback-287-thread-1) [    ] o.a.s.c.c.ConnectionManager Watcher org.apache.solr.common.cloud.ConnectionManager@d20e93 name:ZooKeeperConnection Watcher:127.0.0.1:40715 got event WatchedEvent state:SyncConnected type:None path:null path:null type:None
   [junit4]   2> 391907 INFO  (SUITE-TestManagedSchemaAPI-seed#[ADFDD54241CCA071]-worker) [    ] o.a.s.c.c.ConnectionManager Client is connected to ZooKeeper
   [junit4]   2> 391907 INFO  (SUITE-TestManagedSchemaAPI-seed#[ADFDD54241CCA071]-worker) [    ] o.a.s.c.c.SolrZkClient Using default ZkACLProvider
   [junit4]   2> 391908 INFO  (SUITE-TestManagedSchemaAPI-seed#[ADFDD54241CCA071]-worker) [    ] o.a.s.c.s.i.CloudSolrClient Final constructed zkHost string: 127.0.0.1:40715/solr
   [junit4]   2> 391909 INFO  (SUITE-TestManagedSchemaAPI-seed#[ADFDD54241CCA071]-worker) [    ] o.a.s.c.c.SolrZkClient Using default ZkCredentialsProvider
   [junit4]   2> 391909 INFO  (SUITE-TestManagedSchemaAPI-seed#[ADFDD54241CCA071]-worker) [    ] o.a.s.c.c.ConnectionManager Waiting for client to connect to ZooKeeper
   [junit4]   2> 391910 INFO  (zkCallback-289-thread-1) [    ] o.a.s.c.c.ConnectionManager Watcher org.apache.solr.common.cloud.ConnectionManager@7c2863cf name:ZooKeeperConnection Watcher:127.0.0.1:40715/solr got event WatchedEvent state:SyncConnected type:None path:null path:null type:None
   [junit4]   2> 391910 INFO  (SUITE-TestManagedSchemaAPI-seed#[ADFDD54241CCA071]-worker) [    ] o.a.s.c.c.ConnectionManager Client is connected to ZooKeeper
   [junit4]   2> 391910 INFO  (SUITE-TestManagedSchemaAPI-seed#[ADFDD54241CCA071]-worker) [    ] o.a.s.c.c.SolrZkClient Using default ZkACLProvider
   [junit4]   2> 391910 INFO  (SUITE-TestManagedSchemaAPI-seed#[ADFDD54241CCA071]-worker) [    ] o.a.s.c.c.ZkStateReader Updating cluster state from ZooKeeper... 
   [junit4]   2> 391910 INFO  (SUITE-TestManagedSchemaAPI-seed#[ADFDD54241CCA071]-worker) [    ] o.a.s.c.c.ZkStateReader Updated live nodes from ZooKeeper... (0) -> (2)
   [junit4]   2> 391912 INFO  (SUITE-TestManagedSchemaAPI-seed#[ADFDD54241CCA071]-worker) [    ] o.a.s.c.c.SolrZkClient makePath: /configs/conf1/solrconfig.xml
   [junit4]   2> 391914 INFO  (SUITE-TestManagedSchemaAPI-seed#[ADFDD54241CCA071]-worker) [    ] o.a.s.c.c.SolrZkClient makePath: /configs/conf1/managed-schema
   [junit4]   2> 391929 INFO  (TEST-TestManagedSchemaAPI.test-seed#[ADFDD54241CCA071]) [    ] o.a.s.SolrTestCaseJ4 ###Starting test
   [junit4]   2> 391933 INFO  (qtp1888774735-2489) [    ] o.a.s.h.a.CollectionsHandler Invoked Collection Action :create with params replicationFactor=2&collection.configName=conf1&name=testschemaapi&action=CREATE&numShards=1&wt=javabin&version=2 and sendToOCPQueue=true
   [junit4]   2> 391934 INFO  (OverseerCollectionConfigSetProcessor-95799744851345414-127.0.0.1:39923_solr-n_0000000000) [    ] o.a.s.c.OverseerTaskProcessor Overseer Collection Message Handler: Get the message id:/overseer/collection-queue-work/qn-0000000000 message:{
   [junit4]   2>   "name":"testschemaapi",
   [junit4]   2>   "fromApi":"true",
   [junit4]   2>   "replicationFactor":"2",
   [junit4]   2>   "collection.configName":"conf1",
   [junit4]   2>   "numShards":"1",
   [junit4]   2>   "stateFormat":"2",
   [junit4]   2>   "operation":"create"}
   [junit4]   2> 391934 INFO  (OverseerThreadFactory-818-thread-1) [    ] o.a.s.c.OverseerCollectionMessageHandler OverseerCollectionMessageHandler.processMessage : create , {
   [junit4]   2>   "name":"testschemaapi",
   [junit4]   2>   "fromApi":"true",
   [junit4]   2>   "replicationFactor":"2",
   [junit4]   2>   "collection.configName":"conf1",
   [junit4]   2>   "numShards":"1",
   [junit4]   2>   "stateFormat":"2",
   [junit4]   2>   "operation":"create"}
   [junit4]   2> 391934 INFO  (OverseerThreadFactory-818-thread-1) [    ] o.a.s.c.OverseerCollectionMessageHandler Create collection testschemaapi
   [junit4]   2> 391935 INFO  (OverseerThreadFactory-818-thread-1) [    ] o.a.s.c.OverseerCollectionMessageHandler creating collections conf node /collections/testschemaapi 
   [junit4]   2> 391935 INFO  (OverseerThreadFactory-818-thread-1) [    ] o.a.s.c.c.SolrZkClient makePath: /collections/testschemaapi
   [junit4]   2> 391935 INFO  (zkCallback-286-thread-1) [    ] o.a.s.c.c.ZkStateReader A collections change: [WatchedEvent state:SyncConnected type:NodeChildrenChanged path:/collections], has occurred - updating...
   [junit4]   2> 391935 INFO  (zkCallback-285-thread-1) [    ] o.a.s.c.c.ZkStateReader A collections change: [WatchedEvent state:SyncConnected type:NodeChildrenChanged path:/collections], has occurred - updating...
   [junit4]   2> 391935 INFO  (zkCallback-289-thread-1) [    ] o.a.s.c.c.ZkStateReader A collections change: [WatchedEvent state:SyncConnected type:NodeChildrenChanged path:/collections], has occurred - updating...
   [junit4]   2> 391937 INFO  (OverseerStateUpdate-95799744851345414-127.0.0.1:39923_solr-n_0000000000) [    ] o.a.s.c.Overseer processMessage: queueSize: 1, message = {
   [junit4]   2>   "name":"testschemaapi",
   [junit4]   2>   "fromApi":"true",
   [junit4]   2>   "replicationFactor":"2",
   [junit4]   2>   "collection.configName":"conf1",
   [junit4]   2>   "numShards":"1",
   [junit4]   2>   "stateFormat":"2",
   [junit4]   2>   "operation":"create"} current state version: 0
   [junit4]   2> 391937 INFO  (OverseerStateUpdate-95799744851345414-127.0.0.1:39923_solr-n_0000000000) [    ] o.a.s.c.o.ClusterStateMutator building a new cName: testschemaapi
   [junit4]   2> 391937 INFO  (OverseerStateUpdate-95799744851345414-127.0.0.1:39923_solr-n_0000000000) [    ] o.a.s.c.o.ZkStateWriter going to create_collection /collections/testschemaapi/state.json
   [junit4]   2> 392037 INFO  (OverseerThreadFactory-818-thread-1) [    ] o.a.s.c.OverseerCollectionMessageHandler Creating SolrCores for new collection testschemaapi, shardNames [shard1] , replicationFactor : 2
   [junit4]   2> 392037 INFO  (OverseerThreadFactory-818-thread-1) [    ] o.a.s.c.OverseerCollectionMessageHandler Creating core testschemaapi_shard1_replica2 as part of shard shard1 of collection testschemaapi on 127.0.0.1:39221_solr
   [junit4]   2> 392037 INFO  (OverseerThreadFactory-818-thread-1) [    ] o.a.s.c.OverseerCollectionMessageHandler Creating core testschemaapi_shard1_replica1 as part of shard shard1 of collection testschemaapi on 127.0.0.1:39923_solr
   [junit4]   2> 392039 INFO  (qtp170841050-2490) [    ] o.a.s.h.a.CoreAdminOperation core create command qt=/admin/cores&collection.configName=conf1&name=testschemaapi_shard1_replica1&action=CREATE&numShards=1&collection=testschemaapi&shard=shard1&wt=javabin&version=2
   [junit4]   2> 392039 INFO  (qtp1888774735-2493) [    ] o.a.s.h.a.CoreAdminOperation core create command qt=/admin/cores&collection.configName=conf1&name=testschemaapi_shard1_replica2&action=CREATE&numShards=1&collection=testschemaapi&shard=shard1&wt=javabin&version=2
   [junit4]   2> 392039 INFO  (qtp1888774735-2493) [    ] o.a.s.c.CoreDescriptor Created CoreDescriptor: {name=testschemaapi_shard1_replica2, collection.configName=conf1, config=solrconfig.xml, transient=false, schema=schema.xml, loadOnStartup=true, configSetProperties=configsetprops.json, collection=testschemaapi, numShards=1, dataDir=data/, shard=shard1}
   [junit4]   2> 392039 INFO  (qtp170841050-2490) [    ] o.a.s.c.CoreDescriptor Created CoreDescriptor: {name=testschemaapi_shard1_replica1, collection.configName=conf1, config=solrconfig.xml, transient=false, schema=schema.xml, loadOnStartup=true, configSetProperties=configsetprops.json, collection=testschemaapi, numShards=1, dataDir=data/, shard=shard1}
   [junit4]   2> 392040 INFO  (qtp170841050-2490) [    ] o.a.s.c.ZkController publishing state=down
   [junit4]   2> 392040 INFO  (qtp1888774735-2493) [    ] o.a.s.c.ZkController publishing state=down
   [junit4]   2> 392041 INFO  (qtp170841050-2490) [    ] o.a.s.c.ZkController Registering watch for collection testschemaapi
   [junit4]   2> 392041 INFO  (qtp170841050-2490) [    ] o.a.s.c.c.ZkStateReader addZkWatch [testschemaapi]
   [junit4]   2> 392041 INFO  (qtp1888774735-2493) [    ] o.a.s.c.ZkController Registering watch for collection testschemaapi
   [junit4]   2> 392041 INFO  (qtp1888774735-2493) [    ] o.a.s.c.c.ZkStateReader addZkWatch [testschemaapi]
   [junit4]   2> 392041 INFO  (OverseerStateUpdate-95799744851345414-127.0.0.1:39923_solr-n_0000000000) [    ] o.a.s.c.Overseer processMessage: queueSize: 2, message = {
   [junit4]   2>   "core":"testschemaapi_shard1_replica1",
   [junit4]   2>   "roles":null,
   [junit4]   2>   "base_url":"http://127.0.0.1:39923/solr",
   [junit4]   2>   "node_name":"127.0.0.1:39923_solr",
   [junit4]   2>   "numShards":"1",
   [junit4]   2>   "state":"down",
   [junit4]   2>   "shard":"shard1",
   [junit4]   2>   "collection":"testschemaapi",
   [junit4]   2>   "operation":"state"} current state version: 0
   [junit4]   2> 392041 INFO  (qtp170841050-2490) [    ] o.a.s.c.c.ZkStateReader Add data for [testschemaapi] ver [0]
   [junit4]   2> 392041 INFO  (qtp1888774735-2493) [    ] o.a.s.c.c.ZkStateReader Add data for [testschemaapi] ver [0]
   [junit4]   2> 392041 INFO  (qtp170841050-2490) [    ] o.a.s.c.ZkController look for our core node name
   [junit4]   2> 392041 INFO  (qtp1888774735-2493) [    ] o.a.s.c.ZkController look for our core node name
   [junit4]   2> 392041 INFO  (OverseerStateUpdate-95799744851345414-127.0.0.1:39923_solr-n_0000000000) [    ] o.a.s.c.o.ReplicaMutator Update state numShards=1 message={
   [junit4]   2>   "core":"testschemaapi_shard1_replica1",
   [junit4]   2>   "roles":null,
   [junit4]   2>   "base_url":"http://127.0.0.1:39923/solr",
   [junit4]   2>   "node_name":"127.0.0.1:39923_solr",
   [junit4]   2>   "numShards":"1",
   [junit4]   2>   "state":"down",
   [junit4]   2>   "shard":"shard1",
   [junit4]   2>   "collection":"testschemaapi",
   [junit4]   2>   "operation":"state"}
   [junit4]   2> 392042 INFO  (OverseerStateUpdate-95799744851345414-127.0.0.1:39923_solr-n_0000000000) [    ] o.a.s.c.Overseer processMessage: queueSize: 2, message = {
   [junit4]   2>   "core":"testschemaapi_shard1_replica2",
   [junit4]   2>   "roles":null,
   [junit4]   2>   "base_url":"http://127.0.0.1:39221/solr",
   [junit4]   2>   "node_name":"127.0.0.1:39221_solr",
   [junit4]   2>   "numShards":"1",
   [junit4]   2>   "state":"down",
   [junit4]   2>   "shard":"shard1",
   [junit4]   2>   "collection":"testschemaapi",
   [junit4]   2>   "operation":"state"} current state version: 0
   [junit4]   2> 392042 INFO  (OverseerStateUpdate-95799744851345414-127.0.0.1:39923_solr-n_0000000000) [    ] o.a.s.c.o.ReplicaMutator Update state numShards=1 message={
   [junit4]   2>   "core":"testschemaapi_shard1_replica2",
   [junit4]   2>   "roles":null,
   [junit4]   2>   "base_url":"http://127.0.0.1:39221/solr",
   [junit4]   2>   "node_name":"127.0.0.1:39221_solr",
   [junit4]   2>   "numShards":"1",
   [junit4]   2>   "state":"down",
   [junit4]   2>   "shard":"shard1",
   [junit4]   2>   "collection":"testschemaapi",
   [junit4]   2>   "operation":"state"}
   [junit4]   2> 392143 INFO  (OverseerStateUpdate-95799744851345414-127.0.0.1:39923_solr-n_0000000000) [    ] o.a.s.c.o.ZkStateWriter going to update_collection /collections/testschemaapi/state.json version: 0
   [junit4]   2> 392143 INFO  (zkCallback-285-thread-1) [    ] o.a.s.c.c.ZkStateReader A cluster state change: [WatchedEvent state:SyncConnected type:NodeDataChanged path:/collections/testschemaapi/state.json] for collection [testschemaapi] has occurred - updating... (live nodes size: [2])
   [junit4]   2> 392143 INFO  (zkCallback-286-thread-1) [    ] o.a.s.c.c.ZkStateReader A cluster state change: [WatchedEvent state:SyncConnected type:NodeDataChanged path:/collections/testschemaapi/state.json] for collection [testschemaapi] has occurred - updating... (live nodes size: [2])
   [junit4]   2> 392143 INFO  (zkCallback-285-thread-1) [    ] o.a.s.c.c.ZkStateReader Updating data for [testschemaapi] from [0] to [1]
   [junit4]   2> 392143 INFO  (zkCallback-286-thread-1) [    ] o.a.s.c.c.ZkStateReader Updating data for [testschemaapi] from [0] to [1]
   [junit4]   2> 393041 INFO  (qtp170841050-2490) [    ] o.a.s.c.ZkController waiting to find shard id in clusterstate for testschemaapi_shard1_replica1
   [junit4]   2> 393041 INFO  (qtp1888774735-2493) [    ] o.a.s.c.ZkController waiting to find shard id in clusterstate for testschemaapi_shard1_replica2
   [junit4]   2> 393041 INFO  (qtp170841050-2490) [    ] o.a.s.c.ZkController Check for collection zkNode:testschemaapi
   [junit4]   2> 393041 INFO  (qtp1888774735-2493) [    ] o.a.s.c.ZkController Check for collection zkNode:testschemaapi
   [junit4]   2> 393041 INFO  (qtp170841050-2490) [    ] o.a.s.c.ZkController Collection zkNode exists
   [junit4]   2> 393041 INFO  (qtp170841050-2490) [    ] o.a.s.c.c.ZkStateReader Load collection config from: [/collections/testschemaapi]
   [junit4]   2> 393041 INFO  (qtp1888774735-2493) [    ] o.a.s.c.ZkController Collection zkNode exists
   [junit4]   2> 393041 INFO  (qtp1888774735-2493) [    ] o.a.s.c.c.ZkStateReader Load collection config from: [/collections/testschemaapi]
   [junit4]   2> 393042 INFO  (qtp170841050-2490) [    ] o.a.s.c.c.ZkStateReader path=[/collections/testschemaapi] [configName]=[conf1] specified config exists in ZooKeeper
   [junit4]   2> 393042 INFO  (qtp170841050-2490) [    ] o.a.s.c.SolrResourceLoader new SolrResourceLoader for directory: '/home/jenkins/workspace/Lucene-Solr-master-Linux/solr/build/solr-core/test/J1/temp/solr.schema.TestManagedSchemaAPI_ADFDD54241CCA071-001/tempDir-001/node1/testschemaapi_shard1_replica1'
   [junit4]   2> 393042 INFO  (qtp170841050-2490) [    ] o.a.s.c.SolrResourceLoader JNDI not configured for solr (NoInitialContextEx)
   [junit4]   2> 393042 INFO  (qtp170841050-2490) [    ] o.a.s.c.SolrResourceLoader solr home defaulted to 'solr/' (could not find system property or JNDI)
   [junit4]   2> 393042 INFO  (qtp1888774735-2493) [    ] o.a.s.c.c.ZkStateReader path=[/collections/testschemaapi] [configName]=[conf1] specified config exists in ZooKeeper
   [junit4]   2> 393042 INFO  (qtp1888774735-2493) [    ] o.a.s.c.SolrResourceLoader new SolrResourceLoader for directory: '/home/jenkins/workspace/Lucene-Solr-master-Linux/solr/build/solr-core/test/J1/temp/solr.schema.TestManagedSchemaAPI_ADFDD54241CCA071-001/tempDir-001/node2/testschemaapi_shard1_replica2'
   [junit4]   2> 393042 INFO  (qtp1888774735-2493) [    ] o.a.s.c.SolrResourceLoader JNDI not configured for solr (NoInitialContextEx)
   [junit4]   2> 393042 INFO  (qtp1888774735-2493) [    ] o.a.s.c.SolrResourceLoader solr home defaulted to 'solr/' (could not find system property or JNDI)
   [junit4]   2> 393042 INFO  (qtp170841050-2490) [    ] o.a.s.c.Config loaded config solrconfig.xml with version 0 
   [junit4]   2> 393043 INFO  (qtp1888774735-2493) [    ] o.a.s.c.Config loaded config solrconfig.xml with version 0 
   [junit4]   2> 393046 INFO  (qtp170841050-2490) [    ] o.a.s.c.SolrConfig current version of requestparams : -1
   [junit4]   2> 393046 INFO  (qtp1888774735-2493) [    ] o.a.s.c.SolrConfig current version of requestparams : -1
   [junit4]   2> 393047 INFO  (qtp1888774735-2493) [    ] o.a.s.c.SolrConfig Using Lucene MatchVersion: 7.0.0
   [junit4]   2> 393047 INFO  (qtp170841050-2490) [    ] o.a.s.c.SolrConfig Using Lucene MatchVersion: 7.0.0
   [junit4]   2> 393050 INFO  (qtp1888774735-2493) [    ] o.a.s.c.SolrConfig Loaded SolrConfig: solrconfig.xml
   [junit4]   2> 393050 INFO  (qtp170841050-2490) [    ] o.a.s.c.SolrConfig Loaded SolrConfig: solrconfig.xml
   [junit4]   2> 393054 INFO  (qtp170841050-2490) [    ] o.a.s.s.IndexSchema [testschemaapi_shard1_replica1] Schema name=minimal
   [junit4]   2> 393054 INFO  (qtp1888774735-2493) [    ] o.a.s.s.IndexSchema [testschemaapi_shard1_replica2] Schema name=minimal
   [junit4]   2> 393055 INFO  (qtp170841050-2490) [    ] o.a.s.s.IndexSchema unique key field: id
   [junit4]   2> 393055 INFO  (qtp1888774735-2493) [    ] o.a.s.s.IndexSchema unique key field: id
   [junit4]   2> 393056 INFO  (qtp170841050-2490) [    ] o.a.s.c.ConfigSetProperties Did not find ConfigSet properties, assuming default properties: Can't find resource 'configsetprops.json' in classpath or '/configs/conf1', cwd=/home/jenkins/workspace/Lucene-Solr-master-Linux/solr/build/solr-core/test/J1
   [junit4]   2> 393056 INFO  (qtp1888774735-2493) [    ] o.a.s.c.ConfigSetProperties Did not find ConfigSet properties, assuming default properties: Can't find resource 'configsetprops.json' in classpath or '/configs/conf1', cwd=/home/jenkins/workspace/Lucene-Solr-master-Linux/solr/build/solr-core/test/J1
   [junit4]   2> 393056 INFO  (qtp170841050-2490) [    ] o.a.s.c.CoreContainer Creating SolrCore 'testschemaapi_shard1_replica1' using configuration from collection testschemaapi
   [junit4]   2> 393056 INFO  (qtp1888774735-2493) [    ] o.a.s.c.CoreContainer Creating SolrCore 'testschemaapi_shard1_replica2' using configuration from collection testschemaapi
   [junit4]   2> 393056 INFO  (qtp170841050-2490) [    ] o.a.s.c.SolrCore org.apache.solr.core.MockDirectoryFactory
   [junit4]   2> 393056 INFO  (qtp1888774735-2493) [    ] o.a.s.c.SolrCore org.apache.solr.core.MockDirectoryFactory
   [junit4]   2> 393056 INFO  (qtp170841050-2490) [    ] o.a.s.c.SolrCore [[testschemaapi_shard1_replica1] ] Opening new SolrCore at [/home/jenkins/workspace/Lucene-Solr-master-Linux/solr/build/solr-core/test/J1/temp/solr.schema.TestManagedSchemaAPI_ADFDD54241CCA071-001/tempDir-001/node1/testschemaapi_shard1_replica1], dataDir=[/home/jenkins/workspace/Lucene-Solr-master-Linux/solr/build/solr-core/test/J1/temp/solr.schema.TestManagedSchemaAPI_ADFDD54241CCA071-001/tempDir-001/node1/./testschemaapi_shard1_replica1/data/]
   [junit4]   2> 393056 INFO  (qtp1888774735-2493) [    ] o.a.s.c.SolrCore [[testschemaapi_shard1_replica2] ] Opening new SolrCore at [/home/jenkins/workspace/Lucene-Solr-master-Linux/solr/build/solr-core/test/J1/temp/solr.schema.TestManagedSchemaAPI_ADFDD54241CCA071-001/tempDir-001/node2/testschemaapi_shard1_replica2], dataDir=[/home/jenkins/workspace/Lucene-Solr-master-Linux/solr/build/solr-core/test/J1/temp/solr.schema.TestManagedSchemaAPI_ADFDD54241CCA071-001/tempDir-001/node2/./testschemaapi_shard1_replica2/data/]
   [junit4]   2> 393056 INFO  (qtp170841050-2490) [    ] o.a.s.c.SolrCore JMX monitoring not detected for core: testschemaapi_shard1_replica1
   [junit4]   2> 393056 INFO  (qtp1888774735-2493) [    ] o.a.s.c.SolrCore JMX monitoring not detected for core: testschemaapi_shard1_replica2
   [junit4]   2> 393057 INFO  (qtp1888774735-2493) [    ] o.a.s.c.CachingDirectoryFactory return new directory for /home/jenkins/workspace/Lucene-Solr-master-Linux/solr/build/solr-core/test/J1/temp/solr.schema.TestManagedSchemaAPI_ADFDD54241CCA071-001/tempDir-001/node2/./testschemaapi_shard1_replica2/data
   [junit4]   2> 393057 INFO  (qtp1888774735-2493) [    ] o.a.s.c.SolrCore New index directory detected: old=null new=/home/jenkins/workspace/Lucene-Solr-master-Linux/solr/build/solr-core/test/J1/temp/solr.schema.TestManagedSchemaAPI_ADFDD54241CCA071-001/tempDir-001/node2/./testschemaapi_shard1_replica2/data/index/
   [junit4]   2> 393057 INFO  (qtp170841050-2490) [    ] o.a.s.c.CachingDirectoryFactory return new directory for /home/jenkins/workspace/Lucene-Solr-master-Linux/solr/build/solr-core/test/J1/temp/solr.schema.TestManagedSchemaAPI_ADFDD54241CCA071-001/tempDir-001/node1/./testschemaapi_shard1_replica1/data
   [junit4]   2> 393057 WARN  (qtp1888774735-2493) [    ] o.a.s.c.SolrCore [testschemaapi_shard1_replica2] Solr index directory '/home/jenkins/workspace/Lucene-Solr-master-Linux/solr/build/solr-core/test/J1/temp/solr.schema.TestManagedSchemaAPI_ADFDD54241CCA071-001/tempDir-001/node2/./testschemaapi_shard1_replica2/data/index' doesn't exist. Creating new index...
   [junit4]   2> 393057 INFO  (qtp170841050-2490) [    ] o.a.s.c.SolrCore New index directory detected: old=null new=/home/jenkins/workspace/Lucene-Solr-master-Linux/solr/build/solr-core/test/J1/temp/solr.schema.TestManagedSchemaAPI_ADFDD54241CCA071-001/tempDir-001/node1/./testschemaapi_shard1_replica1/data/index/
   [junit4]   2> 393058 WARN  (qtp170841050-2490) [    ] o.a.s.c.SolrCore [testschemaapi_shard1_replica1] Solr index directory '/home/jenkins/workspace/Lucene-Solr-master-Linux/solr/build/solr-core/test/J1/temp/solr.schema.TestManagedSchemaAPI_ADFDD54241CCA071-001/tempDir-001/node1/./testschemaapi_shard1_replica1/data/index' doesn't exist. Creating new index...
   [junit4]   2> 393058 INFO  (qtp1888774735-2493) [    ] o.a.s.c.CachingDirectoryFactory return new directory for /home/jenkins/workspace/Lucene-Solr-master-Linux/solr/build/solr-core/test/J1/temp/solr.schema.TestManagedSchemaAPI_ADFDD54241CCA071-001/tempDir-001/node2/./testschemaapi_shard1_replica2/data/index
   [junit4]   2> 393058 INFO  (qtp170841050-2490) [    ] o.a.s.c.CachingDirectoryFactory return new directory for /home/jenkins/workspace/Lucene-Solr-master-Linux/solr/build/solr-core/test/J1/temp/solr.schema.TestManagedSchemaAPI_ADFDD54241CCA071-001/tempDir-001/node1/./testschemaapi_shard1_replica1/data/index
   [junit4]   2> 393059 INFO  (qtp170841050-2490) [    ] o.a.s.c.SolrDeletionPolicy SolrDeletionPolicy.onCommit: commits: num=1
   [junit4]   2> 	commit{dir=MockDirectoryWrapper(RAMDirectory@59d587ed lockFactory=org.apache.lucene.store.SingleInstanceLockFactory@a3e7966),segFN=segments_1,generation=1}
   [junit4]   2> 393059 INFO  (qtp1888774735-2493) [    ] o.a.s.c.SolrDeletionPolicy SolrDeletionPolicy.onCommit: commits: num=1
   [junit4]   2> 	commit{dir=MockDirectoryWrapper(RAMDirectory@78b6492e lockFactory=org.apache.lucene.store.SingleInstanceLockFactory@5b8208c6),segFN=segments_1,generation=1}
   [junit4]   2> 393059 INFO  (qtp170841050-2490) [    ] o.a.s.c.SolrDeletionPolicy newest commit generation = 1
   [junit4]   2> 393059 INFO  (qtp1888774735-2493) [    ] o.a.s.c.SolrDeletionPolicy newest commit generation = 1
   [junit4]   2> 393059 INFO  (OldIndexDirectoryCleanupThreadForCore-testschemaapi_shard1_replica2) [    ] o.a.s.c.SolrCore Looking for old index directories to cleanup for core testschemaapi_shard1_replica2 in /home/jenkins/workspace/Lucene-Solr-master-Linux/solr/build/solr-core/test/J1/temp/solr.schema.TestManagedSchemaAPI_ADFDD54241CCA071-001/tempDir-001/node2/./testschemaapi_shard1_replica2/data/
   [junit4]   2> 393059 INFO  (OldIndexDirectoryCleanupThreadForCore-testschemaapi_shard1_replica1) [    ] o.a.s.c.SolrCore Looking for old index directories to cleanup for core testschemaapi_shard1_replica1 in /home/jenkins/workspace/Lucene-Solr-master-Linux/solr/build/solr-core/test/J1/temp/solr.schema.TestManagedSchemaAPI_ADFDD54241CCA071-001/tempDir-001/node1/./testschemaapi_shard1_replica1/data/
   [junit4]   2> 393059 WARN  (OldIndexDirectoryCleanupThreadForCore-testschemaapi_shard1_replica2) [    ] o.a.s.c.DirectoryFactory /home/jenkins/workspace/Lucene-Solr-master-Linux/solr/build/solr-core/test/J1/temp/solr.schema.TestManagedSchemaAPI_ADFDD54241CCA071-001/tempDir-001/node2/./testschemaapi_shard1_replica2/data/ does not point to a valid data directory; skipping clean-up of old index directories.
   [junit4]   2> 393060 WARN  (OldIndexDirectoryCleanupThreadForCore-testschemaapi_shard1_replica1) [    ] o.a.s.c.DirectoryFactory /home/jenkins/workspace/Lucene-Solr-master-Linux/solr/build/solr-core/test/J1/temp/solr.schema.TestManagedSchemaAPI_ADFDD54241CCA071-001/tempDir-001/node1/./testschemaapi_shard1_replica1/data/ does not point to a valid data directory; skipping clean-up of old index directories.
   [junit4]   2> 393061 INFO  (qtp1888774735-2493) [    ] o.a.s.c.SolrCore no updateRequestProcessorChain defined as default, creating implicit default
   [junit4]   2> 393061 INFO  (qtp170841050-2490) [    ] o.a.s.c.SolrCore no updateRequestProcessorChain defined as default, creating implicit default
   [junit4]   2> 393062 INFO  (qtp1888774735-2493) [    ] o.a.s.h.l.XMLLoader xsltCacheLifetimeSeconds=60
   [junit4]   2> 393062 INFO  (qtp170841050-2490) [    ] o.a.s.h.l.XMLLoader xsltCacheLifetimeSeconds=60
   [junit4]   2> 393063 INFO  (qtp1888774735-2493) [    ] o.a.s.h.l.XMLLoader xsltCacheLifetimeSeconds=60
   [junit4]   2> 393063 INFO  (qtp1888774735-2493) [    ] o.a.s.h.l.XMLLoader xsltCacheLifetimeSeconds=60
   [junit4]   2> 393063 INFO  (qtp170841050-2490) [    ] o.a.s.h.l.XMLLoader xsltCacheLifetimeSeconds=60
   [junit4]   2> 393064 INFO  (qtp1888774735-2493) [    ] o.a.s.h.l.XMLLoader xsltCacheLifetimeSeconds=60
   [junit4]   2> 393065 INFO  (qtp170841050-2490) [    ] o.a.s.h.l.XMLLoader xsltCacheLifetimeSeconds=60
   [junit4]   2> 393065 INFO  (qtp1888774735-2493) [    ] o.a.s.c.RequestHandlers Registered paths: /admin/mbeans,/update/csv,/sql,/update/json/docs,/admin/luke,/export,/select,/admin/segments,/get,/admin/system,/replication,/admin/properties,/config,/stream,/schema,/admin/plugins,/admin/logging,/update/json,/admin/ping,/admin/threads,/update,/admin/file
   [junit4]   2> 393065 INFO  (qtp1888774735-2493) [    ] o.a.s.c.SolrCore Using default statsCache cache: org.apache.solr.search.stats.LocalStatsCache
   [junit4]   2> 393065 INFO  (qtp170841050-2490) [    ] o.a.s.h.l.XMLLoader xsltCacheLifetimeSeconds=60
   [junit4]   2> 393065 INFO  (qtp1888774735-2493) [    ] o.a.s.u.UpdateHandler Using UpdateLog implementation: org.apache.solr.update.UpdateLog
   [junit4]   2> 393065 INFO  (qtp1888774735-2493) [    ] o.a.s.u.UpdateLog Initializing UpdateLog: dataDir=null defaultSyncLevel=FLUSH numRecordsToKeep=100 maxNumLogsToKeep=10 numVersionBuckets=65536
   [junit4]   2> 393066 INFO  (qtp170841050-2490) [    ] o.a.s.c.RequestHandlers Registered paths: /admin/mbeans,/update/csv,/sql,/update/json/docs,/admin/luke,/export,/select,/admin/segments,/get,/admin/system,/replication,/admin/properties,/config,/stream,/schema,/admin/plugins,/admin/logging,/update/json,/admin/ping,/admin/threads,/update,/admin/file
   [junit4]   2> 393066 INFO  (qtp170841050-2490) [    ] o.a.s.c.SolrCore Using default statsCache cache: org.apache.solr.search.stats.LocalStatsCache
   [junit4]   2> 393066 INFO  (qtp170841050-2490) [    ] o.a.s.u.UpdateHandler Using UpdateLog implementation: org.apache.solr.update.UpdateLog
   [junit4]   2> 393066 INFO  (qtp170841050-2490) [    ] o.a.s.u.UpdateLog Initializing UpdateLog: dataDir=null defaultSyncLevel=FLUSH numRecordsToKeep=100 maxNumLogsToKeep=10 numVersionBuckets=65536
   [junit4]   2> 393066 INFO  (qtp1888774735-2493) [    ] o.a.s.u.CommitTracker Hard AutoCommit: disabled
   [junit4]   2> 393066 INFO  (qtp1888774735-2493) [    ] o.a.s.u.CommitTracker Soft AutoCommit: disabled
   [junit4]   2> 393066 INFO  (qtp1888774735-2493) [    ] o.a.s.c.SolrDeletionPolicy SolrDeletionPolicy.onInit: commits: num=1
   [junit4]   2> 	commit{dir=MockDirectoryWrapper(RAMDirectory@78b6492e lockFactory=org.apache.lucene.store.SingleInstanceLockFactory@5b8208c6),segFN=segments_1,generation=1}
   [junit4]   2> 393066 INFO  (qtp1888774735-2493) [    ] o.a.s.c.SolrDeletionPolicy newest commit generation = 1
   [junit4]   2> 393067 INFO  (qtp1888774735-2493) [    ] o.a.s.s.SolrIndexSearcher Opening [Searcher@4390f0c[testschemaapi_shard1_replica2] main]
   [junit4]   2> 393067 INFO  (qtp1888774735-2493) [    ] o.a.s.c.c.ZkStateReader Load collection config from: [/collections/testschemaapi]
   [junit4]   2> 393067 INFO  (qtp170841050-2490) [    ] o.a.s.u.CommitTracker Hard AutoCommit: disabled
   [junit4]   2> 393067 INFO  (qtp170841050-2490) [    ] o.a.s.u.CommitTracker Soft AutoCommit: disabled
   [junit4]   2> 393067 INFO  (qtp1888774735-2493) [    ] o.a.s.c.c.ZkStateReader path=[/collections/testschemaapi] [configName]=[conf1] specified config exists in ZooKeeper
   [junit4]   2> 393067 INFO  (qtp1888774735-2493) [    ] o.a.s.r.ManagedResourceStorage Setting up ZooKeeper-based storage for the RestManager with znodeBase: /configs/conf1
   [junit4]   2> 393067 INFO  (qtp170841050-2490) [    ] o.a.s.c.SolrDeletionPolicy SolrDeletionPolicy.onInit: commits: num=1
   [junit4]   2> 	commit{dir=MockDirectoryWrapper(RAMDirectory@59d587ed lockFactory=org.apache.lucene.store.SingleInstanceLockFactory@a3e7966),segFN=segments_1,generation=1}
   [junit4]   2> 393067 INFO  (qtp1888774735-2493) [    ] o.a.s.r.ManagedResourceStorage Configured ZooKeeperStorageIO with znodeBase: /configs/conf1
   [junit4]   2> 393067 INFO  (qtp1888774735-2493) [    ] o.a.s.r.RestManager Initializing RestManager with initArgs: {}
   [junit4]   2> 393067 INFO  (qtp170841050-2490) [    ] o.a.s.c.SolrDeletionPolicy newest commit generation = 1
   [junit4]   2> 393067 INFO  (qtp1888774735-2493) [    ] o.a.s.r.ManagedResourceStorage Reading _rest_managed.json using ZooKeeperStorageIO:path=/configs/conf1
   [junit4]   2> 393067 INFO  (qtp170841050-2490) [    ] o.a.s.s.SolrIndexSearcher Opening [Searcher@2a76e387[testschemaapi_shard1_replica1] main]
   [junit4]   2> 393067 INFO  (qtp170841050-2490) [    ] o.a.s.c.c.ZkStateReader Load collection config from: [/collections/testschemaapi]
   [junit4]   2> 393067 INFO  (qtp1888774735-2493) [    ] o.a.s.r.ManagedResourceStorage No data found for znode /configs/conf1/_rest_managed.json
   [junit4]   2> 393068 INFO  (qtp1888774735-2493) [    ] o.a.s.r.ManagedResourceStorage Loaded null at path _rest_managed.json using ZooKeeperStorageIO:path=/configs/conf1
   [junit4]   2> 393068 INFO  (qtp1888774735-2493) [    ] o.a.s.r.RestManager Initializing 0 registered ManagedResources
   [junit4]   2> 393068 INFO  (qtp170841050-2490) [    ] o.a.s.c.c.ZkStateReader path=[/collections/testschemaapi] [configName]=[conf1] specified config exists in ZooKeeper
   [junit4]   2> 393068 INFO  (qtp170841050-2490) [    ] o.a.s.r.ManagedResourceStorage Setting up ZooKeeper-based storage for the RestManager with znodeBase: /configs/conf1
   [junit4]   2> 393068 INFO  (qtp170841050-2490) [    ] o.a.s.r.ManagedResourceStorage Configured ZooKeeperStorageIO with znodeBase: /configs/conf1
   [junit4]   2> 393068 INFO  (qtp170841050-2490) [    ] o.a.s.r.RestManager Initializing RestManager with initArgs: {}
   [junit4]   2> 393068 INFO  (qtp170841050-2490) [    ] o.a.s.r.ManagedResourceStorage Reading _rest_managed.json using ZooKeeperStorageIO:path=/configs/conf1
   [junit4]   2> 393068 INFO  (qtp170841050-2490) [    ] o.a.s.r.ManagedResourceStorage No data found for znode /configs/conf1/_rest_managed.json
   [junit4]   2> 393068 INFO  (qtp170841050-2490) [    ] o.a.s.r.ManagedResourceStorage Loaded null at path _rest_managed.json using ZooKeeperStorageIO:path=/configs/conf1
   [junit4]   2> 393068 INFO  (qtp170841050-2490) [    ] o.a.s.r.RestManager Initializing 0 registered ManagedResources
   [junit4]   2> 393069 INFO  (qtp1888774735-2493) [    ] o.a.s.s.ZkIndexSchemaReader Creating ZooKeeper watch for the managed schema at /configs/conf1/managed-schema
   [junit4]   2> 393069 INFO  (qtp170841050-2490) [    ] o.a.s.s.ZkIndexSchemaReader Creating ZooKeeper watch for the managed schema at /configs/conf1/managed-schema
   [junit4]   2> 393071 INFO  (qtp1888774735-2493) [    ] o.a.s.c.ZkController Added new OnReconnect listener ZkIndexSchemaReader: /configs/conf1/managed-schema, uniqueCoreId: testschemaapi_shard1_replica2:517385856388109
   [junit4]   2> 393071 INFO  (qtp170841050-2490) [    ] o.a.s.c.ZkController Added new OnReconnect listener ZkIndexSchemaReader: /configs/conf1/managed-schema, uniqueCoreId: testschemaapi_shard1_replica1:517385856370754
   [junit4]   2> 393071 INFO  (qtp1888774735-2493) [    ] o.a.s.h.ReplicationHandler Commits will be reserved for  10000
   [junit4]   2> 393071 INFO  (qtp170841050-2490) [    ] o.a.s.h.ReplicationHandler Commits will be reserved for  10000
   [junit4]   2> 393071 INFO  (searcherExecutor-823-thread-1) [    ] o.a.s.c.SolrCore [testschemaapi_shard1_replica1] Registered new searcher Searcher@2a76e387[testschemaapi_shard1_replica1] main{ExitableDirectoryReader(UninvertingDirectoryReader())}
   [junit4]   2> 393071 INFO  (searcherExecutor-824-thread-1) [    ] o.a.s.c.SolrCore [testschemaapi_shard1_replica2] Registered new searcher Searcher@4390f0c[testschemaapi_shard1_replica2] main{ExitableDirectoryReader(UninvertingDirectoryReader())}
   [junit4]   2> 393071 INFO  (qtp170841050-2490) [    ] o.a.s.u.UpdateLog Looking up max value of version field to seed version buckets
   [junit4]   2> 393071 INFO  (qtp1888774735-2493) [    ] o.a.s.u.UpdateLog Looking up max value of version field to seed version buckets
   [junit4]   2> 393071 INFO  (qtp170841050-2490) [    ] o.a.s.u.VersionInfo Refreshing highest value of _version_ for 65536 version buckets from index
   [junit4]   2> 393071 INFO  (qtp1888774735-2493) [    ] o.a.s.u.VersionInfo Refreshing highest value of _version_ for 65536 version buckets from index
   [junit4]   2> 393071 INFO  (qtp170841050-2490) [    ] o.a.s.u.VersionInfo No terms found for _version_, cannot seed version bucket highest value from index
   [junit4]   2> 393071 INFO  (qtp1888774735-2493) [    ] o.a.s.u.VersionInfo No terms found for _version_, cannot seed version bucket highest value from index
   [junit4]   2> 393071 INFO  (qtp170841050-2490) [    ] o.a.s.u.UpdateLog Could not find max version in index or recent updates, using new clock 1532795920053174272
   [junit4]   2> 393071 INFO  (qtp1888774735-2493) [    ] o.a.s.u.UpdateLog Could not find max version in index or recent updates, using new clock 1532795920053174272
   [junit4]   2> 393074 INFO  (qtp1888774735-2493) [    ] o.a.s.u.UpdateLog Took 2.0ms to seed version buckets with highest version 1532795920053174272
   [junit4]   2> 393074 INFO  (qtp1888774735-2493) [    ] o.a.s.c.ZkController watch zkdir /configs/conf1
   [junit4]   2> 393074 INFO  (qtp170841050-2490) [    ] o.a.s.u.UpdateLog Took 2.0ms to seed version buckets with highest version 1532795920053174272
   [junit4]   2> 393074 INFO  (qtp170841050-2490) [    ] o.a.s.c.ZkController watch zkdir /configs/conf1
   [junit4]   2> 393074 INFO  (qtp1888774735-2493) [    ] o.a.s.c.CoreContainer registering core: testschemaapi_shard1_replica2
   [junit4]   2> 393074 INFO  (qtp1888774735-2493) [    ] o.a.s.c.ZkController Register replica - core:testschemaapi_shard1_replica2 address:http://127.0.0.1:39221/solr collection:testschemaapi shard:shard1
   [junit4]   2> 393074 INFO  (qtp170841050-2490) [    ] o.a.s.c.CoreContainer registering core: testschemaapi_shard1_replica1
   [junit4]   2> 393075 INFO  (qtp170841050-2490) [    ] o.a.s.c.ZkController Register replica - core:testschemaapi_shard1_replica1 address:http://127.0.0.1:39923/solr collection:testschemaapi shard:shard1
   [junit4]   2> 393075 INFO  (qtp1888774735-2493) [    ] o.a.s.c.c.SolrZkClient makePath: /collections/testschemaapi/leader_elect/shard1/election
   [junit4]   2> 393075 INFO  (qtp170841050-2490) [    ] o.a.s.c.c.SolrZkClient makePath: /collections/testschemaapi/leader_elect/shard1/election
   [junit4]   2> 393076 INFO  (qtp170841050-2490) [    ] o.a.s.c.LeaderElector Joined leadership election with path: /collections/testschemaapi/leader_elect/shard1/election/95799744851345414-core_node1-n_0000000000
   [junit4]   2> 393076 INFO  (qtp1888774735-2493) [    ] o.a.s.c.LeaderElector Joined leadership election with path: /collections/testschemaapi/leader_elect/shard1/election/95799744851345413-core_node2-n_0000000001
   [junit4]   2> 393076 INFO  (qtp170841050-2490) [    ] o.a.s.c.ShardLeaderElectionContext Running the leader process for shard=shard1 and weAreReplacement=false and leaderVoteWait=10000
   [junit4]   2> 393076 INFO  (qtp1888774735-2493) [    ] o.a.s.c.LeaderElector Watching path /collections/testschemaapi/leader_elect/shard1/election/95799744851345414-core_node1-n_0000000000 to know if I could be the leader
   [junit4]   2> 393077 INFO  (qtp170841050-2490) [    ] o.a.s.c.ShardLeaderElectionContext Enough replicas found to continue.
   [junit4]   2> 393077 INFO  (qtp170841050-2490) [    ] o.a.s.c.ShardLeaderElectionContext I may be the new leader - try and sync
   [junit4]   2> 393077 INFO  (qtp170841050-2490) [    ] o.a.s.c.SyncStrategy Sync replicas to http://127.0.0.1:39923/solr/testschemaapi_shard1_replica1/
   [junit4]   2> 393077 INFO  (qtp170841050-2490) [    ] o.a.s.u.PeerSync PeerSync: core=testschemaapi_shard1_replica1 url=http://127.0.0.1:39923/solr START replicas=[http://127.0.0.1:39221/solr/testschemaapi_shard1_replica2/] nUpdates=100
   [junit4]   2> 393077 INFO  (OverseerStateUpdate-95799744851345414-127.0.0.1:39923_solr-n_0000000000) [    ] o.a.s.c.Overseer processMessage: queueSize: 1, message = {
   [junit4]   2>   "operation":"leader",
   [junit4]   2>   "shard":"shard1",
   [junit4]   2>   "collection":"testschemaapi"} current state version: 0
   [junit4]   2> 393077 INFO  (qtp170841050-2490) [    ] o.a.s.u.PeerSync PeerSync: core=testschemaapi_shard1_replica1 url=http://127.0.0.1:39923/solr DONE.  We have no versions.  sync failed.
   [junit4]   2> 393077 INFO  (qtp170841050-2490) [    ] o.a.s.c.SyncStrategy Leader's attempt to sync with shard failed, moving to the next candidate
   [junit4]   2> 393077 INFO  (qtp170841050-2490) [    ] o.a.s.c.ShardLeaderElectionContext We failed sync, but we have no versions - we can't sync in that case - we were active before, so become leader anyway
   [junit4]   2> 393078 INFO  (qtp170841050-2490) [    ] o.a.s.c.c.SolrZkClient makePath: /collections/testschemaapi/leaders/shard1
   [junit4]   2> 393079 INFO  (qtp1888774735-2481) [    ] o.a.s.c.S.Request [testschemaapi_shard1_replica2]  webapp=/solr path=/get params={distrib=false&qt=/get&fingerprint=false&getVersions=100&wt=javabin&version=2} status=0 QTime=0
   [junit4]   2> 393079 INFO  (qtp170841050-2490) [    ] o.a.s.c.ShardLeaderElectionContextBase Creating leader registration node /collections/testschemaapi/leaders/shard1/leader after winning as /collections/testschemaapi/leader_elect/shard1/election/95799744851345414-core_node1-n_0000000000
   [junit4]   2> 393080 INFO  (qtp170841050-2490) [    ] o.a.s.c.ShardLeaderElectionContext I am the new leader: http://127.0.0.1:39923/solr/testschemaapi_shard1_replica1/ shard1
   [junit4]   2> 393080 INFO  (OverseerStateUpdate-95799744851345414-127.0.0.1:39923_solr-n_0000000000) [    ] o.a.s.c.Overseer processMessage: queueSize: 1, message = {
   [junit4]   2>   "operation":"leader",
   [junit4]   2>   "shard":"shard1",
   [junit4]   2>   "collection":"testschemaapi",
   [junit4]   2>   "base_url":"http://127.0.0.1:39923/solr",
   [junit4]   2>   "core":"testschemaapi_shard1_replica1",
   [junit4]   2>   "state":"active"} current state version: 0
   [junit4]   2> 393181 INFO  (OverseerStateUpdate-95799744851345414-127.0.0.1:39923_solr-n_0000000000) [    ] o.a.s.c.o.ZkStateWriter going to update_collection /collections/testschemaapi/state.json version: 1
   [junit4]   2> 393181 INFO  (zkCallback-286-thread-1) [    ] o.a.s.c.c.ZkStateReader A cluster state change: [WatchedEvent state:SyncConnected type:NodeDataChanged path:/collections/testschemaapi/state.json] for collection [testschemaapi] has occurred - updating... (live nodes size: [2])
   [junit4]   2> 393181 INFO  (zkCallback-285-thread-1) [    ] o.a.s.c.c.ZkStateReader A cluster state change: [WatchedEvent state:SyncConnected type:NodeDataChanged path:/collections/testschemaapi/state.json] for collection [testschemaapi] has occurred - updating... (live nodes size: [2])
   [junit4]   2> 393182 INFO  (zkCallback-286-thread-1) [    ] o.a.s.c.c.ZkStateReader Updating data for [testschemaapi] from [1] to [2]
   [junit4]   2> 393182 INFO  (zkCallback-285-thread-1) [    ] o.a.s.c.c.ZkStateReader Updating data for [testschemaapi] from [1] to [2]
   [junit4]   2> 393231 INFO  (qtp170841050-2490) [    ] o.a.s.c.ZkController We are http://127.0.0.1:39923/solr/testschemaapi_shard1_replica1/ and leader is http://127.0.0.1:39923/solr/testschemaapi_shard1_replica1/
   [junit4]   2> 393231 INFO  (qtp170841050-2490) [    ] o.a.s.c.ZkController No LogReplay needed for core=testschemaapi_shard1_replica1 baseURL=http://127.0.0.1:39923/solr
   [junit4]   2> 393231 INFO  (qtp170841050-2490) [    ] o.a.s.c.ZkController I am the leader, no recovery necessary
   [junit4]   2> 393231 INFO  (qtp170841050-2490) [    ] o.a.s.c.ZkController publishing state=active
   [junit4]   2> 393232 INFO  (OverseerStateUpdate-95799744851345414-127.0.0.1:39923_solr-n_0000000000) [    ] o.a.s.c.Overseer processMessage: queueSize: 1, message = {
   [junit4]   2>   "core":"testschemaapi_shard1_replica1",
   [junit4]   2>   "core_node_name":"core_node1",
   [junit4]   2>   "roles":null,
   [junit4]   2>   "base_url":"http://127.0.0.1:39923/solr",
   [junit4]   2>   "node_name":"127.0.0.1:39923_solr",
   [junit4]   2>   "numShards":"1",
   [junit4]   2>   "state":"active",
   [junit4]   2>   "shard":"shard1",
   [junit4]   2>   "collection":"testschemaapi",
   [junit4]   2>   "operation":"state"} current state version: 0
   [junit4]   2> 393232 INFO  (OverseerStateUpdate-95799744851345414-127.0.0.1:39923_solr-n_0000000000) [    ] o.a.s.c.o.ReplicaMutator Update state numShards=1 message={
   [junit4]   2>   "core":"testschemaapi_shard1_replica1",
   [junit4]   2>   "core_node_name":"core_node1",
   [junit4]   2>   "roles":null,
   [junit4]   2>   "base_url":"http://127.0.0.1:39923/solr",
   [junit4]   2>   "node_name":"127.0.0.1:39923_solr",
   [junit4]   2>   "numShards":"1",
   [junit4]   2>   "state":"active",
   [junit4]   2>   "shard":"shard1",
   [junit4]   2>   "collection":"testschemaapi",
   [junit4]   2>   "operation":"state"}
   [junit4]   2> 393232 INFO  (qtp170841050-2490) [    ] o.a.s.s.HttpSolrCall [admin] webapp=null path=/admin/cores params={qt=/admin/cores&collection.configName=conf1&name=testschemaapi_shard1_replica1&action=CREATE&numShards=1&collection=testschemaapi&shard=shard1&wt=javabin&version=2} status=0 QTime=1193
   [junit4]   2> 393333 INFO  (OverseerStateUpdate-95799744851345414-127.0.0.1:39923_solr-n_0000000000) [    ] o.a.s.c.o.ZkStateWriter going to update_collection /collections/testschemaapi/state.json version: 2
   [junit4]   2> 393333 INFO  (zkCallback-286-thread-1) [    ] o.a.s.c.c.ZkStateReader A cluster state change: [WatchedEvent state:SyncConnected type:NodeDataChanged path:/collections/testschemaapi/state.json] for collection [testschemaapi] has occurred - updating... (live nodes size: [2])
   [junit4]   2> 393333 INFO  (zkCallback-285-thread-1) [    ] o.a.s.c.c.ZkStateReader A cluster state change: [WatchedEvent state:SyncConnected type:NodeDataChanged path:/collections/testschemaapi/state.json] for collection [testschemaapi] has occurred - updating... (live nodes size: [2])
   [junit4]   2> 393333 INFO  (zkCallback-286-thread-1) [    ] o.a.s.c.c.ZkStateReader Updating data for [testschemaapi] from [2] to [3]
   [junit4]   2> 393333 INFO  (zkCallback-285-thread-1) [    ] o.a.s.c.c.ZkStateReader Updating data for [testschemaapi] from [2] to [3]
   [junit4]   2> 394077 INFO  (qtp1888774735-2493) [    ] o.a.s.c.ZkController We are http://127.0.0.1:39221/solr/testschemaapi_shard1_replica2/ and leader is http://127.0.0.1:39923/solr/testschemaapi_shard1_replica1/
   [junit4]   2> 394077 INFO  (qtp1888774735-2493) [    ] o.a.s.c.ZkController No LogReplay needed for core=testschemaapi_shard1_replica2 baseURL=http://127.0.0.1:39221/solr
   [junit4]   2> 394077 INFO  (qtp1888774735-2493) [    ] o.a.s.c.ZkController Core needs to recover:testschemaapi_shard1_replica2
   [junit4]   2> 394077 INFO  (updateExecutor-279-thread-1) [    ] o.a.s.u.DefaultSolrCoreState Running recovery
   [junit4]   2> 394077 INFO  (recoveryExecutor-280-thread-1) [    ] o.a.s.c.RecoveryStrategy Starting recovery process. recoveringAfterStartup=true
   [junit4]   2> 394077 INFO  (recoveryExecutor-280-thread-1) [    ] o.a.s.c.RecoveryStrategy ###### startupVersions=[[]]
   [junit4]   2> 394077 INFO  (recoveryExecutor-280-thread-1) [    ] o.a.s.c.RecoveryStrategy Begin buffering updates. core=[testschemaapi_shard1_replica2]
   [junit4]   2> 394077 INFO  (recoveryExecutor-280-thread-1) [    ] o.a.s.u.UpdateLog Starting to buffer updates. FSUpdateLog{state=ACTIVE, tlog=null}
   [junit4]   2> 394077 INFO  (recoveryExecutor-280-thread-1) [    ] o.a.s.c.RecoveryStrategy Publishing state of core [testschemaapi_shard1_replica2] as recovering, leader is [http://127.0.0.1:39923/solr/testschemaapi_shard1_replica1/] and I am [http://127.0.0.1:39221/solr/testschemaapi_shard1_replica2/]
   [junit4]   2> 394077 INFO  (recoveryExecutor-280-thread-1) [    ] o.a.s.c.ZkController publishing state=recovering
   [junit4]   2> 394078 INFO  (qtp1888774735-2493) [    ] o.a.s.s.HttpSolrCall [admin] webapp=null path=/admin/cores params={qt=/admin/cores&collection.configName=conf1&name=testschemaapi_shard1_replica2&action=CREATE&numShards=1&collection=testschemaapi&shard=shard1&wt=javabin&version=2} status=0 QTime=2039
   [junit4]   2> 394078 INFO  (OverseerStateUpdate-95799744851345414-127.0.0.1:39923_solr-n_0000000000) [    ] o.a.s.c.Overseer processMessage: queueSize: 1, message = {
   [junit4]   2>   "core":"testschemaapi_shard1_replica2",
   [junit4]   2>   "core_node_name":"core_node2",
   [junit4]   2>   "roles":null,
   [junit4]   2>   "base_url":"http://127.0.0.1:39221/solr",
   [junit4]   2>   "node_name":"127.0.0.1:39221_solr",
   [junit4]   2>   "numShards":"1",
   [junit4]   2>   "state":"recovering",
   [junit4]   2>   "shard":"shard1",
   [junit4]   2>   "collection":"testschemaapi",
   [junit4]   2>   "operation":"state"} current state version: 0
   [junit4]   2> 394079 INFO  (OverseerThreadFactory-818-thread-1) [    ] o.a.s.c.OverseerTaskProcessor Overseer Collection Message Handler: Message id:/overseer/collection-queue-work/qn-0000000000 complete, response:{success={127.0.0.1:39923_solr={responseHeader={status=0,QTime=1193},core=testschemaapi_shard1_replica1},127.0.0.1:39221_solr={responseHeader={status=0,QTime=2039},core=testschemaapi_shard1_replica2}}}
   [junit4]   2> 394079 INFO  (OverseerStateUpdate-95799744851345414-127.0.0.1:39923_solr-n_0000000000) [    ] o.a.s.c.o.ReplicaMutator Update state numShards=1 message={
   [junit4]   2>   "core":"testschemaapi_shard1_replica2",
   [junit4]   2>   "core_node_name":"core_node2",
   [junit4]   2>   "roles":null,
   [junit4]   2>   "base_url":"http://127.0.0.1:39221/solr",
   [junit4]   2>   "node_name":"127.0.0.1:39221_solr",
   [junit4]   2>   "numShards":"1",
   [junit4]   2>   "state":"recovering",
   [junit4]   2>   "shard":"shard1",
   [junit4]   2>   "collection":"testschemaapi",
   [junit4]   2>   "operation":"state"}
   [junit4]   2> 394080 INFO  (recoveryExecutor-280-thread-1) [    ] o.a.s.c.RecoveryStrategy Sending prep recovery command to [http://127.0.0.1:39923/solr]; [WaitForState: action=PREPRECOVERY&core=testschemaapi_shard1_replica1&nodeName=127.0.0.1:39221_solr&coreNodeName=core_node2&state=recovering&checkLive=true&onlyIfLeader=true&onlyIfLeaderActive=true]
   [junit4]   2> 394080 INFO  (zkCallback-285-thread-1) [    ] o.a.s.c.OverseerTaskQueue NodeDataChanged fired on path /overseer/collection-queue-work/qnr-0000000000 state SyncConnected latchEventType null
   [junit4]   2> 394081 INFO  (qtp170841050-2494) [    ] o.a.s.h.a.CoreAdminOperation Going to wait for coreNodeName: core_node2, state: recovering, checkLive: true, onlyIfLeader: true, onlyIfLeaderActive: true
   [junit4]   2> 394081 INFO  (qtp170841050-2494) [    ] o.a.s.h.a.CoreAdminOperation Will wait a max of 183 seconds to see testschemaapi_shard1_replica1 (shard1 of testschemaapi) have state: recovering
   [junit4]   2> 394081 INFO  (qtp1888774735-2489) [    ] o.a.s.h.a.CollectionsHandler Wait for new collection to be active for at most 30 seconds. Check all shard replicas
   [junit4]   2> 394081 INFO  (qtp170841050-2494) [    ] o.a.s.h.a.CoreAdminOperation In WaitForState(recovering): collection=testschemaapi, shard=shard1, thisCore=testschemaapi_shard1_replica1, leaderDoesNotNeedRecovery=false, isLeader? true, live=true, checkLive=true, currentState=down, localState=active, nodeName=127.0.0.1:39221_solr, coreNodeName=core_node2, onlyIfActiveCheckResult=false, nodeProps: core_node2:{"core":"testschemaapi_shard1_replica2","base_url":"http://127.0.0.1:39221/solr","node_name":"127.0.0.1:39221_solr","state":"down"}
   [junit4]   2> 394181 INFO  (OverseerStateUpdate-95799744851345414-127.0.0.1:39923_solr-n_0000000000) [    ] o.a.s.c.o.ZkStateWriter going to update_collection /collections/testschemaapi/state.json version: 3
   [junit4]   2> 394181 INFO  (zkCallback-286-thread-1) [    ] o.a.s.c.c.ZkStateReader A cluster state change: [WatchedEvent state:SyncConnected type:NodeDataChanged path:/collections/testschemaapi/state.json] for collection [testschemaapi] has occurred - updating... (live nodes size: [2])
   [junit4]   2> 394181 INFO  (zkCallback-285-thread-1) [    ] o.a.s.c.c.ZkStateReader A cluster state change: [WatchedEvent state:SyncConnected type:NodeDataChanged path:/collections/testschemaapi/state.json] for collection [testschemaapi] has occurred - updating... (live nodes size: [2])
   [junit4]   2> 394182 INFO  (zkCallback-286-thread-1) [    ] o.a.s.c.c.ZkStateReader Updating data for [testschemaapi] from [3] to [4]
   [junit4]   2> 394182 INFO  (zkCallback-285-thread-1) [    ] o.a.s.c.c.ZkStateReader Updating data for [testschemaapi] from [3] to [4]
   [junit4]   2> 395082 INFO  (qtp170841050-2494) [    ] o.a.s.h.a.CoreAdminOperation In WaitForState(recovering): collection=testschemaapi, shard=shard1, thisCore=testschemaapi_shard1_replica1, leaderDoesNotNeedRecovery=false, isLeader? true, live=true, checkLive=true, currentState=recovering, localState=active, nodeName=127.0.0.1:39221_solr, coreNodeName=core_node2, onlyIfActiveCheckResult=false, nodeProps: core_node2:{"core":"testschemaapi_shard1_replica2","base_url":"http://127.0.0.1:39221/solr","node_name":"127.0.0.1:39221_solr","state":"recovering"}
   [junit4]   2> 395082 INFO  (qtp170841050-2494) [    ] o.a.s.h.a.CoreAdminOperation Waited coreNodeName: core_node2, state: recovering, checkLive: true, onlyIfLeader: true for: 1 seconds.
   [junit4]   2> 395082 INFO  (qtp170841050-2494) [    ] o.a.s.s.HttpSolrCall [admin] webapp=null path=/admin/cores params={nodeName=127.0.0.1:39221_solr&onlyIfLeaderActive=true&core=testschemaapi_shard1_replica1&coreNodeName=core_node2&action=PREPRECOVERY&checkLive=true&state=recovering&onlyIfLeader=true&wt=javabin&version=2} status=0 QTime=1000
   [junit4]   2> 402082 INFO  (recoveryExecutor-280-thread-1) [    ] o.a.s.c.RecoveryStrategy Attempting to PeerSync from [http://127.0.0.1:39923/solr/testschemaapi_shard1_replica1/] - recoveringAfterStartup=[true]
   [junit4]   2> 402082 INFO  (recoveryExecutor-280-thread-1) [    ] o.a.s.u.PeerSync PeerSync: core=testschemaapi_shard1_replica2 url=http://127.0.0.1:39221/solr START replicas=[http://127.0.0.1:39923/solr/testschemaapi_shard1_replica1/] nUpdates=100
   [junit4]   2> 402083 WARN  (recoveryExecutor-280-thread-1) [    ] o.a.s.u.PeerSync no frame of reference to tell if we've missed updates
   [junit4]   2> 402083 INFO  (recoveryExecutor-280-thread-1) [    ] o.a.s.c.RecoveryStrategy PeerSync Recovery was not successful - trying replication.
   [junit4]   2> 402083 INFO  (recoveryExecutor-280-thread-1) [    ] o.a.s.c.RecoveryStrategy Starting Replication Recovery.
   [junit4]   2> 402083 INFO  (recoveryExecutor-280-thread-1) [    ] o.a.s.c.RecoveryStrategy Attempting to replicate from [http://127.0.0.1:39923/solr/testschemaapi_shard1_replica1/].
   [junit4]   2> 402086 INFO  (qtp170841050-2494) [    ] o.a.s.u.IndexFingerprint IndexFingerprint millis:0.0 result:{maxVersionSpecified=9223372036854775807, maxVersionEncountered=0, maxInHash=0, versionsHash=0, numVersions=0, numDocs=0, maxDoc=0}
   [junit4]   2> 402086 INFO  (qtp170841050-2494) [    ] o.a.s.c.S.Request [testschemaapi_shard1_replica1]  webapp=/solr path=/get params={distrib=false&qt=/get&fingerprint=true&getVersions=100&wt=javabin&version=2} status=0 QTime=1
   [junit4]   2> 402087 INFO  (qtp170841050-2486) [    ] o.a.s.u.DirectUpdateHandler2 start commit{,optimize=false,openSearcher=false,waitSearcher=true,expungeDeletes=false,softCommit=false,prepareCommit=false}
   [junit4]   2> 402087 INFO  (qtp170841050-2486) [    ] o.a.s.u.DirectUpdateHandler2 No uncommitted changes. Skipping IW.commit.
   [junit4]   2> 402087 INFO  (qtp170841050-2486) [    ] o.a.s.u.DirectUpdateHandler2 end_commit_flush
   [junit4]   2> 402087 INFO  (qtp170841050-2486) [    ] o.a.s.u.p.LogUpdateProcessorFactory [testschemaapi_shard1_replica1]  webapp=/solr path=/update params={waitSearcher=true&openSearcher=false&commit=true&softCommit=false&commit_end_point=true&wt=javabin&version=2}{commit=} 0 0
   [junit4]   2> 402089 INFO  (qtp170841050-2480) [    ] o.a.s.c.S.Request [testschemaapi_shard1_replica1]  webapp=/solr path=/replication params={qt=/replication&wt=javabin&version=2&command=indexversion} status=0 QTime=0
   [junit4]   2> 402089 INFO  (recoveryExecutor-280-thread-1) [    ] o.a.s.c.RecoveryStrategy No replay needed.
   [junit4]   2> 402089 INFO  (recoveryExecutor-280-thread-1) [    ] o.a.s.c.RecoveryStrategy Replication Recovery was successful.
   [junit4]   2> 402089 INFO  (recoveryExecutor-280-thread-1) [    ] o.a.s.c.RecoveryStrategy Registering as Active after recovery.
   [junit4]   2> 402089 INFO  (recoveryExecutor-280-thread-1) [    ] o.a.s.c.ZkController publishing state=active
   [junit4]   2> 402091 INFO  (recoveryExecutor-280-thread-1) [    ] o.a.s.c.RecoveryStrategy Updating version bucket highest from index after successful recovery.
   [junit4]   2> 402091 INFO  (recoveryExecutor-280-thread-1) [    ] o.a.s.u.UpdateLog Looking up max value of version field to seed version buckets
   [junit4]   2> 402091 INFO  (recoveryExecutor-280-thread-1) [    ] o.a.s.u.VersionInfo Refreshing highest value of _version_ for 65536 version buckets from index
   [junit4]   2> 402091 INFO  (recoveryExecutor-280-thread-1) [    ] o.a.s.u.VersionInfo No terms found for _version_, cannot seed version bucket highest value from index
   [junit4]   2> 402091 INFO  (recoveryExecutor-280-thread-1) [    ] o.a.s.u.UpdateLog Could not find max version in index or recent updates, using new clock 1532795929511329792
   [junit4]   2> 402092 INFO  (OverseerStateUpdate-95799744851345414-127.0.0.1:39923_solr-n_0000000000) [    ] o.a.s.c.Overseer processMessage: queueSize: 1, message = {
   [junit4]   2>   "core":"testschemaapi_shard1_replica2",
   [junit4]   2>   "core_node_name":"core_node2",
   [junit4]   2>   "roles":null,
   [junit4]   2>   "base_url":"http://127.0.0.1:39221/solr",
   [junit4]   2>   "node_name":"127.0.0.1:39221_solr",
   [junit4]   2>   "numShards":"1",
   [junit4]   2>   "state":"active",
   [junit4]   2>   "shard":"shard1",
   [junit4]   2>   "collection":"testschemaapi",
   [junit4]   2>   "operation":"state"} current state version: 0
   [junit4]   2> 402092 INFO  (OverseerStateUpdate-95799744851345414-127.0.0.1:39923_solr-n_0000000000) [    ] o.a.s.c.o.ReplicaMutator Update state numShards=1 message={
   [junit4]   2>   "core":"testschemaapi_shard1_replica2",
   [junit4]   2>   "core_node_name":"core_node2",
   [junit4]   2>   "roles":null,
   [junit4]   2>   "base_url":"http://127.0.0.1:39221/solr",
   [junit4]   2>   "node_name":"127.0.0.1:39221_solr",
   [junit4]   2>   "numShards":"1",
   [junit4]   2>   "state":"active",
   [junit4]   2>   "shard":"shard1",
   [junit4]   2>   "collection":"testschemaapi",
   [junit4]   2>   "operation":"state"}
   [junit4]   2> 402093 INFO  (OverseerStateUpdate-95799744851345414-127.0.0.1:39923_solr-n_0000000000) [    ] o.a.s.c.o.ZkStateWriter going to update_collection /collections/testschemaapi/state.json version: 4
   [junit4]   2> 402093 INFO  (zkCallback-286-thread-1) [    ] o.a.s.c.c.ZkStateReader A cluster state change: [WatchedEvent state:SyncConnected type:NodeDataChanged path:/collections/testschemaapi/state.json] for collection [testschemaapi] has occurred - updating... (live nodes size: [2])
   [junit4]   2> 402093 INFO  (zkCallback-285-thread-1) [    ] o.a.s.c.c.ZkStateReader A cluster state change: [WatchedEvent state:SyncConnected type:NodeDataChanged path:/collections/testschemaapi/state.json] for collection [testschemaapi] has occurred - updating... (live nodes size: [2])
   [junit4]   2> 402093 INFO  (zkCallback-286-thread-1) [    ] o.a.s.c.c.ZkStateReader Updating data for [testschemaapi] from [4] to [5]
   [junit4]   2> 402093 INFO  (zkCallback-285-thread-1) [    ] o.a.s.c.c.ZkStateReader Updating data for [testschemaapi] from [4] to [5]
   [junit4]   2> 402093 INFO  (recoveryExecutor-280-thread-1) [    ] o.a.s.u.UpdateLog Took 2.0ms to seed version buckets with highest version 1532795929511329792
   [junit4]   2> 402093 INFO  (recoveryExecutor-280-thread-1) [    ] o.a.s.c.RecoveryStrategy Finished recovery process, successful=[true]
   [junit4]   2> 403082 INFO  (qtp1888774735-2489) [    ] o.a.s.s.HttpSolrCall [admin] webapp=null path=/admin/collections params={replicationFactor=2&collection.configName=conf1&name=testschemaapi&action=CREATE&numShards=1&wt=javabin&version=2} status=0 QTime=11149
   [junit4]   2> 403095 INFO  (qtp170841050-2494) [    ] o.a.s.s.SchemaManager managed schema loaded . version : 0 
   [junit4]   2> 403098 INFO  (qtp170841050-2494) [    ] o.a.s.s.IndexSchema [testschemaapi_shard1_replica1] Schema name=minimal
   [junit4]   2> 403100 INFO  (qtp170841050-2494) [    ] o.a.s.s.IndexSchema unique key field: id
   [junit4]   2> 403114 INFO  (qtp170841050-2494) [    ] o.a.s.c.ZkController Persisted config data to node /configs/conf1/managed-schema 
   [junit4]   2> 403114 INFO  (zkCallback-285-thread-1) [    ] o.a.s.s.ZkIndexSchemaReader A schema change: WatchedEvent state:SyncConnected type:NodeDataChanged path:/configs/conf1/managed-schema, has occurred - updating schema from ZooKeeper ...
   [junit4]   2> 403114 INFO  (zkCallback-286-thread-1) [    ] o.a.s.s.ZkIndexSchemaReader A schema change: WatchedEvent state:SyncConnected type:NodeDataChanged path:/configs/conf1/managed-schema, has occurred - updating schema from ZooKeeper ...
   [junit4]   2> 403114 INFO  (zkCallback-285-thread-1) [    ] o.a.s.s.ZkIndexSchemaReader Retrieved schema version 1 from ZooKeeper
   [junit4]   2> 403115 INFO  (qtp170841050-2494) [    ] o.a.s.s.ManagedIndexSchema Waiting up to 599 secs for 1 replicas to apply schema update version 0 for collection testschemaapi
   [junit4]   2> 403117 INFO  (zkCallback-285-thread-1) [    ] o.a.s.s.IndexSchema [testschemaapi_shard1_replica2] Schema name=minimal
   [junit4]   2> 403123 INFO  (Thread-739) [    ] o.a.s.c.ZkController Running listeners for /configs/conf1
   [junit4]   2> 403123 INFO  (Thread-739) [    ] o.a.s.c.SolrCore config update listener called for core testschemaapi_shard1_replica2
   [junit4]   2> 403124 INFO  (Thread-739) [    ] o.a.s.c.SolrConfig current version of requestparams : -1
   [junit4]   2> 403124 INFO  (Thread-740) [    ] o.a.s.c.ZkController Running listeners for /configs/conf1
   [junit4]   2> 403124 INFO  (Thread-740) [    ] o.a.s.c.SolrCore config update listener called for core testschemaapi_shard1_replica1
   [junit4]   2> 403124 INFO  (zkCallback-285-thread-1) [    ] o.a.s.s.

[...truncated too long message...]

ne-Solr-master-Linux/solr/build/solr-core/test/J1/temp/solr.schema.TestManagedSchemaAPI_ADFDD54241CCA071-001/tempDir-001/node2/./testschemaapi_shard1_replica2/data/index
   [junit4]   2> 403345 INFO  (zkCallback-285-thread-1) [    ] o.a.s.c.Overseer Overseer (id=95799744851345413-127.0.0.1:39221_solr-n_0000000001) starting
   [junit4]   2> 403345 INFO  (Thread-746) [    ] o.a.s.s.IndexSchema unique key field: id
   [junit4]   2> 403345 INFO  (Thread-745) [    ] o.a.s.s.IndexSchema unique key field: id
   [junit4]   2> 403347 INFO  (Thread-745) [    ] o.a.s.c.ConfigSetProperties Did not find ConfigSet properties, assuming default properties: Can't find resource 'configsetprops.json' in classpath or '/configs/conf1', cwd=/home/jenkins/workspace/Lucene-Solr-master-Linux/solr/build/solr-core/test/J1
   [junit4]   2> 403347 INFO  (Thread-745) [    ] o.a.s.c.CoreContainer Reloading SolrCore 'testschemaapi_shard1_replica2' using configuration from collection testschemaapi
   [junit4]   2> 403349 INFO  (zkCallback-285-thread-1) [    ] o.a.s.c.OverseerAutoReplicaFailoverThread Starting OverseerAutoReplicaFailoverThread autoReplicaFailoverWorkLoopDelay=10000 autoReplicaFailoverWaitAfterExpiration=30000 autoReplicaFailoverBadNodeExpiration=60000
   [junit4]   2> 403349 INFO  (OverseerCollectionConfigSetProcessor-95799744851345413-127.0.0.1:39221_solr-n_0000000001) [    ] o.a.s.c.OverseerTaskProcessor Process current queue of overseer operations
   [junit4]   2> 403349 INFO  (jetty-launcher-275-thread-1) [    ] o.a.s.c.Overseer Overseer (id=95799744851345413-127.0.0.1:39221_solr-n_0000000001) closing
   [junit4]   2> 403349 INFO  (OverseerStateUpdate-95799744851345413-127.0.0.1:39221_solr-n_0000000001) [    ] o.a.s.c.Overseer Starting to work on the main queue
   [junit4]   2> 403349 INFO  (OverseerCollectionConfigSetProcessor-95799744851345413-127.0.0.1:39221_solr-n_0000000001) [    ] o.a.s.c.OverseerTaskProcessor According to ZK I (id=95799744851345413-127.0.0.1:39221_solr-n_0000000001) am no longer a leader.
   [junit4]   2> 403349 INFO  (OverseerStateUpdate-95799744851345413-127.0.0.1:39221_solr-n_0000000001) [    ] o.a.s.c.Overseer Overseer Loop exiting : 127.0.0.1:39221_solr
   [junit4]   2> 403351 ERROR (OverseerCollectionConfigSetProcessor-95799744851345413-127.0.0.1:39221_solr-n_0000000001) [    ] o.a.s.c.OverseerTaskProcessor Unable to prioritize overseer 
   [junit4]   2> java.lang.InterruptedException
   [junit4]   2> 	at org.apache.solr.common.cloud.ZkCmdExecutor.retryOperation(ZkCmdExecutor.java:67)
   [junit4]   2> 	at org.apache.solr.common.cloud.SolrZkClient.exists(SolrZkClient.java:311)
   [junit4]   2> 	at org.apache.solr.cloud.OverseerNodePrioritizer.prioritizeOverseerNodes(OverseerNodePrioritizer.java:60)
   [junit4]   2> 	at org.apache.solr.cloud.OverseerTaskProcessor.run(OverseerTaskProcessor.java:162)
   [junit4]   2> 	at java.lang.Thread.run(java.base@9-ea/Thread.java:804)
   [junit4]   2> 403351 INFO  (zkCallback-285-thread-1) [    ] o.a.s.c.c.ZkStateReader A live node change: [WatchedEvent state:SyncConnected type:NodeChildrenChanged path:/live_nodes], has occurred - updating... (live nodes size: [1])
   [junit4]   2> 403358 WARN  (zkCallback-285-thread-1) [    ] o.a.s.c.c.ZkStateReader ZooKeeper watch triggered, but Solr cannot talk to ZK: [KeeperErrorCode = Session expired for /live_nodes]
   [junit4]   2> 403358 INFO  (jetty-launcher-275-thread-1) [    ] o.e.j.s.h.ContextHandler Stopped o.e.j.s.ServletContextHandler@62345777{/solr,null,UNAVAILABLE}
   [junit4]   2> 403359 INFO  (SUITE-TestManagedSchemaAPI-seed#[ADFDD54241CCA071]-worker) [    ] o.a.s.c.ZkTestServer connecting to 127.0.0.1:40715 40715
   [junit4]   2> 403497 INFO  (Thread-709) [    ] o.a.s.c.ZkTestServer connecting to 127.0.0.1:40715 40715
   [junit4]   2> 403498 WARN  (Thread-709) [    ] o.a.s.c.ZkTestServer Watch limit violations: 
   [junit4]   2> Maximum concurrent create/delete watches above limit:
   [junit4]   2> 
   [junit4]   2> 	6	/solr/configs/conf1/managed-schema
   [junit4]   2> 	6	/solr/configs/conf1
   [junit4]   2> 	3	/solr/aliases.json
   [junit4]   2> 	2	/solr/security.json
   [junit4]   2> 
   [junit4]   2> Maximum concurrent data watches above limit:
   [junit4]   2> 
   [junit4]   2> 	3	/solr/clusterstate.json
   [junit4]   2> 	2	/solr/collections/testschemaapi/state.json
   [junit4]   2> 
   [junit4]   2> Maximum concurrent children watches above limit:
   [junit4]   2> 
   [junit4]   2> 	3	/solr/live_nodes
   [junit4]   2> 	3	/solr/collections
   [junit4]   2> 
   [junit4]   2> 403498 INFO  (SUITE-TestManagedSchemaAPI-seed#[ADFDD54241CCA071]-worker) [    ] o.a.s.SolrTestCaseJ4 ###deleteCore
   [junit4]   2> NOTE: leaving temporary files on disk at: /home/jenkins/workspace/Lucene-Solr-master-Linux/solr/build/solr-core/test/J1/temp/solr.schema.TestManagedSchemaAPI_ADFDD54241CCA071-001
   [junit4]   2> Apr 27, 2016 8:15:11 PM com.carrotsearch.randomizedtesting.ThreadLeakControl checkThreadLeaks
   [junit4]   2> WARNING: Will linger awaiting termination of 2 leaked thread(s).
   [junit4]   2> 413347 WARN  (Thread-746) [    ] o.a.s.c.ZkController listener throws error
   [junit4]   2> org.apache.solr.common.SolrException: Unable to reload core [testschemaapi_shard1_replica1]
   [junit4]   2> 	at org.apache.solr.core.CoreContainer.reload(CoreContainer.java:945)
   [junit4]   2> 	at org.apache.solr.core.SolrCore.lambda$getConfListener$6(SolrCore.java:2489)
   [junit4]   2> 	at org.apache.solr.cloud.ZkController$4.run(ZkController.java:2425)
   [junit4]   2> Caused by: org.apache.solr.common.SolrException: Could not load conf for core testschemaapi_shard1_replica1: Unable to load reader for ConfigSet properties: configsetprops.json
   [junit4]   2> 	at org.apache.solr.core.ConfigSetService.getConfig(ConfigSetService.java:86)
   [junit4]   2> 	at org.apache.solr.core.CoreContainer.reload(CoreContainer.java:937)
   [junit4]   2> 	... 2 more
   [junit4]   2> Caused by: org.apache.solr.common.SolrException: Unable to load reader for ConfigSet properties: configsetprops.json
   [junit4]   2> 	at org.apache.solr.core.ConfigSetProperties.readFromResourceLoader(ConfigSetProperties.java:57)
   [junit4]   2> 	at org.apache.solr.core.ConfigSetService.createConfigSetProperties(ConfigSetService.java:118)
   [junit4]   2> 	at org.apache.solr.core.ConfigSetService.getConfig(ConfigSetService.java:80)
   [junit4]   2> 	... 3 more
   [junit4]   2> Caused by: java.io.IOException: We re-tried 10 times but was still unable to fetch resource=configsetprops.json from ZK
   [junit4]   2> 	at org.apache.solr.cloud.ZkSolrResourceLoader.openResource(ZkSolrResourceLoader.java:116)
   [junit4]   2> 	at org.apache.solr.core.ConfigSetProperties.readFromResourceLoader(ConfigSetProperties.java:52)
   [junit4]   2> 	... 5 more
   [junit4]   2> Caused by: org.apache.zookeeper.KeeperException$SessionExpiredException: KeeperErrorCode = Session expired for /configs/conf1/configsetprops.json
   [junit4]   2> 	at org.apache.zookeeper.KeeperException.create(KeeperException.java:127)
   [junit4]   2> 	at org.apache.zookeeper.KeeperException.create(KeeperException.java:51)
   [junit4]   2> 	at org.apache.zookeeper.ZooKeeper.exists(ZooKeeper.java:1045)
   [junit4]   2> 	at org.apache.solr.common.cloud.SolrZkClient$5.execute(SolrZkClient.java:314)
   [junit4]   2> 	at org.apache.solr.common.cloud.SolrZkClient$5.execute(SolrZkClient.java:311)
   [junit4]   2> 	at org.apache.solr.common.cloud.ZkCmdExecutor.retryOperation(ZkCmdExecutor.java:60)
   [junit4]   2> 	at org.apache.solr.common.cloud.SolrZkClient.exists(SolrZkClient.java:311)
   [junit4]   2> 	at org.apache.solr.cloud.ZkController.pathExists(ZkController.java:800)
   [junit4]   2> 	at org.apache.solr.cloud.ZkSolrResourceLoader.openResource(ZkSolrResourceLoader.java:89)
   [junit4]   2> 	... 6 more
   [junit4]   2> NOTE: test params are: codec=Asserting(Lucene60): {_version_=BlockTreeOrds(blocksize=128), id=PostingsFormat(name=Direct), myNewField=BlockTreeOrds(blocksize=128)}, docValues:{}, maxPointsInLeafNode=1336, maxMBSortInHeap=6.690939406949868, sim=RandomSimilarity(queryNorm=true,coord=yes): {}, locale=en-MU, timezone=Greenwich
   [junit4]   2> NOTE: Linux 4.2.0-35-generic amd64/Oracle Corporation 9-ea (64-bit)/cpus=12,threads=1,free=185032696,total=525860864
   [junit4]   2> NOTE: All tests run in this JVM: [SolrPluginUtilsTest, SolrInfoMBeanTest, SimplePostToolTest, HttpPartitionTest, TestSerializedLuceneMatchVersion, RulesTest, OverseerRolesTest, TestTrackingShardHandlerFactory, TestConfigSetImmutable, TestScoreJoinQPNoScore, TestHashPartitioner, TestManagedSchemaAPI]
   [junit4] Completed [77/591 (1!)] on J1 in 22.80s, 1 test, 1 error <<< FAILURES!

[...truncated 1648 lines...]
BUILD FAILED
/home/jenkins/workspace/Lucene-Solr-master-Linux/build.xml:740: The following error occurred while executing this line:
/home/jenkins/workspace/Lucene-Solr-master-Linux/build.xml:684: The following error occurred while executing this line:
/home/jenkins/workspace/Lucene-Solr-master-Linux/build.xml:59: The following error occurred while executing this line:
/home/jenkins/workspace/Lucene-Solr-master-Linux/solr/build.xml:233: The following error occurred while executing this line:
/home/jenkins/workspace/Lucene-Solr-master-Linux/solr/common-build.xml:529: The following error occurred while executing this line:
/home/jenkins/workspace/Lucene-Solr-master-Linux/lucene/common-build.xml:1457: The following error occurred while executing this line:
/home/jenkins/workspace/Lucene-Solr-master-Linux/lucene/common-build.xml:1014: There were test failures: 591 suites (10 ignored), 2388 tests, 1 error, 116 ignored (70 assumptions) [seed: ADFDD54241CCA071]

Total time: 54 minutes 18 seconds
Build step 'Invoke Ant' marked build as failure
Archiving artifacts
[WARNINGS] Skipping publisher since build result is FAILURE
Recording test results
Email was triggered for: Failure - Any
Sending email for trigger: Failure - Any



Mime
View raw message