lucene-dev mailing list archives

Site index · List index
Message view « Date » · « Thread »
Top « Date » · « Thread »
From Policeman Jenkins Server <jenk...@thetaphi.de>
Subject [JENKINS] Lucene-Solr-6.x-Linux (64bit/jdk1.8.0_92) - Build # 512 - Failure!
Date Wed, 27 Apr 2016 21:42:43 GMT
Build: http://jenkins.thetaphi.de/job/Lucene-Solr-6.x-Linux/512/
Java: 64bit/jdk1.8.0_92 -XX:-UseCompressedOops -XX:+UseParallelGC

2 tests failed.
FAILED:  org.apache.solr.cloud.CollectionsAPIDistributedZkTest.test

Error Message:
Captured an uncaught exception in thread: Thread[id=4682, name=collection0, state=RUNNABLE, group=TGRP-CollectionsAPIDistributedZkTest]

Stack Trace:
com.carrotsearch.randomizedtesting.UncaughtExceptionError: Captured an uncaught exception in thread: Thread[id=4682, name=collection0, state=RUNNABLE, group=TGRP-CollectionsAPIDistributedZkTest]
	at __randomizedtesting.SeedInfo.seed([DA339391C3A8918:85F706E3B2C6E4E0]:0)
Caused by: org.apache.solr.client.solrj.impl.HttpSolrClient$RemoteSolrException: Error from server at http://127.0.0.1:42980: collection already exists: awholynewstresscollection_collection0_0
	at __randomizedtesting.SeedInfo.seed([DA339391C3A8918]:0)
	at org.apache.solr.client.solrj.impl.HttpSolrClient.executeMethod(HttpSolrClient.java:590)
	at org.apache.solr.client.solrj.impl.HttpSolrClient.request(HttpSolrClient.java:259)
	at org.apache.solr.client.solrj.impl.HttpSolrClient.request(HttpSolrClient.java:248)
	at org.apache.solr.client.solrj.impl.LBHttpSolrClient.doRequest(LBHttpSolrClient.java:404)
	at org.apache.solr.client.solrj.impl.LBHttpSolrClient.request(LBHttpSolrClient.java:357)
	at org.apache.solr.client.solrj.impl.CloudSolrClient.sendRequest(CloudSolrClient.java:1192)
	at org.apache.solr.client.solrj.impl.CloudSolrClient.requestWithRetryOnStaleState(CloudSolrClient.java:962)
	at org.apache.solr.client.solrj.impl.CloudSolrClient.request(CloudSolrClient.java:898)
	at org.apache.solr.client.solrj.SolrClient.request(SolrClient.java:1219)
	at org.apache.solr.cloud.AbstractFullDistribZkTestBase.createCollection(AbstractFullDistribZkTestBase.java:1595)
	at org.apache.solr.cloud.AbstractFullDistribZkTestBase.createCollection(AbstractFullDistribZkTestBase.java:1616)
	at org.apache.solr.cloud.CollectionsAPIDistributedZkTest$1CollectionThread.run(CollectionsAPIDistributedZkTest.java:987)


FAILED:  org.apache.solr.handler.TestReplicationHandlerBackup.doTestBackup

Error Message:
expected:<1> but was:<2>

Stack Trace:
java.lang.AssertionError: expected:<1> but was:<2>
	at __randomizedtesting.SeedInfo.seed([DA339391C3A8918:4C28195C3B847A57]:0)
	at org.junit.Assert.fail(Assert.java:93)
	at org.junit.Assert.failNotEquals(Assert.java:647)
	at org.junit.Assert.assertEquals(Assert.java:128)
	at org.junit.Assert.assertEquals(Assert.java:472)
	at org.junit.Assert.assertEquals(Assert.java:456)
	at org.apache.solr.handler.TestReplicationHandlerBackup.doTestBackup(TestReplicationHandlerBackup.java:245)
	at sun.reflect.NativeMethodAccessorImpl.invoke0(Native Method)
	at sun.reflect.NativeMethodAccessorImpl.invoke(NativeMethodAccessorImpl.java:62)
	at sun.reflect.DelegatingMethodAccessorImpl.invoke(DelegatingMethodAccessorImpl.java:43)
	at java.lang.reflect.Method.invoke(Method.java:498)
	at com.carrotsearch.randomizedtesting.RandomizedRunner.invoke(RandomizedRunner.java:1764)
	at com.carrotsearch.randomizedtesting.RandomizedRunner$8.evaluate(RandomizedRunner.java:871)
	at com.carrotsearch.randomizedtesting.RandomizedRunner$9.evaluate(RandomizedRunner.java:907)
	at com.carrotsearch.randomizedtesting.RandomizedRunner$10.evaluate(RandomizedRunner.java:921)
	at com.carrotsearch.randomizedtesting.rules.SystemPropertiesRestoreRule$1.evaluate(SystemPropertiesRestoreRule.java:57)
	at org.apache.lucene.util.TestRuleSetupTeardownChained$1.evaluate(TestRuleSetupTeardownChained.java:49)
	at org.apache.lucene.util.AbstractBeforeAfterRule$1.evaluate(AbstractBeforeAfterRule.java:45)
	at org.apache.lucene.util.TestRuleThreadAndTestName$1.evaluate(TestRuleThreadAndTestName.java:48)
	at org.apache.lucene.util.TestRuleIgnoreAfterMaxFailures$1.evaluate(TestRuleIgnoreAfterMaxFailures.java:64)
	at org.apache.lucene.util.TestRuleMarkFailure$1.evaluate(TestRuleMarkFailure.java:47)
	at com.carrotsearch.randomizedtesting.rules.StatementAdapter.evaluate(StatementAdapter.java:36)
	at com.carrotsearch.randomizedtesting.ThreadLeakControl$StatementRunner.run(ThreadLeakControl.java:367)
	at com.carrotsearch.randomizedtesting.ThreadLeakControl.forkTimeoutingTask(ThreadLeakControl.java:809)
	at com.carrotsearch.randomizedtesting.ThreadLeakControl$3.evaluate(ThreadLeakControl.java:460)
	at com.carrotsearch.randomizedtesting.RandomizedRunner.runSingleTest(RandomizedRunner.java:880)
	at com.carrotsearch.randomizedtesting.RandomizedRunner$5.evaluate(RandomizedRunner.java:781)
	at com.carrotsearch.randomizedtesting.RandomizedRunner$6.evaluate(RandomizedRunner.java:816)
	at com.carrotsearch.randomizedtesting.RandomizedRunner$7.evaluate(RandomizedRunner.java:827)
	at com.carrotsearch.randomizedtesting.rules.StatementAdapter.evaluate(StatementAdapter.java:36)
	at com.carrotsearch.randomizedtesting.rules.SystemPropertiesRestoreRule$1.evaluate(SystemPropertiesRestoreRule.java:57)
	at org.apache.lucene.util.AbstractBeforeAfterRule$1.evaluate(AbstractBeforeAfterRule.java:45)
	at com.carrotsearch.randomizedtesting.rules.StatementAdapter.evaluate(StatementAdapter.java:36)
	at org.apache.lucene.util.TestRuleStoreClassName$1.evaluate(TestRuleStoreClassName.java:41)
	at com.carrotsearch.randomizedtesting.rules.NoShadowingOrOverridesOnMethodsRule$1.evaluate(NoShadowingOrOverridesOnMethodsRule.java:40)
	at com.carrotsearch.randomizedtesting.rules.NoShadowingOrOverridesOnMethodsRule$1.evaluate(NoShadowingOrOverridesOnMethodsRule.java:40)
	at com.carrotsearch.randomizedtesting.rules.StatementAdapter.evaluate(StatementAdapter.java:36)
	at com.carrotsearch.randomizedtesting.rules.StatementAdapter.evaluate(StatementAdapter.java:36)
	at com.carrotsearch.randomizedtesting.rules.StatementAdapter.evaluate(StatementAdapter.java:36)
	at org.apache.lucene.util.TestRuleAssertionsRequired$1.evaluate(TestRuleAssertionsRequired.java:53)
	at org.apache.lucene.util.TestRuleMarkFailure$1.evaluate(TestRuleMarkFailure.java:47)
	at org.apache.lucene.util.TestRuleIgnoreAfterMaxFailures$1.evaluate(TestRuleIgnoreAfterMaxFailures.java:64)
	at org.apache.lucene.util.TestRuleIgnoreTestSuites$1.evaluate(TestRuleIgnoreTestSuites.java:54)
	at com.carrotsearch.randomizedtesting.rules.StatementAdapter.evaluate(StatementAdapter.java:36)
	at com.carrotsearch.randomizedtesting.ThreadLeakControl$StatementRunner.run(ThreadLeakControl.java:367)
	at java.lang.Thread.run(Thread.java:745)




Build Log:
[...truncated 11138 lines...]
   [junit4] Suite: org.apache.solr.handler.TestReplicationHandlerBackup
   [junit4]   2> Creating dataDir: /home/jenkins/workspace/Lucene-Solr-6.x-Linux/solr/build/solr-core/test/J2/temp/solr.handler.TestReplicationHandlerBackup_DA339391C3A8918-001/init-core-data-001
   [junit4]   2> 664211 INFO  (TEST-TestReplicationHandlerBackup.doTestBackup-seed#[DA339391C3A8918]) [    ] o.a.s.SolrTestCaseJ4 ###Starting doTestBackup
   [junit4]   2> 664211 INFO  (TEST-TestReplicationHandlerBackup.doTestBackup-seed#[DA339391C3A8918]) [    ] o.a.s.SolrTestCaseJ4 Writing core.properties file to /home/jenkins/workspace/Lucene-Solr-6.x-Linux/solr/build/solr-core/test/J2/temp/solr.handler.TestReplicationHandlerBackup_DA339391C3A8918-001/solr-instance-001/collection1
   [junit4]   2> 664234 INFO  (TEST-TestReplicationHandlerBackup.doTestBackup-seed#[DA339391C3A8918]) [    ] o.e.j.s.Server jetty-9.3.8.v20160314
   [junit4]   2> 664235 INFO  (TEST-TestReplicationHandlerBackup.doTestBackup-seed#[DA339391C3A8918]) [    ] o.e.j.s.h.ContextHandler Started o.e.j.s.ServletContextHandler@6a62fdcb{/solr,null,AVAILABLE}
   [junit4]   2> 664235 INFO  (TEST-TestReplicationHandlerBackup.doTestBackup-seed#[DA339391C3A8918]) [    ] o.e.j.s.ServerConnector Started ServerConnector@38cff6c8{HTTP/1.1,[http/1.1]}{127.0.0.1:43101}
   [junit4]   2> 664236 INFO  (TEST-TestReplicationHandlerBackup.doTestBackup-seed#[DA339391C3A8918]) [    ] o.e.j.s.Server Started @665794ms
   [junit4]   2> 664236 INFO  (TEST-TestReplicationHandlerBackup.doTestBackup-seed#[DA339391C3A8918]) [    ] o.a.s.c.s.e.JettySolrRunner Jetty properties: {solr.data.dir=/home/jenkins/workspace/Lucene-Solr-6.x-Linux/solr/build/solr-core/test/J2/temp/solr.handler.TestReplicationHandlerBackup_DA339391C3A8918-001/solr-instance-001/collection1/data, hostContext=/solr, hostPort=43101}
   [junit4]   2> 664236 INFO  (TEST-TestReplicationHandlerBackup.doTestBackup-seed#[DA339391C3A8918]) [    ] o.a.s.s.SolrDispatchFilter SolrDispatchFilter.init(): sun.misc.Launcher$AppClassLoader@73d16e93
   [junit4]   2> 664236 INFO  (TEST-TestReplicationHandlerBackup.doTestBackup-seed#[DA339391C3A8918]) [    ] o.a.s.c.SolrResourceLoader new SolrResourceLoader for directory: '/home/jenkins/workspace/Lucene-Solr-6.x-Linux/solr/build/solr-core/test/J2/temp/solr.handler.TestReplicationHandlerBackup_DA339391C3A8918-001/solr-instance-001'
   [junit4]   2> 664236 INFO  (TEST-TestReplicationHandlerBackup.doTestBackup-seed#[DA339391C3A8918]) [    ] o.a.s.c.SolrResourceLoader JNDI not configured for solr (NoInitialContextEx)
   [junit4]   2> 664236 INFO  (TEST-TestReplicationHandlerBackup.doTestBackup-seed#[DA339391C3A8918]) [    ] o.a.s.c.SolrResourceLoader solr home defaulted to 'solr/' (could not find system property or JNDI)
   [junit4]   2> 664236 INFO  (TEST-TestReplicationHandlerBackup.doTestBackup-seed#[DA339391C3A8918]) [    ] o.a.s.c.SolrXmlConfig Loading container configuration from /home/jenkins/workspace/Lucene-Solr-6.x-Linux/solr/build/solr-core/test/J2/temp/solr.handler.TestReplicationHandlerBackup_DA339391C3A8918-001/solr-instance-001/solr.xml
   [junit4]   2> 664240 INFO  (TEST-TestReplicationHandlerBackup.doTestBackup-seed#[DA339391C3A8918]) [    ] o.a.s.c.CorePropertiesLocator Config-defined core root directory: /home/jenkins/workspace/Lucene-Solr-6.x-Linux/solr/build/solr-core/test/J2/temp/solr.handler.TestReplicationHandlerBackup_DA339391C3A8918-001/solr-instance-001/.
   [junit4]   2> 664241 INFO  (TEST-TestReplicationHandlerBackup.doTestBackup-seed#[DA339391C3A8918]) [    ] o.a.s.c.CoreContainer New CoreContainer 1840965807
   [junit4]   2> 664241 INFO  (TEST-TestReplicationHandlerBackup.doTestBackup-seed#[DA339391C3A8918]) [    ] o.a.s.c.CoreContainer Loading cores into CoreContainer [instanceDir=/home/jenkins/workspace/Lucene-Solr-6.x-Linux/solr/build/solr-core/test/J2/temp/solr.handler.TestReplicationHandlerBackup_DA339391C3A8918-001/solr-instance-001]
   [junit4]   2> 664241 WARN  (TEST-TestReplicationHandlerBackup.doTestBackup-seed#[DA339391C3A8918]) [    ] o.a.s.c.CoreContainer Couldn't add files from /home/jenkins/workspace/Lucene-Solr-6.x-Linux/solr/build/solr-core/test/J2/temp/solr.handler.TestReplicationHandlerBackup_DA339391C3A8918-001/solr-instance-001/lib to classpath: /home/jenkins/workspace/Lucene-Solr-6.x-Linux/solr/build/solr-core/test/J2/temp/solr.handler.TestReplicationHandlerBackup_DA339391C3A8918-001/solr-instance-001/lib
   [junit4]   2> 664241 INFO  (TEST-TestReplicationHandlerBackup.doTestBackup-seed#[DA339391C3A8918]) [    ] o.a.s.h.c.HttpShardHandlerFactory created with socketTimeout : 90000,urlScheme : ,connTimeout : 15000,maxConnectionsPerHost : 20,maxConnections : 10000,corePoolSize : 0,maximumPoolSize : 2147483647,maxThreadIdleTime : 5,sizeOfQueue : -1,fairnessPolicy : false,useRetries : false,
   [junit4]   2> 664242 INFO  (TEST-TestReplicationHandlerBackup.doTestBackup-seed#[DA339391C3A8918]) [    ] o.a.s.u.UpdateShardHandler Creating UpdateShardHandler HTTP client with params: socketTimeout=340000&connTimeout=45000&retry=true
   [junit4]   2> 664242 INFO  (TEST-TestReplicationHandlerBackup.doTestBackup-seed#[DA339391C3A8918]) [    ] o.a.s.l.LogWatcher SLF4J impl is org.slf4j.impl.Log4jLoggerFactory
   [junit4]   2> 664242 INFO  (TEST-TestReplicationHandlerBackup.doTestBackup-seed#[DA339391C3A8918]) [    ] o.a.s.l.LogWatcher Registering Log Listener [Log4j (org.slf4j.impl.Log4jLoggerFactory)]
   [junit4]   2> 664242 INFO  (TEST-TestReplicationHandlerBackup.doTestBackup-seed#[DA339391C3A8918]) [    ] o.a.s.c.CoreContainer Security conf doesn't exist. Skipping setup for authorization module.
   [junit4]   2> 664242 INFO  (TEST-TestReplicationHandlerBackup.doTestBackup-seed#[DA339391C3A8918]) [    ] o.a.s.c.CoreContainer No authentication plugin used.
   [junit4]   2> 664243 INFO  (TEST-TestReplicationHandlerBackup.doTestBackup-seed#[DA339391C3A8918]) [    ] o.a.s.c.CorePropertiesLocator Looking for core definitions underneath /home/jenkins/workspace/Lucene-Solr-6.x-Linux/solr/build/solr-core/test/J2/temp/solr.handler.TestReplicationHandlerBackup_DA339391C3A8918-001/solr-instance-001/.
   [junit4]   2> 664243 INFO  (TEST-TestReplicationHandlerBackup.doTestBackup-seed#[DA339391C3A8918]) [    ] o.a.s.c.CoreDescriptor Created CoreDescriptor: {name=collection1, config=solrconfig.xml, loadOnStartup=true, schema=schema.xml, configSetProperties=configsetprops.json, transient=false, dataDir=data/}
   [junit4]   2> 664243 INFO  (TEST-TestReplicationHandlerBackup.doTestBackup-seed#[DA339391C3A8918]) [    ] o.a.s.c.CorePropertiesLocator Found core collection1 in /home/jenkins/workspace/Lucene-Solr-6.x-Linux/solr/build/solr-core/test/J2/temp/solr.handler.TestReplicationHandlerBackup_DA339391C3A8918-001/solr-instance-001/./collection1
   [junit4]   2> 664243 INFO  (TEST-TestReplicationHandlerBackup.doTestBackup-seed#[DA339391C3A8918]) [    ] o.a.s.c.CorePropertiesLocator Found 1 core definitions
   [junit4]   2> 664246 INFO  (TEST-TestReplicationHandlerBackup.doTestBackup-seed#[DA339391C3A8918]) [    ] o.a.s.s.SolrDispatchFilter user.dir=/home/jenkins/workspace/Lucene-Solr-6.x-Linux/solr/build/solr-core/test/J2
   [junit4]   2> 664246 INFO  (TEST-TestReplicationHandlerBackup.doTestBackup-seed#[DA339391C3A8918]) [    ] o.a.s.s.SolrDispatchFilter SolrDispatchFilter.init() done
   [junit4]   2> 664247 INFO  (coreLoadExecutor-2724-thread-1) [    ] o.a.s.c.SolrResourceLoader new SolrResourceLoader for directory: '/home/jenkins/workspace/Lucene-Solr-6.x-Linux/solr/build/solr-core/test/J2/temp/solr.handler.TestReplicationHandlerBackup_DA339391C3A8918-001/solr-instance-001/collection1'
   [junit4]   2> 664247 INFO  (coreLoadExecutor-2724-thread-1) [    ] o.a.s.c.SolrResourceLoader JNDI not configured for solr (NoInitialContextEx)
   [junit4]   2> 664247 INFO  (coreLoadExecutor-2724-thread-1) [    ] o.a.s.c.SolrResourceLoader solr home defaulted to 'solr/' (could not find system property or JNDI)
   [junit4]   2> 664252 INFO  (coreLoadExecutor-2724-thread-1) [    ] o.a.s.c.SolrConfig current version of requestparams : -1
   [junit4]   2> 664253 WARN  (coreLoadExecutor-2724-thread-1) [    ] o.a.s.c.Config Beginning with Solr 5.5, <mergePolicy> is deprecated, use <mergePolicyFactory> instead.
   [junit4]   2> 664254 INFO  (coreLoadExecutor-2724-thread-1) [    ] o.a.s.c.SolrConfig Using Lucene MatchVersion: 6.1.0
   [junit4]   2> 664258 INFO  (coreLoadExecutor-2724-thread-1) [    ] o.a.s.c.SolrConfig Loaded SolrConfig: solrconfig.xml
   [junit4]   2> 664260 INFO  (coreLoadExecutor-2724-thread-1) [    ] o.a.s.s.IndexSchema [collection1] Schema name=test
   [junit4]   2> 664261 INFO  (coreLoadExecutor-2724-thread-1) [    ] o.a.s.s.IndexSchema unique key field: id
   [junit4]   2> 664263 INFO  (coreLoadExecutor-2724-thread-1) [    ] o.a.s.c.ConfigSetProperties Did not find ConfigSet properties, assuming default properties: Can't find resource 'configsetprops.json' in classpath or '/home/jenkins/workspace/Lucene-Solr-6.x-Linux/solr/build/solr-core/test/J2/temp/solr.handler.TestReplicationHandlerBackup_DA339391C3A8918-001/solr-instance-001/collection1'
   [junit4]   2> 664263 INFO  (coreLoadExecutor-2724-thread-1) [    ] o.a.s.c.CoreContainer Creating SolrCore 'collection1' using configuration from instancedir /home/jenkins/workspace/Lucene-Solr-6.x-Linux/solr/build/solr-core/test/J2/temp/solr.handler.TestReplicationHandlerBackup_DA339391C3A8918-001/solr-instance-001/./collection1
   [junit4]   2> 664263 INFO  (coreLoadExecutor-2724-thread-1) [    x:collection1] o.a.s.c.SolrCore org.apache.solr.core.MockDirectoryFactory
   [junit4]   2> 664263 INFO  (coreLoadExecutor-2724-thread-1) [    x:collection1] o.a.s.c.SolrCore [[collection1] ] Opening new SolrCore at [/home/jenkins/workspace/Lucene-Solr-6.x-Linux/solr/build/solr-core/test/J2/temp/solr.handler.TestReplicationHandlerBackup_DA339391C3A8918-001/solr-instance-001/collection1], dataDir=[/home/jenkins/workspace/Lucene-Solr-6.x-Linux/solr/build/solr-core/test/J2/temp/solr.handler.TestReplicationHandlerBackup_DA339391C3A8918-001/solr-instance-001/./collection1/data/]
   [junit4]   2> 664263 INFO  (coreLoadExecutor-2724-thread-1) [    x:collection1] o.a.s.c.SolrCore JMX monitoring not detected for core: collection1
   [junit4]   2> 664263 INFO  (coreLoadExecutor-2724-thread-1) [    x:collection1] o.a.s.c.CachingDirectoryFactory return new directory for /home/jenkins/workspace/Lucene-Solr-6.x-Linux/solr/build/solr-core/test/J2/temp/solr.handler.TestReplicationHandlerBackup_DA339391C3A8918-001/solr-instance-001/./collection1/data
   [junit4]   2> 664264 INFO  (coreLoadExecutor-2724-thread-1) [    x:collection1] o.a.s.c.SolrCore New index directory detected: old=null new=/home/jenkins/workspace/Lucene-Solr-6.x-Linux/solr/build/solr-core/test/J2/temp/solr.handler.TestReplicationHandlerBackup_DA339391C3A8918-001/solr-instance-001/./collection1/data/index/
   [junit4]   2> 664264 WARN  (coreLoadExecutor-2724-thread-1) [    x:collection1] o.a.s.c.SolrCore [collection1] Solr index directory '/home/jenkins/workspace/Lucene-Solr-6.x-Linux/solr/build/solr-core/test/J2/temp/solr.handler.TestReplicationHandlerBackup_DA339391C3A8918-001/solr-instance-001/./collection1/data/index' doesn't exist. Creating new index...
   [junit4]   2> 664264 INFO  (coreLoadExecutor-2724-thread-1) [    x:collection1] o.a.s.c.CachingDirectoryFactory return new directory for /home/jenkins/workspace/Lucene-Solr-6.x-Linux/solr/build/solr-core/test/J2/temp/solr.handler.TestReplicationHandlerBackup_DA339391C3A8918-001/solr-instance-001/./collection1/data/index
   [junit4]   2> 664264 INFO  (coreLoadExecutor-2724-thread-1) [    x:collection1] o.a.s.u.RandomMergePolicy RandomMergePolicy wrapping class org.apache.lucene.index.TieredMergePolicy: [TieredMergePolicy: maxMergeAtOnce=22, maxMergeAtOnceExplicit=12, maxMergedSegmentMB=52.248046875, floorSegmentMB=0.3125, forceMergeDeletesPctAllowed=9.99064720514027, segmentsPerTier=19.0, maxCFSSegmentSizeMB=8.796093022207999E12, noCFSRatio=1.0
   [junit4]   2> 664264 INFO  (coreLoadExecutor-2724-thread-1) [    x:collection1] o.a.s.c.SolrDeletionPolicy SolrDeletionPolicy.onCommit: commits: num=1
   [junit4]   2> 	commit{dir=MockDirectoryWrapper(RAMDirectory@2d83621 lockFactory=org.apache.lucene.store.SingleInstanceLockFactory@463d9cd4),segFN=segments_1,generation=1}
   [junit4]   2> 664264 INFO  (coreLoadExecutor-2724-thread-1) [    x:collection1] o.a.s.c.SolrDeletionPolicy newest commit generation = 1
   [junit4]   2> 664265 INFO  (OldIndexDirectoryCleanupThreadForCore-collection1) [    x:collection1] o.a.s.c.SolrCore Looking for old index directories to cleanup for core collection1 in /home/jenkins/workspace/Lucene-Solr-6.x-Linux/solr/build/solr-core/test/J2/temp/solr.handler.TestReplicationHandlerBackup_DA339391C3A8918-001/solr-instance-001/./collection1/data/
   [junit4]   2> 664265 INFO  (coreLoadExecutor-2724-thread-1) [    x:collection1] o.a.s.c.SolrCore no updateRequestProcessorChain defined as default, creating implicit default
   [junit4]   2> 664266 INFO  (coreLoadExecutor-2724-thread-1) [    x:collection1] o.a.s.h.l.XMLLoader xsltCacheLifetimeSeconds=60
   [junit4]   2> 664267 INFO  (coreLoadExecutor-2724-thread-1) [    x:collection1] o.a.s.h.l.XMLLoader xsltCacheLifetimeSeconds=60
   [junit4]   2> 664267 INFO  (coreLoadExecutor-2724-thread-1) [    x:collection1] o.a.s.h.l.XMLLoader xsltCacheLifetimeSeconds=60
   [junit4]   2> 664268 INFO  (coreLoadExecutor-2724-thread-1) [    x:collection1] o.a.s.h.l.XMLLoader xsltCacheLifetimeSeconds=60
   [junit4]   2> 664268 INFO  (coreLoadExecutor-2724-thread-1) [    x:collection1] o.a.s.c.RequestHandlers Registered paths: /admin/mbeans,standard,/update/csv,/sql,/update/json/docs,/admin/luke,/export,/admin/segments,/get,/admin/system,/replication,/admin/properties,/config,/stream,/schema,/admin/plugins,/admin/logging,/update/json,/admin/ping,/admin/threads,/update,/admin/file
   [junit4]   2> 664268 INFO  (coreLoadExecutor-2724-thread-1) [    x:collection1] o.a.s.c.SolrCore Using default statsCache cache: org.apache.solr.search.stats.LocalStatsCache
   [junit4]   2> 664268 INFO  (coreLoadExecutor-2724-thread-1) [    x:collection1] o.a.s.u.CommitTracker Hard AutoCommit: disabled
   [junit4]   2> 664268 INFO  (coreLoadExecutor-2724-thread-1) [    x:collection1] o.a.s.u.CommitTracker Soft AutoCommit: disabled
   [junit4]   2> 664269 INFO  (coreLoadExecutor-2724-thread-1) [    x:collection1] o.a.s.u.RandomMergePolicy RandomMergePolicy wrapping class org.apache.lucene.index.LogDocMergePolicy: [LogDocMergePolicy: minMergeSize=1000, mergeFactor=49, maxMergeSize=9223372036854775807, maxMergeSizeForForcedMerge=9223372036854775807, calibrateSizeByDeletes=true, maxMergeDocs=2147483647, maxCFSSegmentSizeMB=8.796093022207999E12, noCFSRatio=0.7700990369179636]
   [junit4]   2> 664269 INFO  (coreLoadExecutor-2724-thread-1) [    x:collection1] o.a.s.c.SolrDeletionPolicy SolrDeletionPolicy.onInit: commits: num=1
   [junit4]   2> 	commit{dir=MockDirectoryWrapper(RAMDirectory@2d83621 lockFactory=org.apache.lucene.store.SingleInstanceLockFactory@463d9cd4),segFN=segments_1,generation=1}
   [junit4]   2> 664269 INFO  (coreLoadExecutor-2724-thread-1) [    x:collection1] o.a.s.c.SolrDeletionPolicy newest commit generation = 1
   [junit4]   2> 664269 INFO  (coreLoadExecutor-2724-thread-1) [    x:collection1] o.a.s.s.SolrIndexSearcher Opening [Searcher@7c6019be[collection1] main]
   [junit4]   2> 664269 INFO  (coreLoadExecutor-2724-thread-1) [    x:collection1] o.a.s.r.ManagedResourceStorage File-based storage initialized to use dir: /home/jenkins/workspace/Lucene-Solr-6.x-Linux/solr/build/solr-core/test/J2/temp/solr.handler.TestReplicationHandlerBackup_DA339391C3A8918-001/solr-instance-001/collection1/conf
   [junit4]   2> 664269 INFO  (coreLoadExecutor-2724-thread-1) [    x:collection1] o.a.s.r.RestManager Initializing RestManager with initArgs: {storageDir=/home/jenkins/workspace/Lucene-Solr-6.x-Linux/solr/build/solr-core/test/J2/temp/solr.handler.TestReplicationHandlerBackup_DA339391C3A8918-001/solr-instance-001/collection1/conf}
   [junit4]   2> 664269 INFO  (coreLoadExecutor-2724-thread-1) [    x:collection1] o.a.s.r.ManagedResourceStorage Reading _rest_managed.json using file:dir=/home/jenkins/workspace/Lucene-Solr-6.x-Linux/solr/build/solr-core/test/J2/temp/solr.handler.TestReplicationHandlerBackup_DA339391C3A8918-001/solr-instance-001/collection1/conf
   [junit4]   2> 664269 INFO  (coreLoadExecutor-2724-thread-1) [    x:collection1] o.a.s.r.RestManager Initializing 0 registered ManagedResources
   [junit4]   2> 664269 INFO  (coreLoadExecutor-2724-thread-1) [    x:collection1] o.a.s.h.ReplicationHandler Replication enabled for following config files: schema-replication2.xml:schema.xml
   [junit4]   2> 664270 INFO  (coreLoadExecutor-2724-thread-1) [    x:collection1] o.a.s.h.ReplicationHandler Commits will be reserved for  10000
   [junit4]   2> 664270 INFO  (searcherExecutor-2725-thread-1-processing-x:collection1) [    x:collection1] o.a.s.c.SolrCore [collection1] Registered new searcher Searcher@7c6019be[collection1] main{ExitableDirectoryReader(UninvertingDirectoryReader())}
   [junit4]   2> 664270 INFO  (coreLoadExecutor-2724-thread-1) [    x:collection1] o.a.s.c.CoreContainer registering core: collection1
   [junit4]   2> 664752 INFO  (qtp1045902544-5670) [    x:collection1] o.a.s.u.DirectUpdateHandler2 [collection1] REMOVING ALL DOCUMENTS FROM INDEX
   [junit4]   2> 664752 INFO  (qtp1045902544-5670) [    x:collection1] o.a.s.u.p.LogUpdateProcessorFactory [collection1]  webapp=/solr path=/update params={wt=javabin&version=2}{deleteByQuery=*:*} 0 0
   [junit4]   2> 664755 INFO  (qtp1045902544-5665) [    x:collection1] o.a.s.u.p.LogUpdateProcessorFactory [collection1]  webapp=/solr path=/update params={wt=javabin&version=2}{add=[0]} 0 1
   [junit4]   2> 664757 INFO  (qtp1045902544-5672) [    x:collection1] o.a.s.u.p.LogUpdateProcessorFactory [collection1]  webapp=/solr path=/update params={wt=javabin&version=2}{add=[1]} 0 0
   [junit4]   2> 664758 INFO  (qtp1045902544-5672) [    x:collection1] o.a.s.u.p.LogUpdateProcessorFactory [collection1]  webapp=/solr path=/update params={wt=javabin&version=2}{add=[2]} 0 0
   [junit4]   2> 664760 INFO  (qtp1045902544-5670) [    x:collection1] o.a.s.u.p.LogUpdateProcessorFactory [collection1]  webapp=/solr path=/update params={wt=javabin&version=2}{add=[3]} 0 0
   [junit4]   2> 664762 INFO  (qtp1045902544-5665) [    x:collection1] o.a.s.u.p.LogUpdateProcessorFactory [collection1]  webapp=/solr path=/update params={wt=javabin&version=2}{add=[4]} 0 0
   [junit4]   2> 664764 INFO  (qtp1045902544-5671) [    x:collection1] o.a.s.u.p.LogUpdateProcessorFactory [collection1]  webapp=/solr path=/update params={wt=javabin&version=2}{add=[5]} 0 0
   [junit4]   2> 664765 INFO  (qtp1045902544-5671) [    x:collection1] o.a.s.u.p.LogUpdateProcessorFactory [collection1]  webapp=/solr path=/update params={wt=javabin&version=2}{add=[6]} 0 0
   [junit4]   2> 664767 INFO  (qtp1045902544-5670) [    x:collection1] o.a.s.u.p.LogUpdateProcessorFactory [collection1]  webapp=/solr path=/update params={wt=javabin&version=2}{add=[7]} 0 0
   [junit4]   2> 664768 INFO  (qtp1045902544-5665) [    x:collection1] o.a.s.u.p.LogUpdateProcessorFactory [collection1]  webapp=/solr path=/update params={wt=javabin&version=2}{add=[8]} 0 0
   [junit4]   2> 664770 INFO  (qtp1045902544-5672) [    x:collection1] o.a.s.u.p.LogUpdateProcessorFactory [collection1]  webapp=/solr path=/update params={wt=javabin&version=2}{add=[9]} 0 0
   [junit4]   2> 664772 INFO  (qtp1045902544-5672) [    x:collection1] o.a.s.u.DirectUpdateHandler2 start commit{,optimize=false,openSearcher=true,waitSearcher=true,expungeDeletes=false,softCommit=false,prepareCommit=false}
   [junit4]   2> 664775 INFO  (qtp1045902544-5672) [    x:collection1] o.a.s.c.SolrDeletionPolicy SolrDeletionPolicy.onCommit: commits: num=2
   [junit4]   2> 	commit{dir=MockDirectoryWrapper(RAMDirectory@2d83621 lockFactory=org.apache.lucene.store.SingleInstanceLockFactory@463d9cd4),segFN=segments_1,generation=1}
   [junit4]   2> 	commit{dir=MockDirectoryWrapper(RAMDirectory@2d83621 lockFactory=org.apache.lucene.store.SingleInstanceLockFactory@463d9cd4),segFN=segments_2,generation=2}
   [junit4]   2> 664775 INFO  (qtp1045902544-5672) [    x:collection1] o.a.s.c.SolrDeletionPolicy newest commit generation = 2
   [junit4]   2> 664779 INFO  (Thread-2160) [    x:collection1] o.a.s.h.SnapShooter Creating backup snapshot <not named> at /home/jenkins/workspace/Lucene-Solr-6.x-Linux/solr/build/solr-core/test/J2/temp/solr.handler.TestReplicationHandlerBackup_DA339391C3A8918-001/solr-instance-001/./collection1/data/
   [junit4]   2> 664779 INFO  (qtp1045902544-5672) [    x:collection1] o.a.s.s.SolrIndexSearcher Opening [Searcher@2726effd[collection1] main]
   [junit4]   2> 664780 INFO  (qtp1045902544-5672) [    x:collection1] o.a.s.u.DirectUpdateHandler2 end_commit_flush
   [junit4]   2> 664780 INFO  (searcherExecutor-2725-thread-1-processing-x:collection1) [    x:collection1] o.a.s.c.SolrCore [collection1] Registered new searcher Searcher@2726effd[collection1] main{ExitableDirectoryReader(UninvertingDirectoryReader(Uninverting(_0(6.1.0):c10)))}
   [junit4]   2> 664780 INFO  (qtp1045902544-5672) [    x:collection1] o.a.s.u.p.LogUpdateProcessorFactory [collection1]  webapp=/solr path=/update params={waitSearcher=true&commit=true&softCommit=false&wt=javabin&version=2}{commit=} 0 8
   [junit4]   2> 664780 INFO  (Thread-2160) [    x:collection1] o.a.s.h.SnapShooter Done creating backup snapshot: <not named> at /home/jenkins/workspace/Lucene-Solr-6.x-Linux/solr/build/solr-core/test/J2/temp/solr.handler.TestReplicationHandlerBackup_DA339391C3A8918-001/solr-instance-001/./collection1/data/
   [junit4]   2> 664801 INFO  (qtp1045902544-5665) [    x:collection1] o.a.s.c.S.Request [collection1]  webapp=/solr path=/replication params={command=backup} status=0 QTime=0
   [junit4]   2> 664801 INFO  (Thread-2161) [    x:collection1] o.a.s.h.SnapShooter Creating backup snapshot <not named> at /home/jenkins/workspace/Lucene-Solr-6.x-Linux/solr/build/solr-core/test/J2/temp/solr.handler.TestReplicationHandlerBackup_DA339391C3A8918-001/solr-instance-001/./collection1/data/
   [junit4]   2> 664805 INFO  (Thread-2161) [    x:collection1] o.a.s.h.SnapShooter Done creating backup snapshot: <not named> at /home/jenkins/workspace/Lucene-Solr-6.x-Linux/solr/build/solr-core/test/J2/temp/solr.handler.TestReplicationHandlerBackup_DA339391C3A8918-001/solr-instance-001/./collection1/data/
   [junit4]   2> 664816 INFO  (qtp1045902544-5670) [    x:collection1] o.a.s.c.S.Request [collection1]  webapp=/solr path=/replication params={command=details} status=0 QTime=0
   [junit4]   2> 665820 INFO  (qtp1045902544-5671) [    x:collection1] o.a.s.c.S.Request [collection1]  webapp=/solr path=/replication params={command=backup} status=0 QTime=0
   [junit4]   2> 665820 INFO  (Thread-2162) [    x:collection1] o.a.s.h.SnapShooter Creating backup snapshot <not named> at /home/jenkins/workspace/Lucene-Solr-6.x-Linux/solr/build/solr-core/test/J2/temp/solr.handler.TestReplicationHandlerBackup_DA339391C3A8918-001/solr-instance-001/./collection1/data/
   [junit4]   2> 665821 INFO  (Thread-2162) [    x:collection1] o.a.s.h.SnapShooter Done creating backup snapshot: <not named> at /home/jenkins/workspace/Lucene-Solr-6.x-Linux/solr/build/solr-core/test/J2/temp/solr.handler.TestReplicationHandlerBackup_DA339391C3A8918-001/solr-instance-001/./collection1/data/
   [junit4]   2> 665822 INFO  (qtp1045902544-5672) [    x:collection1] o.a.s.c.S.Request [collection1]  webapp=/solr path=/replication params={command=details} status=0 QTime=0
   [junit4]   2> 666825 INFO  (qtp1045902544-5667) [    x:collection1] o.a.s.c.S.Request [collection1]  webapp=/solr path=/replication params={command=backup} status=0 QTime=0
   [junit4]   2> 666825 INFO  (Thread-2163) [    x:collection1] o.a.s.h.SnapShooter Creating backup snapshot <not named> at /home/jenkins/workspace/Lucene-Solr-6.x-Linux/solr/build/solr-core/test/J2/temp/solr.handler.TestReplicationHandlerBackup_DA339391C3A8918-001/solr-instance-001/./collection1/data/
   [junit4]   2> 666826 INFO  (Thread-2163) [    x:collection1] o.a.s.h.SnapShooter Done creating backup snapshot: <not named> at /home/jenkins/workspace/Lucene-Solr-6.x-Linux/solr/build/solr-core/test/J2/temp/solr.handler.TestReplicationHandlerBackup_DA339391C3A8918-001/solr-instance-001/./collection1/data/
   [junit4]   2> 666827 INFO  (qtp1045902544-5665) [    x:collection1] o.a.s.c.S.Request [collection1]  webapp=/solr path=/replication params={command=details} status=0 QTime=0
   [junit4]   2> 667830 INFO  (qtp1045902544-5670) [    x:collection1] o.a.s.c.S.Request [collection1]  webapp=/solr path=/replication params={command=backup} status=0 QTime=0
   [junit4]   2> 667830 INFO  (Thread-2164) [    x:collection1] o.a.s.h.SnapShooter Creating backup snapshot <not named> at /home/jenkins/workspace/Lucene-Solr-6.x-Linux/solr/build/solr-core/test/J2/temp/solr.handler.TestReplicationHandlerBackup_DA339391C3A8918-001/solr-instance-001/./collection1/data/
   [junit4]   2> 667830 INFO  (Thread-2164) [    x:collection1] o.a.s.h.SnapShooter Done creating backup snapshot: <not named> at /home/jenkins/workspace/Lucene-Solr-6.x-Linux/solr/build/solr-core/test/J2/temp/solr.handler.TestReplicationHandlerBackup_DA339391C3A8918-001/solr-instance-001/./collection1/data/
   [junit4]   2> 667832 INFO  (qtp1045902544-5671) [    x:collection1] o.a.s.c.S.Request [collection1]  webapp=/solr path=/replication params={command=details} status=0 QTime=0
   [junit4]   2> 669737 INFO  (TEST-TestReplicationHandlerBackup.doTestBackup-seed#[DA339391C3A8918]) [    ] o.a.s.SolrTestCaseJ4 ###Ending doTestBackup
   [junit4]   2> 669738 INFO  (TEST-TestReplicationHandlerBackup.doTestBackup-seed#[DA339391C3A8918]) [    ] o.e.j.s.ServerConnector Stopped ServerConnector@38cff6c8{HTTP/1.1,[http/1.1]}{127.0.0.1:0}
   [junit4]   2> 669738 INFO  (TEST-TestReplicationHandlerBackup.doTestBackup-seed#[DA339391C3A8918]) [    ] o.a.s.c.CoreContainer Shutting down CoreContainer instance=1840965807
   [junit4]   2> 669743 INFO  (coreCloseExecutor-2729-thread-1) [    x:collection1] o.a.s.c.SolrCore [collection1]  CLOSING SolrCore org.apache.solr.core.SolrCore@7d78430a
   [junit4]   2> 669743 INFO  (coreCloseExecutor-2729-thread-1) [    x:collection1] o.a.s.u.DirectUpdateHandler2 closing DirectUpdateHandler2{commits=1,autocommits=0,soft autocommits=0,optimizes=0,rollbacks=0,expungeDeletes=0,docsPending=0,adds=0,deletesById=0,deletesByQuery=0,errors=0,cumulative_adds=10,cumulative_deletesById=0,cumulative_deletesByQuery=1,cumulative_errors=0}
   [junit4]   2> 669743 INFO  (coreCloseExecutor-2729-thread-1) [    x:collection1] o.a.s.u.SolrCoreState Closing SolrCoreState
   [junit4]   2> 669743 INFO  (coreCloseExecutor-2729-thread-1) [    x:collection1] o.a.s.u.DefaultSolrCoreState SolrCoreState ref count has reached 0 - closing IndexWriter
   [junit4]   2> 669743 INFO  (coreCloseExecutor-2729-thread-1) [    x:collection1] o.a.s.u.DefaultSolrCoreState closing IndexWriter with IndexWriterCloser
   [junit4]   2> 669744 INFO  (coreCloseExecutor-2729-thread-1) [    x:collection1] o.a.s.c.SolrCore [collection1] Closing main searcher on request.
   [junit4]   2> 669744 INFO  (coreCloseExecutor-2729-thread-1) [    x:collection1] o.a.s.c.CachingDirectoryFactory Closing MockDirectoryFactory - 2 directories currently being tracked
   [junit4]   2> 669744 INFO  (coreCloseExecutor-2729-thread-1) [    x:collection1] o.a.s.c.CachingDirectoryFactory looking to close /home/jenkins/workspace/Lucene-Solr-6.x-Linux/solr/build/solr-core/test/J2/temp/solr.handler.TestReplicationHandlerBackup_DA339391C3A8918-001/solr-instance-001/./collection1/data [CachedDir<<refCount=0;path=/home/jenkins/workspace/Lucene-Solr-6.x-Linux/solr/build/solr-core/test/J2/temp/solr.handler.TestReplicationHandlerBackup_DA339391C3A8918-001/solr-instance-001/./collection1/data;done=false>>]
   [junit4]   2> 669744 INFO  (coreCloseExecutor-2729-thread-1) [    x:collection1] o.a.s.c.CachingDirectoryFactory Closing directory, CoreContainer#isShutdown=true
   [junit4]   2> 669744 INFO  (coreCloseExecutor-2729-thread-1) [    x:collection1] o.a.s.c.CachingDirectoryFactory Closing directory: /home/jenkins/workspace/Lucene-Solr-6.x-Linux/solr/build/solr-core/test/J2/temp/solr.handler.TestReplicationHandlerBackup_DA339391C3A8918-001/solr-instance-001/./collection1/data
   [junit4]   2> 669744 INFO  (coreCloseExecutor-2729-thread-1) [    x:collection1] o.a.s.c.CachingDirectoryFactory looking to close /home/jenkins/workspace/Lucene-Solr-6.x-Linux/solr/build/solr-core/test/J2/temp/solr.handler.TestReplicationHandlerBackup_DA339391C3A8918-001/solr-instance-001/./collection1/data/index [CachedDir<<refCount=0;path=/home/jenkins/workspace/Lucene-Solr-6.x-Linux/solr/build/solr-core/test/J2/temp/solr.handler.TestReplicationHandlerBackup_DA339391C3A8918-001/solr-instance-001/./collection1/data/index;done=false>>]
   [junit4]   2> 669744 INFO  (coreCloseExecutor-2729-thread-1) [    x:collection1] o.a.s.c.CachingDirectoryFactory Closing directory, CoreContainer#isShutdown=true
   [junit4]   2> 669744 INFO  (coreCloseExecutor-2729-thread-1) [    x:collection1] o.a.s.c.CachingDirectoryFactory Closing directory: /home/jenkins/workspace/Lucene-Solr-6.x-Linux/solr/build/solr-core/test/J2/temp/solr.handler.TestReplicationHandlerBackup_DA339391C3A8918-001/solr-instance-001/./collection1/data/index
   [junit4]   2> 669744 INFO  (TEST-TestReplicationHandlerBackup.doTestBackup-seed#[DA339391C3A8918]) [    ] o.e.j.s.h.ContextHandler Stopped o.e.j.s.ServletContextHandler@6a62fdcb{/solr,null,UNAVAILABLE}
   [junit4]   2> NOTE: reproduce with: ant test  -Dtestcase=TestReplicationHandlerBackup -Dtests.method=doTestBackup -Dtests.seed=DA339391C3A8918 -Dtests.multiplier=3 -Dtests.slow=true -Dtests.locale=sr-BA -Dtests.timezone=SystemV/YST9YDT -Dtests.asserts=true -Dtests.file.encoding=UTF-8
   [junit4] FAILURE 5.54s J2 | TestReplicationHandlerBackup.doTestBackup <<<
   [junit4]    > Throwable #1: java.lang.AssertionError: expected:<1> but was:<2>
   [junit4]    > 	at __randomizedtesting.SeedInfo.seed([DA339391C3A8918:4C28195C3B847A57]:0)
   [junit4]    > 	at org.apache.solr.handler.TestReplicationHandlerBackup.doTestBackup(TestReplicationHandlerBackup.java:245)
   [junit4]    > 	at java.lang.Thread.run(Thread.java:745)
   [junit4]   2> 669748 INFO  (TEST-TestReplicationHandlerBackup.testBackupOnCommit-seed#[DA339391C3A8918]) [    ] o.a.s.SolrTestCaseJ4 ###Starting testBackupOnCommit
   [junit4]   2> 669748 INFO  (TEST-TestReplicationHandlerBackup.testBackupOnCommit-seed#[DA339391C3A8918]) [    ] o.a.s.SolrTestCaseJ4 Writing core.properties file to /home/jenkins/workspace/Lucene-Solr-6.x-Linux/solr/build/solr-core/test/J2/temp/solr.handler.TestReplicationHandlerBackup_DA339391C3A8918-001/solr-instance-002/collection1
   [junit4]   2> 669921 INFO  (TEST-TestReplicationHandlerBackup.testBackupOnCommit-seed#[DA339391C3A8918]) [    ] o.e.j.s.Server jetty-9.3.8.v20160314
   [junit4]   2> 669922 INFO  (TEST-TestReplicationHandlerBackup.testBackupOnCommit-seed#[DA339391C3A8918]) [    ] o.e.j.s.h.ContextHandler Started o.e.j.s.ServletContextHandler@50f3c05c{/solr,null,AVAILABLE}
   [junit4]   2> 669923 INFO  (TEST-TestReplicationHandlerBackup.testBackupOnCommit-seed#[DA339391C3A8918]) [    ] o.e.j.s.ServerConnector Started ServerConnector@798910cc{HTTP/1.1,[http/1.1]}{127.0.0.1:37922}
   [junit4]   2> 669923 INFO  (TEST-TestReplicationHandlerBackup.testBackupOnCommit-seed#[DA339391C3A8918]) [    ] o.e.j.s.Server Started @671482ms
   [junit4]   2> 669923 INFO  (TEST-TestReplicationHandlerBackup.testBackupOnCommit-seed#[DA339391C3A8918]) [    ] o.a.s.c.s.e.JettySolrRunner Jetty properties: {solr.data.dir=/home/jenkins/workspace/Lucene-Solr-6.x-Linux/solr/build/solr-core/test/J2/temp/solr.handler.TestReplicationHandlerBackup_DA339391C3A8918-001/solr-instance-002/collection1/data, hostContext=/solr, hostPort=37922}
   [junit4]   2> 669923 INFO  (TEST-TestReplicationHandlerBackup.testBackupOnCommit-seed#[DA339391C3A8918]) [    ] o.a.s.s.SolrDispatchFilter SolrDispatchFilter.init(): sun.misc.Launcher$AppClassLoader@73d16e93
   [junit4]   2> 669923 INFO  (TEST-TestReplicationHandlerBackup.testBackupOnCommit-seed#[DA339391C3A8918]) [    ] o.a.s.c.SolrResourceLoader new SolrResourceLoader for directory: '/home/jenkins/workspace/Lucene-Solr-6.x-Linux/solr/build/solr-core/test/J2/temp/solr.handler.TestReplicationHandlerBackup_DA339391C3A8918-001/solr-instance-002'
   [junit4]   2> 669923 INFO  (TEST-TestReplicationHandlerBackup.testBackupOnCommit-seed#[DA339391C3A8918]) [    ] o.a.s.c.SolrResourceLoader JNDI not configured for solr (NoInitialContextEx)
   [junit4]   2> 669923 INFO  (TEST-TestReplicationHandlerBackup.testBackupOnCommit-seed#[DA339391C3A8918]) [    ] o.a.s.c.SolrResourceLoader solr home defaulted to 'solr/' (could not find system property or JNDI)
   [junit4]   2> 669924 INFO  (TEST-TestReplicationHandlerBackup.testBackupOnCommit-seed#[DA339391C3A8918]) [    ] o.a.s.c.SolrXmlConfig Loading container configuration from /home/jenkins/workspace/Lucene-Solr-6.x-Linux/solr/build/solr-core/test/J2/temp/solr.handler.TestReplicationHandlerBackup_DA339391C3A8918-001/solr-instance-002/solr.xml
   [junit4]   2> 669927 INFO  (TEST-TestReplicationHandlerBackup.testBackupOnCommit-seed#[DA339391C3A8918]) [    ] o.a.s.c.CorePropertiesLocator Config-defined core root directory: /home/jenkins/workspace/Lucene-Solr-6.x-Linux/solr/build/solr-core/test/J2/temp/solr.handler.TestReplicationHandlerBackup_DA339391C3A8918-001/solr-instance-002/.
   [junit4]   2> 669927 INFO  (TEST-TestReplicationHandlerBackup.testBackupOnCommit-seed#[DA339391C3A8918]) [    ] o.a.s.c.CoreContainer New CoreContainer 996305112
   [junit4]   2> 669927 INFO  (TEST-TestReplicationHandlerBackup.testBackupOnCommit-seed#[DA339391C3A8918]) [    ] o.a.s.c.CoreContainer Loading cores into CoreContainer [instanceDir=/home/jenkins/workspace/Lucene-Solr-6.x-Linux/solr/build/solr-core/test/J2/temp/solr.handler.TestReplicationHandlerBackup_DA339391C3A8918-001/solr-instance-002]
   [junit4]   2> 669927 WARN  (TEST-TestReplicationHandlerBackup.testBackupOnCommit-seed#[DA339391C3A8918]) [    ] o.a.s.c.CoreContainer Couldn't add files from /home/jenkins/workspace/Lucene-Solr-6.x-Linux/solr/build/solr-core/test/J2/temp/solr.handler.TestReplicationHandlerBackup_DA339391C3A8918-001/solr-instance-002/lib to classpath: /home/jenkins/workspace/Lucene-Solr-6.x-Linux/solr/build/solr-core/test/J2/temp/solr.handler.TestReplicationHandlerBackup_DA339391C3A8918-001/solr-instance-002/lib
   [junit4]   2> 669928 INFO  (TEST-TestReplicationHandlerBackup.testBackupOnCommit-seed#[DA339391C3A8918]) [    ] o.a.s.h.c.HttpShardHandlerFactory created with socketTimeout : 90000,urlScheme : ,connTimeout : 15000,maxConnectionsPerHost : 20,maxConnections : 10000,corePoolSize : 0,maximumPoolSize : 2147483647,maxThreadIdleTime : 5,sizeOfQueue : -1,fairnessPolicy : false,useRetries : false,
   [junit4]   2> 669928 INFO  (TEST-TestReplicationHandlerBackup.testBackupOnCommit-seed#[DA339391C3A8918]) [    ] o.a.s.u.UpdateShardHandler Creating UpdateShardHandler HTTP client with params: socketTimeout=340000&connTimeout=45000&retry=true
   [junit4]   2> 669929 INFO  (TEST-TestReplicationHandlerBackup.testBackupOnCommit-seed#[DA339391C3A8918]) [    ] o.a.s.l.LogWatcher SLF4J impl is org.slf4j.impl.Log4jLoggerFactory
   [junit4]   2> 669929 INFO  (TEST-TestReplicationHandlerBackup.testBackupOnCommit-seed#[DA339391C3A8918]) [    ] o.a.s.l.LogWatcher Registering Log Listener [Log4j (org.slf4j.impl.Log4jLoggerFactory)]
   [junit4]   2> 669929 INFO  (TEST-TestReplicationHandlerBackup.testBackupOnCommit-seed#[DA339391C3A8918]) [    ] o.a.s.c.CoreContainer Security conf doesn't exist. Skipping setup for authorization module.
   [junit4]   2> 669929 INFO  (TEST-TestReplicationHandlerBackup.testBackupOnCommit-seed#[DA339391C3A8918]) [    ] o.a.s.c.CoreContainer No authentication plugin used.
   [junit4]   2> 669929 INFO  (TEST-TestReplicationHandlerBackup.testBackupOnCommit-seed#[DA339391C3A8918]) [    ] o.a.s.c.CorePropertiesLocator Looking for core definitions underneath /home/jenkins/workspace/Lucene-Solr-6.x-Linux/solr/build/solr-core/test/J2/temp/solr.handler.TestReplicationHandlerBackup_DA339391C3A8918-001/solr-instance-002/.
   [junit4]   2> 669930 INFO  (TEST-TestReplicationHandlerBackup.testBackupOnCommit-seed#[DA339391C3A8918]) [    ] o.a.s.c.CoreDescriptor Created CoreDescriptor: {name=collection1, config=solrconfig.xml, loadOnStartup=true, schema=schema.xml, configSetProperties=configsetprops.json, transient=false, dataDir=data/}
   [junit4]   2> 669930 INFO  (TEST-TestReplicationHandlerBackup.testBackupOnCommit-seed#[DA339391C3A8918]) [    ] o.a.s.c.CorePropertiesLocator Found core collection1 in /home/jenkins/workspace/Lucene-Solr-6.x-Linux/solr/build/solr-core/test/J2/temp/solr.handler.TestReplicationHandlerBackup_DA339391C3A8918-001/solr-instance-002/./collection1
   [junit4]   2> 669930 INFO  (TEST-TestReplicationHandlerBackup.testBackupOnCommit-seed#[DA339391C3A8918]) [    ] o.a.s.c.CorePropertiesLocator Found 1 core definitions
   [junit4]   2> 669930 INFO  (coreLoadExecutor-2736-thread-1) [    ] o.a.s.c.SolrResourceLoader new SolrResourceLoader for directory: '/home/jenkins/workspace/Lucene-Solr-6.x-Linux/solr/build/solr-core/test/J2/temp/solr.handler.TestReplicationHandlerBackup_DA339391C3A8918-001/solr-instance-002/collection1'
   [junit4]   2> 669930 INFO  (TEST-TestReplicationHandlerBackup.testBackupOnCommit-seed#[DA339391C3A8918]) [    ] o.a.s.s.SolrDispatchFilter user.dir=/home/jenkins/workspace/Lucene-Solr-6.x-Linux/solr/build/solr-core/test/J2
   [junit4]   2> 669930 INFO  (TEST-TestReplicationHandlerBackup.testBackupOnCommit-seed#[DA339391C3A8918]) [    ] o.a.s.s.SolrDispatchFilter SolrDispatchFilter.init() done
   [junit4]   2> 669930 INFO  (coreLoadExecutor-2736-thread-1) [    ] o.a.s.c.SolrResourceLoader JNDI not configured for solr (NoInitialContextEx)
   [junit4]   2> 669930 INFO  (coreLoadExecutor-2736-thread-1) [    ] o.a.s.c.SolrResourceLoader solr home defaulted to 'solr/' (could not find system property or JNDI)
   [junit4]   2> 669935 INFO  (coreLoadExecutor-2736-thread-1) [    ] o.a.s.c.SolrConfig current version of requestparams : -1
   [junit4]   2> 669937 WARN  (coreLoadExecutor-2736-thread-1) [    ] o.a.s.c.Config Beginning with Solr 5.5, <mergePolicy> is deprecated, use <mergePolicyFactory> instead.
   [junit4]   2> 669937 INFO  (coreLoadExecutor-2736-thread-1) [    ] o.a.s.c.SolrConfig Using Lucene MatchVersion: 6.1.0
   [junit4]   2> 669948 INFO  (coreLoadExecutor-2736-thread-1) [    ] o.a.s.c.SolrConfig Loaded SolrConfig: solrconfig.xml
   [junit4]   2> 669950 INFO  (coreLoadExecutor-2736-thread-1) [    ] o.a.s.s.IndexSchema [collection1] Schema name=test
   [junit4]   2> 669952 INFO  (coreLoadExecutor-2736-thread-1) [    ] o.a.s.s.IndexSchema unique key field: id
   [junit4]   2> 669953 INFO  (coreLoadExecutor-2736-thread-1) [    ] o.a.s.c.ConfigSetProperties Did not find ConfigSet properties, assuming default properties: Can't find resource 'configsetprops.json' in classpath or '/home/jenkins/workspace/Lucene-Solr-6.x-Linux/solr/build/solr-core/test/J2/temp/solr.handler.TestReplicationHandlerBackup_DA339391C3A8918-001/solr-instance-002/collection1'
   [junit4]   2> 669953 INFO  (coreLoadExecutor-2736-thread-1) [    ] o.a.s.c.CoreContainer Creating SolrCore 'collection1' using configuration from instancedir /home/jenkins/workspace/Lucene-Solr-6.x-Linux/solr/build/solr-core/test/J2/temp/solr.handler.TestReplicationHandlerBackup_DA339391C3A8918-001/solr-instance-002/./collection1
   [junit4]   2> 669953 INFO  (coreLoadExecutor-2736-thread-1) [    x:collection1] o.a.s.c.SolrCore org.apache.solr.core.MockDirectoryFactory
   [junit4]   2> 669953 INFO  (coreLoadExecutor-2736-thread-1) [    x:collection1] o.a.s.c.SolrCore [[collection1] ] Opening new SolrCore at [/home/jenkins/workspace/Lucene-Solr-6.x-Linux/solr/build/solr-core/test/J2/temp/solr.handler.TestReplicationHandlerBackup_DA339391C3A8918-001/solr-instance-002/collection1], dataDir=[/home/jenkins/workspace/Lucene-Solr-6.x-Linux/solr/build/solr-core/test/J2/temp/solr.handler.TestReplicationHandlerBackup_DA339391C3A8918-001/solr-instance-002/./collection1/data/]
   [junit4]   2> 669953 INFO  (coreLoadExecutor-2736-thread-1) [    x:collection1] o.a.s.c.SolrCore JMX monitoring not detected for core: collection1
   [junit4]   2> 669953 INFO  (coreLoadExecutor-2736-thread-1) [    x:collection1] o.a.s.c.CachingDirectoryFactory return new directory for /home/jenkins/workspace/Lucene-Solr-6.x-Linux/solr/build/solr-core/test/J2/temp/solr.handler.TestReplicationHandlerBackup_DA339391C3A8918-001/solr-instance-002/./collection1/data
   [junit4]   2> 669953 INFO  (coreLoadExecutor-2736-thread-1) [    x:collection1] o.a.s.c.SolrCore New index directory detected: old=null new=/home/jenkins/workspace/Lucene-Solr-6.x-Linux/solr/build/solr-core/test/J2/temp/solr.handler.TestReplicationHandlerBackup_DA339391C3A8918-001/solr-instance-002/./collection1/data/index/
   [junit4]   2> 669953 WARN  (coreLoadExecutor-2736-thread-1) [    x:collection1] o.a.s.c.SolrCore [collection1] Solr index directory '/home/jenkins/workspace/Lucene-Solr-6.x-Linux/solr/build/solr-core/test/J2/temp/solr.handler.TestReplicationHandlerBackup_DA339391C3A8918-001/solr-instance-002/./collection1/data/index' doesn't exist. Creating new index...
   [junit4]   2> 669954 INFO  (coreLoadExecutor-2736-thread-1) [    x:collection1] o.a.s.c.CachingDirectoryFactory return new directory for /home/jenkins/workspace/Lucene-Solr-6.x-Linux/solr/build/solr-core/test/J2/temp/solr.handler.TestReplicationHandlerBackup_DA339391C3A8918-001/solr-instance-002/./collection1/data/index
   [junit4]   2> 669954 INFO  (coreLoadExecutor-2736-thread-1) [    x:collection1] o.a.s.u.RandomMergePolicy RandomMergePolicy wrapping class org.apache.lucene.index.TieredMergePolicy: [TieredMergePolicy: maxMergeAtOnce=22, maxMergeAtOnceExplicit=12, maxMergedSegmentMB=52.248046875, floorSegmentMB=0.3125, forceMergeDeletesPctAllowed=9.99064720514027, segmentsPerTier=19.0, maxCFSSegmentSizeMB=8.796093022207999E12, noCFSRatio=1.0
   [junit4]   2> 669954 INFO  (coreLoadExecutor-2736-thread-1) [    x:collection1] o.a.s.c.SolrDeletionPolicy SolrDeletionPolicy.onCommit: commits: num=1
   [junit4]   2> 	commit{dir=MockDirectoryWrapper(RAMDirectory@6abb2df1 lockFactory=org.apache.lucene.store.SingleInstanceLockFactory@787391af),segFN=segments_1,generation=1}
   [junit4]   2> 669954 INFO  (coreLoadExecutor-2736-thread-1) [    x:collection1] o.a.s.c.SolrDeletionPolicy newest commit generation = 1
   [junit4]   2> 669954 INFO  (OldIndexDirectoryCleanupThreadForCore-collection1) [    x:collection1] o.a.s.c.SolrCore Looking for old index directories to cleanup for core collection1 in /home/jenkins/workspace/Lucene-Solr-6.x-Linux/solr/build/solr-core/test/J2/temp/solr.handler.TestReplicationHandlerBackup_DA339391C3A8918-001/solr-instance-002/./collection1/data/
   [junit4]   2> 669955 INFO  (coreLoadExecutor-2736-thread-1) [    x:collection1] o.a.s.c.SolrCore no updateRequestProcessorChain defined as default, creating implicit default
   [junit4]   2> 669956 INFO  (coreLoadExecutor-2736-thread-1) [    x:collection1] o.a.s.h.l.XMLLoader xsltCacheLifetimeSeconds=60
   [junit4]   2> 669956 INFO  (coreLoadExecutor-2736-thread-1) [    x:collection1] o.a.s.h.l.XMLLoader xsltCacheLifetimeSeconds=60
   [junit4]   2> 669957 INFO  (coreLoadExecutor-2736-thread-1) [    x:collection1] o.a.s.h.l.XMLLoader xsltCacheLifetimeSeconds=60
   [junit4]   2> 669957 INFO  (coreLoadExecutor-2736-thread-1) [    x:collection1] o.a.s.h.l.XMLLoader xsltCacheLifetimeSeconds=60
   [junit4]   2> 669959 INFO  (coreLoadExecutor-2736-thread-1) [    x:collection1] o.a.s.c.RequestHandlers Registered paths: /admin/mbeans,standard,/update/csv,/sql,/update/json/docs,/admin/luke,/export,/admin/segments,/get,/admin/system,/replication,/admin/properties,/config,/stream,/schema,/admin/plugins,/admin/logging,/update/json,/admin/ping,/admin/threads,/update,/admin/file
   [junit4]   2> 669959 INFO  (coreLoadExecutor-2736-thread-1) [    x:collection1] o.a.s.c.SolrCore Using default statsCache cache: org.apache.solr.search.stats.LocalStatsCache
   [junit4]   2> 669959 INFO  (coreLoadExecutor-2736-thread-1) [    x:collection1] o.a.s.u.CommitTracker Hard AutoCommit: disabled
   [junit4]   2> 669959 INFO  (coreLoadExecutor-2736-thread-1) [    x:collection1] o.a.s.u.CommitTracker Soft AutoCommit: disabled
   [junit4]   2> 669959 INFO  (coreLoadExecutor-2736-thread-1) [    x:collection1] o.a.s.u.RandomMergePolicy RandomMergePolicy wrapping class org.apache.lucene.index.LogDocMergePolicy: [LogDocMergePolicy: minMergeSize=1000, mergeFactor=49, maxMergeSize=9223372036854775807, maxMergeSizeForForcedMerge=9223372036854775807, calibrateSizeByDeletes=true, maxMergeDocs=2147483647, maxCFSSegmentSizeMB=8.796093022207999E12, noCFSRatio=0.7700990369179636]
   [junit4]   2> 669959 INFO  (coreLoadExecutor-2736-thread-1) [    x:collection1] o.a.s.c.SolrDeletionPolicy SolrDeletionPolicy.onInit: commits: num=1
   [junit4]   2> 	commit{dir=MockDirectoryWrapper(RAMDirectory@6abb2df1 lockFactory=org.apache.lucene.store.SingleInstanceLockFactory@787391af),segFN=segments_1,generation=1}
   [junit4]   2> 669959 INFO  (coreLoadExecutor-2736-thread-1) [    x:collection1] o.a.s.c.SolrDeletionPolicy newest commit generation = 1
   [junit4]   2> 669959 INFO  (coreLoadExecutor-2736-thread-1) [    x:collection1] o.a.s.s.SolrIndexSearcher Opening [Searcher@7b36e20f[collection1] main]
   [junit4]   2> 669959 INFO  (coreLoadExecutor-2736-thread-1) [    x:collection1] o.a.s.r.ManagedResourceStorage File-based storage initialized to use dir: /home/jenkins/workspace/Lucene-Solr-6.x-Linux/solr/build/solr-core/test/J2/temp/solr.handler.TestReplicationHandlerBackup_DA339391C3A8918-001/solr-instance-002/collection1/conf
   [junit4]   2> 669959 INFO  (coreLoadExecutor-2736-thread-1) [    x:collection1] o.a.s.r.RestManager Initializing RestManager with initArgs: {storageDir=/home/jenkins/workspace/Lucene-Solr-6.x-Linux/solr/build/solr-core/test/J2/temp/solr.handler.TestReplicationHandlerBackup_DA339391C3A8918-001/solr-instance-002/collection1/conf}
   [junit4]   2> 669959 INFO  (coreLoadExecutor-2736-thread-1) [    x:collection1] o.a.s.r.ManagedResourceStorage Reading _rest_managed.json using file:dir=/home/jenkins/workspace/Lucene-Solr-6.x-Linux/solr/build/solr-core/test/J2/temp/solr.handler.TestReplicationHandlerBackup_DA339391C3A8918-001/solr-instance-002/collection1/conf
   [junit4]   2> 669960 INFO  (coreLoadExecutor-2736-thread-1) [    x:collection1] o.a.s.r.RestManager Initializing 0 registered ManagedResources
   [junit4]   2> 669960 INFO  (coreLoadExecutor-2736-thread-1) [    x:collection1] o.a.s.h.ReplicationHandler Replication enabled for following config files: schema-replication2.xml:schema.xml
   [junit4]   2> 669960 INFO  (coreLoadExecutor-2736-thread-1) [    x:collection1] o.a.s.h.ReplicationHandler Commits will be reserved for  10000
   [junit4]   2> 669960 INFO  (searcherExecutor-2737-thread-1-processing-x:collection1) [    x:collection1] o.a.s.c.SolrCore [collection1] Registered new searcher Searcher@7b36e20f[collection1] main{ExitableDirectoryReader(UninvertingDirectoryReader())}
   [junit4]   2> 669960 INFO  (coreLoadExecutor-2736-thread-1) [    x:collection1] o.a.s.c.CoreContainer registering core: collection1
   [junit4]   2> 670432 INFO  (qtp1096823676-5695) [    x:collection1] o.a.s.u.DirectUpdateHandler2 [collection1] REMOVING ALL DOCUMENTS FROM INDEX
   [junit4]   2> 670432 INFO  (qtp1096823676-5695) [    x:collection1] o.a.s.u.p.LogUpdateProcessorFactory [collection1]  webapp=/solr path=/update params={wt=javabin&version=2}{deleteByQuery=*:*} 0 0
   [junit4]   2> 670435 INFO  (qtp1096823676-5696) [    x:collection1] o.a.s.u.p.LogUpdateProcessorFactory [collection1]  webapp=/solr path=/update params={wt=javabin&version=2}{add=[0]} 0 0
   [junit4]   2> 670436 INFO  (qtp1096823676-5697) [    x:collection1] o.a.s.u.p.LogUpdateProcessorFactory [collection1]  webapp=/solr path=/update params={wt=javabin&version=2}{add=[1]} 0 0
   [junit4]   2> 670438 INFO  (qtp1096823676-5690) [    x:collection1] o.a.s.u.p.LogUpdateProcessorFactory [collection1]  webapp=/solr path=/update params={wt=javabin&version=2}{add=[2]} 0 0
   [junit4]   2> 670439 INFO  (qtp1096823676-5695) [    x:collection1] o.a.s.u.p.LogUpdateProcessorFactory [collection1]  webapp=/solr path=/update params={wt=javabin&version=2}{add=[3]} 0 0
   [junit4]   2> 670441 INFO  (qtp1096823676-5696) [    x:collection1] o.a.s.u.p.LogUpdateProcessorFactory [collection1]  webapp=/solr path=/update params={wt=javabin&version=2}{add=[4]} 0 0
   [junit4]   2> 670442 INFO  (qtp1096823676-5697) [    x:collection1] o.a.s.u.p.LogUpdateProcessorFactory [collection1]  webapp=/solr path=/update params={wt=javabin&version=2}{add=[5]} 0 0
   [junit4]   2> 670443 INFO  (qtp1096823676-5690) [    x:collection1] o.a.s.u.p.LogUpdateProcessorFactory [collection1]  webapp=/solr path=/update params={wt=javabin&version=2}{add=[6]} 0 0
   [junit4]   2> 670445 INFO  (qtp1096823676-5695) [    x:collection1] o.a.s.u.p.LogUpdateProcessorFactory [collection1]  webapp=/solr path=/update params={wt=javabin&version=2}{add=[7]} 0 0
   [junit4]   2> 670446 INFO  (qtp1096823676-5696) [    x:collection1] o.a.s.u.p.LogUpdateProcessorFactory [collection1]  webapp=/solr path=/update params={wt=javabin&version=2}{add=[8]} 0 0
   [junit4]   2> 670448 INFO  (qtp1096823676-5697) [    x:collection1] o.a.s.u.p.LogUpdateProcessorFactory [collection1]  webapp=/solr path=/update params={wt=javabin&version=2}{add=[9]} 0 0
   [junit4]   2> 670449 INFO  (qtp1096823676-5690) [    x:collection1] o.a.s.u.p.LogUpdateProcessorFactory [collection1]  webapp=/solr path=/update params={wt=javabin&version=2}{add=[10]} 0 0
   [junit4]   2> 670450 INFO  (qtp1096823676-5695) [    x:collection1] o.a.s.u.p.LogUpdateProcessorFactory [collection1]  webapp=/solr path=/update params={wt=javabin&version=2}{add=[11]} 0 0
   [junit4]   2> 670452 INFO  (qtp1096823676-5696) [    x:collection1] o.a.s.u.p.LogUpdateProcessorFactory [collection1]  webapp=/solr path=/update params={wt=javabin&version=2}{add=[12]} 0 0
   [junit4]   2> 670453 INFO  (qtp1096823676-5697) [    x:collection1] o.a.s.u.p.LogUpdateProcessorFactory [collection1]  webapp=/solr path=/update params={wt=javabin&version=2}{add=[13]} 0 0
   [junit4]   2> 670455 INFO  (qtp1096823676-5690) [    x:collection1] o.a.s.u.p.LogUpdateProcessorFactory [collection1]  webapp=/solr path=/update params={wt=javabin&version=2}{add=[14]} 0 0
   [junit4]   2> 670456 INFO  (qtp1096823676-5695) [    x:collection1] o.a.s.u.p.LogUpdateProcessorFactory [collection1]  webapp=/solr path=/update params={wt=javabin&version=2}{add=[15]} 0 0
   [junit4]   2> 670457 INFO  (qtp1096823676-5696) [    x:collection1] o.a.s.u.p.LogUpdateProcessorFactory [collection1]  webapp=/solr path=/update params={wt=javabin&version=2}{add=[16]} 0 0
   [junit4]   2> 670459 INFO  (qtp1096823676-5697) [    x:collection1] o.a.s.u.p.LogUpdateProcessorFactory [collection1]  webapp=/solr path=/update params={wt=javabin&version=2}{add=[17]} 0 0
   [junit4]   2> 670460 INFO  (qtp1096823676-5690) [    x:collection1] o.a.s.u.p.LogUpdateProcessorFactory [collection1]  webapp=/solr path=/update params={wt=javabin&version=2}{add=[18]} 0 0
   [junit4]   2> 670462 INFO  (qtp1096823676-5695) [    x:collection1] o.a.s.u.p.LogUpdateProcessorFactory [collection1]  webapp=/solr path=/update params={wt=javabin&version=2}{add=[19]} 0 0
   [junit4]   2> 670463 INFO  (qtp1096823676-5696) [    x:collection1] o.a.s.u.p.LogUpdateProcessorFactory [collection1]  webapp=/solr path=/update params={wt=javabin&version=2}{add=[20]} 0 0
   [junit4]   2> 670465 INFO  (qtp1096823676-5697) [    x:collection1] o.a.s.u.p.LogUpdateProcessorFactory [collection1]  webapp=/solr path=/update params={wt=javabin&version=2}{add=[21]} 0 0
   [junit4]   2> 670466 INFO  (qtp1096823676-5690) [    x:collection1] o.a.s.u.p.LogUpdateProcessorFactory [collection1]  webapp=/solr path=/update params={wt=javabin&version=2}{add=[22]} 0 0
   [junit4]   2> 670468 INFO  (qtp1096823676-5695) [    x:collection1] o.a.s.u.p.LogUpdateProcessorFactory [collection1]  webapp=/solr path=/update params={wt=javabin&version=2}{add=[23]} 0 0
   [junit4]   2> 670469 INFO  (qtp1096823676-5696) [    x:collection1] o.a.s.u.p.LogUpdateProcessorFactory [collection1]  webapp=/solr path=/update params={wt=javabin&version=2}{add=[24]} 0 0
   [junit4]   2> 670470 INFO  (qtp1096823676-5697) [    x:collection1] o.a.s.u.p.LogUpdateProcessorFactory [collection1]  webapp=/solr path=/update params={wt=javabin&version=2}{add=[25]} 0 0
   [junit4]   2> 670472 INFO  (qtp1096823676-5690) [    x:collection1] o.a.s.u.p.LogUpdateProcessorFactory [collection1]  webapp=/solr path=/update params={wt=javabin&version=2}{add=[26]} 0 0
   [junit4]   2> 670473 INFO  (qtp1096823676-5695) [    x:collection1] o.a.s.u.p.LogUpdateProcessorFactory [collection1]  webapp=/solr path=/update params={wt=javabin&version=2}{add=[27]} 0 0
   [junit4]   2> 670475 INFO  (qtp1096823676-5696) [    x:collection1] o.a.s.u.p.LogUpdateProcessorFactory [collection1]  webapp=/solr path=/update params={wt=javabin&version=2}{add=[28]} 0 0
   [junit4]   2> 670476 INFO  (qtp1096823676-5697) [    x:collection1] o.a.s.u.p.LogUpdateProcessorFactory [collection1]  webapp=/solr path=/update params={wt=javabin&version=2}{add=[29]} 0 0
   [junit4]   2> 670478 INFO  (qtp1096823676-5690) [    x:collection1] o.a.s.u.p.LogUpdateProcessorFactory [collection1]  webapp=/solr path=/update params={wt=javabin&version=2}{add=[30]} 0 0
   [junit4]   2> 670479 INFO  (qtp1096823676-5695) [    x:collection1] o.a.s.u.p.LogUpdateProcessorFactory [collection1]  webapp=/solr path=/update params={wt=javabin&version=2}{add=[31]} 0 0
   [junit4]   2> 670481 INFO  (qtp1096823676-5696) [    x:collection1] o.a.s.u.p.LogUpdateProcessorFactory [collection1]  webapp=/solr path=/update params={wt=javabin&version=2}{add=[32]} 0 0
   [junit4]   2> 670482 INFO  (qtp1096823676-5697) [    x:collection1] o.a.s.u.p.LogUpdateProcessorFactory [collection1]  webapp=/solr path=/update params={wt=javabin&version=2}{add=[33]} 0 0
   [junit4]   2> 670483 INFO  (qtp1096823676-5690) [    x:collection1] o.a.s.u.p.LogUpdateProcessorFactory [collection1]  webapp=/solr path=/update params={wt=javabin&version=2}{add=[34]} 0 0
   [junit4]   2> 670485 INFO  (qtp1096823676-5695) [    x:collection1] o.a.s.u.p.LogUpdateProcessorFactory [collection1]  webapp=/solr path=/update params={wt=javabin&version=2}{add=[35]} 0 0
   [junit4]   2> 670486 INFO  (qtp1096823676-5696) [    x:collection1] o.a.s.u.p.LogUpdateProcessorFactory [collection1]  webapp=/solr path=/update params={wt=javabin&version=2}{add=[36]} 0 0
   [junit4]   2> 670488 INFO  (qtp1096823676-5697) [    x:collection1] o.a.s.u.p.LogUpdateProcessorFactory [collection1]  webapp=/solr path=/update params={wt=javabin&version=2}{add=[37]} 0 0
   [junit4]   2> 670489 INFO  (qtp1096823676-5690) [    x:collection1] o.a.s.u.p.LogUpdateProcessorFactory [collection1]  webapp=/solr path=/update params={wt=javabin&version=2}{add=[38]} 0 0
   [junit4]   2> 670490 INFO  (qtp1096823676-5695) [    x:collection1] o.a.s.u.p.LogUpdateProcessorFactory [collection1]  webapp=/solr path=/update params={wt=javabin&version=2}{add=[39]} 0 0
   [junit4]   2> 670492 INFO  (qtp1096823676-5696) [    x:collection1] o.a.s.u.p.LogUpdateProcessorFactory [collection1]  webapp=/solr path=/update params={wt=javabin&version=2}{add=[40]} 0 0
   [junit4]   2> 670493 INFO  (qtp1096823676-5697) [    x:collection1] o.a.s.u.p.LogUpdateProcessorFactory [collection1]  webapp=/solr path=/update params={wt=javabin&version=2}{add=[41]} 0 0
   [junit4]   2> 670495 INFO  (qtp1096823676-5690) [    x:collection1] o.a.s.u.p.LogUpdateProcessorFactory [collection1]  webapp=/solr path=/update params={wt=javabin&version=2}{add=[42]} 0 0
   [junit4]   2> 670496 INFO  (qtp1096823676-5695) [    x:collection1] o.a.s.u.p.LogUpdateProcessorFactory [collection1]  webapp=/solr path=/update params={wt=javabin&version=2}{add=[43]} 0 0
   [junit4]   2> 670498 INFO  (qtp1096823676-5696) [    x:collection1] o.a.s.u.p.LogUpdateProcessorFactory [collection1]  webapp=/solr path=/update params={wt=javabin&version=2}{add=[44]} 0 0
   [junit4]   2> 670500 INFO  (qtp1096823676-5697) [    x:collection1] o.a.s.u.p.LogUpdateProcessorFactory [collection1]  webapp=/solr path=/update params={wt=javabin&version=2}{add=[45]} 0 0
   [junit4]   2> 670501 INFO  (qtp1096823676-5690) [    x:collection1] o.a.s.u.p.LogUpdateProcessorFactory [collection1]  webapp=/solr path=/update params={wt=javabin&version=2}{add=[46]} 0 0
   [junit4]   2> 670502 INFO  (qtp1096823676-5695) [    x:collection1] o.a.s.u.p.LogUpdateProcessorFactory [collection1]  webapp=/solr path=/update params={wt=javabin&version=2}{add=[47]} 0 0
   [junit4]   2> 670504 INFO  (qtp1096823676-5696) [    x:collection1] o.a.s.u.p.LogUpdateProcessorFactory [collection1]  webapp=/solr path=/update params={wt=javabin&version=2}{add=[48]} 0 0
   [junit4]   2> 670505 INFO  (qtp1096823676-5697) [    x:collection1] o.a.s.u.p.LogUpdateProcessorFactory [collection1]  webapp=/solr path=/update params={wt=javabin&version=2}{add=[49]} 0 0
   [junit4]   2> 670507 INFO  (qtp1096823676-5690) [    x:collection1] o.a.s.u.p.LogUpdateProcessorFactory [collection1]  webapp=/solr path=/update params={wt=javabin&version=2}{add=[50]} 0 0
   [junit4]   2> 670508 INFO  (qtp1096823676-5695) [    x:collection1] o.a.s.u.p.LogUpdateProcessorFactory [collection1]  webapp=/solr path=/update params={wt=javabin&version=2}{add=[51]} 0 0
   [junit4]   2> 670510 INFO  (qtp1096823676-5696) [    x:collection1] o.a.s.u.p.LogUpdateProcessorFactory [collection1]  webapp=/solr path=/update params={wt=javabin&version=2}{add=[52]} 0 0
   [junit4]   2> 670511 INFO  (qtp1096823676-5697) [    x:collection1] o.a.s.u.p.LogUpdateProcessorFactory [collection1]  webapp=/solr path=/update params={wt=javabin&version=2}{add=[53]} 0 0
   [junit4]   2> 670513 INFO  (qtp1096823676-5690) [    x:collection1] o.a.s.u.p.LogUpdateProcessorFactory [collection1]  webapp=/solr path=/update params={wt=javabin&version=2}{add=[54]} 0 0
   [junit4]   2> 670514 INFO  (qtp1096823676-5695) [    x:collection1] o.a.s.u.p.LogUpdateProcessorFactory [collection1]  webapp=/solr path=/update params={wt=javabin&version=2}{add=[55]} 0 0
   [junit4]   2> 670516 INFO  (qtp1096823676-5696) [    x:collection1] o.a.s.u.p.LogUpdateProcessorFactory [collection1]  webapp=/solr path=/update params={wt=javabin&version=2}{add=[56]} 0 0
   [junit4]   2> 670517 INFO  (qtp1096823676-5697) [    x:collection1] o.a.s.u.p.LogUpdateProcessorFactory [collection1]  webapp=/solr path=/update params={wt=javabin&version=2}{add=[57]} 0 0
   [junit4]   2> 670518 INFO  (qtp1096823676-5690) [    x:collection1] o.a.s.u.p.LogUpdateProcessorFactory [collection1]  webapp=/solr path=/update params={wt=javabin&version=2}{add=[58]} 0 0
   [junit4]   2> 670520 INFO  (qtp1096823676-5695) [    x:collection1] o.a.s.u.p.LogUpdateProcessorFactory [collection1]  webapp=/solr path=/update params={wt=javabin&version=2}{add=[59]} 0 0
   [junit4]   2> 670522 INFO  (qtp1096823676-5696) [    x:collection1] o.a.s.u.DirectUpdateHandler2 start commit{,optimize=false,openSearcher=true,waitSearcher=true,expungeDeletes=false,softCommit=false,prepareCommit=false}
   [junit4]   2> 670525 INFO  (qtp1096823676-5696) [    x:collection1] o.a.s.c.SolrDeletionPolicy SolrDeletionPolicy.onCommit: commits: num=2
   [junit4]   2> 	commit{dir=MockDirectoryWrapper(RAMDirectory@6abb2df1 lockFactory=org.apache.lucene.store.SingleInstanceLockFactory@787391af),segFN=segments_1,generation=1}
   [junit4]   2> 	commit{dir=MockDirectoryWrapper(RAMDirectory@6abb2df1 lockFactory=org.apache.lucene.store.SingleInstanceLockFactory@787391af),segFN=segments_2,generation=2}
   [junit4]   2> 670525 INFO  (qtp1096823676-5696) [    x:collection1] o.a.s.c.SolrDeletionPolicy newest commit generation = 2
   [junit4]   2> 670526 INFO  (Thread-2177) [    x:collection1] o.a.s.h.SnapShooter Creating backup snapshot <not named> at /home/jenkins/workspace/Lucene-Solr-6.x-Linux/solr/build/solr-core/test/J2/temp/solr.handler.TestReplicationHandlerBackup_DA339391C3A8918-001/solr-instance-002/./collection1/data/
   [junit4]   2> 670526 INFO  (Thread-2177) [    x:collection1] o.a.s.h.SnapShooter Done creating backup snapshot: <not named> at /home/jenkins/workspace/Lucene-Solr-6.x-Linux/solr/build/solr-core/test/J2/temp/solr.handler.TestReplicationHandlerBackup_DA339391C3A8918-001/solr-instance-002/./collection1/data/
   [junit4]   2> 670526 INFO  (qtp1096823676-5696) [    x:collection1] o.a.s.s.SolrIndexSearcher Opening [Searcher@16e2071e[collection1] main]
   [junit4]   2> 670527 INFO  (qtp1096823676-5696) [    x:collection1] o.a.s.u.DirectUpdateHandler2 end_commit_flush
   [junit4]   2> 670527 INFO  (searcherExecutor-2737-thread-1-processing-x:collection1) [    x:collection1] o.a.s.c.SolrCore [collection1] Registered new searcher Searcher@16e2071e[collection1] main{ExitableDirectoryReader(UninvertingDirectoryReader(Uninverting(_0(6.1.0):c60)))}
   [junit4]   2> 670527 INFO  (qtp1096823676-5696) [    x:collection1] o.a.s.u.p.LogUpdateProcessorFactory [collection1]  webapp=/solr path=/update params={waitSearcher=true&commit=true&softCommit=false&wt=javabin&version=2}{commit=} 0 5
   [junit4]   2> 670529 INFO  (qtp1096823676-5697) [    x:collection1] o.a.s.c.S.Request [collection1]  webapp=/solr path=/replication params={command=details} status=0 QTime=0
   [junit4]   2> 671530 INFO  (TEST-TestReplicationHandlerBackup.testBackupOnCommit-seed#[DA339391C3A8918]) [    ] o.a.s.SolrTestCaseJ4 ###Ending testBackupOnCommit
   [junit4]   2> 671531 INFO  (TEST-TestReplicationHandlerBackup.testBackupOnCommit-seed#[DA339391C3A8918]) [    ] o.e.j.s.ServerConnector Stopped ServerConnector@798910cc{HTTP/1.1,[http/1.1]}{127.0.0.1:0}
   [junit4]   2> 671531 INFO  (TEST-TestReplicationHandlerBackup.testBackupOnCommit-seed#[DA339391C3A8918]) [    ] o.a.s.c.CoreContainer Shutting down CoreContainer instance=996305112
   [junit4]   2> 671531 INFO  (coreCloseExecutor-2741-thread-1) [    x:collection1] o.a.s.c.SolrCore [collection1]  CLOSING SolrCore org.apache.solr.core.SolrCore@52f39515
   [junit4]   2> 671531 INFO  (coreCloseExecutor-2741-thread-1) [    x:collection1] o.a.s.u.DirectUpdateHandler2 closing DirectUpdateHandler2{commits=1,autocommits=0,soft autocommits=0,optimizes=0,rollbacks=0,expungeDeletes=0,docsPending=0,adds=0,deletesById=0,deletesByQuery=0,errors=0,cumulative_adds=60,cumulative_deletesById=0,cumulative_deletesByQuery=1,cumulative_errors=0}
   [junit4]   2> 671531 INFO  (coreCloseExecutor-2741-thread-1) [    x:collection1] o.a.s.u.SolrCoreState Closing SolrCoreState
   [junit4]   2> 671531 INFO  (coreCloseExecutor-2741-thread-1) [    x:collection1] o.a.s.u.DefaultSolrCoreState SolrCoreState ref count has reached 0 - closing IndexWriter
   [junit4]   2> 671531 INFO  (coreCloseExecutor-2741-thread-1) [    x:collection1] o.a.s.u.DefaultSolrCoreState closing IndexWriter with IndexWriterCloser
   [junit4]   2> 671531 INFO  (coreCloseExecutor-2741-thread-1) [    x:collection1] o.a.s.c.SolrCore [collection1] Closing main searcher on request.
   [junit4]   2> 671531 INFO  (coreCloseExecutor-2741-thread-1) [    x:collection1] o.a.s.c.CachingDirectoryFactory Closing MockDirectoryFactory - 2 directories currently being tracked
   [junit4]   2> 671531 INFO  (coreCloseExecutor-2741-thread-1) [    x:collection1] o.a.s.c.CachingDirectoryFactory looking to close /home/jenkins/workspace/Lucene-Solr-6.x-Linux/solr/build/solr-core/test/J2/temp/solr.handler.TestReplicationHandlerBackup_DA339391C3A8918-001/solr-instance-002/./collection1/data [CachedDir<<refCount=0;path=/home/jenkins/workspace/Lucene-Solr-6.x-Linux/solr/build/solr-core/test/J2/temp/solr.handler.TestReplicationHandlerBackup_DA339391C3A8918-001/solr-instance-002/./collection1/data;done=false>>]
   [junit4]   2> 671531 INFO  (coreCloseExecutor-2741-thread-1) [    x:collection1] o.a.s.c.CachingDirectoryFactory Closing directory, CoreContainer#isShutdown=true
   [junit4]   2> 671532 INFO  (coreCloseExecutor-2741-thread-1) [    x:collection1] o.a.s.c.CachingDirectoryFactory Closing directory: /home/jenkins/workspace/Lucene-Solr-6.x-Linux/solr/build/solr-core/test/J2/temp/solr.handler.TestReplicationHandlerBackup_DA339391C3A8918-001/solr-instance-002/./collection1/data
   [junit4]   2> 671532 INFO  (coreCloseExecutor-2741-thread-1) [    x:collection1] o.a.s.c.CachingDirectoryFactory looking to close /home/jenkins/workspace/Lucene-Solr-6.x-Linux/solr/build/solr-core/test/J2/temp/solr.handler.TestReplicationHandlerBackup_DA339391C3A8918-001/solr-instance-002/./collection1/data/index [CachedDir<<refCount=0;path=/home/jenkins/workspace/Lucene-Solr-6.x-Linux/solr/build/solr-core/test/J2/temp/solr.handler.TestReplicationHandlerBackup_DA339391C3A8918-001/solr-instance-002/./collection1/data/index;done=false>>]
   [junit4]   2> 671532 INFO  (coreCloseExecutor-2741-thread-1) [    x:collection1] o.a.s.c.CachingDirectoryFactory Closing directory, CoreContainer#isShutdown=true
   [junit4]   2> 671532 INFO  (coreCloseExecutor-2741-thread-1) [    x:collection1] o.a.s.c.CachingDirectoryFactory Closing directory: /home/jenkins/workspace/Lucene-Solr-6.x-Linux/solr/build/solr-core/test/J2/temp/solr.handler.TestReplicationHandlerBackup_DA339391C3A8918-001/solr-instance-002/./collection1/data/index
   [junit4]   2> 671532 INFO  (TEST-TestReplicationHandlerBackup.testBackupOnCommit-seed#[DA339391C3A8918]) [    ] o.e.j.s.h.ContextHandler Stopped o.e.j.s.ServletContextHandler@50f3c05c{/solr,null,UNAVAILABLE}
   [junit4]   2> 671533 INFO  (SUITE-TestReplicationHandlerBackup-seed#[DA339391C3A8918]-worker) [    ] o.a.s.SolrTestCaseJ4 ###deleteCore
   [junit4]   2> NOTE: leaving temporary files on disk at: /home/jenkins/workspace/Lucene-Solr-6.x-Linux/solr/build/solr-core/test/J2/temp/solr.handler.TestReplicationHandlerBackup_DA339391C3A8918-001
   [junit4]   2> NOTE: test params are: codec=Asserting(Lucene60): {name=Lucene50(blocksize=128), id=Lucene50(blocksize=128)}, docValues:{}, maxPointsInLeafNode=1496, maxMBSortInHeap=6.565158238306622, sim=RandomSimilarity(queryNorm=false,coord=crazy): {}, locale=sr-BA, timezone=SystemV/YST9YDT
   [junit4]   2> NOTE: Linux 4.2.0-35-generic amd64/Oracle Corporation 1.8.0_92 (64-bit)/cpus=12,threads=1,free=161671744,total=529006592
   [junit4]   2> NOTE: All tests run in this JVM: [TestOverriddenPrefixQueryForCustomFieldType, TestZkChroot, SampleTest, BlockCacheTest, TestConfigSetsAPIExclusivity, TestImplicitCoreProperties, TestJmxIntegration, SuggesterTest, TestReloadDeadlock, TestNamedUpdateProcessors, SuggesterTSTTest, TestBulkSchemaAPI, MergeStrategyTest, SparseHLLTest, TestExpandComponent, TermVectorComponentDistributedTest, UnloadDistributedZkTest, MigrateRouteKeyTest, TestAuthenticationFramework, TestSolrIndexConfig, DirectUpdateHandlerTest, RegexBoostProcessorTest, TestSchemaSimilarityResource, TestRecovery, TestAddFieldRealTimeGet, DistributedSuggestComponentTest, TestCustomDocTransformer, HardAutoCommitTest, TestJmxMonitoredMap, BadIndexSchemaTest, RemoteQueryErrorTest, DirectUpdateHandlerOptimizeTest, ClusterStateTest, FullSolrCloudDistribCmdsTest, TestPHPSerializedResponseWriter, TestPerFieldSimilarity, TestXmlQParser, TestJettySolrRunner, ShowFileRequestHandlerTest, SuggestComponentContextFilterQueryTest, BlobRepositoryCloudTest, TestCloudManagedSchema, TestUtils, TestExactStatsCache, TestManagedResource, CheckHdfsIndexTest, LeaderElectionTest, DistributedFacetPivotWhiteBoxTest, TestDistributedMissingSort, TestCoreDiscovery, TestReplicationHandlerBackup]
   [junit4] Completed [189/591 (1!)] on J2 in 7.34s, 2 tests, 1 failure <<< FAILURES!

[...truncated 36 lines...]
   [junit4] Suite: org.apache.solr.cloud.CollectionsAPIDistributedZkTest
   [junit4]   2> Creating dataDir: /home/jenkins/workspace/Lucene-Solr-6.x-Linux/solr/build/solr-core/test/J1/temp/solr.cloud.CollectionsAPIDistributedZkTest_DA339391C3A8918-001/init-core-data-001
   [junit4]   2> 590960 INFO  (SUITE-CollectionsAPIDistributedZkTest-seed#[DA339391C3A8918]-worker) [    ] o.a.s.SolrTestCaseJ4 Randomized ssl (false) and clientAuth (false)
   [junit4]   2> 590960 INFO  (SUITE-CollectionsAPIDistributedZkTest-seed#[DA339391C3A8918]-worker) [    ] o.a.s.BaseDistributedSearchTestCase Setting hostContext system property: /
   [junit4]   2> 590962 INFO  (TEST-CollectionsAPIDistributedZkTest.test-seed#[DA339391C3A8918]) [    ] o.a.s.c.ZkTestServer STARTING ZK TEST SERVER
   [junit4]   2> 590963 INFO  (Thread-1579) [    ] o.a.s.c.ZkTestServer client port:0.0.0.0/0.0.0.0:0
   [junit4]   2> 590963 INFO  (Thread-1579) [    ] o.a.s.c.ZkTestServer Starting server
   [junit4]   2> 591063 INFO  (TEST-CollectionsAPIDistributedZkTest.test-seed#[DA339391C3A8918]) [    ] o.a.s.c.ZkTestServer start zk server on port:34935
   [junit4]   2> 591063 INFO  (TEST-CollectionsAPIDistributedZkTest.test-seed#[DA339391C3A8918]) [    ] o.a.s.c.c.SolrZkClient Using default ZkCredentialsProvider
   [junit4]   2> 591063 INFO  (TEST-CollectionsAPIDistributedZkTest.test-seed#[DA339391C3A8918]) [    ] o.a.s.c.c.ConnectionManager Waiting for client to connect to ZooKeeper
   [junit4]   2> 591072 INFO  (zkCallback-628-thread-1) [    ] o.a.s.c.c.ConnectionManager Watcher org.apache.solr.common.cloud.ConnectionManager@69bff032 name:ZooKeeperConnection Watcher:127.0.0.1:34935 got event WatchedEvent state:SyncConnected type:None path:null path:null type:None
   [junit4]   2> 591072 INFO  (TEST-CollectionsAPIDistributedZkTest.test-seed#[DA339391C3A8918]) [    ] o.a.s.c.c.ConnectionManager Client is connected to ZooKeeper
   [junit4]   2> 591072 INFO  (TEST-CollectionsAPIDistributedZkTest.test-seed#[DA339391C3A8918]) [    ] o.a.s.c.c.SolrZkClient Using default ZkACLProvider
   [junit4]   2> 591072 INFO  (TEST-CollectionsAPIDistributedZkTest.test-seed#[DA339391C3A8918]) [    ] o.a.s.c.c.SolrZkClient makePath: /solr
   [junit4]   2> 591074 INFO  (TEST-CollectionsAPIDistributedZkTest.test-seed#[DA339391C3A8918]) [    ] o.a.s.c.c.SolrZkClient Using default ZkCredentialsProvider
   [junit4]   2> 591074 INFO  (TEST-CollectionsAPIDistributedZkTest.test-seed#[DA339391C3A8918]) [    ] o.a.s.c.c.ConnectionManager Waiting for client to connect to ZooKeeper
   [junit4]   2> 591074 INFO  (zkCallback-629-thread-1) [    ] o.a.s.c.c.ConnectionManager Watcher org.apache.solr.common.cloud.ConnectionManager@3f32c12c name:ZooKeeperConnection Watcher:127.0.0.1:34935/solr got event WatchedEvent state:SyncConnected type:None path:null path:null type:None
   [junit4]   2> 591074 INFO  (TEST-CollectionsAPIDistributedZkTest.test-seed#[DA339391C3A8918]) [    ] o.a.s.c.c.ConnectionManager Client is connected to ZooKeeper
   [junit4]   2> 591075 INFO  (TEST-CollectionsAPIDistributedZkTest.test-seed#[DA339391C3A8918]) [    ] o.a.s.c.c.SolrZkClient Using default ZkACLProvider
   [junit4]   2> 591075 INFO  (TEST-CollectionsAPIDistributedZkTest.test-seed#[DA339391C3A8918]) [    ] o.a.s.c.c.SolrZkClient makePath: /collections/collection1
   [junit4]   2> 591075 INFO  (TEST-CollectionsAPIDistributedZkTest.test-seed#[DA339391C3A8918]) [    ] o.a.s.c.c.SolrZkClient makePath: /collections/collection1/shards
   [junit4]   2> 591076 INFO  (TEST-CollectionsAPIDistributedZkTest.test-seed#[DA339391C3A8918]) [    ] o.a.s.c.c.SolrZkClient makePath: /collections/control_collection
   [junit4]   2> 591076 INFO  (TEST-CollectionsAPIDistributedZkTest.test-seed#[DA339391C3A8918]) [    ] o.a.s.c.c.SolrZkClient makePath: /collections/control_collection/shards
   [junit4]   2> 591077 INFO  (TEST-CollectionsAPIDistributedZkTest.test-seed#[DA339391C3A8918]) [    ] o.a.s.c.AbstractZkTestCase put /home/jenkins/workspace/Lucene-Solr-6.x-Linux/solr/core/src/test-files/solr/collection1/conf/solrconfig-tlog.xml to /configs/conf1/solrconfig.xml
   [junit4]   2> 591077 INFO  (TEST-CollectionsAPIDistributedZkTest.test-seed#[DA339391C3A8918]) [    ] o.a.s.c.c.SolrZkClient makePath: /configs/conf1/solrconfig.xml
   [junit4]   2> 591078 INFO  (TEST-CollectionsAPIDistributedZkTest.test-seed#[DA339391C3A8918]) [    ] o.a.s.c.AbstractZkTestCase put /home/jenkins/workspace/Lucene-Solr-6.x-Linux/solr/core/src/test-files/solr/collection1/conf/schema.xml to /configs/conf1/schema.xml
   [junit4]   2> 591078 INFO  (TEST-CollectionsAPIDistributedZkTest.test-seed#[DA339391C3A8918]) [    ] o.a.s.c.c.SolrZkClient makePath: /configs/conf1/schema.xml
   [junit4]   2> 591079 INFO  (TEST-CollectionsAPIDistributedZkTest.test-seed#[DA339391C3A8918]) [    ] o.a.s.c.AbstractZkTestCase put /home/jenkins/workspace/Lucene-Solr-6.x-Linux/solr/core/src/test-files/solr/collection1/conf/solrconfig.snippet.randomindexconfig.xml to /configs/conf1/solrconfig.snippet.randomindexconfig.xml
   [junit4]   2> 591079 INFO  (TEST-CollectionsAPIDistributedZkTest.test-seed#[DA339391C3A8918]) [    ] o.a.s.c.c.SolrZkClient makePath: /configs/conf1/solrconfig.snippet.randomindexconfig.xml
   [junit4]   2> 591080 INFO  (TEST-CollectionsAPIDistributedZkTest.test-seed#[DA339391C3A8918]) [    ] o.a.s.c.AbstractZkTestCase put /home/jenkins/workspace/Lucene-Solr-6.x-Linux/solr/core/src/test-files/solr/collection1/conf/stopwords.txt to /configs/conf1/stopwords.txt
   [junit4]   2> 591080 INFO  (TEST-CollectionsAPIDistributedZkTest.test-seed#[DA339391C3A8918]) [    ] o.a.s.c.c.SolrZkClient makePath: /configs/conf1/stopwords.txt
   [junit4]   2> 591081 INFO  (TEST-CollectionsAPIDistributedZkTest.test-seed#[DA339391C3A8918]) [    ] o.a.s.c.AbstractZkTestCase put /home/jenkins/workspace/Lucene-Solr-6.x-Linux/solr/core/src/test-files/solr/collection1/conf/protwords.txt to /configs/conf1/protwords.txt
   [junit4]   2> 591081 INFO  (TEST-CollectionsAPIDistributedZkTest.test-seed#[DA339391C3A8918]) [    ] o.a.s.c.c.SolrZkClient makePath: /configs/conf1/protwords.txt
   [junit4]   2> 591081 INFO  (TEST-CollectionsAPIDistributedZkTest.test-seed#[DA339391C3A8918]) [    ] o.a.s.c.AbstractZkTestCase put /home/jenkins/workspace/Lucene-Solr-6.x-Linux/solr/core/src/test-files/solr/collection1/conf/currency.xml to /configs/conf1/currency.xml
   [junit4]   2> 591081 INFO  (TEST-CollectionsAPIDistributedZkTest.test-seed#[DA339391C3A8918]) [    ] o.a.s.c.c.SolrZkClient makePath: /configs/conf1/currency.xml
   [junit4]   2> 591082 INFO  (TEST-CollectionsAPIDistributedZkTest.test-seed#[DA339391C3A8918]) [    ] o.a.s.c.AbstractZkTestCase put /home/jenkins/workspace/Lucene-Solr-6.x-Linux/solr/core/src/test-files/solr/collection1/conf/enumsConfig.xml to /configs/conf1/enumsConfig.xml
   [junit4]   2> 591082 INFO  (TEST-CollectionsAPIDistributedZkTest.test-seed#[DA339391C3A8918]) [    ] o.a.s.c.c.SolrZkClient makePath: /configs/conf1/enumsConfig.xml
   [junit4]   2> 591082 INFO  (TEST-CollectionsAPIDistributedZkTest.test-seed#[DA339391C3A8918]) [    ] o.a.s.c.AbstractZkTestCase put /home/jenkins/workspace/Lucene-Solr-6.x-Linux/solr/core/src/test-files/solr/collection1/conf/open-exchange-rates.json to /configs/conf1/open-exchange-rates.json
   [junit4]   2> 591083 INFO  (TEST-CollectionsAPIDistributedZkTest.test-seed#[DA339391C3A8918]) [    ] o.a.s.c.c.SolrZkClient makePath: /configs/conf1/open-exchange-rates.json
   [junit4]   2> 591083 INFO  (TEST-CollectionsAPIDistributedZkTest.test-seed#[DA339391C3A8918]) [    ] o.a.s.c.AbstractZkTestCase put /home/jenkins/workspace/Lucene-Solr-6.x-Linux/solr/core/src/test-files/solr/collection1/conf/mapping-ISOLatin1Accent.txt to /configs/conf1/mapping-ISOLatin1Accent.txt
   [junit4]   2> 591083 INFO  (TEST-CollectionsAPIDistributedZkTest.test-seed#[DA339391C3A8918]) [    ] o.a.s.c.c.SolrZkClient makePath: /configs/conf1/mapping-ISOLatin1Accent.txt
   [junit4]   2> 591084 INFO  (TEST-CollectionsAPIDistributedZkTest.test-seed#[DA339391C3A8918]) [    ] o.a.s.c.AbstractZkTestCase put /home/jenkins/workspace/Lucene-Solr-6.x-Linux/solr/core/src/test-files/solr/collection1/conf/old_synonyms.txt to /configs/conf1/old_synonyms.txt
   [junit4]   2> 591085 INFO  (TEST-CollectionsAPIDistributedZkTest.test-seed#[DA339391C3A8918]) [    ] o.a.s.c.c.SolrZkClient makePath: /configs/conf1/old_synonyms.txt
   [junit4]   2> 591085 INFO  (TEST-CollectionsAPIDistributedZkTest.test-seed#[DA339391C3A8918]) [    ] o.a.s.c.AbstractZkTestCase put /home/jenkins/workspace/Lucene-Solr-6.x-Linux/solr/core/src/test-files/solr/collection1/conf/synonyms.txt to /configs/conf1/synonyms.txt
   [junit4]   2> 591085 INFO  (TEST-CollectionsAPIDistributedZkTest.test-seed#[DA339391C3A8918]) [    ] o.a.s.c.c.SolrZkClient makePath: /configs/conf1/synonyms.txt
   [junit4]   2> 591086 INFO  (TEST-CollectionsAPIDistributedZkTest.test-seed#[DA339391C3A8918]) [    ] o.a.s.c.c.SolrZkClient Using default ZkCredentialsProvider
   [junit4]   2> 591086 INFO  (TEST-CollectionsAPIDistributedZkTest.test-seed#[DA339391C3A8918]) [    ] o.a.s.c.c.ConnectionManager Waiting for client to connect to ZooKeeper
   [junit4]   2> 591087 INFO  (zkCallback-630-thread-1) [    ] o.a.s.c.c.ConnectionManager Watcher org.apache.solr.common.cloud.ConnectionManager@21d7a835 name:ZooKeeperConnection Watcher:127.0.0.1:34935 got event WatchedEvent state:SyncConnected type:None path:null path:null type:None
   [junit4]   2> 591087 INFO  (TEST-CollectionsAPIDistributedZkTest.test-seed#[DA339391C3A8918]) [    ] o.a.s.c.c.ConnectionManager Client is connected to ZooKeeper
   [junit4]   2> 591087 INFO  (TEST-CollectionsAPIDistributedZkTest.test-seed#[DA339391C3A8918]) [    ] o.a.s.c.c.SolrZkClient Using default ZkACLProvider
   [junit4]   2> 591087 INFO  (TEST-CollectionsAPIDistributedZkTest.test-seed#[DA339391C3A8918]) [    ] o.a.s.c.c.SolrZkClient makePath: /solr
   [junit4]   2> 591088 INFO  (TEST-CollectionsAPIDistributedZkTest.test-seed#[DA339391C3A8918]) [    ] o.a.s.c.c.SolrZkClient Using default ZkCredentialsProvider
   [junit4]   2> 591088 INFO  (TEST-CollectionsAPIDistributedZkTest.test-seed#[DA339391C3A8918]) [    ] o.a.s.c.c.ConnectionManager Waiting for client to connect to ZooKeeper
   [junit4]   2> 591089 INFO  (zkCallback-631-thread-1) [    ] o.a.s.c.c.ConnectionManager Watcher org.apache.solr.common.cloud.ConnectionManager@48079259 name:ZooKeeperConnection Watcher:127.0.0.1:34935/solr got event WatchedEvent state:SyncConnected type:None path:null path:null type:None
   [junit4]   2> 591089 INFO  (TEST-CollectionsAPIDistributedZkTest.test-seed#[DA339391C3A8918]) [    ] o.a.s.c.c.ConnectionManager Client is connected to ZooKeeper
   [junit4]   2> 591089 INFO  (TEST-CollectionsAPIDistributedZkTest.test-seed#[DA339391C3A8918]) [    ] o.a.s.c.c.SolrZkClient Using default ZkACLProvider
   [junit4]   2> 591089 INFO  (TEST-CollectionsAPIDistributedZkTest.test-seed#[DA339391C3A8918]) [    ] o.a.s.c.AbstractZkTestCase put /home/jenkins/workspace/Lucene-Solr-6.x-Linux/solr/core/src/test-files/solr/collection1/conf/solrconfig-tlog.xml to /configs/conf2/solrconfig.xml
   [junit4]   2> 591089 INFO  (TEST-CollectionsAPIDistributedZkTest.test-seed#[DA339391C3A8918]) [    ] o.a.s.c.c.SolrZkClient makePath: /configs/conf2/solrconfig.xml
   [junit4]   2> 591090 INFO  (TEST-CollectionsAPIDistributedZkTest.test-seed#[DA339391C3A8918]) [    ] o.a.s.c.AbstractZkTestCase put /home/jenkins/workspace/Lucene-Solr-6.x-Linux/solr/core/src/test-files/solr/collection1/conf/schema.xml to /configs/conf2/schema.xml
   [junit4]   2> 591090 INFO  (TEST-CollectionsAPIDistributedZkTest.test-seed#[DA339391C3A8918]) [    ] o.a.s.c.c.SolrZkClient makePath: /configs/conf2/schema.xml
   [junit4]   2> 591091 INFO  (TEST-CollectionsAPIDistributedZkTest.test-seed#[DA339391C3A8918]) [    ] o.a.s.c.AbstractZkTestCase put /home/jenkins/workspace/Lucene-Solr-6.x-Linux/solr/core/src/test-files/solr/collection1/conf/enumsConfig.xml to /configs/conf2/enumsConfig.xml
   [junit4]   2> 591091 INFO  (TEST-CollectionsAPIDistributedZkTest.test-seed#[DA339391C3A8918]) [    ] o.a.s.c.c.SolrZkClient makePath: /configs/conf2/enumsConfig.xml
   [junit4]   2> 591092 INFO  (TEST-CollectionsAPIDistributedZkTest.test-seed#[DA339391C3A8918]) [    ] o.a.s.c.AbstractZkTestCase put /home/jenkins/workspace/Lucene-Solr-6.x-Linux/solr/core/src/test-files/solr/collection1/conf/solrconfig.snippet.randomindexconfig.xml to /configs/conf2/solrconfig.snippet.randomindexconfig.xml
   [junit4]   2> 591092 INFO  (TEST-CollectionsAPIDistributedZkTest.test-seed#[DA339391C3A8918]) [    ] o.a.s.c.c.SolrZkClient makePath: /configs/conf2/solrconfig.snippet.randomindexconfig.xml
   [junit4]   2> 591093 INFO  (TEST-CollectionsAPIDistributedZkTest.test-seed#[DA339391C3A8918]) [    ] o.a.s.c.AbstractZkTestCase put /home/jenkins/workspace/Lucene-Solr-6.x-Linux/solr/core/src/test-files/solr/collection1/conf/stopwords.txt to /configs/conf2/stopwords.txt
   [junit4]   2> 591093 INFO  (TEST-CollectionsAPIDistributedZkTest.test-seed#[DA339391C3A8918]) [    ] o.a.s.c.c.SolrZkClient makePath: /configs/conf2/stopwords.txt
   [junit4]   2> 591093 INFO  (TEST-CollectionsAPIDistributedZkTest.test-seed#[DA339391C3A8918]) [    ] o.a.s.c.AbstractZkTestCase put /home/jenkins/workspace/Lucene-Solr-6.x-Linux/solr/core/src/test-files/solr/collection1/conf/protwords.txt to /configs/conf2/protwords.txt
   [junit4]   2> 591094 INFO  (TEST-CollectionsAPIDistributedZkTest.test-seed#[DA339391C3A8918]) [    ] o.a.s.c.c.SolrZkClient makePath: /configs/conf2/protwords.txt
   [junit4]   2> 591094 INFO  (TEST-CollectionsAPIDistributedZkTest.test-seed#[DA339391C3A8918]) [    ] o.a.s.c.AbstractZkTestCase put /home/jenkins/workspace/Lucene-Solr-6.x-Linux/solr/core/src/test-files/solr/collection1/conf/currency.xml to /configs/conf2/currency.xml
   [junit4]   2> 591094 INFO  (TEST-CollectionsAPIDistributedZkTest.test-seed#[DA339391C3A8918]) [    ] o.a.s.c.c.SolrZkClient makePath: /configs/conf2/currency.xml
   [junit4]   2> 591095 INFO  (TEST-CollectionsAPIDistributedZkTest.test-seed#[DA339391C3A8918]) [    ] o.a.s.c.AbstractZkTestCase put /home/jenkins/workspace/Lucene-Solr-6.x-Linux/solr/core/src/test-files/solr/collection1/conf/open-exchange-rates.json to /configs/conf2/open-exchange-rates.json
   [junit4]   2> 591095 INFO  (TEST-CollectionsAPIDistributedZkTest.test-seed#[DA339391C3A8918]) [    ] o.a.s.c.c.SolrZkClient makePath: /configs/conf2/open-exchange-rates.json
   [junit4]   2> 591096 INFO  (TEST-CollectionsAPIDistributedZkTest.test-seed#[DA339391C3A8918]) [    ] o.a.s.c.AbstractZkTestCase put /home/jenkins/workspace/Lucene-Solr-6.x-Linux/solr/core/src/test-files/solr/collection1/conf/mapping-ISOLatin1Accent.txt to /configs/conf2/mapping-ISOLatin1Accent.txt
   [junit4]   2> 591096 INFO  (TEST-CollectionsAPIDistributedZkTest.test-seed#[DA339391C3A8918]) [    ] o.a.s.c.c.SolrZkClient makePath: /configs/conf2/mapping-ISOLatin1Accent.txt
   [junit4]   2> 591096 INFO  (TEST-CollectionsAPIDistributedZkTest.test-seed#[DA339391C3A8918]) [    ] o.a.s.c.AbstractZkTestCase put /home/jenkins/

[...truncated too long message...]

ing... (live nodes size: [1])
   [junit4]   2> 831152 INFO  (zkCallback-659-thread-6-processing-n:127.0.0.1:39659_) [n:127.0.0.1:39659_    ] o.a.s.c.c.ZkStateReader A live node change: [WatchedEvent state:SyncConnected type:NodeChildrenChanged path:/live_nodes], has occurred - updating... (live nodes size: [1])
   [junit4]   2> 831152 WARN  (zkCallback-659-thread-6-processing-n:127.0.0.1:39659_) [n:127.0.0.1:39659_    ] o.a.s.c.c.ZkStateReader ZooKeeper watch triggered, but Solr cannot talk to ZK: [KeeperErrorCode = Session expired for /live_nodes]
   [junit4]   2> 831152 INFO  (zkCallback-664-thread-6) [    ] o.a.s.c.c.ZkStateReader A live node change: [WatchedEvent state:SyncConnected type:NodeChildrenChanged path:/live_nodes], has occurred - updating... (live nodes size: [1])
   [junit4]   2> 831152 INFO  (zkCallback-638-thread-3) [    ] o.a.s.c.c.ZkStateReader Updated live nodes from ZooKeeper... (1) -> (0)
   [junit4]   2> 831152 INFO  (zkCallback-664-thread-6) [    ] o.a.s.c.c.ZkStateReader Updated live nodes from ZooKeeper... (1) -> (0)
   [junit4]   2> 832650 WARN  (zkCallback-659-thread-9-processing-n:127.0.0.1:39659_) [n:127.0.0.1:39659_    ] o.a.s.c.c.ZkStateReader ZooKeeper watch triggered, but Solr cannot talk to ZK: [KeeperErrorCode = Session expired for /clusterstate.json]
   [junit4]   2> 832651 INFO  (TEST-CollectionsAPIDistributedZkTest.test-seed#[DA339391C3A8918]) [    ] o.e.j.s.ServerConnector Stopped ServerConnector@4322d35{HTTP/1.1,[http/1.1]}{127.0.0.1:0}
   [junit4]   2> 832651 INFO  (TEST-CollectionsAPIDistributedZkTest.test-seed#[DA339391C3A8918]) [    ] o.e.j.s.h.ContextHandler Stopped o.e.j.s.ServletContextHandler@66f60f80{/,null,UNAVAILABLE}
   [junit4]   2> 832659 INFO  (TEST-CollectionsAPIDistributedZkTest.test-seed#[DA339391C3A8918]) [    ] o.a.s.c.ChaosMonkey monkey: stop shard! 40278
   [junit4]   2> 832659 INFO  (TEST-CollectionsAPIDistributedZkTest.test-seed#[DA339391C3A8918]) [    ] o.a.s.c.ZkTestServer connecting to 127.0.0.1:34935 34935
   [junit4]   2> 832779 INFO  (Thread-1666) [    ] o.a.s.c.ZkTestServer connecting to 127.0.0.1:34935 34935
   [junit4]   2> 832780 WARN  (Thread-1666) [    ] o.a.s.c.ZkTestServer Watch limit violations: 
   [junit4]   2> Maximum concurrent create/delete watches above limit:
   [junit4]   2> 
   [junit4]   2> 	6	/solr/aliases.json
   [junit4]   2> 	5	/solr/collections/halfdeletedcollection2/state.json
   [junit4]   2> 	5	/solr/collections/awholynewstresscollection_collection0_0/state.json
   [junit4]   2> 	5	/solr/collections/awholynewstresscollection_collection1_0/state.json
   [junit4]   2> 	5	/solr/configs/conf2
   [junit4]   2> 	3	/solr/collections/addReplicaColl/state.json
   [junit4]   2> 	2	/solr/collections/awholynewcollection_2/state.json
   [junit4]   2> 
   [junit4]   2> Maximum concurrent data watches above limit:
   [junit4]   2> 
   [junit4]   2> 	4	/solr/clusterstate.json
   [junit4]   2> 	2	/solr/overseer_elect/election/95799978104127494-127.0.0.1:40278_-n_0000000000
   [junit4]   2> 	2	/solr/collections/acollectionafterbaddelete/state.json
   [junit4]   2> 	2	/solr/collections/halfdeletedcollection2/leader_elect/shard3/election/95799978104127501-core_node2-n_0000000000
   [junit4]   2> 	2	/solr/collections/halfdeletedcollection2/leader_elect/shard2/election/95799978104127494-core_node3-n_0000000000
   [junit4]   2> 	2	/solr/collections/awholynewstresscollection_collection0_0/leader_elect/shard4/election/95799978104127507-core_node1-n_0000000000
   [junit4]   2> 	2	/solr/collections/halfdeletedcollection/state.json
   [junit4]   2> 
   [junit4]   2> Maximum concurrent children watches above limit:
   [junit4]   2> 
   [junit4]   2> 	5	/solr/live_nodes
   [junit4]   2> 	4	/solr/collections
   [junit4]   2> 	2	/solr/overseer/queue
   [junit4]   2> 	2	/solr/overseer/collection-queue-work
   [junit4]   2> 	2	/solr/overseer/queue-work
   [junit4]   2> 
   [junit4]   2> NOTE: reproduce with: ant test  -Dtestcase=CollectionsAPIDistributedZkTest -Dtests.method=test -Dtests.seed=DA339391C3A8918 -Dtests.multiplier=3 -Dtests.slow=true -Dtests.locale=es-UY -Dtests.timezone=Arctic/Longyearbyen -Dtests.asserts=true -Dtests.file.encoding=UTF-8
   [junit4] ERROR    242s J1 | CollectionsAPIDistributedZkTest.test <<<
   [junit4]    > Throwable #1: com.carrotsearch.randomizedtesting.UncaughtExceptionError: Captured an uncaught exception in thread: Thread[id=4682, name=collection0, state=RUNNABLE, group=TGRP-CollectionsAPIDistributedZkTest]
   [junit4]    > 	at __randomizedtesting.SeedInfo.seed([DA339391C3A8918:85F706E3B2C6E4E0]:0)
   [junit4]    > Caused by: org.apache.solr.client.solrj.impl.HttpSolrClient$RemoteSolrException: Error from server at http://127.0.0.1:42980: collection already exists: awholynewstresscollection_collection0_0
   [junit4]    > 	at __randomizedtesting.SeedInfo.seed([DA339391C3A8918]:0)
   [junit4]    > 	at org.apache.solr.client.solrj.impl.HttpSolrClient.executeMethod(HttpSolrClient.java:590)
   [junit4]    > 	at org.apache.solr.client.solrj.impl.HttpSolrClient.request(HttpSolrClient.java:259)
   [junit4]    > 	at org.apache.solr.client.solrj.impl.HttpSolrClient.request(HttpSolrClient.java:248)
   [junit4]    > 	at org.apache.solr.client.solrj.impl.LBHttpSolrClient.doRequest(LBHttpSolrClient.java:404)
   [junit4]    > 	at org.apache.solr.client.solrj.impl.LBHttpSolrClient.request(LBHttpSolrClient.java:357)
   [junit4]    > 	at org.apache.solr.client.solrj.impl.CloudSolrClient.sendRequest(CloudSolrClient.java:1192)
   [junit4]    > 	at org.apache.solr.client.solrj.impl.CloudSolrClient.requestWithRetryOnStaleState(CloudSolrClient.java:962)
   [junit4]    > 	at org.apache.solr.client.solrj.impl.CloudSolrClient.request(CloudSolrClient.java:898)
   [junit4]    > 	at org.apache.solr.client.solrj.SolrClient.request(SolrClient.java:1219)
   [junit4]    > 	at org.apache.solr.cloud.AbstractFullDistribZkTestBase.createCollection(AbstractFullDistribZkTestBase.java:1595)
   [junit4]    > 	at org.apache.solr.cloud.AbstractFullDistribZkTestBase.createCollection(AbstractFullDistribZkTestBase.java:1616)
   [junit4]    > 	at org.apache.solr.cloud.CollectionsAPIDistributedZkTest$1CollectionThread.run(CollectionsAPIDistributedZkTest.java:987)
   [junit4]   2> 832784 INFO  (SUITE-CollectionsAPIDistributedZkTest-seed#[DA339391C3A8918]-worker) [    ] o.a.s.SolrTestCaseJ4 ###deleteCore
   [junit4]   2> NOTE: test params are: codec=Asserting(Lucene60): {other_tl1=PostingsFormat(name=LuceneVarGapFixedInterval), range_facet_l_dv=PostingsFormat(name=Memory doPackFST= true), _version_=PostingsFormat(name=LuceneVarGapFixedInterval), multiDefault=FSTOrd50, a_t=PostingsFormat(name=LuceneVarGapFixedInterval), intDefault=PostingsFormat(name=LuceneVarGapFixedInterval), a_i1=PostingsFormat(name=LuceneVarGapFixedInterval), id=PostingsFormat(name=Memory doPackFST= true), range_facet_i_dv=PostingsFormat(name=LuceneVarGapFixedInterval), text=BlockTreeOrds(blocksize=128), range_facet_l=PostingsFormat(name=LuceneVarGapFixedInterval), timestamp=PostingsFormat(name=LuceneVarGapFixedInterval)}, docValues:{range_facet_l_dv=DocValuesFormat(name=Memory), range_facet_i_dv=DocValuesFormat(name=Direct), timestamp=DocValuesFormat(name=Direct)}, maxPointsInLeafNode=1839, maxMBSortInHeap=7.926300929023402, sim=ClassicSimilarity, locale=es-UY, timezone=Arctic/Longyearbyen
   [junit4]   2> NOTE: Linux 4.2.0-35-generic amd64/Oracle Corporation 1.8.0_92 (64-bit)/cpus=12,threads=1,free=153636160,total=517996544
   [junit4]   2> NOTE: All tests run in this JVM: [TestNoOpRegenerator, TestMiniSolrCloudCluster, BasicFunctionalityTest, BufferStoreTest, ShardRoutingTest, HdfsDirectoryFactoryTest, OpenCloseCoreStressTest, WordBreakSolrSpellCheckerTest, TestRecoveryHdfs, DOMUtilTest, SpellingQueryConverterTest, TestRestManager, CursorMarkTest, HLLUtilTest, TermsComponentTest, TermVectorComponentTest, TestRebalanceLeaders, CustomCollectionTest, SaslZkACLProviderTest, TestInitParams, SolrCmdDistributorTest, UUIDUpdateProcessorFallbackTest, TestSchemaResource, TestQueryUtils, SpatialFilterTest, DistributedQueryComponentOptimizationTest, TestBinaryResponseWriter, SolrIndexConfigTest, TestCodecSupport, DocValuesMissingTest, LeaderInitiatedRecoveryOnShardRestartTest, SoftAutoCommitTest, AliasIntegrationTest, CollectionsAPIAsyncDistributedZkTest, TestChildDocTransformer, TestLMJelinekMercerSimilarityFactory, BJQParserTest, TestDocumentBuilder, LoggingHandlerTest, SpellCheckComponentTest, HdfsChaosMonkeyNothingIsSafeTest, SchemaVersionSpecificBehaviorTest, TimeZoneUtilsTest, BasicAuthIntegrationTest, TestSortingResponseWriter, HighlighterTest, CollectionsAPIDistributedZkTest]
   [junit4] Completed [200/591 (2!)] on J1 in 242.01s, 1 test, 1 error <<< FAILURES!

[...truncated 1285 lines...]
BUILD FAILED
/home/jenkins/workspace/Lucene-Solr-6.x-Linux/build.xml:740: The following error occurred while executing this line:
/home/jenkins/workspace/Lucene-Solr-6.x-Linux/build.xml:684: The following error occurred while executing this line:
/home/jenkins/workspace/Lucene-Solr-6.x-Linux/build.xml:59: The following error occurred while executing this line:
/home/jenkins/workspace/Lucene-Solr-6.x-Linux/solr/build.xml:233: The following error occurred while executing this line:
/home/jenkins/workspace/Lucene-Solr-6.x-Linux/solr/common-build.xml:529: The following error occurred while executing this line:
/home/jenkins/workspace/Lucene-Solr-6.x-Linux/lucene/common-build.xml:1457: The following error occurred while executing this line:
/home/jenkins/workspace/Lucene-Solr-6.x-Linux/lucene/common-build.xml:1014: There were test failures: 591 suites (10 ignored), 2383 tests, 1 error, 1 failure, 114 ignored (70 assumptions) [seed: DA339391C3A8918]

Total time: 61 minutes 7 seconds
Build step 'Invoke Ant' marked build as failure
Archiving artifacts
[WARNINGS] Skipping publisher since build result is FAILURE
Recording test results
Email was triggered for: Failure - Any
Sending email for trigger: Failure - Any



Mime
View raw message