lucene-dev mailing list archives

Site index · List index
Message view « Date » · « Thread »
Top « Date » · « Thread »
From Policeman Jenkins Server <jenk...@thetaphi.de>
Subject [JENKINS] Lucene-Solr-6.x-Windows (32bit/jdk1.8.0_72) - Build # 118 - Still Failing!
Date Fri, 15 Apr 2016 11:50:41 GMT
Build: http://jenkins.thetaphi.de/job/Lucene-Solr-6.x-Windows/118/
Java: 32bit/jdk1.8.0_72 -client -XX:+UseParallelGC

13 tests failed.
FAILED:  org.apache.lucene.queryparser.xml.TestCoreParser.testPointRangeQuery

Error Message:
this IndexReader is closed

Stack Trace:
org.apache.lucene.store.AlreadyClosedException: this IndexReader is closed
	at __randomizedtesting.SeedInfo.seed([36E7629C7634AAC0:99D3C6CAC6B794DA]:0)
	at org.apache.lucene.index.IndexReader.ensureOpen(IndexReader.java:272)
	at org.apache.lucene.index.SegmentReader.getPostingsReader(SegmentReader.java:240)
	at org.apache.lucene.index.CodecReader.fields(CodecReader.java:109)
	at org.apache.lucene.index.LeafReader.terms(LeafReader.java:207)
	at org.apache.lucene.index.TermContext.build(TermContext.java:91)
	at org.apache.lucene.search.TermQuery.createWeight(TermQuery.java:191)
	at org.apache.lucene.search.IndexSearcher.createWeight(IndexSearcher.java:752)
	at org.apache.lucene.search.AssertingIndexSearcher.createWeight(AssertingIndexSearcher.java:76)
	at org.apache.lucene.search.BooleanWeight.<init>(BooleanWeight.java:57)
	at org.apache.lucene.search.BooleanQuery.createWeight(BooleanQuery.java:226)
	at org.apache.lucene.search.IndexSearcher.createWeight(IndexSearcher.java:752)
	at org.apache.lucene.search.AssertingIndexSearcher.createWeight(AssertingIndexSearcher.java:76)
	at org.apache.lucene.search.IndexSearcher.createNormalizedWeight(IndexSearcher.java:735)
	at org.apache.lucene.search.AssertingIndexSearcher.createNormalizedWeight(AssertingIndexSearcher.java:57)
	at org.apache.lucene.search.IndexSearcher.search(IndexSearcher.java:473)
	at org.apache.lucene.search.IndexSearcher.search(IndexSearcher.java:592)
	at org.apache.lucene.search.IndexSearcher.searchAfter(IndexSearcher.java:450)
	at org.apache.lucene.search.IndexSearcher.search(IndexSearcher.java:461)
	at org.apache.lucene.queryparser.xml.TestCoreParser.dumpResults(TestCoreParser.java:194)
	at org.apache.lucene.queryparser.xml.TestCoreParser.testPointRangeQuery(TestCoreParser.java:135)
	at sun.reflect.NativeMethodAccessorImpl.invoke0(Native Method)
	at sun.reflect.NativeMethodAccessorImpl.invoke(NativeMethodAccessorImpl.java:62)
	at sun.reflect.DelegatingMethodAccessorImpl.invoke(DelegatingMethodAccessorImpl.java:43)
	at java.lang.reflect.Method.invoke(Method.java:498)
	at com.carrotsearch.randomizedtesting.RandomizedRunner.invoke(RandomizedRunner.java:1764)
	at com.carrotsearch.randomizedtesting.RandomizedRunner$8.evaluate(RandomizedRunner.java:871)
	at com.carrotsearch.randomizedtesting.RandomizedRunner$9.evaluate(RandomizedRunner.java:907)
	at com.carrotsearch.randomizedtesting.RandomizedRunner$10.evaluate(RandomizedRunner.java:921)
	at org.apache.lucene.util.TestRuleSetupTeardownChained$1.evaluate(TestRuleSetupTeardownChained.java:49)
	at org.apache.lucene.util.AbstractBeforeAfterRule$1.evaluate(AbstractBeforeAfterRule.java:45)
	at org.apache.lucene.util.TestRuleThreadAndTestName$1.evaluate(TestRuleThreadAndTestName.java:48)
	at org.apache.lucene.util.TestRuleIgnoreAfterMaxFailures$1.evaluate(TestRuleIgnoreAfterMaxFailures.java:64)
	at org.apache.lucene.util.TestRuleMarkFailure$1.evaluate(TestRuleMarkFailure.java:47)
	at com.carrotsearch.randomizedtesting.rules.StatementAdapter.evaluate(StatementAdapter.java:36)
	at com.carrotsearch.randomizedtesting.ThreadLeakControl$StatementRunner.run(ThreadLeakControl.java:367)
	at com.carrotsearch.randomizedtesting.ThreadLeakControl.forkTimeoutingTask(ThreadLeakControl.java:809)
	at com.carrotsearch.randomizedtesting.ThreadLeakControl$3.evaluate(ThreadLeakControl.java:460)
	at com.carrotsearch.randomizedtesting.RandomizedRunner.runSingleTest(RandomizedRunner.java:880)
	at com.carrotsearch.randomizedtesting.RandomizedRunner$5.evaluate(RandomizedRunner.java:781)
	at com.carrotsearch.randomizedtesting.RandomizedRunner$6.evaluate(RandomizedRunner.java:816)
	at com.carrotsearch.randomizedtesting.RandomizedRunner$7.evaluate(RandomizedRunner.java:827)
	at org.apache.lucene.util.AbstractBeforeAfterRule$1.evaluate(AbstractBeforeAfterRule.java:45)
	at com.carrotsearch.randomizedtesting.rules.StatementAdapter.evaluate(StatementAdapter.java:36)
	at org.apache.lucene.util.TestRuleStoreClassName$1.evaluate(TestRuleStoreClassName.java:41)
	at com.carrotsearch.randomizedtesting.rules.NoShadowingOrOverridesOnMethodsRule$1.evaluate(NoShadowingOrOverridesOnMethodsRule.java:40)
	at com.carrotsearch.randomizedtesting.rules.NoShadowingOrOverridesOnMethodsRule$1.evaluate(NoShadowingOrOverridesOnMethodsRule.java:40)
	at com.carrotsearch.randomizedtesting.rules.StatementAdapter.evaluate(StatementAdapter.java:36)
	at com.carrotsearch.randomizedtesting.rules.StatementAdapter.evaluate(StatementAdapter.java:36)
	at com.carrotsearch.randomizedtesting.rules.StatementAdapter.evaluate(StatementAdapter.java:36)
	at org.apache.lucene.util.TestRuleAssertionsRequired$1.evaluate(TestRuleAssertionsRequired.java:53)
	at org.apache.lucene.util.TestRuleMarkFailure$1.evaluate(TestRuleMarkFailure.java:47)
	at org.apache.lucene.util.TestRuleIgnoreAfterMaxFailures$1.evaluate(TestRuleIgnoreAfterMaxFailures.java:64)
	at org.apache.lucene.util.TestRuleIgnoreTestSuites$1.evaluate(TestRuleIgnoreTestSuites.java:54)
	at com.carrotsearch.randomizedtesting.rules.StatementAdapter.evaluate(StatementAdapter.java:36)
	at com.carrotsearch.randomizedtesting.ThreadLeakControl$StatementRunner.run(ThreadLeakControl.java:367)
	at java.lang.Thread.run(Thread.java:745)


FAILED:  org.apache.lucene.queryparser.xml.TestCoreParser.testConstantScoreQueryXML

Error Message:
this IndexReader is closed

Stack Trace:
org.apache.lucene.store.AlreadyClosedException: this IndexReader is closed
	at __randomizedtesting.SeedInfo.seed([36E7629C7634AAC0:953ADD23DDC754ED]:0)
	at org.apache.lucene.index.IndexReader.ensureOpen(IndexReader.java:272)
	at org.apache.lucene.index.SegmentReader.getPostingsReader(SegmentReader.java:240)
	at org.apache.lucene.index.CodecReader.fields(CodecReader.java:109)
	at org.apache.lucene.index.LeafReader.terms(LeafReader.java:207)
	at org.apache.lucene.search.MultiTermQueryConstantScoreWrapper$1.rewrite(MultiTermQueryConstantScoreWrapper.java:142)
	at org.apache.lucene.search.MultiTermQueryConstantScoreWrapper$1.bulkScorer(MultiTermQueryConstantScoreWrapper.java:201)
	at org.apache.lucene.search.LRUQueryCache$CachingWrapperWeight.cache(LRUQueryCache.java:593)
	at org.apache.lucene.search.LRUQueryCache$CachingWrapperWeight.bulkScorer(LRUQueryCache.java:641)
	at org.apache.lucene.search.AssertingWeight.bulkScorer(AssertingWeight.java:68)
	at org.apache.lucene.search.ConstantScoreQuery$1.bulkScorer(ConstantScoreQuery.java:120)
	at org.apache.lucene.search.AssertingWeight.bulkScorer(AssertingWeight.java:68)
	at org.apache.lucene.search.AssertingWeight.bulkScorer(AssertingWeight.java:68)
	at org.apache.lucene.search.IndexSearcher.search(IndexSearcher.java:666)
	at org.apache.lucene.search.AssertingIndexSearcher.search(AssertingIndexSearcher.java:91)
	at org.apache.lucene.search.IndexSearcher.search(IndexSearcher.java:473)
	at org.apache.lucene.search.IndexSearcher.search(IndexSearcher.java:592)
	at org.apache.lucene.search.IndexSearcher.searchAfter(IndexSearcher.java:450)
	at org.apache.lucene.search.IndexSearcher.search(IndexSearcher.java:461)
	at org.apache.lucene.queryparser.xml.TestCoreParser.dumpResults(TestCoreParser.java:194)
	at org.apache.lucene.queryparser.xml.TestCoreParser.testConstantScoreQueryXML(TestCoreParser.java:115)
	at sun.reflect.NativeMethodAccessorImpl.invoke0(Native Method)
	at sun.reflect.NativeMethodAccessorImpl.invoke(NativeMethodAccessorImpl.java:62)
	at sun.reflect.DelegatingMethodAccessorImpl.invoke(DelegatingMethodAccessorImpl.java:43)
	at java.lang.reflect.Method.invoke(Method.java:498)
	at com.carrotsearch.randomizedtesting.RandomizedRunner.invoke(RandomizedRunner.java:1764)
	at com.carrotsearch.randomizedtesting.RandomizedRunner$8.evaluate(RandomizedRunner.java:871)
	at com.carrotsearch.randomizedtesting.RandomizedRunner$9.evaluate(RandomizedRunner.java:907)
	at com.carrotsearch.randomizedtesting.RandomizedRunner$10.evaluate(RandomizedRunner.java:921)
	at org.apache.lucene.util.TestRuleSetupTeardownChained$1.evaluate(TestRuleSetupTeardownChained.java:49)
	at org.apache.lucene.util.AbstractBeforeAfterRule$1.evaluate(AbstractBeforeAfterRule.java:45)
	at org.apache.lucene.util.TestRuleThreadAndTestName$1.evaluate(TestRuleThreadAndTestName.java:48)
	at org.apache.lucene.util.TestRuleIgnoreAfterMaxFailures$1.evaluate(TestRuleIgnoreAfterMaxFailures.java:64)
	at org.apache.lucene.util.TestRuleMarkFailure$1.evaluate(TestRuleMarkFailure.java:47)
	at com.carrotsearch.randomizedtesting.rules.StatementAdapter.evaluate(StatementAdapter.java:36)
	at com.carrotsearch.randomizedtesting.ThreadLeakControl$StatementRunner.run(ThreadLeakControl.java:367)
	at com.carrotsearch.randomizedtesting.ThreadLeakControl.forkTimeoutingTask(ThreadLeakControl.java:809)
	at com.carrotsearch.randomizedtesting.ThreadLeakControl$3.evaluate(ThreadLeakControl.java:460)
	at com.carrotsearch.randomizedtesting.RandomizedRunner.runSingleTest(RandomizedRunner.java:880)
	at com.carrotsearch.randomizedtesting.RandomizedRunner$5.evaluate(RandomizedRunner.java:781)
	at com.carrotsearch.randomizedtesting.RandomizedRunner$6.evaluate(RandomizedRunner.java:816)
	at com.carrotsearch.randomizedtesting.RandomizedRunner$7.evaluate(RandomizedRunner.java:827)
	at org.apache.lucene.util.AbstractBeforeAfterRule$1.evaluate(AbstractBeforeAfterRule.java:45)
	at com.carrotsearch.randomizedtesting.rules.StatementAdapter.evaluate(StatementAdapter.java:36)
	at org.apache.lucene.util.TestRuleStoreClassName$1.evaluate(TestRuleStoreClassName.java:41)
	at com.carrotsearch.randomizedtesting.rules.NoShadowingOrOverridesOnMethodsRule$1.evaluate(NoShadowingOrOverridesOnMethodsRule.java:40)
	at com.carrotsearch.randomizedtesting.rules.NoShadowingOrOverridesOnMethodsRule$1.evaluate(NoShadowingOrOverridesOnMethodsRule.java:40)
	at com.carrotsearch.randomizedtesting.rules.StatementAdapter.evaluate(StatementAdapter.java:36)
	at com.carrotsearch.randomizedtesting.rules.StatementAdapter.evaluate(StatementAdapter.java:36)
	at com.carrotsearch.randomizedtesting.rules.StatementAdapter.evaluate(StatementAdapter.java:36)
	at org.apache.lucene.util.TestRuleAssertionsRequired$1.evaluate(TestRuleAssertionsRequired.java:53)
	at org.apache.lucene.util.TestRuleMarkFailure$1.evaluate(TestRuleMarkFailure.java:47)
	at org.apache.lucene.util.TestRuleIgnoreAfterMaxFailures$1.evaluate(TestRuleIgnoreAfterMaxFailures.java:64)
	at org.apache.lucene.util.TestRuleIgnoreTestSuites$1.evaluate(TestRuleIgnoreTestSuites.java:54)
	at com.carrotsearch.randomizedtesting.rules.StatementAdapter.evaluate(StatementAdapter.java:36)
	at com.carrotsearch.randomizedtesting.ThreadLeakControl$StatementRunner.run(ThreadLeakControl.java:367)
	at java.lang.Thread.run(Thread.java:745)


FAILED:  org.apache.lucene.queryparser.xml.TestCoreParser.testBooleanQueryXML

Error Message:
this IndexReader is closed

Stack Trace:
org.apache.lucene.store.AlreadyClosedException: this IndexReader is closed
	at __randomizedtesting.SeedInfo.seed([36E7629C7634AAC0:E0DCBDFD27F8FD83]:0)
	at org.apache.lucene.index.IndexReader.ensureOpen(IndexReader.java:272)
	at org.apache.lucene.index.SegmentReader.getPostingsReader(SegmentReader.java:240)
	at org.apache.lucene.index.CodecReader.fields(CodecReader.java:109)
	at org.apache.lucene.index.LeafReader.terms(LeafReader.java:207)
	at org.apache.lucene.index.TermContext.build(TermContext.java:91)
	at org.apache.lucene.search.TermQuery.createWeight(TermQuery.java:191)
	at org.apache.lucene.search.IndexSearcher.createWeight(IndexSearcher.java:752)
	at org.apache.lucene.search.AssertingIndexSearcher.createWeight(AssertingIndexSearcher.java:76)
	at org.apache.lucene.search.BooleanWeight.<init>(BooleanWeight.java:57)
	at org.apache.lucene.search.BooleanQuery.createWeight(BooleanQuery.java:226)
	at org.apache.lucene.search.IndexSearcher.createWeight(IndexSearcher.java:752)
	at org.apache.lucene.search.AssertingIndexSearcher.createWeight(AssertingIndexSearcher.java:76)
	at org.apache.lucene.search.IndexSearcher.createNormalizedWeight(IndexSearcher.java:735)
	at org.apache.lucene.search.AssertingIndexSearcher.createNormalizedWeight(AssertingIndexSearcher.java:57)
	at org.apache.lucene.search.IndexSearcher.search(IndexSearcher.java:473)
	at org.apache.lucene.search.IndexSearcher.search(IndexSearcher.java:592)
	at org.apache.lucene.search.IndexSearcher.searchAfter(IndexSearcher.java:450)
	at org.apache.lucene.search.IndexSearcher.search(IndexSearcher.java:461)
	at org.apache.lucene.queryparser.xml.TestCoreParser.dumpResults(TestCoreParser.java:194)
	at org.apache.lucene.queryparser.xml.TestCoreParser.testBooleanQueryXML(TestCoreParser.java:73)
	at sun.reflect.NativeMethodAccessorImpl.invoke0(Native Method)
	at sun.reflect.NativeMethodAccessorImpl.invoke(NativeMethodAccessorImpl.java:62)
	at sun.reflect.DelegatingMethodAccessorImpl.invoke(DelegatingMethodAccessorImpl.java:43)
	at java.lang.reflect.Method.invoke(Method.java:498)
	at com.carrotsearch.randomizedtesting.RandomizedRunner.invoke(RandomizedRunner.java:1764)
	at com.carrotsearch.randomizedtesting.RandomizedRunner$8.evaluate(RandomizedRunner.java:871)
	at com.carrotsearch.randomizedtesting.RandomizedRunner$9.evaluate(RandomizedRunner.java:907)
	at com.carrotsearch.randomizedtesting.RandomizedRunner$10.evaluate(RandomizedRunner.java:921)
	at org.apache.lucene.util.TestRuleSetupTeardownChained$1.evaluate(TestRuleSetupTeardownChained.java:49)
	at org.apache.lucene.util.AbstractBeforeAfterRule$1.evaluate(AbstractBeforeAfterRule.java:45)
	at org.apache.lucene.util.TestRuleThreadAndTestName$1.evaluate(TestRuleThreadAndTestName.java:48)
	at org.apache.lucene.util.TestRuleIgnoreAfterMaxFailures$1.evaluate(TestRuleIgnoreAfterMaxFailures.java:64)
	at org.apache.lucene.util.TestRuleMarkFailure$1.evaluate(TestRuleMarkFailure.java:47)
	at com.carrotsearch.randomizedtesting.rules.StatementAdapter.evaluate(StatementAdapter.java:36)
	at com.carrotsearch.randomizedtesting.ThreadLeakControl$StatementRunner.run(ThreadLeakControl.java:367)
	at com.carrotsearch.randomizedtesting.ThreadLeakControl.forkTimeoutingTask(ThreadLeakControl.java:809)
	at com.carrotsearch.randomizedtesting.ThreadLeakControl$3.evaluate(ThreadLeakControl.java:460)
	at com.carrotsearch.randomizedtesting.RandomizedRunner.runSingleTest(RandomizedRunner.java:880)
	at com.carrotsearch.randomizedtesting.RandomizedRunner$5.evaluate(RandomizedRunner.java:781)
	at com.carrotsearch.randomizedtesting.RandomizedRunner$6.evaluate(RandomizedRunner.java:816)
	at com.carrotsearch.randomizedtesting.RandomizedRunner$7.evaluate(RandomizedRunner.java:827)
	at org.apache.lucene.util.AbstractBeforeAfterRule$1.evaluate(AbstractBeforeAfterRule.java:45)
	at com.carrotsearch.randomizedtesting.rules.StatementAdapter.evaluate(StatementAdapter.java:36)
	at org.apache.lucene.util.TestRuleStoreClassName$1.evaluate(TestRuleStoreClassName.java:41)
	at com.carrotsearch.randomizedtesting.rules.NoShadowingOrOverridesOnMethodsRule$1.evaluate(NoShadowingOrOverridesOnMethodsRule.java:40)
	at com.carrotsearch.randomizedtesting.rules.NoShadowingOrOverridesOnMethodsRule$1.evaluate(NoShadowingOrOverridesOnMethodsRule.java:40)
	at com.carrotsearch.randomizedtesting.rules.StatementAdapter.evaluate(StatementAdapter.java:36)
	at com.carrotsearch.randomizedtesting.rules.StatementAdapter.evaluate(StatementAdapter.java:36)
	at com.carrotsearch.randomizedtesting.rules.StatementAdapter.evaluate(StatementAdapter.java:36)
	at org.apache.lucene.util.TestRuleAssertionsRequired$1.evaluate(TestRuleAssertionsRequired.java:53)
	at org.apache.lucene.util.TestRuleMarkFailure$1.evaluate(TestRuleMarkFailure.java:47)
	at org.apache.lucene.util.TestRuleIgnoreAfterMaxFailures$1.evaluate(TestRuleIgnoreAfterMaxFailures.java:64)
	at org.apache.lucene.util.TestRuleIgnoreTestSuites$1.evaluate(TestRuleIgnoreTestSuites.java:54)
	at com.carrotsearch.randomizedtesting.rules.StatementAdapter.evaluate(StatementAdapter.java:36)
	at com.carrotsearch.randomizedtesting.ThreadLeakControl$StatementRunner.run(ThreadLeakControl.java:367)
	at java.lang.Thread.run(Thread.java:745)


FAILED:  org.apache.lucene.queryparser.xml.TestCoreParser.testSpanTermXML

Error Message:
this IndexReader is closed

Stack Trace:
org.apache.lucene.store.AlreadyClosedException: this IndexReader is closed
	at __randomizedtesting.SeedInfo.seed([36E7629C7634AAC0:D25AA83BA5FB3E07]:0)
	at org.apache.lucene.index.IndexReader.ensureOpen(IndexReader.java:272)
	at org.apache.lucene.index.SegmentReader.getPostingsReader(SegmentReader.java:240)
	at org.apache.lucene.index.CodecReader.fields(CodecReader.java:109)
	at org.apache.lucene.index.LeafReader.terms(LeafReader.java:207)
	at org.apache.lucene.index.TermContext.build(TermContext.java:91)
	at org.apache.lucene.search.spans.SpanTermQuery.createWeight(SpanTermQuery.java:71)
	at org.apache.lucene.search.spans.SpanOrQuery.createWeight(SpanOrQuery.java:125)
	at org.apache.lucene.search.spans.SpanNearQuery.createWeight(SpanNearQuery.java:182)
	at org.apache.lucene.search.spans.SpanOrQuery.createWeight(SpanOrQuery.java:125)
	at org.apache.lucene.search.spans.SpanOrQuery.createWeight(SpanOrQuery.java:41)
	at org.apache.lucene.search.IndexSearcher.createWeight(IndexSearcher.java:752)
	at org.apache.lucene.search.AssertingIndexSearcher.createWeight(AssertingIndexSearcher.java:76)
	at org.apache.lucene.search.IndexSearcher.createNormalizedWeight(IndexSearcher.java:735)
	at org.apache.lucene.search.AssertingIndexSearcher.createNormalizedWeight(AssertingIndexSearcher.java:57)
	at org.apache.lucene.search.IndexSearcher.search(IndexSearcher.java:473)
	at org.apache.lucene.search.IndexSearcher.search(IndexSearcher.java:592)
	at org.apache.lucene.search.IndexSearcher.searchAfter(IndexSearcher.java:450)
	at org.apache.lucene.search.IndexSearcher.search(IndexSearcher.java:461)
	at org.apache.lucene.queryparser.xml.TestCoreParser.dumpResults(TestCoreParser.java:194)
	at org.apache.lucene.queryparser.xml.TestCoreParser.testSpanTermXML(TestCoreParser.java:110)
	at sun.reflect.NativeMethodAccessorImpl.invoke0(Native Method)
	at sun.reflect.NativeMethodAccessorImpl.invoke(NativeMethodAccessorImpl.java:62)
	at sun.reflect.DelegatingMethodAccessorImpl.invoke(DelegatingMethodAccessorImpl.java:43)
	at java.lang.reflect.Method.invoke(Method.java:498)
	at com.carrotsearch.randomizedtesting.RandomizedRunner.invoke(RandomizedRunner.java:1764)
	at com.carrotsearch.randomizedtesting.RandomizedRunner$8.evaluate(RandomizedRunner.java:871)
	at com.carrotsearch.randomizedtesting.RandomizedRunner$9.evaluate(RandomizedRunner.java:907)
	at com.carrotsearch.randomizedtesting.RandomizedRunner$10.evaluate(RandomizedRunner.java:921)
	at org.apache.lucene.util.TestRuleSetupTeardownChained$1.evaluate(TestRuleSetupTeardownChained.java:49)
	at org.apache.lucene.util.AbstractBeforeAfterRule$1.evaluate(AbstractBeforeAfterRule.java:45)
	at org.apache.lucene.util.TestRuleThreadAndTestName$1.evaluate(TestRuleThreadAndTestName.java:48)
	at org.apache.lucene.util.TestRuleIgnoreAfterMaxFailures$1.evaluate(TestRuleIgnoreAfterMaxFailures.java:64)
	at org.apache.lucene.util.TestRuleMarkFailure$1.evaluate(TestRuleMarkFailure.java:47)
	at com.carrotsearch.randomizedtesting.rules.StatementAdapter.evaluate(StatementAdapter.java:36)
	at com.carrotsearch.randomizedtesting.ThreadLeakControl$StatementRunner.run(ThreadLeakControl.java:367)
	at com.carrotsearch.randomizedtesting.ThreadLeakControl.forkTimeoutingTask(ThreadLeakControl.java:809)
	at com.carrotsearch.randomizedtesting.ThreadLeakControl$3.evaluate(ThreadLeakControl.java:460)
	at com.carrotsearch.randomizedtesting.RandomizedRunner.runSingleTest(RandomizedRunner.java:880)
	at com.carrotsearch.randomizedtesting.RandomizedRunner$5.evaluate(RandomizedRunner.java:781)
	at com.carrotsearch.randomizedtesting.RandomizedRunner$6.evaluate(RandomizedRunner.java:816)
	at com.carrotsearch.randomizedtesting.RandomizedRunner$7.evaluate(RandomizedRunner.java:827)
	at org.apache.lucene.util.AbstractBeforeAfterRule$1.evaluate(AbstractBeforeAfterRule.java:45)
	at com.carrotsearch.randomizedtesting.rules.StatementAdapter.evaluate(StatementAdapter.java:36)
	at org.apache.lucene.util.TestRuleStoreClassName$1.evaluate(TestRuleStoreClassName.java:41)
	at com.carrotsearch.randomizedtesting.rules.NoShadowingOrOverridesOnMethodsRule$1.evaluate(NoShadowingOrOverridesOnMethodsRule.java:40)
	at com.carrotsearch.randomizedtesting.rules.NoShadowingOrOverridesOnMethodsRule$1.evaluate(NoShadowingOrOverridesOnMethodsRule.java:40)
	at com.carrotsearch.randomizedtesting.rules.StatementAdapter.evaluate(StatementAdapter.java:36)
	at com.carrotsearch.randomizedtesting.rules.StatementAdapter.evaluate(StatementAdapter.java:36)
	at com.carrotsearch.randomizedtesting.rules.StatementAdapter.evaluate(StatementAdapter.java:36)
	at org.apache.lucene.util.TestRuleAssertionsRequired$1.evaluate(TestRuleAssertionsRequired.java:53)
	at org.apache.lucene.util.TestRuleMarkFailure$1.evaluate(TestRuleMarkFailure.java:47)
	at org.apache.lucene.util.TestRuleIgnoreAfterMaxFailures$1.evaluate(TestRuleIgnoreAfterMaxFailures.java:64)
	at org.apache.lucene.util.TestRuleIgnoreTestSuites$1.evaluate(TestRuleIgnoreTestSuites.java:54)
	at com.carrotsearch.randomizedtesting.rules.StatementAdapter.evaluate(StatementAdapter.java:36)
	at com.carrotsearch.randomizedtesting.ThreadLeakControl$StatementRunner.run(ThreadLeakControl.java:367)
	at java.lang.Thread.run(Thread.java:745)


FAILED:  org.apache.lucene.queryparser.xml.TestCoreParser.testCustomFieldUserQueryXML

Error Message:
this IndexReader is closed

Stack Trace:
org.apache.lucene.store.AlreadyClosedException: this IndexReader is closed
	at __randomizedtesting.SeedInfo.seed([36E7629C7634AAC0:B2DED973FA0A76F]:0)
	at org.apache.lucene.index.IndexReader.ensureOpen(IndexReader.java:272)
	at org.apache.lucene.index.SegmentReader.getPostingsReader(SegmentReader.java:240)
	at org.apache.lucene.index.CodecReader.fields(CodecReader.java:109)
	at org.apache.lucene.index.LeafReader.terms(LeafReader.java:207)
	at org.apache.lucene.index.TermContext.build(TermContext.java:91)
	at org.apache.lucene.search.TermQuery.createWeight(TermQuery.java:191)
	at org.apache.lucene.search.BoostQuery.createWeight(BoostQuery.java:116)
	at org.apache.lucene.search.IndexSearcher.createWeight(IndexSearcher.java:752)
	at org.apache.lucene.search.AssertingIndexSearcher.createWeight(AssertingIndexSearcher.java:76)
	at org.apache.lucene.search.IndexSearcher.createNormalizedWeight(IndexSearcher.java:735)
	at org.apache.lucene.search.AssertingIndexSearcher.createNormalizedWeight(AssertingIndexSearcher.java:57)
	at org.apache.lucene.search.IndexSearcher.search(IndexSearcher.java:473)
	at org.apache.lucene.search.IndexSearcher.search(IndexSearcher.java:592)
	at org.apache.lucene.search.IndexSearcher.searchAfter(IndexSearcher.java:450)
	at org.apache.lucene.search.IndexSearcher.search(IndexSearcher.java:461)
	at org.apache.lucene.queryparser.xml.TestCoreParser.testCustomFieldUserQueryXML(TestCoreParser.java:99)
	at sun.reflect.NativeMethodAccessorImpl.invoke0(Native Method)
	at sun.reflect.NativeMethodAccessorImpl.invoke(NativeMethodAccessorImpl.java:62)
	at sun.reflect.DelegatingMethodAccessorImpl.invoke(DelegatingMethodAccessorImpl.java:43)
	at java.lang.reflect.Method.invoke(Method.java:498)
	at com.carrotsearch.randomizedtesting.RandomizedRunner.invoke(RandomizedRunner.java:1764)
	at com.carrotsearch.randomizedtesting.RandomizedRunner$8.evaluate(RandomizedRunner.java:871)
	at com.carrotsearch.randomizedtesting.RandomizedRunner$9.evaluate(RandomizedRunner.java:907)
	at com.carrotsearch.randomizedtesting.RandomizedRunner$10.evaluate(RandomizedRunner.java:921)
	at org.apache.lucene.util.TestRuleSetupTeardownChained$1.evaluate(TestRuleSetupTeardownChained.java:49)
	at org.apache.lucene.util.AbstractBeforeAfterRule$1.evaluate(AbstractBeforeAfterRule.java:45)
	at org.apache.lucene.util.TestRuleThreadAndTestName$1.evaluate(TestRuleThreadAndTestName.java:48)
	at org.apache.lucene.util.TestRuleIgnoreAfterMaxFailures$1.evaluate(TestRuleIgnoreAfterMaxFailures.java:64)
	at org.apache.lucene.util.TestRuleMarkFailure$1.evaluate(TestRuleMarkFailure.java:47)
	at com.carrotsearch.randomizedtesting.rules.StatementAdapter.evaluate(StatementAdapter.java:36)
	at com.carrotsearch.randomizedtesting.ThreadLeakControl$StatementRunner.run(ThreadLeakControl.java:367)
	at com.carrotsearch.randomizedtesting.ThreadLeakControl.forkTimeoutingTask(ThreadLeakControl.java:809)
	at com.carrotsearch.randomizedtesting.ThreadLeakControl$3.evaluate(ThreadLeakControl.java:460)
	at com.carrotsearch.randomizedtesting.RandomizedRunner.runSingleTest(RandomizedRunner.java:880)
	at com.carrotsearch.randomizedtesting.RandomizedRunner$5.evaluate(RandomizedRunner.java:781)
	at com.carrotsearch.randomizedtesting.RandomizedRunner$6.evaluate(RandomizedRunner.java:816)
	at com.carrotsearch.randomizedtesting.RandomizedRunner$7.evaluate(RandomizedRunner.java:827)
	at org.apache.lucene.util.AbstractBeforeAfterRule$1.evaluate(AbstractBeforeAfterRule.java:45)
	at com.carrotsearch.randomizedtesting.rules.StatementAdapter.evaluate(StatementAdapter.java:36)
	at org.apache.lucene.util.TestRuleStoreClassName$1.evaluate(TestRuleStoreClassName.java:41)
	at com.carrotsearch.randomizedtesting.rules.NoShadowingOrOverridesOnMethodsRule$1.evaluate(NoShadowingOrOverridesOnMethodsRule.java:40)
	at com.carrotsearch.randomizedtesting.rules.NoShadowingOrOverridesOnMethodsRule$1.evaluate(NoShadowingOrOverridesOnMethodsRule.java:40)
	at com.carrotsearch.randomizedtesting.rules.StatementAdapter.evaluate(StatementAdapter.java:36)
	at com.carrotsearch.randomizedtesting.rules.StatementAdapter.evaluate(StatementAdapter.java:36)
	at com.carrotsearch.randomizedtesting.rules.StatementAdapter.evaluate(StatementAdapter.java:36)
	at org.apache.lucene.util.TestRuleAssertionsRequired$1.evaluate(TestRuleAssertionsRequired.java:53)
	at org.apache.lucene.util.TestRuleMarkFailure$1.evaluate(TestRuleMarkFailure.java:47)
	at org.apache.lucene.util.TestRuleIgnoreAfterMaxFailures$1.evaluate(TestRuleIgnoreAfterMaxFailures.java:64)
	at org.apache.lucene.util.TestRuleIgnoreTestSuites$1.evaluate(TestRuleIgnoreTestSuites.java:54)
	at com.carrotsearch.randomizedtesting.rules.StatementAdapter.evaluate(StatementAdapter.java:36)
	at com.carrotsearch.randomizedtesting.ThreadLeakControl$StatementRunner.run(ThreadLeakControl.java:367)
	at java.lang.Thread.run(Thread.java:745)


FAILED:  org.apache.lucene.queryparser.xml.TestCoreParser.testMatchAllDocsPlusFilterXML

Error Message:
this IndexReader is closed

Stack Trace:
org.apache.lucene.store.AlreadyClosedException: this IndexReader is closed
	at __randomizedtesting.SeedInfo.seed([36E7629C7634AAC0:2ABAEB0C1D69CEC1]:0)
	at org.apache.lucene.index.IndexReader.ensureOpen(IndexReader.java:272)
	at org.apache.lucene.index.SegmentReader.getPostingsReader(SegmentReader.java:240)
	at org.apache.lucene.index.CodecReader.fields(CodecReader.java:109)
	at org.apache.lucene.index.LeafReader.terms(LeafReader.java:207)
	at org.apache.lucene.search.MultiTermQueryConstantScoreWrapper$1.rewrite(MultiTermQueryConstantScoreWrapper.java:142)
	at org.apache.lucene.search.MultiTermQueryConstantScoreWrapper$1.bulkScorer(MultiTermQueryConstantScoreWrapper.java:201)
	at org.apache.lucene.search.LRUQueryCache$CachingWrapperWeight.bulkScorer(LRUQueryCache.java:644)
	at org.apache.lucene.search.AssertingWeight.bulkScorer(AssertingWeight.java:68)
	at org.apache.lucene.search.ConstantScoreQuery$1.bulkScorer(ConstantScoreQuery.java:120)
	at org.apache.lucene.search.AssertingWeight.bulkScorer(AssertingWeight.java:68)
	at org.apache.lucene.search.AssertingWeight.bulkScorer(AssertingWeight.java:68)
	at org.apache.lucene.search.IndexSearcher.search(IndexSearcher.java:666)
	at org.apache.lucene.search.AssertingIndexSearcher.search(AssertingIndexSearcher.java:91)
	at org.apache.lucene.search.IndexSearcher.search(IndexSearcher.java:473)
	at org.apache.lucene.search.IndexSearcher.search(IndexSearcher.java:592)
	at org.apache.lucene.search.IndexSearcher.searchAfter(IndexSearcher.java:450)
	at org.apache.lucene.search.IndexSearcher.search(IndexSearcher.java:461)
	at org.apache.lucene.queryparser.xml.TestCoreParser.dumpResults(TestCoreParser.java:194)
	at org.apache.lucene.queryparser.xml.TestCoreParser.testMatchAllDocsPlusFilterXML(TestCoreParser.java:120)
	at sun.reflect.NativeMethodAccessorImpl.invoke0(Native Method)
	at sun.reflect.NativeMethodAccessorImpl.invoke(NativeMethodAccessorImpl.java:62)
	at sun.reflect.DelegatingMethodAccessorImpl.invoke(DelegatingMethodAccessorImpl.java:43)
	at java.lang.reflect.Method.invoke(Method.java:498)
	at com.carrotsearch.randomizedtesting.RandomizedRunner.invoke(RandomizedRunner.java:1764)
	at com.carrotsearch.randomizedtesting.RandomizedRunner$8.evaluate(RandomizedRunner.java:871)
	at com.carrotsearch.randomizedtesting.RandomizedRunner$9.evaluate(RandomizedRunner.java:907)
	at com.carrotsearch.randomizedtesting.RandomizedRunner$10.evaluate(RandomizedRunner.java:921)
	at org.apache.lucene.util.TestRuleSetupTeardownChained$1.evaluate(TestRuleSetupTeardownChained.java:49)
	at org.apache.lucene.util.AbstractBeforeAfterRule$1.evaluate(AbstractBeforeAfterRule.java:45)
	at org.apache.lucene.util.TestRuleThreadAndTestName$1.evaluate(TestRuleThreadAndTestName.java:48)
	at org.apache.lucene.util.TestRuleIgnoreAfterMaxFailures$1.evaluate(TestRuleIgnoreAfterMaxFailures.java:64)
	at org.apache.lucene.util.TestRuleMarkFailure$1.evaluate(TestRuleMarkFailure.java:47)
	at com.carrotsearch.randomizedtesting.rules.StatementAdapter.evaluate(StatementAdapter.java:36)
	at com.carrotsearch.randomizedtesting.ThreadLeakControl$StatementRunner.run(ThreadLeakControl.java:367)
	at com.carrotsearch.randomizedtesting.ThreadLeakControl.forkTimeoutingTask(ThreadLeakControl.java:809)
	at com.carrotsearch.randomizedtesting.ThreadLeakControl$3.evaluate(ThreadLeakControl.java:460)
	at com.carrotsearch.randomizedtesting.RandomizedRunner.runSingleTest(RandomizedRunner.java:880)
	at com.carrotsearch.randomizedtesting.RandomizedRunner$5.evaluate(RandomizedRunner.java:781)
	at com.carrotsearch.randomizedtesting.RandomizedRunner$6.evaluate(RandomizedRunner.java:816)
	at com.carrotsearch.randomizedtesting.RandomizedRunner$7.evaluate(RandomizedRunner.java:827)
	at org.apache.lucene.util.AbstractBeforeAfterRule$1.evaluate(AbstractBeforeAfterRule.java:45)
	at com.carrotsearch.randomizedtesting.rules.StatementAdapter.evaluate(StatementAdapter.java:36)
	at org.apache.lucene.util.TestRuleStoreClassName$1.evaluate(TestRuleStoreClassName.java:41)
	at com.carrotsearch.randomizedtesting.rules.NoShadowingOrOverridesOnMethodsRule$1.evaluate(NoShadowingOrOverridesOnMethodsRule.java:40)
	at com.carrotsearch.randomizedtesting.rules.NoShadowingOrOverridesOnMethodsRule$1.evaluate(NoShadowingOrOverridesOnMethodsRule.java:40)
	at com.carrotsearch.randomizedtesting.rules.StatementAdapter.evaluate(StatementAdapter.java:36)
	at com.carrotsearch.randomizedtesting.rules.StatementAdapter.evaluate(StatementAdapter.java:36)
	at com.carrotsearch.randomizedtesting.rules.StatementAdapter.evaluate(StatementAdapter.java:36)
	at org.apache.lucene.util.TestRuleAssertionsRequired$1.evaluate(TestRuleAssertionsRequired.java:53)
	at org.apache.lucene.util.TestRuleMarkFailure$1.evaluate(TestRuleMarkFailure.java:47)
	at org.apache.lucene.util.TestRuleIgnoreAfterMaxFailures$1.evaluate(TestRuleIgnoreAfterMaxFailures.java:64)
	at org.apache.lucene.util.TestRuleIgnoreTestSuites$1.evaluate(TestRuleIgnoreTestSuites.java:54)
	at com.carrotsearch.randomizedtesting.rules.StatementAdapter.evaluate(StatementAdapter.java:36)
	at com.carrotsearch.randomizedtesting.ThreadLeakControl$StatementRunner.run(ThreadLeakControl.java:367)
	at java.lang.Thread.run(Thread.java:745)


FAILED:  org.apache.lucene.queryparser.xml.TestCoreParser.testNumericRangeQueryXML

Error Message:
this IndexReader is closed

Stack Trace:
org.apache.lucene.store.AlreadyClosedException: this IndexReader is closed
	at __randomizedtesting.SeedInfo.seed([36E7629C7634AAC0:149FF15FC2873968]:0)
	at org.apache.lucene.index.IndexReader.ensureOpen(IndexReader.java:272)
	at org.apache.lucene.index.SegmentReader.getPostingsReader(SegmentReader.java:240)
	at org.apache.lucene.index.CodecReader.fields(CodecReader.java:109)
	at org.apache.lucene.index.LeafReader.terms(LeafReader.java:207)
	at org.apache.lucene.index.TermContext.build(TermContext.java:91)
	at org.apache.lucene.search.TermQuery.createWeight(TermQuery.java:191)
	at org.apache.lucene.search.IndexSearcher.createWeight(IndexSearcher.java:752)
	at org.apache.lucene.search.AssertingIndexSearcher.createWeight(AssertingIndexSearcher.java:76)
	at org.apache.lucene.search.BooleanWeight.<init>(BooleanWeight.java:57)
	at org.apache.lucene.search.BooleanQuery.createWeight(BooleanQuery.java:226)
	at org.apache.lucene.search.IndexSearcher.createWeight(IndexSearcher.java:752)
	at org.apache.lucene.search.AssertingIndexSearcher.createWeight(AssertingIndexSearcher.java:76)
	at org.apache.lucene.search.IndexSearcher.createNormalizedWeight(IndexSearcher.java:735)
	at org.apache.lucene.search.AssertingIndexSearcher.createNormalizedWeight(AssertingIndexSearcher.java:57)
	at org.apache.lucene.search.IndexSearcher.search(IndexSearcher.java:473)
	at org.apache.lucene.search.IndexSearcher.search(IndexSearcher.java:592)
	at org.apache.lucene.search.IndexSearcher.searchAfter(IndexSearcher.java:450)
	at org.apache.lucene.search.IndexSearcher.search(IndexSearcher.java:461)
	at org.apache.lucene.queryparser.xml.TestCoreParser.dumpResults(TestCoreParser.java:194)
	at org.apache.lucene.queryparser.xml.TestCoreParser.testNumericRangeQueryXML(TestCoreParser.java:130)
	at sun.reflect.NativeMethodAccessorImpl.invoke0(Native Method)
	at sun.reflect.NativeMethodAccessorImpl.invoke(NativeMethodAccessorImpl.java:62)
	at sun.reflect.DelegatingMethodAccessorImpl.invoke(DelegatingMethodAccessorImpl.java:43)
	at java.lang.reflect.Method.invoke(Method.java:498)
	at com.carrotsearch.randomizedtesting.RandomizedRunner.invoke(RandomizedRunner.java:1764)
	at com.carrotsearch.randomizedtesting.RandomizedRunner$8.evaluate(RandomizedRunner.java:871)
	at com.carrotsearch.randomizedtesting.RandomizedRunner$9.evaluate(RandomizedRunner.java:907)
	at com.carrotsearch.randomizedtesting.RandomizedRunner$10.evaluate(RandomizedRunner.java:921)
	at org.apache.lucene.util.TestRuleSetupTeardownChained$1.evaluate(TestRuleSetupTeardownChained.java:49)
	at org.apache.lucene.util.AbstractBeforeAfterRule$1.evaluate(AbstractBeforeAfterRule.java:45)
	at org.apache.lucene.util.TestRuleThreadAndTestName$1.evaluate(TestRuleThreadAndTestName.java:48)
	at org.apache.lucene.util.TestRuleIgnoreAfterMaxFailures$1.evaluate(TestRuleIgnoreAfterMaxFailures.java:64)
	at org.apache.lucene.util.TestRuleMarkFailure$1.evaluate(TestRuleMarkFailure.java:47)
	at com.carrotsearch.randomizedtesting.rules.StatementAdapter.evaluate(StatementAdapter.java:36)
	at com.carrotsearch.randomizedtesting.ThreadLeakControl$StatementRunner.run(ThreadLeakControl.java:367)
	at com.carrotsearch.randomizedtesting.ThreadLeakControl.forkTimeoutingTask(ThreadLeakControl.java:809)
	at com.carrotsearch.randomizedtesting.ThreadLeakControl$3.evaluate(ThreadLeakControl.java:460)
	at com.carrotsearch.randomizedtesting.RandomizedRunner.runSingleTest(RandomizedRunner.java:880)
	at com.carrotsearch.randomizedtesting.RandomizedRunner$5.evaluate(RandomizedRunner.java:781)
	at com.carrotsearch.randomizedtesting.RandomizedRunner$6.evaluate(RandomizedRunner.java:816)
	at com.carrotsearch.randomizedtesting.RandomizedRunner$7.evaluate(RandomizedRunner.java:827)
	at org.apache.lucene.util.AbstractBeforeAfterRule$1.evaluate(AbstractBeforeAfterRule.java:45)
	at com.carrotsearch.randomizedtesting.rules.StatementAdapter.evaluate(StatementAdapter.java:36)
	at org.apache.lucene.util.TestRuleStoreClassName$1.evaluate(TestRuleStoreClassName.java:41)
	at com.carrotsearch.randomizedtesting.rules.NoShadowingOrOverridesOnMethodsRule$1.evaluate(NoShadowingOrOverridesOnMethodsRule.java:40)
	at com.carrotsearch.randomizedtesting.rules.NoShadowingOrOverridesOnMethodsRule$1.evaluate(NoShadowingOrOverridesOnMethodsRule.java:40)
	at com.carrotsearch.randomizedtesting.rules.StatementAdapter.evaluate(StatementAdapter.java:36)
	at com.carrotsearch.randomizedtesting.rules.StatementAdapter.evaluate(StatementAdapter.java:36)
	at com.carrotsearch.randomizedtesting.rules.StatementAdapter.evaluate(StatementAdapter.java:36)
	at org.apache.lucene.util.TestRuleAssertionsRequired$1.evaluate(TestRuleAssertionsRequired.java:53)
	at org.apache.lucene.util.TestRuleMarkFailure$1.evaluate(TestRuleMarkFailure.java:47)
	at org.apache.lucene.util.TestRuleIgnoreAfterMaxFailures$1.evaluate(TestRuleIgnoreAfterMaxFailures.java:64)
	at org.apache.lucene.util.TestRuleIgnoreTestSuites$1.evaluate(TestRuleIgnoreTestSuites.java:54)
	at com.carrotsearch.randomizedtesting.rules.StatementAdapter.evaluate(StatementAdapter.java:36)
	at com.carrotsearch.randomizedtesting.ThreadLeakControl$StatementRunner.run(ThreadLeakControl.java:367)
	at java.lang.Thread.run(Thread.java:745)


FAILED:  org.apache.lucene.queryparser.xml.TestCoreParser.testTermQueryXML

Error Message:
this IndexReader is closed

Stack Trace:
org.apache.lucene.store.AlreadyClosedException: this IndexReader is closed
	at __randomizedtesting.SeedInfo.seed([36E7629C7634AAC0:AC034171ABCAA728]:0)
	at org.apache.lucene.index.IndexReader.ensureOpen(IndexReader.java:272)
	at org.apache.lucene.index.SegmentReader.getPostingsReader(SegmentReader.java:240)
	at org.apache.lucene.index.CodecReader.fields(CodecReader.java:109)
	at org.apache.lucene.index.LeafReader.terms(LeafReader.java:207)
	at org.apache.lucene.index.TermContext.build(TermContext.java:91)
	at org.apache.lucene.search.TermQuery.createWeight(TermQuery.java:191)
	at org.apache.lucene.search.IndexSearcher.createWeight(IndexSearcher.java:752)
	at org.apache.lucene.search.AssertingIndexSearcher.createWeight(AssertingIndexSearcher.java:76)
	at org.apache.lucene.search.IndexSearcher.createNormalizedWeight(IndexSearcher.java:735)
	at org.apache.lucene.search.AssertingIndexSearcher.createNormalizedWeight(AssertingIndexSearcher.java:57)
	at org.apache.lucene.search.IndexSearcher.search(IndexSearcher.java:473)
	at org.apache.lucene.search.IndexSearcher.search(IndexSearcher.java:592)
	at org.apache.lucene.search.IndexSearcher.searchAfter(IndexSearcher.java:450)
	at org.apache.lucene.search.IndexSearcher.search(IndexSearcher.java:461)
	at org.apache.lucene.queryparser.xml.TestCoreParser.dumpResults(TestCoreParser.java:194)
	at org.apache.lucene.queryparser.xml.TestCoreParser.testTermQueryXML(TestCoreParser.java:63)
	at sun.reflect.NativeMethodAccessorImpl.invoke0(Native Method)
	at sun.reflect.NativeMethodAccessorImpl.invoke(NativeMethodAccessorImpl.java:62)
	at sun.reflect.DelegatingMethodAccessorImpl.invoke(DelegatingMethodAccessorImpl.java:43)
	at java.lang.reflect.Method.invoke(Method.java:498)
	at com.carrotsearch.randomizedtesting.RandomizedRunner.invoke(RandomizedRunner.java:1764)
	at com.carrotsearch.randomizedtesting.RandomizedRunner$8.evaluate(RandomizedRunner.java:871)
	at com.carrotsearch.randomizedtesting.RandomizedRunner$9.evaluate(RandomizedRunner.java:907)
	at com.carrotsearch.randomizedtesting.RandomizedRunner$10.evaluate(RandomizedRunner.java:921)
	at org.apache.lucene.util.TestRuleSetupTeardownChained$1.evaluate(TestRuleSetupTeardownChained.java:49)
	at org.apache.lucene.util.AbstractBeforeAfterRule$1.evaluate(AbstractBeforeAfterRule.java:45)
	at org.apache.lucene.util.TestRuleThreadAndTestName$1.evaluate(TestRuleThreadAndTestName.java:48)
	at org.apache.lucene.util.TestRuleIgnoreAfterMaxFailures$1.evaluate(TestRuleIgnoreAfterMaxFailures.java:64)
	at org.apache.lucene.util.TestRuleMarkFailure$1.evaluate(TestRuleMarkFailure.java:47)
	at com.carrotsearch.randomizedtesting.rules.StatementAdapter.evaluate(StatementAdapter.java:36)
	at com.carrotsearch.randomizedtesting.ThreadLeakControl$StatementRunner.run(ThreadLeakControl.java:367)
	at com.carrotsearch.randomizedtesting.ThreadLeakControl.forkTimeoutingTask(ThreadLeakControl.java:809)
	at com.carrotsearch.randomizedtesting.ThreadLeakControl$3.evaluate(ThreadLeakControl.java:460)
	at com.carrotsearch.randomizedtesting.RandomizedRunner.runSingleTest(RandomizedRunner.java:880)
	at com.carrotsearch.randomizedtesting.RandomizedRunner$5.evaluate(RandomizedRunner.java:781)
	at com.carrotsearch.randomizedtesting.RandomizedRunner$6.evaluate(RandomizedRunner.java:816)
	at com.carrotsearch.randomizedtesting.RandomizedRunner$7.evaluate(RandomizedRunner.java:827)
	at org.apache.lucene.util.AbstractBeforeAfterRule$1.evaluate(AbstractBeforeAfterRule.java:45)
	at com.carrotsearch.randomizedtesting.rules.StatementAdapter.evaluate(StatementAdapter.java:36)
	at org.apache.lucene.util.TestRuleStoreClassName$1.evaluate(TestRuleStoreClassName.java:41)
	at com.carrotsearch.randomizedtesting.rules.NoShadowingOrOverridesOnMethodsRule$1.evaluate(NoShadowingOrOverridesOnMethodsRule.java:40)
	at com.carrotsearch.randomizedtesting.rules.NoShadowingOrOverridesOnMethodsRule$1.evaluate(NoShadowingOrOverridesOnMethodsRule.java:40)
	at com.carrotsearch.randomizedtesting.rules.StatementAdapter.evaluate(StatementAdapter.java:36)
	at com.carrotsearch.randomizedtesting.rules.StatementAdapter.evaluate(StatementAdapter.java:36)
	at com.carrotsearch.randomizedtesting.rules.StatementAdapter.evaluate(StatementAdapter.java:36)
	at org.apache.lucene.util.TestRuleAssertionsRequired$1.evaluate(TestRuleAssertionsRequired.java:53)
	at org.apache.lucene.util.TestRuleMarkFailure$1.evaluate(TestRuleMarkFailure.java:47)
	at org.apache.lucene.util.TestRuleIgnoreAfterMaxFailures$1.evaluate(TestRuleIgnoreAfterMaxFailures.java:64)
	at org.apache.lucene.util.TestRuleIgnoreTestSuites$1.evaluate(TestRuleIgnoreTestSuites.java:54)
	at com.carrotsearch.randomizedtesting.rules.StatementAdapter.evaluate(StatementAdapter.java:36)
	at com.carrotsearch.randomizedtesting.ThreadLeakControl$StatementRunner.run(ThreadLeakControl.java:367)
	at java.lang.Thread.run(Thread.java:745)


FAILED:  org.apache.lucene.queryparser.xml.TestCoreParser.testBoostingTermQueryXML

Error Message:
this IndexReader is closed

Stack Trace:
org.apache.lucene.store.AlreadyClosedException: this IndexReader is closed
	at __randomizedtesting.SeedInfo.seed([36E7629C7634AAC0:196491806A3EED0D]:0)
	at org.apache.lucene.index.IndexReader.ensureOpen(IndexReader.java:272)
	at org.apache.lucene.index.SegmentReader.getPostingsReader(SegmentReader.java:240)
	at org.apache.lucene.index.CodecReader.fields(CodecReader.java:109)
	at org.apache.lucene.index.LeafReader.terms(LeafReader.java:207)
	at org.apache.lucene.index.TermContext.build(TermContext.java:91)
	at org.apache.lucene.search.spans.SpanTermQuery.createWeight(SpanTermQuery.java:71)
	at org.apache.lucene.queries.payloads.PayloadScoreQuery.createWeight(PayloadScoreQuery.java:89)
	at org.apache.lucene.queries.payloads.PayloadScoreQuery.createWeight(PayloadScoreQuery.java:50)
	at org.apache.lucene.search.IndexSearcher.createWeight(IndexSearcher.java:752)
	at org.apache.lucene.search.AssertingIndexSearcher.createWeight(AssertingIndexSearcher.java:76)
	at org.apache.lucene.search.IndexSearcher.createNormalizedWeight(IndexSearcher.java:735)
	at org.apache.lucene.search.AssertingIndexSearcher.createNormalizedWeight(AssertingIndexSearcher.java:57)
	at org.apache.lucene.search.IndexSearcher.search(IndexSearcher.java:473)
	at org.apache.lucene.search.IndexSearcher.search(IndexSearcher.java:592)
	at org.apache.lucene.search.IndexSearcher.searchAfter(IndexSearcher.java:450)
	at org.apache.lucene.search.IndexSearcher.search(IndexSearcher.java:461)
	at org.apache.lucene.queryparser.xml.TestCoreParser.dumpResults(TestCoreParser.java:194)
	at org.apache.lucene.queryparser.xml.TestCoreParser.testBoostingTermQueryXML(TestCoreParser.java:105)
	at sun.reflect.NativeMethodAccessorImpl.invoke0(Native Method)
	at sun.reflect.NativeMethodAccessorImpl.invoke(NativeMethodAccessorImpl.java:62)
	at sun.reflect.DelegatingMethodAccessorImpl.invoke(DelegatingMethodAccessorImpl.java:43)
	at java.lang.reflect.Method.invoke(Method.java:498)
	at com.carrotsearch.randomizedtesting.RandomizedRunner.invoke(RandomizedRunner.java:1764)
	at com.carrotsearch.randomizedtesting.RandomizedRunner$8.evaluate(RandomizedRunner.java:871)
	at com.carrotsearch.randomizedtesting.RandomizedRunner$9.evaluate(RandomizedRunner.java:907)
	at com.carrotsearch.randomizedtesting.RandomizedRunner$10.evaluate(RandomizedRunner.java:921)
	at org.apache.lucene.util.TestRuleSetupTeardownChained$1.evaluate(TestRuleSetupTeardownChained.java:49)
	at org.apache.lucene.util.AbstractBeforeAfterRule$1.evaluate(AbstractBeforeAfterRule.java:45)
	at org.apache.lucene.util.TestRuleThreadAndTestName$1.evaluate(TestRuleThreadAndTestName.java:48)
	at org.apache.lucene.util.TestRuleIgnoreAfterMaxFailures$1.evaluate(TestRuleIgnoreAfterMaxFailures.java:64)
	at org.apache.lucene.util.TestRuleMarkFailure$1.evaluate(TestRuleMarkFailure.java:47)
	at com.carrotsearch.randomizedtesting.rules.StatementAdapter.evaluate(StatementAdapter.java:36)
	at com.carrotsearch.randomizedtesting.ThreadLeakControl$StatementRunner.run(ThreadLeakControl.java:367)
	at com.carrotsearch.randomizedtesting.ThreadLeakControl.forkTimeoutingTask(ThreadLeakControl.java:809)
	at com.carrotsearch.randomizedtesting.ThreadLeakControl$3.evaluate(ThreadLeakControl.java:460)
	at com.carrotsearch.randomizedtesting.RandomizedRunner.runSingleTest(RandomizedRunner.java:880)
	at com.carrotsearch.randomizedtesting.RandomizedRunner$5.evaluate(RandomizedRunner.java:781)
	at com.carrotsearch.randomizedtesting.RandomizedRunner$6.evaluate(RandomizedRunner.java:816)
	at com.carrotsearch.randomizedtesting.RandomizedRunner$7.evaluate(RandomizedRunner.java:827)
	at org.apache.lucene.util.AbstractBeforeAfterRule$1.evaluate(AbstractBeforeAfterRule.java:45)
	at com.carrotsearch.randomizedtesting.rules.StatementAdapter.evaluate(StatementAdapter.java:36)
	at org.apache.lucene.util.TestRuleStoreClassName$1.evaluate(TestRuleStoreClassName.java:41)
	at com.carrotsearch.randomizedtesting.rules.NoShadowingOrOverridesOnMethodsRule$1.evaluate(NoShadowingOrOverridesOnMethodsRule.java:40)
	at com.carrotsearch.randomizedtesting.rules.NoShadowingOrOverridesOnMethodsRule$1.evaluate(NoShadowingOrOverridesOnMethodsRule.java:40)
	at com.carrotsearch.randomizedtesting.rules.StatementAdapter.evaluate(StatementAdapter.java:36)
	at com.carrotsearch.randomizedtesting.rules.StatementAdapter.evaluate(StatementAdapter.java:36)
	at com.carrotsearch.randomizedtesting.rules.StatementAdapter.evaluate(StatementAdapter.java:36)
	at org.apache.lucene.util.TestRuleAssertionsRequired$1.evaluate(TestRuleAssertionsRequired.java:53)
	at org.apache.lucene.util.TestRuleMarkFailure$1.evaluate(TestRuleMarkFailure.java:47)
	at org.apache.lucene.util.TestRuleIgnoreAfterMaxFailures$1.evaluate(TestRuleIgnoreAfterMaxFailures.java:64)
	at org.apache.lucene.util.TestRuleIgnoreTestSuites$1.evaluate(TestRuleIgnoreTestSuites.java:54)
	at com.carrotsearch.randomizedtesting.rules.StatementAdapter.evaluate(StatementAdapter.java:36)
	at com.carrotsearch.randomizedtesting.ThreadLeakControl$StatementRunner.run(ThreadLeakControl.java:367)
	at java.lang.Thread.run(Thread.java:745)


FAILED:  org.apache.lucene.queryparser.xml.TestCoreParser.testNestedBooleanQuery

Error Message:
this IndexReader is closed

Stack Trace:
org.apache.lucene.store.AlreadyClosedException: this IndexReader is closed
	at __randomizedtesting.SeedInfo.seed([36E7629C7634AAC0:FDDC9C8384AC8C87]:0)
	at org.apache.lucene.index.IndexReader.ensureOpen(IndexReader.java:272)
	at org.apache.lucene.index.SegmentReader.getPostingsReader(SegmentReader.java:240)
	at org.apache.lucene.index.CodecReader.fields(CodecReader.java:109)
	at org.apache.lucene.index.LeafReader.terms(LeafReader.java:207)
	at org.apache.lucene.index.TermContext.build(TermContext.java:91)
	at org.apache.lucene.search.TermQuery.createWeight(TermQuery.java:191)
	at org.apache.lucene.search.IndexSearcher.createWeight(IndexSearcher.java:752)
	at org.apache.lucene.search.AssertingIndexSearcher.createWeight(AssertingIndexSearcher.java:76)
	at org.apache.lucene.search.BooleanWeight.<init>(BooleanWeight.java:57)
	at org.apache.lucene.search.BooleanQuery.createWeight(BooleanQuery.java:226)
	at org.apache.lucene.search.IndexSearcher.createWeight(IndexSearcher.java:752)
	at org.apache.lucene.search.AssertingIndexSearcher.createWeight(AssertingIndexSearcher.java:76)
	at org.apache.lucene.search.IndexSearcher.createNormalizedWeight(IndexSearcher.java:735)
	at org.apache.lucene.search.AssertingIndexSearcher.createNormalizedWeight(AssertingIndexSearcher.java:57)
	at org.apache.lucene.search.IndexSearcher.search(IndexSearcher.java:473)
	at org.apache.lucene.search.IndexSearcher.search(IndexSearcher.java:592)
	at org.apache.lucene.search.IndexSearcher.searchAfter(IndexSearcher.java:450)
	at org.apache.lucene.search.IndexSearcher.search(IndexSearcher.java:461)
	at org.apache.lucene.queryparser.xml.TestCoreParser.dumpResults(TestCoreParser.java:194)
	at org.apache.lucene.queryparser.xml.TestCoreParser.testNestedBooleanQuery(TestCoreParser.java:125)
	at sun.reflect.NativeMethodAccessorImpl.invoke0(Native Method)
	at sun.reflect.NativeMethodAccessorImpl.invoke(NativeMethodAccessorImpl.java:62)
	at sun.reflect.DelegatingMethodAccessorImpl.invoke(DelegatingMethodAccessorImpl.java:43)
	at java.lang.reflect.Method.invoke(Method.java:498)
	at com.carrotsearch.randomizedtesting.RandomizedRunner.invoke(RandomizedRunner.java:1764)
	at com.carrotsearch.randomizedtesting.RandomizedRunner$8.evaluate(RandomizedRunner.java:871)
	at com.carrotsearch.randomizedtesting.RandomizedRunner$9.evaluate(RandomizedRunner.java:907)
	at com.carrotsearch.randomizedtesting.RandomizedRunner$10.evaluate(RandomizedRunner.java:921)
	at org.apache.lucene.util.TestRuleSetupTeardownChained$1.evaluate(TestRuleSetupTeardownChained.java:49)
	at org.apache.lucene.util.AbstractBeforeAfterRule$1.evaluate(AbstractBeforeAfterRule.java:45)
	at org.apache.lucene.util.TestRuleThreadAndTestName$1.evaluate(TestRuleThreadAndTestName.java:48)
	at org.apache.lucene.util.TestRuleIgnoreAfterMaxFailures$1.evaluate(TestRuleIgnoreAfterMaxFailures.java:64)
	at org.apache.lucene.util.TestRuleMarkFailure$1.evaluate(TestRuleMarkFailure.java:47)
	at com.carrotsearch.randomizedtesting.rules.StatementAdapter.evaluate(StatementAdapter.java:36)
	at com.carrotsearch.randomizedtesting.ThreadLeakControl$StatementRunner.run(ThreadLeakControl.java:367)
	at com.carrotsearch.randomizedtesting.ThreadLeakControl.forkTimeoutingTask(ThreadLeakControl.java:809)
	at com.carrotsearch.randomizedtesting.ThreadLeakControl$3.evaluate(ThreadLeakControl.java:460)
	at com.carrotsearch.randomizedtesting.RandomizedRunner.runSingleTest(RandomizedRunner.java:880)
	at com.carrotsearch.randomizedtesting.RandomizedRunner$5.evaluate(RandomizedRunner.java:781)
	at com.carrotsearch.randomizedtesting.RandomizedRunner$6.evaluate(RandomizedRunner.java:816)
	at com.carrotsearch.randomizedtesting.RandomizedRunner$7.evaluate(RandomizedRunner.java:827)
	at org.apache.lucene.util.AbstractBeforeAfterRule$1.evaluate(AbstractBeforeAfterRule.java:45)
	at com.carrotsearch.randomizedtesting.rules.StatementAdapter.evaluate(StatementAdapter.java:36)
	at org.apache.lucene.util.TestRuleStoreClassName$1.evaluate(TestRuleStoreClassName.java:41)
	at com.carrotsearch.randomizedtesting.rules.NoShadowingOrOverridesOnMethodsRule$1.evaluate(NoShadowingOrOverridesOnMethodsRule.java:40)
	at com.carrotsearch.randomizedtesting.rules.NoShadowingOrOverridesOnMethodsRule$1.evaluate(NoShadowingOrOverridesOnMethodsRule.java:40)
	at com.carrotsearch.randomizedtesting.rules.StatementAdapter.evaluate(StatementAdapter.java:36)
	at com.carrotsearch.randomizedtesting.rules.StatementAdapter.evaluate(StatementAdapter.java:36)
	at com.carrotsearch.randomizedtesting.rules.StatementAdapter.evaluate(StatementAdapter.java:36)
	at org.apache.lucene.util.TestRuleAssertionsRequired$1.evaluate(TestRuleAssertionsRequired.java:53)
	at org.apache.lucene.util.TestRuleMarkFailure$1.evaluate(TestRuleMarkFailure.java:47)
	at org.apache.lucene.util.TestRuleIgnoreAfterMaxFailures$1.evaluate(TestRuleIgnoreAfterMaxFailures.java:64)
	at org.apache.lucene.util.TestRuleIgnoreTestSuites$1.evaluate(TestRuleIgnoreTestSuites.java:54)
	at com.carrotsearch.randomizedtesting.rules.StatementAdapter.evaluate(StatementAdapter.java:36)
	at com.carrotsearch.randomizedtesting.ThreadLeakControl$StatementRunner.run(ThreadLeakControl.java:367)
	at java.lang.Thread.run(Thread.java:745)


FAILED:  org.apache.lucene.queryparser.xml.TestCoreParser.testUserQueryXML

Error Message:
this IndexReader is closed

Stack Trace:
org.apache.lucene.store.AlreadyClosedException: this IndexReader is closed
	at __randomizedtesting.SeedInfo.seed([36E7629C7634AAC0:5FB16CFA9FCB401D]:0)
	at org.apache.lucene.index.IndexReader.ensureOpen(IndexReader.java:272)
	at org.apache.lucene.index.SegmentReader.getPostingsReader(SegmentReader.java:240)
	at org.apache.lucene.index.CodecReader.fields(CodecReader.java:109)
	at org.apache.lucene.index.LeafReader.terms(LeafReader.java:207)
	at org.apache.lucene.index.TermContext.build(TermContext.java:91)
	at org.apache.lucene.search.PhraseQuery$PhraseWeight.<init>(PhraseQuery.java:375)
	at org.apache.lucene.search.PhraseQuery.createWeight(PhraseQuery.java:511)
	at org.apache.lucene.search.IndexSearcher.createWeight(IndexSearcher.java:752)
	at org.apache.lucene.search.AssertingIndexSearcher.createWeight(AssertingIndexSearcher.java:76)
	at org.apache.lucene.search.BooleanWeight.<init>(BooleanWeight.java:57)
	at org.apache.lucene.search.BooleanQuery.createWeight(BooleanQuery.java:226)
	at org.apache.lucene.search.IndexSearcher.createWeight(IndexSearcher.java:752)
	at org.apache.lucene.search.AssertingIndexSearcher.createWeight(AssertingIndexSearcher.java:76)
	at org.apache.lucene.search.IndexSearcher.createNormalizedWeight(IndexSearcher.java:735)
	at org.apache.lucene.search.AssertingIndexSearcher.createNormalizedWeight(AssertingIndexSearcher.java:57)
	at org.apache.lucene.search.IndexSearcher.search(IndexSearcher.java:473)
	at org.apache.lucene.search.IndexSearcher.search(IndexSearcher.java:592)
	at org.apache.lucene.search.IndexSearcher.searchAfter(IndexSearcher.java:450)
	at org.apache.lucene.search.IndexSearcher.search(IndexSearcher.java:461)
	at org.apache.lucene.queryparser.xml.TestCoreParser.dumpResults(TestCoreParser.java:194)
	at org.apache.lucene.queryparser.xml.TestCoreParser.testUserQueryXML(TestCoreParser.java:94)
	at sun.reflect.NativeMethodAccessorImpl.invoke0(Native Method)
	at sun.reflect.NativeMethodAccessorImpl.invoke(NativeMethodAccessorImpl.java:62)
	at sun.reflect.DelegatingMethodAccessorImpl.invoke(DelegatingMethodAccessorImpl.java:43)
	at java.lang.reflect.Method.invoke(Method.java:498)
	at com.carrotsearch.randomizedtesting.RandomizedRunner.invoke(RandomizedRunner.java:1764)
	at com.carrotsearch.randomizedtesting.RandomizedRunner$8.evaluate(RandomizedRunner.java:871)
	at com.carrotsearch.randomizedtesting.RandomizedRunner$9.evaluate(RandomizedRunner.java:907)
	at com.carrotsearch.randomizedtesting.RandomizedRunner$10.evaluate(RandomizedRunner.java:921)
	at org.apache.lucene.util.TestRuleSetupTeardownChained$1.evaluate(TestRuleSetupTeardownChained.java:49)
	at org.apache.lucene.util.AbstractBeforeAfterRule$1.evaluate(AbstractBeforeAfterRule.java:45)
	at org.apache.lucene.util.TestRuleThreadAndTestName$1.evaluate(TestRuleThreadAndTestName.java:48)
	at org.apache.lucene.util.TestRuleIgnoreAfterMaxFailures$1.evaluate(TestRuleIgnoreAfterMaxFailures.java:64)
	at org.apache.lucene.util.TestRuleMarkFailure$1.evaluate(TestRuleMarkFailure.java:47)
	at com.carrotsearch.randomizedtesting.rules.StatementAdapter.evaluate(StatementAdapter.java:36)
	at com.carrotsearch.randomizedtesting.ThreadLeakControl$StatementRunner.run(ThreadLeakControl.java:367)
	at com.carrotsearch.randomizedtesting.ThreadLeakControl.forkTimeoutingTask(ThreadLeakControl.java:809)
	at com.carrotsearch.randomizedtesting.ThreadLeakControl$3.evaluate(ThreadLeakControl.java:460)
	at com.carrotsearch.randomizedtesting.RandomizedRunner.runSingleTest(RandomizedRunner.java:880)
	at com.carrotsearch.randomizedtesting.RandomizedRunner$5.evaluate(RandomizedRunner.java:781)
	at com.carrotsearch.randomizedtesting.RandomizedRunner$6.evaluate(RandomizedRunner.java:816)
	at com.carrotsearch.randomizedtesting.RandomizedRunner$7.evaluate(RandomizedRunner.java:827)
	at org.apache.lucene.util.AbstractBeforeAfterRule$1.evaluate(AbstractBeforeAfterRule.java:45)
	at com.carrotsearch.randomizedtesting.rules.StatementAdapter.evaluate(StatementAdapter.java:36)
	at org.apache.lucene.util.TestRuleStoreClassName$1.evaluate(TestRuleStoreClassName.java:41)
	at com.carrotsearch.randomizedtesting.rules.NoShadowingOrOverridesOnMethodsRule$1.evaluate(NoShadowingOrOverridesOnMethodsRule.java:40)
	at com.carrotsearch.randomizedtesting.rules.NoShadowingOrOverridesOnMethodsRule$1.evaluate(NoShadowingOrOverridesOnMethodsRule.java:40)
	at com.carrotsearch.randomizedtesting.rules.StatementAdapter.evaluate(StatementAdapter.java:36)
	at com.carrotsearch.randomizedtesting.rules.StatementAdapter.evaluate(StatementAdapter.java:36)
	at com.carrotsearch.randomizedtesting.rules.StatementAdapter.evaluate(StatementAdapter.java:36)
	at org.apache.lucene.util.TestRuleAssertionsRequired$1.evaluate(TestRuleAssertionsRequired.java:53)
	at org.apache.lucene.util.TestRuleMarkFailure$1.evaluate(TestRuleMarkFailure.java:47)
	at org.apache.lucene.util.TestRuleIgnoreAfterMaxFailures$1.evaluate(TestRuleIgnoreAfterMaxFailures.java:64)
	at org.apache.lucene.util.TestRuleIgnoreTestSuites$1.evaluate(TestRuleIgnoreTestSuites.java:54)
	at com.carrotsearch.randomizedtesting.rules.StatementAdapter.evaluate(StatementAdapter.java:36)
	at com.carrotsearch.randomizedtesting.ThreadLeakControl$StatementRunner.run(ThreadLeakControl.java:367)
	at java.lang.Thread.run(Thread.java:745)


FAILED:  org.apache.lucene.queryparser.xml.TestCoreParser.testRangeQueryXML

Error Message:
this IndexReader is closed

Stack Trace:
org.apache.lucene.store.AlreadyClosedException: this IndexReader is closed
	at __randomizedtesting.SeedInfo.seed([36E7629C7634AAC0:8568357AB01C0714]:0)
	at org.apache.lucene.index.IndexReader.ensureOpen(IndexReader.java:272)
	at org.apache.lucene.index.SegmentReader.getPostingsReader(SegmentReader.java:240)
	at org.apache.lucene.index.CodecReader.fields(CodecReader.java:109)
	at org.apache.lucene.index.LeafReader.terms(LeafReader.java:207)
	at org.apache.lucene.search.MultiTermQueryConstantScoreWrapper$1.rewrite(MultiTermQueryConstantScoreWrapper.java:142)
	at org.apache.lucene.search.MultiTermQueryConstantScoreWrapper$1.bulkScorer(MultiTermQueryConstantScoreWrapper.java:201)
	at org.apache.lucene.search.AssertingWeight.bulkScorer(AssertingWeight.java:68)
	at org.apache.lucene.search.AssertingWeight.bulkScorer(AssertingWeight.java:68)
	at org.apache.lucene.search.IndexSearcher.search(IndexSearcher.java:666)
	at org.apache.lucene.search.AssertingIndexSearcher.search(AssertingIndexSearcher.java:91)
	at org.apache.lucene.search.IndexSearcher.search(IndexSearcher.java:473)
	at org.apache.lucene.search.IndexSearcher.search(IndexSearcher.java:592)
	at org.apache.lucene.search.IndexSearcher.searchAfter(IndexSearcher.java:450)
	at org.apache.lucene.search.IndexSearcher.search(IndexSearcher.java:461)
	at org.apache.lucene.queryparser.xml.TestCoreParser.dumpResults(TestCoreParser.java:194)
	at org.apache.lucene.queryparser.xml.TestCoreParser.testRangeQueryXML(TestCoreParser.java:89)
	at sun.reflect.NativeMethodAccessorImpl.invoke0(Native Method)
	at sun.reflect.NativeMethodAccessorImpl.invoke(NativeMethodAccessorImpl.java:62)
	at sun.reflect.DelegatingMethodAccessorImpl.invoke(DelegatingMethodAccessorImpl.java:43)
	at java.lang.reflect.Method.invoke(Method.java:498)
	at com.carrotsearch.randomizedtesting.RandomizedRunner.invoke(RandomizedRunner.java:1764)
	at com.carrotsearch.randomizedtesting.RandomizedRunner$8.evaluate(RandomizedRunner.java:871)
	at com.carrotsearch.randomizedtesting.RandomizedRunner$9.evaluate(RandomizedRunner.java:907)
	at com.carrotsearch.randomizedtesting.RandomizedRunner$10.evaluate(RandomizedRunner.java:921)
	at org.apache.lucene.util.TestRuleSetupTeardownChained$1.evaluate(TestRuleSetupTeardownChained.java:49)
	at org.apache.lucene.util.AbstractBeforeAfterRule$1.evaluate(AbstractBeforeAfterRule.java:45)
	at org.apache.lucene.util.TestRuleThreadAndTestName$1.evaluate(TestRuleThreadAndTestName.java:48)
	at org.apache.lucene.util.TestRuleIgnoreAfterMaxFailures$1.evaluate(TestRuleIgnoreAfterMaxFailures.java:64)
	at org.apache.lucene.util.TestRuleMarkFailure$1.evaluate(TestRuleMarkFailure.java:47)
	at com.carrotsearch.randomizedtesting.rules.StatementAdapter.evaluate(StatementAdapter.java:36)
	at com.carrotsearch.randomizedtesting.ThreadLeakControl$StatementRunner.run(ThreadLeakControl.java:367)
	at com.carrotsearch.randomizedtesting.ThreadLeakControl.forkTimeoutingTask(ThreadLeakControl.java:809)
	at com.carrotsearch.randomizedtesting.ThreadLeakControl$3.evaluate(ThreadLeakControl.java:460)
	at com.carrotsearch.randomizedtesting.RandomizedRunner.runSingleTest(RandomizedRunner.java:880)
	at com.carrotsearch.randomizedtesting.RandomizedRunner$5.evaluate(RandomizedRunner.java:781)
	at com.carrotsearch.randomizedtesting.RandomizedRunner$6.evaluate(RandomizedRunner.java:816)
	at com.carrotsearch.randomizedtesting.RandomizedRunner$7.evaluate(RandomizedRunner.java:827)
	at org.apache.lucene.util.AbstractBeforeAfterRule$1.evaluate(AbstractBeforeAfterRule.java:45)
	at com.carrotsearch.randomizedtesting.rules.StatementAdapter.evaluate(StatementAdapter.java:36)
	at org.apache.lucene.util.TestRuleStoreClassName$1.evaluate(TestRuleStoreClassName.java:41)
	at com.carrotsearch.randomizedtesting.rules.NoShadowingOrOverridesOnMethodsRule$1.evaluate(NoShadowingOrOverridesOnMethodsRule.java:40)
	at com.carrotsearch.randomizedtesting.rules.NoShadowingOrOverridesOnMethodsRule$1.evaluate(NoShadowingOrOverridesOnMethodsRule.java:40)
	at com.carrotsearch.randomizedtesting.rules.StatementAdapter.evaluate(StatementAdapter.java:36)
	at com.carrotsearch.randomizedtesting.rules.StatementAdapter.evaluate(StatementAdapter.java:36)
	at com.carrotsearch.randomizedtesting.rules.StatementAdapter.evaluate(StatementAdapter.java:36)
	at org.apache.lucene.util.TestRuleAssertionsRequired$1.evaluate(TestRuleAssertionsRequired.java:53)
	at org.apache.lucene.util.TestRuleMarkFailure$1.evaluate(TestRuleMarkFailure.java:47)
	at org.apache.lucene.util.TestRuleIgnoreAfterMaxFailures$1.evaluate(TestRuleIgnoreAfterMaxFailures.java:64)
	at org.apache.lucene.util.TestRuleIgnoreTestSuites$1.evaluate(TestRuleIgnoreTestSuites.java:54)
	at com.carrotsearch.randomizedtesting.rules.StatementAdapter.evaluate(StatementAdapter.java:36)
	at com.carrotsearch.randomizedtesting.ThreadLeakControl$StatementRunner.run(ThreadLeakControl.java:367)
	at java.lang.Thread.run(Thread.java:745)


FAILED:  org.apache.lucene.queryparser.xml.TestCoreParser.testTermsQueryXML

Error Message:
this IndexReader is closed

Stack Trace:
org.apache.lucene.store.AlreadyClosedException: this IndexReader is closed
	at __randomizedtesting.SeedInfo.seed([36E7629C7634AAC0:1164FE9DB750D37A]:0)
	at org.apache.lucene.index.IndexReader.ensureOpen(IndexReader.java:272)
	at org.apache.lucene.index.SegmentReader.getPostingsReader(SegmentReader.java:240)
	at org.apache.lucene.index.CodecReader.fields(CodecReader.java:109)
	at org.apache.lucene.index.LeafReader.terms(LeafReader.java:207)
	at org.apache.lucene.index.TermContext.build(TermContext.java:91)
	at org.apache.lucene.search.TermQuery.createWeight(TermQuery.java:191)
	at org.apache.lucene.search.IndexSearcher.createWeight(IndexSearcher.java:752)
	at org.apache.lucene.search.AssertingIndexSearcher.createWeight(AssertingIndexSearcher.java:76)
	at org.apache.lucene.search.BooleanWeight.<init>(BooleanWeight.java:57)
	at org.apache.lucene.search.BooleanQuery.createWeight(BooleanQuery.java:226)
	at org.apache.lucene.search.IndexSearcher.createWeight(IndexSearcher.java:752)
	at org.apache.lucene.search.AssertingIndexSearcher.createWeight(AssertingIndexSearcher.java:76)
	at org.apache.lucene.search.IndexSearcher.createNormalizedWeight(IndexSearcher.java:735)
	at org.apache.lucene.search.AssertingIndexSearcher.createNormalizedWeight(AssertingIndexSearcher.java:57)
	at org.apache.lucene.search.IndexSearcher.search(IndexSearcher.java:473)
	at org.apache.lucene.search.IndexSearcher.search(IndexSearcher.java:592)
	at org.apache.lucene.search.IndexSearcher.searchAfter(IndexSearcher.java:450)
	at org.apache.lucene.search.IndexSearcher.search(IndexSearcher.java:461)
	at org.apache.lucene.queryparser.xml.TestCoreParser.dumpResults(TestCoreParser.java:194)
	at org.apache.lucene.queryparser.xml.TestCoreParser.testTermsQueryXML(TestCoreParser.java:68)
	at sun.reflect.NativeMethodAccessorImpl.invoke0(Native Method)
	at sun.reflect.NativeMethodAccessorImpl.invoke(NativeMethodAccessorImpl.java:62)
	at sun.reflect.DelegatingMethodAccessorImpl.invoke(DelegatingMethodAccessorImpl.java:43)
	at java.lang.reflect.Method.invoke(Method.java:498)
	at com.carrotsearch.randomizedtesting.RandomizedRunner.invoke(RandomizedRunner.java:1764)
	at com.carrotsearch.randomizedtesting.RandomizedRunner$8.evaluate(RandomizedRunner.java:871)
	at com.carrotsearch.randomizedtesting.RandomizedRunner$9.evaluate(RandomizedRunner.java:907)
	at com.carrotsearch.randomizedtesting.RandomizedRunner$10.evaluate(RandomizedRunner.java:921)
	at org.apache.lucene.util.TestRuleSetupTeardownChained$1.evaluate(TestRuleSetupTeardownChained.java:49)
	at org.apache.lucene.util.AbstractBeforeAfterRule$1.evaluate(AbstractBeforeAfterRule.java:45)
	at org.apache.lucene.util.TestRuleThreadAndTestName$1.evaluate(TestRuleThreadAndTestName.java:48)
	at org.apache.lucene.util.TestRuleIgnoreAfterMaxFailures$1.evaluate(TestRuleIgnoreAfterMaxFailures.java:64)
	at org.apache.lucene.util.TestRuleMarkFailure$1.evaluate(TestRuleMarkFailure.java:47)
	at com.carrotsearch.randomizedtesting.rules.StatementAdapter.evaluate(StatementAdapter.java:36)
	at com.carrotsearch.randomizedtesting.ThreadLeakControl$StatementRunner.run(ThreadLeakControl.java:367)
	at com.carrotsearch.randomizedtesting.ThreadLeakControl.forkTimeoutingTask(ThreadLeakControl.java:809)
	at com.carrotsearch.randomizedtesting.ThreadLeakControl$3.evaluate(ThreadLeakControl.java:460)
	at com.carrotsearch.randomizedtesting.RandomizedRunner.runSingleTest(RandomizedRunner.java:880)
	at com.carrotsearch.randomizedtesting.RandomizedRunner$5.evaluate(RandomizedRunner.java:781)
	at com.carrotsearch.randomizedtesting.RandomizedRunner$6.evaluate(RandomizedRunner.java:816)
	at com.carrotsearch.randomizedtesting.RandomizedRunner$7.evaluate(RandomizedRunner.java:827)
	at org.apache.lucene.util.AbstractBeforeAfterRule$1.evaluate(AbstractBeforeAfterRule.java:45)
	at com.carrotsearch.randomizedtesting.rules.StatementAdapter.evaluate(StatementAdapter.java:36)
	at org.apache.lucene.util.TestRuleStoreClassName$1.evaluate(TestRuleStoreClassName.java:41)
	at com.carrotsearch.randomizedtesting.rules.NoShadowingOrOverridesOnMethodsRule$1.evaluate(NoShadowingOrOverridesOnMethodsRule.java:40)
	at com.carrotsearch.randomizedtesting.rules.NoShadowingOrOverridesOnMethodsRule$1.evaluate(NoShadowingOrOverridesOnMethodsRule.java:40)
	at com.carrotsearch.randomizedtesting.rules.StatementAdapter.evaluate(StatementAdapter.java:36)
	at com.carrotsearch.randomizedtesting.rules.StatementAdapter.evaluate(StatementAdapter.java:36)
	at com.carrotsearch.randomizedtesting.rules.StatementAdapter.evaluate(StatementAdapter.java:36)
	at org.apache.lucene.util.TestRuleAssertionsRequired$1.evaluate(TestRuleAssertionsRequired.java:53)
	at org.apache.lucene.util.TestRuleMarkFailure$1.evaluate(TestRuleMarkFailure.java:47)
	at org.apache.lucene.util.TestRuleIgnoreAfterMaxFailures$1.evaluate(TestRuleIgnoreAfterMaxFailures.java:64)
	at org.apache.lucene.util.TestRuleIgnoreTestSuites$1.evaluate(TestRuleIgnoreTestSuites.java:54)
	at com.carrotsearch.randomizedtesting.rules.StatementAdapter.evaluate(StatementAdapter.java:36)
	at com.carrotsearch.randomizedtesting.ThreadLeakControl$StatementRunner.run(ThreadLeakControl.java:367)
	at java.lang.Thread.run(Thread.java:745)




Build Log:
[...truncated 8005 lines...]
   [junit4] Suite: org.apache.lucene.queryparser.xml.TestCoreParser
   [junit4]   2> NOTE: reproduce with: ant test  -Dtestcase=TestCoreParser -Dtests.method=testPointRangeQuery -Dtests.seed=36E7629C7634AAC0 -Dtests.slow=true -Dtests.locale=da -Dtests.timezone=Africa/Niamey -Dtests.asserts=true -Dtests.file.encoding=UTF-8
   [junit4] ERROR   0.01s J0 | TestCoreParser.testPointRangeQuery <<<
   [junit4]    > Throwable #1: org.apache.lucene.store.AlreadyClosedException: this IndexReader is closed
   [junit4]    > 	at __randomizedtesting.SeedInfo.seed([36E7629C7634AAC0:99D3C6CAC6B794DA]:0)
   [junit4]    > 	at org.apache.lucene.index.IndexReader.ensureOpen(IndexReader.java:272)
   [junit4]    > 	at org.apache.lucene.index.SegmentReader.getPostingsReader(SegmentReader.java:240)
   [junit4]    > 	at org.apache.lucene.index.CodecReader.fields(CodecReader.java:109)
   [junit4]    > 	at org.apache.lucene.index.LeafReader.terms(LeafReader.java:207)
   [junit4]    > 	at org.apache.lucene.index.TermContext.build(TermContext.java:91)
   [junit4]    > 	at org.apache.lucene.search.TermQuery.createWeight(TermQuery.java:191)
   [junit4]    > 	at org.apache.lucene.search.IndexSearcher.createWeight(IndexSearcher.java:752)
   [junit4]    > 	at org.apache.lucene.search.AssertingIndexSearcher.createWeight(AssertingIndexSearcher.java:76)
   [junit4]    > 	at org.apache.lucene.search.BooleanWeight.<init>(BooleanWeight.java:57)
   [junit4]    > 	at org.apache.lucene.search.BooleanQuery.createWeight(BooleanQuery.java:226)
   [junit4]    > 	at org.apache.lucene.search.IndexSearcher.createWeight(IndexSearcher.java:752)
   [junit4]    > 	at org.apache.lucene.search.AssertingIndexSearcher.createWeight(AssertingIndexSearcher.java:76)
   [junit4]    > 	at org.apache.lucene.search.IndexSearcher.createNormalizedWeight(IndexSearcher.java:735)
   [junit4]    > 	at org.apache.lucene.search.AssertingIndexSearcher.createNormalizedWeight(AssertingIndexSearcher.java:57)
   [junit4]    > 	at org.apache.lucene.search.IndexSearcher.search(IndexSearcher.java:473)
   [junit4]    > 	at org.apache.lucene.search.IndexSearcher.search(IndexSearcher.java:592)
   [junit4]    > 	at org.apache.lucene.search.IndexSearcher.searchAfter(IndexSearcher.java:450)
   [junit4]    > 	at org.apache.lucene.search.IndexSearcher.search(IndexSearcher.java:461)
   [junit4]    > 	at org.apache.lucene.queryparser.xml.TestCoreParser.dumpResults(TestCoreParser.java:194)
   [junit4]    > 	at org.apache.lucene.queryparser.xml.TestCoreParser.testPointRangeQuery(TestCoreParser.java:135)
   [junit4]    > 	at java.lang.Thread.run(Thread.java:745)
   [junit4]   2> NOTE: reproduce with: ant test  -Dtestcase=TestCoreParser -Dtests.method=testConstantScoreQueryXML -Dtests.seed=36E7629C7634AAC0 -Dtests.slow=true -Dtests.locale=da -Dtests.timezone=Africa/Niamey -Dtests.asserts=true -Dtests.file.encoding=UTF-8
   [junit4] ERROR   0.01s J0 | TestCoreParser.testConstantScoreQueryXML <<<
   [junit4]    > Throwable #1: org.apache.lucene.store.AlreadyClosedException: this IndexReader is closed
   [junit4]    > 	at __randomizedtesting.SeedInfo.seed([36E7629C7634AAC0:953ADD23DDC754ED]:0)
   [junit4]    > 	at org.apache.lucene.index.IndexReader.ensureOpen(IndexReader.java:272)
   [junit4]    > 	at org.apache.lucene.index.SegmentReader.getPostingsReader(SegmentReader.java:240)
   [junit4]    > 	at org.apache.lucene.index.CodecReader.fields(CodecReader.java:109)
   [junit4]    > 	at org.apache.lucene.index.LeafReader.terms(LeafReader.java:207)
   [junit4]    > 	at org.apache.lucene.search.MultiTermQueryConstantScoreWrapper$1.rewrite(MultiTermQueryConstantScoreWrapper.java:142)
   [junit4]    > 	at org.apache.lucene.search.MultiTermQueryConstantScoreWrapper$1.bulkScorer(MultiTermQueryConstantScoreWrapper.java:201)
   [junit4]    > 	at org.apache.lucene.search.LRUQueryCache$CachingWrapperWeight.cache(LRUQueryCache.java:593)
   [junit4]    > 	at org.apache.lucene.search.LRUQueryCache$CachingWrapperWeight.bulkScorer(LRUQueryCache.java:641)
   [junit4]    > 	at org.apache.lucene.search.AssertingWeight.bulkScorer(AssertingWeight.java:68)
   [junit4]    > 	at org.apache.lucene.search.ConstantScoreQuery$1.bulkScorer(ConstantScoreQuery.java:120)
   [junit4]    > 	at org.apache.lucene.search.AssertingWeight.bulkScorer(AssertingWeight.java:68)
   [junit4]    > 	at org.apache.lucene.search.AssertingWeight.bulkScorer(AssertingWeight.java:68)
   [junit4]    > 	at org.apache.lucene.search.IndexSearcher.search(IndexSearcher.java:666)
   [junit4]    > 	at org.apache.lucene.search.AssertingIndexSearcher.search(AssertingIndexSearcher.java:91)
   [junit4]    > 	at org.apache.lucene.search.IndexSearcher.search(IndexSearcher.java:473)
   [junit4]    > 	at org.apache.lucene.search.IndexSearcher.search(IndexSearcher.java:592)
   [junit4]    > 	at org.apache.lucene.search.IndexSearcher.searchAfter(IndexSearcher.java:450)
   [junit4]    > 	at org.apache.lucene.search.IndexSearcher.search(IndexSearcher.java:461)
   [junit4]    > 	at org.apache.lucene.queryparser.xml.TestCoreParser.dumpResults(TestCoreParser.java:194)
   [junit4]    > 	at org.apache.lucene.queryparser.xml.TestCoreParser.testConstantScoreQueryXML(TestCoreParser.java:115)
   [junit4]    > 	at java.lang.Thread.run(Thread.java:745)
   [junit4]   2> NOTE: reproduce with: ant test  -Dtestcase=TestCoreParser -Dtests.method=testBooleanQueryXML -Dtests.seed=36E7629C7634AAC0 -Dtests.slow=true -Dtests.locale=da -Dtests.timezone=Africa/Niamey -Dtests.asserts=true -Dtests.file.encoding=UTF-8
   [junit4] ERROR   0.01s J0 | TestCoreParser.testBooleanQueryXML <<<
   [junit4]    > Throwable #1: org.apache.lucene.store.AlreadyClosedException: this IndexReader is closed
   [junit4]    > 	at __randomizedtesting.SeedInfo.seed([36E7629C7634AAC0:E0DCBDFD27F8FD83]:0)
   [junit4]    > 	at org.apache.lucene.index.IndexReader.ensureOpen(IndexReader.java:272)
   [junit4]    > 	at org.apache.lucene.index.SegmentReader.getPostingsReader(SegmentReader.java:240)
   [junit4]    > 	at org.apache.lucene.index.CodecReader.fields(CodecReader.java:109)
   [junit4]    > 	at org.apache.lucene.index.LeafReader.terms(LeafReader.java:207)
   [junit4]    > 	at org.apache.lucene.index.TermContext.build(TermContext.java:91)
   [junit4]    > 	at org.apache.lucene.search.TermQuery.createWeight(TermQuery.java:191)
   [junit4]    > 	at org.apache.lucene.search.IndexSearcher.createWeight(IndexSearcher.java:752)
   [junit4]    > 	at org.apache.lucene.search.AssertingIndexSearcher.createWeight(AssertingIndexSearcher.java:76)
   [junit4]    > 	at org.apache.lucene.search.BooleanWeight.<init>(BooleanWeight.java:57)
   [junit4]    > 	at org.apache.lucene.search.BooleanQuery.createWeight(BooleanQuery.java:226)
   [junit4]    > 	at org.apache.lucene.search.IndexSearcher.createWeight(IndexSearcher.java:752)
   [junit4]    > 	at org.apache.lucene.search.AssertingIndexSearcher.createWeight(AssertingIndexSearcher.java:76)
   [junit4]    > 	at org.apache.lucene.search.IndexSearcher.createNormalizedWeight(IndexSearcher.java:735)
   [junit4]    > 	at org.apache.lucene.search.AssertingIndexSearcher.createNormalizedWeight(AssertingIndexSearcher.java:57)
   [junit4]    > 	at org.apache.lucene.search.IndexSearcher.search(IndexSearcher.java:473)
   [junit4]    > 	at org.apache.lucene.search.IndexSearcher.search(IndexSearcher.java:592)
   [junit4]    > 	at org.apache.lucene.search.IndexSearcher.searchAfter(IndexSearcher.java:450)
   [junit4]    > 	at org.apache.lucene.search.IndexSearcher.search(IndexSearcher.java:461)
   [junit4]    > 	at org.apache.lucene.queryparser.xml.TestCoreParser.dumpResults(TestCoreParser.java:194)
   [junit4]    > 	at org.apache.lucene.queryparser.xml.TestCoreParser.testBooleanQueryXML(TestCoreParser.java:73)
   [junit4]    > 	at java.lang.Thread.run(Thread.java:745)
   [junit4]   2> NOTE: reproduce with: ant test  -Dtestcase=TestCoreParser -Dtests.method=testSpanTermXML -Dtests.seed=36E7629C7634AAC0 -Dtests.slow=true -Dtests.locale=da -Dtests.timezone=Africa/Niamey -Dtests.asserts=true -Dtests.file.encoding=UTF-8
   [junit4] ERROR   0.00s J0 | TestCoreParser.testSpanTermXML <<<
   [junit4]    > Throwable #1: org.apache.lucene.store.AlreadyClosedException: this IndexReader is closed
   [junit4]    > 	at __randomizedtesting.SeedInfo.seed([36E7629C7634AAC0:D25AA83BA5FB3E07]:0)
   [junit4]    > 	at org.apache.lucene.index.IndexReader.ensureOpen(IndexReader.java:272)
   [junit4]    > 	at org.apache.lucene.index.SegmentReader.getPostingsReader(SegmentReader.java:240)
   [junit4]    > 	at org.apache.lucene.index.CodecReader.fields(CodecReader.java:109)
   [junit4]    > 	at org.apache.lucene.index.LeafReader.terms(LeafReader.java:207)
   [junit4]    > 	at org.apache.lucene.index.TermContext.build(TermContext.java:91)
   [junit4]    > 	at org.apache.lucene.search.spans.SpanTermQuery.createWeight(SpanTermQuery.java:71)
   [junit4]    > 	at org.apache.lucene.search.spans.SpanOrQuery.createWeight(SpanOrQuery.java:125)
   [junit4]    > 	at org.apache.lucene.search.spans.SpanNearQuery.createWeight(SpanNearQuery.java:182)
   [junit4]    > 	at org.apache.lucene.search.spans.SpanOrQuery.createWeight(SpanOrQuery.java:125)
   [junit4]    > 	at org.apache.lucene.search.spans.SpanOrQuery.createWeight(SpanOrQuery.java:41)
   [junit4]    > 	at org.apache.lucene.search.IndexSearcher.createWeight(IndexSearcher.java:752)
   [junit4]    > 	at org.apache.lucene.search.AssertingIndexSearcher.createWeight(AssertingIndexSearcher.java:76)
   [junit4]    > 	at org.apache.lucene.search.IndexSearcher.createNormalizedWeight(IndexSearcher.java:735)
   [junit4]    > 	at org.apache.lucene.search.AssertingIndexSearcher.createNormalizedWeight(AssertingIndexSearcher.java:57)
   [junit4]    > 	at org.apache.lucene.search.IndexSearcher.search(IndexSearcher.java:473)
   [junit4]    > 	at org.apache.lucene.search.IndexSearcher.search(IndexSearcher.java:592)
   [junit4]    > 	at org.apache.lucene.search.IndexSearcher.searchAfter(IndexSearcher.java:450)
   [junit4]    > 	at org.apache.lucene.search.IndexSearcher.search(IndexSearcher.java:461)
   [junit4]    > 	at org.apache.lucene.queryparser.xml.TestCoreParser.dumpResults(TestCoreParser.java:194)
   [junit4]    > 	at org.apache.lucene.queryparser.xml.TestCoreParser.testSpanTermXML(TestCoreParser.java:110)
   [junit4]    > 	at java.lang.Thread.run(Thread.java:745)
   [junit4]   2> NOTE: reproduce with: ant test  -Dtestcase=TestCoreParser -Dtests.method=testCustomFieldUserQueryXML -Dtests.seed=36E7629C7634AAC0 -Dtests.slow=true -Dtests.locale=da -Dtests.timezone=Africa/Niamey -Dtests.asserts=true -Dtests.file.encoding=UTF-8
   [junit4] ERROR   0.00s J0 | TestCoreParser.testCustomFieldUserQueryXML <<<
   [junit4]    > Throwable #1: org.apache.lucene.store.AlreadyClosedException: this IndexReader is closed
   [junit4]    > 	at __randomizedtesting.SeedInfo.seed([36E7629C7634AAC0:B2DED973FA0A76F]:0)
   [junit4]    > 	at org.apache.lucene.index.IndexReader.ensureOpen(IndexReader.java:272)
   [junit4]    > 	at org.apache.lucene.index.SegmentReader.getPostingsReader(SegmentReader.java:240)
   [junit4]    > 	at org.apache.lucene.index.CodecReader.fields(CodecReader.java:109)
   [junit4]    > 	at org.apache.lucene.index.LeafReader.terms(LeafReader.java:207)
   [junit4]    > 	at org.apache.lucene.index.TermContext.build(TermContext.java:91)
   [junit4]    > 	at org.apache.lucene.search.TermQuery.createWeight(TermQuery.java:191)
   [junit4]    > 	at org.apache.lucene.search.BoostQuery.createWeight(BoostQuery.java:116)
   [junit4]    > 	at org.apache.lucene.search.IndexSearcher.createWeight(IndexSearcher.java:752)
   [junit4]    > 	at org.apache.lucene.search.AssertingIndexSearcher.createWeight(AssertingIndexSearcher.java:76)
   [junit4]    > 	at org.apache.lucene.search.IndexSearcher.createNormalizedWeight(IndexSearcher.java:735)
   [junit4]    > 	at org.apache.lucene.search.AssertingIndexSearcher.createNormalizedWeight(AssertingIndexSearcher.java:57)
   [junit4]    > 	at org.apache.lucene.search.IndexSearcher.search(IndexSearcher.java:473)
   [junit4]    > 	at org.apache.lucene.search.IndexSearcher.search(IndexSearcher.java:592)
   [junit4]    > 	at org.apache.lucene.search.IndexSearcher.searchAfter(IndexSearcher.java:450)
   [junit4]    > 	at org.apache.lucene.search.IndexSearcher.search(IndexSearcher.java:461)
   [junit4]    > 	at org.apache.lucene.queryparser.xml.TestCoreParser.testCustomFieldUserQueryXML(TestCoreParser.java:99)
   [junit4]    > 	at java.lang.Thread.run(Thread.java:745)
   [junit4]   2> NOTE: reproduce with: ant test  -Dtestcase=TestCoreParser -Dtests.method=testMatchAllDocsPlusFilterXML -Dtests.seed=36E7629C7634AAC0 -Dtests.slow=true -Dtests.locale=da -Dtests.timezone=Africa/Niamey -Dtests.asserts=true -Dtests.file.encoding=UTF-8
   [junit4] ERROR   0.00s J0 | TestCoreParser.testMatchAllDocsPlusFilterXML <<<
   [junit4]    > Throwable #1: org.apache.lucene.store.AlreadyClosedException: this IndexReader is closed
   [junit4]    > 	at __randomizedtesting.SeedInfo.seed([36E7629C7634AAC0:2ABAEB0C1D69CEC1]:0)
   [junit4]    > 	at org.apache.lucene.index.IndexReader.ensureOpen(IndexReader.java:272)
   [junit4]    > 	at org.apache.lucene.index.SegmentReader.getPostingsReader(SegmentReader.java:240)
   [junit4]    > 	at org.apache.lucene.index.CodecReader.fields(CodecReader.java:109)
   [junit4]    > 	at org.apache.lucene.index.LeafReader.terms(LeafReader.java:207)
   [junit4]    > 	at org.apache.lucene.search.MultiTermQueryConstantScoreWrapper$1.rewrite(MultiTermQueryConstantScoreWrapper.java:142)
   [junit4]    > 	at org.apache.lucene.search.MultiTermQueryConstantScoreWrapper$1.bulkScorer(MultiTermQueryConstantScoreWrapper.java:201)
   [junit4]    > 	at org.apache.lucene.search.LRUQueryCache$CachingWrapperWeight.bulkScorer(LRUQueryCache.java:644)
   [junit4]    > 	at org.apache.lucene.search.AssertingWeight.bulkScorer(AssertingWeight.java:68)
   [junit4]    > 	at org.apache.lucene.search.ConstantScoreQuery$1.bulkScorer(ConstantScoreQuery.java:120)
   [junit4]    > 	at org.apache.lucene.search.AssertingWeight.bulkScorer(AssertingWeight.java:68)
   [junit4]    > 	at org.apache.lucene.search.AssertingWeight.bulkScorer(AssertingWeight.java:68)
   [junit4]    > 	at org.apache.lucene.search.IndexSearcher.search(IndexSearcher.java:666)
   [junit4]    > 	at org.apache.lucene.search.AssertingIndexSearcher.search(AssertingIndexSearcher.java:91)
   [junit4]    > 	at org.apache.lucene.search.IndexSearcher.search(IndexSearcher.java:473)
   [junit4]    > 	at org.apache.lucene.search.IndexSearcher.search(IndexSearcher.java:592)
   [junit4]    > 	at org.apache.lucene.search.IndexSearcher.searchAfter(IndexSearcher.java:450)
   [junit4]    > 	at org.apache.lucene.search.IndexSearcher.search(IndexSearcher.java:461)
   [junit4]    > 	at org.apache.lucene.queryparser.xml.TestCoreParser.dumpResults(TestCoreParser.java:194)
   [junit4]    > 	at org.apache.lucene.queryparser.xml.TestCoreParser.testMatchAllDocsPlusFilterXML(TestCoreParser.java:120)
   [junit4]    > 	at java.lang.Thread.run(Thread.java:745)
   [junit4]   2> NOTE: reproduce with: ant test  -Dtestcase=TestCoreParser -Dtests.method=testNumericRangeQueryXML -Dtests.seed=36E7629C7634AAC0 -Dtests.slow=true -Dtests.locale=da -Dtests.timezone=Africa/Niamey -Dtests.asserts=true -Dtests.file.encoding=UTF-8
   [junit4] ERROR   0.00s J0 | TestCoreParser.testNumericRangeQueryXML <<<
   [junit4]    > Throwable #1: org.apache.lucene.store.AlreadyClosedException: this IndexReader is closed
   [junit4]    > 	at __randomizedtesting.SeedInfo.seed([36E7629C7634AAC0:149FF15FC2873968]:0)
   [junit4]    > 	at org.apache.lucene.index.IndexReader.ensureOpen(IndexReader.java:272)
   [junit4]    > 	at org.apache.lucene.index.SegmentReader.getPostingsReader(SegmentReader.java:240)
   [junit4]    > 	at org.apache.lucene.index.CodecReader.fields(CodecReader.java:109)
   [junit4]    > 	at org.apache.lucene.index.LeafReader.terms(LeafReader.java:207)
   [junit4]    > 	at org.apache.lucene.index.TermContext.build(TermContext.java:91)
   [junit4]    > 	at org.apache.lucene.search.TermQuery.createWeight(TermQuery.java:191)
   [junit4]    > 	at org.apache.lucene.search.IndexSearcher.createWeight(IndexSearcher.java:752)
   [junit4]    > 	at org.apache.lucene.search.AssertingIndexSearcher.createWeight(AssertingIndexSearcher.java:76)
   [junit4]    > 	at org.apache.lucene.search.BooleanWeight.<init>(BooleanWeight.java:57)
   [junit4]    > 	at org.apache.lucene.search.BooleanQuery.createWeight(BooleanQuery.java:226)
   [junit4]    > 	at org.apache.lucene.search.IndexSearcher.createWeight(IndexSearcher.java:752)
   [junit4]    > 	at org.apache.lucene.search.AssertingIndexSearcher.createWeight(AssertingIndexSearcher.java:76)
   [junit4]    > 	at org.apache.lucene.search.IndexSearcher.createNormalizedWeight(IndexSearcher.java:735)
   [junit4]    > 	at org.apache.lucene.search.AssertingIndexSearcher.createNormalizedWeight(AssertingIndexSearcher.java:57)
   [junit4]    > 	at org.apache.lucene.search.IndexSearcher.search(IndexSearcher.java:473)
   [junit4]    > 	at org.apache.lucene.search.IndexSearcher.search(IndexSearcher.java:592)
   [junit4]    > 	at org.apache.lucene.search.IndexSearcher.searchAfter(IndexSearcher.java:450)
   [junit4]    > 	at org.apache.lucene.search.IndexSearcher.search(IndexSearcher.java:461)
   [junit4]    > 	at org.apache.lucene.queryparser.xml.TestCoreParser.dumpResults(TestCoreParser.java:194)
   [junit4]    > 	at org.apache.lucene.queryparser.xml.TestCoreParser.testNumericRangeQueryXML(TestCoreParser.java:130)
   [junit4]    > 	at java.lang.Thread.run(Thread.java:745)
   [junit4]   2> NOTE: reproduce with: ant test  -Dtestcase=TestCoreParser -Dtests.method=testTermQueryXML -Dtests.seed=36E7629C7634AAC0 -Dtests.slow=true -Dtests.locale=da -Dtests.timezone=Africa/Niamey -Dtests.asserts=true -Dtests.file.encoding=UTF-8
   [junit4] ERROR   0.00s J0 | TestCoreParser.testTermQueryXML <<<
   [junit4]    > Throwable #1: org.apache.lucene.store.AlreadyClosedException: this IndexReader is closed
   [junit4]    > 	at __randomizedtesting.SeedInfo.seed([36E7629C7634AAC0:AC034171ABCAA728]:0)
   [junit4]    > 	at org.apache.lucene.index.IndexReader.ensureOpen(IndexReader.java:272)
   [junit4]    > 	at org.apache.lucene.index.SegmentReader.getPostingsReader(SegmentReader.java:240)
   [junit4]    > 	at org.apache.lucene.index.CodecReader.fields(CodecReader.java:109)
   [junit4]    > 	at org.apache.lucene.index.LeafReader.terms(LeafReader.java:207)
   [junit4]    > 	at org.apache.lucene.index.TermContext.build(TermContext.java:91)
   [junit4]    > 	at org.apache.lucene.search.TermQuery.createWeight(TermQuery.java:191)
   [junit4]    > 	at org.apache.lucene.search.IndexSearcher.createWeight(IndexSearcher.java:752)
   [junit4]    > 	at org.apache.lucene.search.AssertingIndexSearcher.createWeight(AssertingIndexSearcher.java:76)
   [junit4]    > 	at org.apache.lucene.search.IndexSearcher.createNormalizedWeight(IndexSearcher.java:735)
   [junit4]    > 	at org.apache.lucene.search.AssertingIndexSearcher.createNormalizedWeight(AssertingIndexSearcher.java:57)
   [junit4]    > 	at org.apache.lucene.search.IndexSearcher.search(IndexSearcher.java:473)
   [junit4]    > 	at org.apache.lucene.search.IndexSearcher.search(IndexSearcher.java:592)
   [junit4]    > 	at org.apache.lucene.search.IndexSearcher.searchAfter(IndexSearcher.java:450)
   [junit4]    > 	at org.apache.lucene.search.IndexSearcher.search(IndexSearcher.java:461)
   [junit4]    > 	at org.apache.lucene.queryparser.xml.TestCoreParser.dumpResults(TestCoreParser.java:194)
   [junit4]    > 	at org.apache.lucene.queryparser.xml.TestCoreParser.testTermQueryXML(TestCoreParser.java:63)
   [junit4]    > 	at java.lang.Thread.run(Thread.java:745)
   [junit4]   2> NOTE: reproduce with: ant test  -Dtestcase=TestCoreParser -Dtests.method=testBoostingTermQueryXML -Dtests.seed=36E7629C7634AAC0 -Dtests.slow=true -Dtests.locale=da -Dtests.timezone=Africa/Niamey -Dtests.asserts=true -Dtests.file.encoding=UTF-8
   [junit4] ERROR   0.00s J0 | TestCoreParser.testBoostingTermQueryXML <<<
   [junit4]    > Throwable #1: org.apache.lucene.store.AlreadyClosedException: this IndexReader is closed
   [junit4]    > 	at __randomizedtesting.SeedInfo.seed([36E7629C7634AAC0:196491806A3EED0D]:0)
   [junit4]    > 	at org.apache.lucene.index.IndexReader.ensureOpen(IndexReader.java:272)
   [junit4]    > 	at org.apache.lucene.index.SegmentReader.getPostingsReader(SegmentReader.java:240)
   [junit4]    > 	at org.apache.lucene.index.CodecReader.fields(CodecReader.java:109)
   [junit4]    > 	at org.apache.lucene.index.LeafReader.terms(LeafReader.java:207)
   [junit4]    > 	at org.apache.lucene.index.TermContext.build(TermContext.java:91)
   [junit4]    > 	at org.apache.lucene.search.spans.SpanTermQuery.createWeight(SpanTermQuery.java:71)
   [junit4]    > 	at org.apache.lucene.queries.payloads.PayloadScoreQuery.createWeight(PayloadScoreQuery.java:89)
   [junit4]    > 	at org.apache.lucene.queries.payloads.PayloadScoreQuery.

[...truncated too long message...]

rchAfter(IndexSearcher.java:450)
   [junit4]    > 	at org.apache.lucene.search.IndexSearcher.search(IndexSearcher.java:461)
   [junit4]    > 	at org.apache.lucene.queryparser.xml.TestCoreParser.dumpResults(TestCoreParser.java:194)
   [junit4]    > 	at org.apache.lucene.queryparser.xml.TestCoreParser.testNestedBooleanQuery(TestCoreParser.java:125)
   [junit4]    > 	at java.lang.Thread.run(Thread.java:745)
   [junit4]   2> NOTE: reproduce with: ant test  -Dtestcase=TestCoreParser -Dtests.method=testUserQueryXML -Dtests.seed=36E7629C7634AAC0 -Dtests.slow=true -Dtests.locale=da -Dtests.timezone=Africa/Niamey -Dtests.asserts=true -Dtests.file.encoding=UTF-8
   [junit4] ERROR   0.00s J0 | TestCoreParser.testUserQueryXML <<<
   [junit4]    > Throwable #1: org.apache.lucene.store.AlreadyClosedException: this IndexReader is closed
   [junit4]    > 	at __randomizedtesting.SeedInfo.seed([36E7629C7634AAC0:5FB16CFA9FCB401D]:0)
   [junit4]    > 	at org.apache.lucene.index.IndexReader.ensureOpen(IndexReader.java:272)
   [junit4]    > 	at org.apache.lucene.index.SegmentReader.getPostingsReader(SegmentReader.java:240)
   [junit4]    > 	at org.apache.lucene.index.CodecReader.fields(CodecReader.java:109)
   [junit4]    > 	at org.apache.lucene.index.LeafReader.terms(LeafReader.java:207)
   [junit4]    > 	at org.apache.lucene.index.TermContext.build(TermContext.java:91)
   [junit4]    > 	at org.apache.lucene.search.PhraseQuery$PhraseWeight.<init>(PhraseQuery.java:375)
   [junit4]    > 	at org.apache.lucene.search.PhraseQuery.createWeight(PhraseQuery.java:511)
   [junit4]    > 	at org.apache.lucene.search.IndexSearcher.createWeight(IndexSearcher.java:752)
   [junit4]    > 	at org.apache.lucene.search.AssertingIndexSearcher.createWeight(AssertingIndexSearcher.java:76)
   [junit4]    > 	at org.apache.lucene.search.BooleanWeight.<init>(BooleanWeight.java:57)
   [junit4]    > 	at org.apache.lucene.search.BooleanQuery.createWeight(BooleanQuery.java:226)
   [junit4]    > 	at org.apache.lucene.search.IndexSearcher.createWeight(IndexSearcher.java:752)
   [junit4]    > 	at org.apache.lucene.search.AssertingIndexSearcher.createWeight(AssertingIndexSearcher.java:76)
   [junit4]    > 	at org.apache.lucene.search.IndexSearcher.createNormalizedWeight(IndexSearcher.java:735)
   [junit4]    > 	at org.apache.lucene.search.AssertingIndexSearcher.createNormalizedWeight(AssertingIndexSearcher.java:57)
   [junit4]    > 	at org.apache.lucene.search.IndexSearcher.search(IndexSearcher.java:473)
   [junit4]    > 	at org.apache.lucene.search.IndexSearcher.search(IndexSearcher.java:592)
   [junit4]    > 	at org.apache.lucene.search.IndexSearcher.searchAfter(IndexSearcher.java:450)
   [junit4]    > 	at org.apache.lucene.search.IndexSearcher.search(IndexSearcher.java:461)
   [junit4]    > 	at org.apache.lucene.queryparser.xml.TestCoreParser.dumpResults(TestCoreParser.java:194)
   [junit4]    > 	at org.apache.lucene.queryparser.xml.TestCoreParser.testUserQueryXML(TestCoreParser.java:94)
   [junit4]    > 	at java.lang.Thread.run(Thread.java:745)
   [junit4]   2> NOTE: reproduce with: ant test  -Dtestcase=TestCoreParser -Dtests.method=testRangeQueryXML -Dtests.seed=36E7629C7634AAC0 -Dtests.slow=true -Dtests.locale=da -Dtests.timezone=Africa/Niamey -Dtests.asserts=true -Dtests.file.encoding=UTF-8
   [junit4] ERROR   0.00s J0 | TestCoreParser.testRangeQueryXML <<<
   [junit4]    > Throwable #1: org.apache.lucene.store.AlreadyClosedException: this IndexReader is closed
   [junit4]    > 	at __randomizedtesting.SeedInfo.seed([36E7629C7634AAC0:8568357AB01C0714]:0)
   [junit4]    > 	at org.apache.lucene.index.IndexReader.ensureOpen(IndexReader.java:272)
   [junit4]    > 	at org.apache.lucene.index.SegmentReader.getPostingsReader(SegmentReader.java:240)
   [junit4]    > 	at org.apache.lucene.index.CodecReader.fields(CodecReader.java:109)
   [junit4]    > 	at org.apache.lucene.index.LeafReader.terms(LeafReader.java:207)
   [junit4]    > 	at org.apache.lucene.search.MultiTermQueryConstantScoreWrapper$1.rewrite(MultiTermQueryConstantScoreWrapper.java:142)
   [junit4]    > 	at org.apache.lucene.search.MultiTermQueryConstantScoreWrapper$1.bulkScorer(MultiTermQueryConstantScoreWrapper.java:201)
   [junit4]    > 	at org.apache.lucene.search.AssertingWeight.bulkScorer(AssertingWeight.java:68)
   [junit4]    > 	at org.apache.lucene.search.AssertingWeight.bulkScorer(AssertingWeight.java:68)
   [junit4]    > 	at org.apache.lucene.search.IndexSearcher.search(IndexSearcher.java:666)
   [junit4]    > 	at org.apache.lucene.search.AssertingIndexSearcher.search(AssertingIndexSearcher.java:91)
   [junit4]    > 	at org.apache.lucene.search.IndexSearcher.search(IndexSearcher.java:473)
   [junit4]    > 	at org.apache.lucene.search.IndexSearcher.search(IndexSearcher.java:592)
   [junit4]    > 	at org.apache.lucene.search.IndexSearcher.searchAfter(IndexSearcher.java:450)
   [junit4]    > 	at org.apache.lucene.search.IndexSearcher.search(IndexSearcher.java:461)
   [junit4]    > 	at org.apache.lucene.queryparser.xml.TestCoreParser.dumpResults(TestCoreParser.java:194)
   [junit4]    > 	at org.apache.lucene.queryparser.xml.TestCoreParser.testRangeQueryXML(TestCoreParser.java:89)
   [junit4]    > 	at java.lang.Thread.run(Thread.java:745)
   [junit4]   2> NOTE: reproduce with: ant test  -Dtestcase=TestCoreParser -Dtests.method=testTermsQueryXML -Dtests.seed=36E7629C7634AAC0 -Dtests.slow=true -Dtests.locale=da -Dtests.timezone=Africa/Niamey -Dtests.asserts=true -Dtests.file.encoding=UTF-8
   [junit4] ERROR   0.00s J0 | TestCoreParser.testTermsQueryXML <<<
   [junit4]    > Throwable #1: org.apache.lucene.store.AlreadyClosedException: this IndexReader is closed
   [junit4]    > 	at __randomizedtesting.SeedInfo.seed([36E7629C7634AAC0:1164FE9DB750D37A]:0)
   [junit4]    > 	at org.apache.lucene.index.IndexReader.ensureOpen(IndexReader.java:272)
   [junit4]    > 	at org.apache.lucene.index.SegmentReader.getPostingsReader(SegmentReader.java:240)
   [junit4]    > 	at org.apache.lucene.index.CodecReader.fields(CodecReader.java:109)
   [junit4]    > 	at org.apache.lucene.index.LeafReader.terms(LeafReader.java:207)
   [junit4]    > 	at org.apache.lucene.index.TermContext.build(TermContext.java:91)
   [junit4]    > 	at org.apache.lucene.search.TermQuery.createWeight(TermQuery.java:191)
   [junit4]    > 	at org.apache.lucene.search.IndexSearcher.createWeight(IndexSearcher.java:752)
   [junit4]    > 	at org.apache.lucene.search.AssertingIndexSearcher.createWeight(AssertingIndexSearcher.java:76)
   [junit4]    > 	at org.apache.lucene.search.BooleanWeight.<init>(BooleanWeight.java:57)
   [junit4]    > 	at org.apache.lucene.search.BooleanQuery.createWeight(BooleanQuery.java:226)
   [junit4]    > 	at org.apache.lucene.search.IndexSearcher.createWeight(IndexSearcher.java:752)
   [junit4]    > 	at org.apache.lucene.search.AssertingIndexSearcher.createWeight(AssertingIndexSearcher.java:76)
   [junit4]    > 	at org.apache.lucene.search.IndexSearcher.createNormalizedWeight(IndexSearcher.java:735)
   [junit4]    > 	at org.apache.lucene.search.AssertingIndexSearcher.createNormalizedWeight(AssertingIndexSearcher.java:57)
   [junit4]    > 	at org.apache.lucene.search.IndexSearcher.search(IndexSearcher.java:473)
   [junit4]    > 	at org.apache.lucene.search.IndexSearcher.search(IndexSearcher.java:592)
   [junit4]    > 	at org.apache.lucene.search.IndexSearcher.searchAfter(IndexSearcher.java:450)
   [junit4]    > 	at org.apache.lucene.search.IndexSearcher.search(IndexSearcher.java:461)
   [junit4]    > 	at org.apache.lucene.queryparser.xml.TestCoreParser.dumpResults(TestCoreParser.java:194)
   [junit4]    > 	at org.apache.lucene.queryparser.xml.TestCoreParser.testTermsQueryXML(TestCoreParser.java:68)
   [junit4]    > 	at java.lang.Thread.run(Thread.java:745)
   [junit4]   2> NOTE: test params are: codec=Lucene60, sim=RandomSimilarity(queryNorm=false,coord=no): {}, locale=da, timezone=Africa/Niamey
   [junit4]   2> NOTE: Windows 10 10.0 x86/Oracle Corporation 1.8.0_72 (32-bit)/cpus=3,threads=1,free=45735056,total=69992448
   [junit4]   2> NOTE: All tests run in this JVM: [TestPrecedenceQueryParser, TestPointQueryParser, TestSpanQueryParserSimpleSample, TestQueryParser, TestSpanQueryParser, Test01Exceptions, TestLegacyNumericQueryParser, TestCorePlusQueriesParser, Test03Distance, TestQueryTemplateManager, TestAnalyzingQueryParser, TestQueryTreeBuilder, TestMultiPhraseQueryParsing, TestCoreParser]
   [junit4] Completed [30/30 (1!)] on J0 in 0.09s, 14 tests, 13 errors <<< FAILURES!

[...truncated 19 lines...]
BUILD FAILED
C:\Users\jenkins\workspace\Lucene-Solr-6.x-Windows\build.xml:740: The following error occurred while executing this line:
C:\Users\jenkins\workspace\Lucene-Solr-6.x-Windows\build.xml:684: The following error occurred while executing this line:
C:\Users\jenkins\workspace\Lucene-Solr-6.x-Windows\build.xml:59: The following error occurred while executing this line:
C:\Users\jenkins\workspace\Lucene-Solr-6.x-Windows\lucene\build.xml:476: The following error occurred while executing this line:
C:\Users\jenkins\workspace\Lucene-Solr-6.x-Windows\lucene\common-build.xml:2187: The following error occurred while executing this line:
C:\Users\jenkins\workspace\Lucene-Solr-6.x-Windows\lucene\module-build.xml:58: The following error occurred while executing this line:
C:\Users\jenkins\workspace\Lucene-Solr-6.x-Windows\lucene\common-build.xml:1457: The following error occurred while executing this line:
C:\Users\jenkins\workspace\Lucene-Solr-6.x-Windows\lucene\common-build.xml:1014: There were test failures: 30 suites, 449 tests, 13 errors, 1 ignored [seed: 36E7629C7634AAC0]

Total time: 17 minutes 15 seconds
Build step 'Invoke Ant' marked build as failure
Archiving artifacts
[WARNINGS] Skipping publisher since build result is FAILURE
Recording test results
Email was triggered for: Failure - Any
Sending email for trigger: Failure - Any



Mime
View raw message