lucene-dev mailing list archives

Site index · List index
Message view « Date » · « Thread »
Top « Date » · « Thread »
From Apache Jenkins Server <jenk...@builds.apache.org>
Subject [JENKINS] Lucene-Solr-Tests-master - Build # 1062 - Still Failing
Date Sun, 10 Apr 2016 00:52:08 GMT
Build: https://builds.apache.org/job/Lucene-Solr-Tests-master/1062/

1 tests failed.
FAILED:  org.apache.lucene.index.TestBackwardsCompatibility.testUnsupportedOldIndexes

Error Message:
Cannot find resource: unsupported.6.0.0-cfs.zip

Stack Trace:
java.io.IOException: Cannot find resource: unsupported.6.0.0-cfs.zip
	at __randomizedtesting.SeedInfo.seed([40FFA02DBD2EC930:BB04920E0DB56E6C]:0)
	at org.apache.lucene.util.LuceneTestCase.getDataInputStream(LuceneTestCase.java:1940)
	at org.apache.lucene.index.TestBackwardsCompatibility.testUnsupportedOldIndexes(TestBackwardsCompatibility.java:515)
	at sun.reflect.NativeMethodAccessorImpl.invoke0(Native Method)
	at sun.reflect.NativeMethodAccessorImpl.invoke(NativeMethodAccessorImpl.java:62)
	at sun.reflect.DelegatingMethodAccessorImpl.invoke(DelegatingMethodAccessorImpl.java:43)
	at java.lang.reflect.Method.invoke(Method.java:498)
	at com.carrotsearch.randomizedtesting.RandomizedRunner.invoke(RandomizedRunner.java:1764)
	at com.carrotsearch.randomizedtesting.RandomizedRunner$8.evaluate(RandomizedRunner.java:871)
	at com.carrotsearch.randomizedtesting.RandomizedRunner$9.evaluate(RandomizedRunner.java:907)
	at com.carrotsearch.randomizedtesting.RandomizedRunner$10.evaluate(RandomizedRunner.java:921)
	at org.apache.lucene.util.TestRuleSetupTeardownChained$1.evaluate(TestRuleSetupTeardownChained.java:49)
	at org.apache.lucene.util.AbstractBeforeAfterRule$1.evaluate(AbstractBeforeAfterRule.java:45)
	at org.apache.lucene.util.TestRuleThreadAndTestName$1.evaluate(TestRuleThreadAndTestName.java:48)
	at org.apache.lucene.util.TestRuleIgnoreAfterMaxFailures$1.evaluate(TestRuleIgnoreAfterMaxFailures.java:64)
	at org.apache.lucene.util.TestRuleMarkFailure$1.evaluate(TestRuleMarkFailure.java:47)
	at com.carrotsearch.randomizedtesting.rules.StatementAdapter.evaluate(StatementAdapter.java:36)
	at com.carrotsearch.randomizedtesting.ThreadLeakControl$StatementRunner.run(ThreadLeakControl.java:367)
	at com.carrotsearch.randomizedtesting.ThreadLeakControl.forkTimeoutingTask(ThreadLeakControl.java:809)
	at com.carrotsearch.randomizedtesting.ThreadLeakControl$3.evaluate(ThreadLeakControl.java:460)
	at com.carrotsearch.randomizedtesting.RandomizedRunner.runSingleTest(RandomizedRunner.java:880)
	at com.carrotsearch.randomizedtesting.RandomizedRunner$5.evaluate(RandomizedRunner.java:781)
	at com.carrotsearch.randomizedtesting.RandomizedRunner$6.evaluate(RandomizedRunner.java:816)
	at com.carrotsearch.randomizedtesting.RandomizedRunner$7.evaluate(RandomizedRunner.java:827)
	at org.apache.lucene.util.AbstractBeforeAfterRule$1.evaluate(AbstractBeforeAfterRule.java:45)
	at com.carrotsearch.randomizedtesting.rules.StatementAdapter.evaluate(StatementAdapter.java:36)
	at org.apache.lucene.util.TestRuleStoreClassName$1.evaluate(TestRuleStoreClassName.java:41)
	at com.carrotsearch.randomizedtesting.rules.NoShadowingOrOverridesOnMethodsRule$1.evaluate(NoShadowingOrOverridesOnMethodsRule.java:40)
	at com.carrotsearch.randomizedtesting.rules.NoShadowingOrOverridesOnMethodsRule$1.evaluate(NoShadowingOrOverridesOnMethodsRule.java:40)
	at com.carrotsearch.randomizedtesting.rules.StatementAdapter.evaluate(StatementAdapter.java:36)
	at com.carrotsearch.randomizedtesting.rules.StatementAdapter.evaluate(StatementAdapter.java:36)
	at com.carrotsearch.randomizedtesting.rules.StatementAdapter.evaluate(StatementAdapter.java:36)
	at org.apache.lucene.util.TestRuleAssertionsRequired$1.evaluate(TestRuleAssertionsRequired.java:53)
	at org.apache.lucene.util.TestRuleMarkFailure$1.evaluate(TestRuleMarkFailure.java:47)
	at org.apache.lucene.util.TestRuleIgnoreAfterMaxFailures$1.evaluate(TestRuleIgnoreAfterMaxFailures.java:64)
	at org.apache.lucene.util.TestRuleIgnoreTestSuites$1.evaluate(TestRuleIgnoreTestSuites.java:54)
	at com.carrotsearch.randomizedtesting.rules.StatementAdapter.evaluate(StatementAdapter.java:36)
	at com.carrotsearch.randomizedtesting.ThreadLeakControl$StatementRunner.run(ThreadLeakControl.java:367)
	at java.lang.Thread.run(Thread.java:745)




Build Log:
[...truncated 4278 lines...]
   [junit4] Suite: org.apache.lucene.index.TestBackwardsCompatibility
   [junit4] IGNOR/A 0.04s J2 | TestBackwardsCompatibility.testCreateSingleSegmentNoCFS
   [junit4]    > Assumption #1: backcompat creation tests must be run with -Dtests.bwcdir=/path/to/write/indexes
   [junit4] IGNOR/A 0.01s J2 | TestBackwardsCompatibility.testCreateCFS
   [junit4]    > Assumption #1: backcompat creation tests must be run with -Dtests.bwcdir=/path/to/write/indexes
   [junit4]   2> NOTE: reproduce with: ant test  -Dtestcase=TestBackwardsCompatibility
-Dtests.method=testUnsupportedOldIndexes -Dtests.seed=40FFA02DBD2EC930 -Dtests.multiplier=2
-Dtests.slow=true -Dtests.locale=sr-BA -Dtests.timezone=America/Fortaleza -Dtests.asserts=true
-Dtests.file.encoding=UTF-8
   [junit4] ERROR   3.74s J2 | TestBackwardsCompatibility.testUnsupportedOldIndexes <<<
   [junit4]    > Throwable #1: java.io.IOException: Cannot find resource: unsupported.6.0.0-cfs.zip
   [junit4]    > 	at __randomizedtesting.SeedInfo.seed([40FFA02DBD2EC930:BB04920E0DB56E6C]:0)
   [junit4]    > 	at org.apache.lucene.util.LuceneTestCase.getDataInputStream(LuceneTestCase.java:1940)
   [junit4]    > 	at org.apache.lucene.index.TestBackwardsCompatibility.testUnsupportedOldIndexes(TestBackwardsCompatibility.java:515)
   [junit4]    > 	at java.lang.Thread.run(Thread.java:745)
   [junit4] IGNOR/A 0.00s J2 | TestBackwardsCompatibility.testCreateSingleSegmentCFS
   [junit4]    > Assumption #1: backcompat creation tests must be run with -Dtests.bwcdir=/path/to/write/indexes
   [junit4] IGNOR/A 0.00s J2 | TestBackwardsCompatibility.testCreateMoreTermsIndex
   [junit4]    > Assumption #1: backcompat creation tests must be run with -Dtests.bwcdir=/path/to/write/indexes
   [junit4] IGNOR/A 0.02s J2 | TestBackwardsCompatibility.testCreateIndexWithDocValuesUpdates
   [junit4]    > Assumption #1: backcompat creation tests must be run with -Dtests.bwcdir=/path/to/write/indexes
   [junit4] IGNOR/A 0.00s J2 | TestBackwardsCompatibility.testCreateNoCFS
   [junit4]    > Assumption #1: backcompat creation tests must be run with -Dtests.bwcdir=/path/to/write/indexes
   [junit4]   2> NOTE: leaving temporary files on disk at: /x1/jenkins/jenkins-slave/workspace/Lucene-Solr-Tests-master/lucene/build/backward-codecs/test/J2/temp/lucene.index.TestBackwardsCompatibility_40FFA02DBD2EC930-001
   [junit4]   2> NOTE: test params are: codec=Asserting(Lucene60): {}, docValues:{}, maxPointsInLeafNode=1308,
maxMBSortInHeap=4.348310772472463, sim=RandomSimilarity(queryNorm=true,coord=no): {}, locale=sr-BA,
timezone=America/Fortaleza
   [junit4]   2> NOTE: Linux 3.13.0-52-generic amd64/Oracle Corporation 1.8.0_74 (64-bit)/cpus=4,threads=1,free=179166192,total=319291392
   [junit4]   2> NOTE: All tests run in this JVM: [TestBackwardsCompatibility]
   [junit4] Completed [1/3 (1!)] on J2 in 8.34s, 27 tests, 1 error, 6 skipped <<<
FAILURES!

[...truncated 27 lines...]
BUILD FAILED
/x1/jenkins/jenkins-slave/workspace/Lucene-Solr-Tests-master/build.xml:740: The following
error occurred while executing this line:
/x1/jenkins/jenkins-slave/workspace/Lucene-Solr-Tests-master/build.xml:684: The following
error occurred while executing this line:
/x1/jenkins/jenkins-slave/workspace/Lucene-Solr-Tests-master/build.xml:59: The following error
occurred while executing this line:
/x1/jenkins/jenkins-slave/workspace/Lucene-Solr-Tests-master/lucene/build.xml:476: The following
error occurred while executing this line:
/x1/jenkins/jenkins-slave/workspace/Lucene-Solr-Tests-master/lucene/common-build.xml:2187:
The following error occurred while executing this line:
/x1/jenkins/jenkins-slave/workspace/Lucene-Solr-Tests-master/lucene/module-build.xml:58: The
following error occurred while executing this line:
/x1/jenkins/jenkins-slave/workspace/Lucene-Solr-Tests-master/lucene/common-build.xml:1457:
The following error occurred while executing this line:
/x1/jenkins/jenkins-slave/workspace/Lucene-Solr-Tests-master/lucene/common-build.xml:1014:
There were test failures: 3 suites, 151 tests, 1 error, 11 ignored (11 assumptions) [seed:
40FFA02DBD2EC930]

Total time: 22 minutes 54 seconds
Build step 'Invoke Ant' marked build as failure
Archiving artifacts
Recording test results
Email was triggered for: Failure - Any
Sending email for trigger: Failure - Any




Mime
View raw message