lucene-dev mailing list archives

Site index · List index
Message view « Date » · « Thread »
Top « Date » · « Thread »
From Policeman Jenkins Server <jenk...@thetaphi.de>
Subject [JENKINS] Lucene-Solr-5.5-Windows (64bit/jdk1.8.0_92) - Build # 58 - Failure!
Date Thu, 28 Apr 2016 00:23:54 GMT
Build: http://jenkins.thetaphi.de/job/Lucene-Solr-5.5-Windows/58/
Java: 64bit/jdk1.8.0_92 -XX:-UseCompressedOops -XX:+UseSerialGC

1 tests failed.
FAILED:  junit.framework.TestSuite.org.apache.lucene.store.TestSimpleFSDirectory

Error Message:
Could not remove the following files (in the order of attempts):    C:\Users\jenkins\workspace\Lucene-Solr-5.5-Windows\lucene\build\core\test\J0\temp\lucene.store.TestSimpleFSDirectory_BA75157CCC80915B-001\testThreadSafety-001:
java.nio.file.AccessDeniedException: C:\Users\jenkins\workspace\Lucene-Solr-5.5-Windows\lucene\build\core\test\J0\temp\lucene.store.TestSimpleFSDirectory_BA75157CCC80915B-001\testThreadSafety-001
   C:\Users\jenkins\workspace\Lucene-Solr-5.5-Windows\lucene\build\core\test\J0\temp\lucene.store.TestSimpleFSDirectory_BA75157CCC80915B-001:
java.nio.file.DirectoryNotEmptyException: C:\Users\jenkins\workspace\Lucene-Solr-5.5-Windows\lucene\build\core\test\J0\temp\lucene.store.TestSimpleFSDirectory_BA75157CCC80915B-001


Stack Trace:
java.io.IOException: Could not remove the following files (in the order of attempts):
   C:\Users\jenkins\workspace\Lucene-Solr-5.5-Windows\lucene\build\core\test\J0\temp\lucene.store.TestSimpleFSDirectory_BA75157CCC80915B-001\testThreadSafety-001:
java.nio.file.AccessDeniedException: C:\Users\jenkins\workspace\Lucene-Solr-5.5-Windows\lucene\build\core\test\J0\temp\lucene.store.TestSimpleFSDirectory_BA75157CCC80915B-001\testThreadSafety-001
   C:\Users\jenkins\workspace\Lucene-Solr-5.5-Windows\lucene\build\core\test\J0\temp\lucene.store.TestSimpleFSDirectory_BA75157CCC80915B-001:
java.nio.file.DirectoryNotEmptyException: C:\Users\jenkins\workspace\Lucene-Solr-5.5-Windows\lucene\build\core\test\J0\temp\lucene.store.TestSimpleFSDirectory_BA75157CCC80915B-001

	at __randomizedtesting.SeedInfo.seed([BA75157CCC80915B]:0)
	at org.apache.lucene.util.IOUtils.rm(IOUtils.java:295)
	at org.apache.lucene.util.TestRuleTemporaryFilesCleanup.afterAlways(TestRuleTemporaryFilesCleanup.java:217)
	at com.carrotsearch.randomizedtesting.rules.TestRuleAdapter$1.afterAlways(TestRuleAdapter.java:31)
	at com.carrotsearch.randomizedtesting.rules.StatementAdapter.evaluate(StatementAdapter.java:43)
	at com.carrotsearch.randomizedtesting.rules.StatementAdapter.evaluate(StatementAdapter.java:36)
	at org.apache.lucene.util.TestRuleAssertionsRequired$1.evaluate(TestRuleAssertionsRequired.java:53)
	at org.apache.lucene.util.TestRuleMarkFailure$1.evaluate(TestRuleMarkFailure.java:47)
	at org.apache.lucene.util.TestRuleIgnoreAfterMaxFailures$1.evaluate(TestRuleIgnoreAfterMaxFailures.java:64)
	at org.apache.lucene.util.TestRuleIgnoreTestSuites$1.evaluate(TestRuleIgnoreTestSuites.java:54)
	at com.carrotsearch.randomizedtesting.rules.StatementAdapter.evaluate(StatementAdapter.java:36)
	at com.carrotsearch.randomizedtesting.ThreadLeakControl$StatementRunner.run(ThreadLeakControl.java:367)
	at java.lang.Thread.run(Thread.java:745)




Build Log:
[...truncated 738 lines...]
   [junit4] Suite: org.apache.lucene.store.TestSimpleFSDirectory
   [junit4]   2> NOTE: test params are: codec=Asserting(Lucene54): {}, docValues:{}, sim=DefaultSimilarity,
locale=ja, timezone=Asia/Novokuznetsk
   [junit4]   2> NOTE: Windows 10 10.0 amd64/Oracle Corporation 1.8.0_92 (64-bit)/cpus=3,threads=1,free=70534840,total=174731264
   [junit4]   2> NOTE: All tests run in this JVM: [TestVersion, TestQueryBuilder, TestSimpleSearchEquivalence,
TestIndexWriterDeleteByQuery, TestCachingTokenFilter, TestReusableStringReader, TestSegmentInfos,
TestParallelTermEnum, TestFieldValueFilter, TestSortRescorer, TestFlushByRamOrCountsPolicy,
TestIndexWriterFromReader, TestOperations, TestCharTermAttributeImpl, TestTryDelete, TestField,
Test2BNumericDocValues, TestStressIndexing2, LimitedFiniteStringsIteratorTest, TestIndexWriterDelete,
TestDocsAndPositions, TestArrayUtil, TestPackedTokenAttributeImpl, TestHugeRamFile, TestPrefixCodedTerms,
TestNumericDocValuesUpdates, TestComplexExplanations, TestDefaultSimilarity, TestIndexFileDeleter,
TestDocumentsWriterDeleteQueue, TestSparseFixedBitDocIdSet, TestIndexWriterThreadsToSegments,
TestSimpleExplanationsOfNonMatches, TestFrequencyTrackingRingBuffer, TestIndexInput, TestBooleanQueryVisitSubscorers,
TestSingleInstanceLockFactory, TestTerms, TestPayloadsOnVectors, TestDirectPacked, TestMultiPhraseQuery,
TestSloppyPhraseQuery2, TestCodecUtil, TestBasics, TestLucene50StoredFieldsFormat, TestMmapDirectory,
TestPerFieldPostingsFormat, TestCloseableThreadLocal, TestFilterLeafReader, TestIndexWriterNRTIsCurrent,
TestIndexWriterOnVMError, TestBooleanRewrites, TestLSBRadixSorter, TestDeletionPolicy, TestTopDocsMerge,
TestIndexWriterUnicode, TestParallelCompositeReader, TestOmitPositions, TestSimilarityBase,
TestLucene50TermVectorsFormat, TestEarlyTermination, Test2BSortedDocValuesFixedSorted, TestTermVectorsWriter,
TestIntArrayDocIdSet, TestSort, TestIndexableField, TestIndexWriterExceptions, TestUsageTrackingFilterCachingPolicy,
TestSimilarity, TestDocIdSetBuilder, TestTermRangeFilter, TestSimpleFSDirectory]
   [junit4]   2> NOTE: reproduce with: ant test  -Dtestcase=TestSimpleFSDirectory -Dtests.seed=BA75157CCC80915B
-Dtests.slow=true -Dtests.locale=ja -Dtests.timezone=Asia/Novokuznetsk -Dtests.asserts=true
-Dtests.file.encoding=Cp1252
   [junit4] ERROR   0.00s J0 | TestSimpleFSDirectory (suite) <<<
   [junit4]    > Throwable #1: java.io.IOException: Could not remove the following files
(in the order of attempts):
   [junit4]    >    C:\Users\jenkins\workspace\Lucene-Solr-5.5-Windows\lucene\build\core\test\J0\temp\lucene.store.TestSimpleFSDirectory_BA75157CCC80915B-001\testThreadSafety-001:
java.nio.file.AccessDeniedException: C:\Users\jenkins\workspace\Lucene-Solr-5.5-Windows\lucene\build\core\test\J0\temp\lucene.store.TestSimpleFSDirectory_BA75157CCC80915B-001\testThreadSafety-001
   [junit4]    >    C:\Users\jenkins\workspace\Lucene-Solr-5.5-Windows\lucene\build\core\test\J0\temp\lucene.store.TestSimpleFSDirectory_BA75157CCC80915B-001:
java.nio.file.DirectoryNotEmptyException: C:\Users\jenkins\workspace\Lucene-Solr-5.5-Windows\lucene\build\core\test\J0\temp\lucene.store.TestSimpleFSDirectory_BA75157CCC80915B-001
   [junit4]    > 	at __randomizedtesting.SeedInfo.seed([BA75157CCC80915B]:0)
   [junit4]    > 	at org.apache.lucene.util.IOUtils.rm(IOUtils.java:295)
   [junit4]    > 	at java.lang.Thread.run(Thread.java:745)
   [junit4] Completed [164/421 (1!)] on J0 in 2.79s, 42 tests, 1 error <<< FAILURES!

[...truncated 853 lines...]
BUILD FAILED
C:\Users\jenkins\workspace\Lucene-Solr-5.5-Windows\build.xml:750: The following error occurred
while executing this line:
C:\Users\jenkins\workspace\Lucene-Solr-5.5-Windows\build.xml:694: The following error occurred
while executing this line:
C:\Users\jenkins\workspace\Lucene-Solr-5.5-Windows\build.xml:59: The following error occurred
while executing this line:
C:\Users\jenkins\workspace\Lucene-Solr-5.5-Windows\lucene\build.xml:50: The following error
occurred while executing this line:
C:\Users\jenkins\workspace\Lucene-Solr-5.5-Windows\lucene\common-build.xml:1477: The following
error occurred while executing this line:
C:\Users\jenkins\workspace\Lucene-Solr-5.5-Windows\lucene\common-build.xml:1033: There were
test failures: 421 suites (1 ignored), 3386 tests, 1 suite-level error, 64 ignored (60 assumptions)
[seed: BA75157CCC80915B]

Total time: 6 minutes 57 seconds
Build step 'Invoke Ant' marked build as failure
Archiving artifacts
[WARNINGS] Skipping publisher since build result is FAILURE
Recording test results
Email was triggered for: Failure - Any
Sending email for trigger: Failure - Any



Mime
View raw message