lucene-dev mailing list archives

Site index · List index
Message view « Date » · « Thread »
Top « Date » · « Thread »
From Apache Jenkins Server <jenk...@builds.apache.org>
Subject [JENKINS] Lucene-Solr-NightlyTests-6.x - Build # 33 - Still Failing
Date Sun, 10 Apr 2016 00:18:19 GMT
Build: https://builds.apache.org/job/Lucene-Solr-NightlyTests-6.x/33/

6 tests failed.
FAILED:  org.apache.solr.client.solrj.ConnectionReuseTest.test

Error Message:
We expected all communication via streaming client to use one connection! expected=245 got=241

Stack Trace:
java.lang.AssertionError: We expected all communication via streaming client to use one connection! expected=245 got=241
	at __randomizedtesting.SeedInfo.seed([5183B715ACE3B7E2:D9D788CF021FDA1A]:0)
	at org.junit.Assert.fail(Assert.java:93)
	at org.junit.Assert.assertTrue(Assert.java:43)
	at org.apache.solr.client.solrj.ConnectionReuseTest.test(ConnectionReuseTest.java:150)
	at sun.reflect.NativeMethodAccessorImpl.invoke0(Native Method)
	at sun.reflect.NativeMethodAccessorImpl.invoke(NativeMethodAccessorImpl.java:62)
	at sun.reflect.DelegatingMethodAccessorImpl.invoke(DelegatingMethodAccessorImpl.java:43)
	at java.lang.reflect.Method.invoke(Method.java:498)
	at com.carrotsearch.randomizedtesting.RandomizedRunner.invoke(RandomizedRunner.java:1764)
	at com.carrotsearch.randomizedtesting.RandomizedRunner$8.evaluate(RandomizedRunner.java:871)
	at com.carrotsearch.randomizedtesting.RandomizedRunner$9.evaluate(RandomizedRunner.java:907)
	at com.carrotsearch.randomizedtesting.RandomizedRunner$10.evaluate(RandomizedRunner.java:921)
	at org.apache.solr.BaseDistributedSearchTestCase$ShardsRepeatRule$ShardsFixedStatement.callStatement(BaseDistributedSearchTestCase.java:992)
	at org.apache.solr.BaseDistributedSearchTestCase$ShardsRepeatRule$ShardsStatement.evaluate(BaseDistributedSearchTestCase.java:967)
	at com.carrotsearch.randomizedtesting.rules.SystemPropertiesRestoreRule$1.evaluate(SystemPropertiesRestoreRule.java:57)
	at org.apache.lucene.util.TestRuleSetupTeardownChained$1.evaluate(TestRuleSetupTeardownChained.java:49)
	at org.apache.lucene.util.AbstractBeforeAfterRule$1.evaluate(AbstractBeforeAfterRule.java:45)
	at org.apache.lucene.util.TestRuleThreadAndTestName$1.evaluate(TestRuleThreadAndTestName.java:48)
	at org.apache.lucene.util.TestRuleIgnoreAfterMaxFailures$1.evaluate(TestRuleIgnoreAfterMaxFailures.java:64)
	at org.apache.lucene.util.TestRuleMarkFailure$1.evaluate(TestRuleMarkFailure.java:47)
	at com.carrotsearch.randomizedtesting.rules.StatementAdapter.evaluate(StatementAdapter.java:36)
	at com.carrotsearch.randomizedtesting.ThreadLeakControl$StatementRunner.run(ThreadLeakControl.java:367)
	at com.carrotsearch.randomizedtesting.ThreadLeakControl.forkTimeoutingTask(ThreadLeakControl.java:809)
	at com.carrotsearch.randomizedtesting.ThreadLeakControl$3.evaluate(ThreadLeakControl.java:460)
	at com.carrotsearch.randomizedtesting.RandomizedRunner.runSingleTest(RandomizedRunner.java:880)
	at com.carrotsearch.randomizedtesting.RandomizedRunner$5.evaluate(RandomizedRunner.java:781)
	at com.carrotsearch.randomizedtesting.RandomizedRunner$6.evaluate(RandomizedRunner.java:816)
	at com.carrotsearch.randomizedtesting.RandomizedRunner$7.evaluate(RandomizedRunner.java:827)
	at com.carrotsearch.randomizedtesting.rules.StatementAdapter.evaluate(StatementAdapter.java:36)
	at com.carrotsearch.randomizedtesting.rules.SystemPropertiesRestoreRule$1.evaluate(SystemPropertiesRestoreRule.java:57)
	at org.apache.lucene.util.AbstractBeforeAfterRule$1.evaluate(AbstractBeforeAfterRule.java:45)
	at com.carrotsearch.randomizedtesting.rules.StatementAdapter.evaluate(StatementAdapter.java:36)
	at org.apache.lucene.util.TestRuleStoreClassName$1.evaluate(TestRuleStoreClassName.java:41)
	at com.carrotsearch.randomizedtesting.rules.NoShadowingOrOverridesOnMethodsRule$1.evaluate(NoShadowingOrOverridesOnMethodsRule.java:40)
	at com.carrotsearch.randomizedtesting.rules.NoShadowingOrOverridesOnMethodsRule$1.evaluate(NoShadowingOrOverridesOnMethodsRule.java:40)
	at com.carrotsearch.randomizedtesting.rules.StatementAdapter.evaluate(StatementAdapter.java:36)
	at com.carrotsearch.randomizedtesting.rules.StatementAdapter.evaluate(StatementAdapter.java:36)
	at com.carrotsearch.randomizedtesting.rules.StatementAdapter.evaluate(StatementAdapter.java:36)
	at org.apache.lucene.util.TestRuleAssertionsRequired$1.evaluate(TestRuleAssertionsRequired.java:53)
	at org.apache.lucene.util.TestRuleMarkFailure$1.evaluate(TestRuleMarkFailure.java:47)
	at org.apache.lucene.util.TestRuleIgnoreAfterMaxFailures$1.evaluate(TestRuleIgnoreAfterMaxFailures.java:64)
	at org.apache.lucene.util.TestRuleIgnoreTestSuites$1.evaluate(TestRuleIgnoreTestSuites.java:54)
	at com.carrotsearch.randomizedtesting.rules.StatementAdapter.evaluate(StatementAdapter.java:36)
	at com.carrotsearch.randomizedtesting.ThreadLeakControl$StatementRunner.run(ThreadLeakControl.java:367)
	at java.lang.Thread.run(Thread.java:745)


FAILED:  org.apache.solr.cloud.LeaderFailoverAfterPartitionTest.test

Error Message:
Expected 2 of 3 replicas to be active but only found 1; [core_node2:{"core":"c8n_1x3_lf_shard1_replica2","base_url":"http://127.0.0.1:50934/_","node_name":"127.0.0.1:50934__","state":"active","leader":"true"}]; clusterState: DocCollection(c8n_1x3_lf)={   "replicationFactor":"3",   "shards":{"shard1":{       "range":"80000000-7fffffff",       "state":"active",       "replicas":{         "core_node1":{           "state":"down",           "base_url":"http://127.0.0.1:53417/_",           "core":"c8n_1x3_lf_shard1_replica3",           "node_name":"127.0.0.1:53417__"},         "core_node2":{           "core":"c8n_1x3_lf_shard1_replica2",           "base_url":"http://127.0.0.1:50934/_",           "node_name":"127.0.0.1:50934__",           "state":"active",           "leader":"true"},         "core_node3":{           "core":"c8n_1x3_lf_shard1_replica1",           "base_url":"http://127.0.0.1:57768/_",           "node_name":"127.0.0.1:57768__",           "state":"down"}}}},   "router":{"name":"compositeId"},   "maxShardsPerNode":"1",   "autoAddReplicas":"false"}

Stack Trace:
java.lang.AssertionError: Expected 2 of 3 replicas to be active but only found 1; [core_node2:{"core":"c8n_1x3_lf_shard1_replica2","base_url":"http://127.0.0.1:50934/_","node_name":"127.0.0.1:50934__","state":"active","leader":"true"}]; clusterState: DocCollection(c8n_1x3_lf)={
  "replicationFactor":"3",
  "shards":{"shard1":{
      "range":"80000000-7fffffff",
      "state":"active",
      "replicas":{
        "core_node1":{
          "state":"down",
          "base_url":"http://127.0.0.1:53417/_",
          "core":"c8n_1x3_lf_shard1_replica3",
          "node_name":"127.0.0.1:53417__"},
        "core_node2":{
          "core":"c8n_1x3_lf_shard1_replica2",
          "base_url":"http://127.0.0.1:50934/_",
          "node_name":"127.0.0.1:50934__",
          "state":"active",
          "leader":"true"},
        "core_node3":{
          "core":"c8n_1x3_lf_shard1_replica1",
          "base_url":"http://127.0.0.1:57768/_",
          "node_name":"127.0.0.1:57768__",
          "state":"down"}}}},
  "router":{"name":"compositeId"},
  "maxShardsPerNode":"1",
  "autoAddReplicas":"false"}
	at __randomizedtesting.SeedInfo.seed([5183B715ACE3B7E2:D9D788CF021FDA1A]:0)
	at org.junit.Assert.fail(Assert.java:93)
	at org.junit.Assert.assertTrue(Assert.java:43)
	at org.apache.solr.cloud.LeaderFailoverAfterPartitionTest.testRf3WithLeaderFailover(LeaderFailoverAfterPartitionTest.java:168)
	at org.apache.solr.cloud.LeaderFailoverAfterPartitionTest.test(LeaderFailoverAfterPartitionTest.java:55)
	at sun.reflect.NativeMethodAccessorImpl.invoke0(Native Method)
	at sun.reflect.NativeMethodAccessorImpl.invoke(NativeMethodAccessorImpl.java:62)
	at sun.reflect.DelegatingMethodAccessorImpl.invoke(DelegatingMethodAccessorImpl.java:43)
	at java.lang.reflect.Method.invoke(Method.java:498)
	at com.carrotsearch.randomizedtesting.RandomizedRunner.invoke(RandomizedRunner.java:1764)
	at com.carrotsearch.randomizedtesting.RandomizedRunner$8.evaluate(RandomizedRunner.java:871)
	at com.carrotsearch.randomizedtesting.RandomizedRunner$9.evaluate(RandomizedRunner.java:907)
	at com.carrotsearch.randomizedtesting.RandomizedRunner$10.evaluate(RandomizedRunner.java:921)
	at org.apache.solr.BaseDistributedSearchTestCase$ShardsRepeatRule$ShardsFixedStatement.callStatement(BaseDistributedSearchTestCase.java:992)
	at org.apache.solr.BaseDistributedSearchTestCase$ShardsRepeatRule$ShardsStatement.evaluate(BaseDistributedSearchTestCase.java:967)
	at com.carrotsearch.randomizedtesting.rules.SystemPropertiesRestoreRule$1.evaluate(SystemPropertiesRestoreRule.java:57)
	at org.apache.lucene.util.TestRuleSetupTeardownChained$1.evaluate(TestRuleSetupTeardownChained.java:49)
	at org.apache.lucene.util.AbstractBeforeAfterRule$1.evaluate(AbstractBeforeAfterRule.java:45)
	at org.apache.lucene.util.TestRuleThreadAndTestName$1.evaluate(TestRuleThreadAndTestName.java:48)
	at org.apache.lucene.util.TestRuleIgnoreAfterMaxFailures$1.evaluate(TestRuleIgnoreAfterMaxFailures.java:64)
	at org.apache.lucene.util.TestRuleMarkFailure$1.evaluate(TestRuleMarkFailure.java:47)
	at com.carrotsearch.randomizedtesting.rules.StatementAdapter.evaluate(StatementAdapter.java:36)
	at com.carrotsearch.randomizedtesting.ThreadLeakControl$StatementRunner.run(ThreadLeakControl.java:367)
	at com.carrotsearch.randomizedtesting.ThreadLeakControl.forkTimeoutingTask(ThreadLeakControl.java:809)
	at com.carrotsearch.randomizedtesting.ThreadLeakControl$3.evaluate(ThreadLeakControl.java:460)
	at com.carrotsearch.randomizedtesting.RandomizedRunner.runSingleTest(RandomizedRunner.java:880)
	at com.carrotsearch.randomizedtesting.RandomizedRunner$5.evaluate(RandomizedRunner.java:781)
	at com.carrotsearch.randomizedtesting.RandomizedRunner$6.evaluate(RandomizedRunner.java:816)
	at com.carrotsearch.randomizedtesting.RandomizedRunner$7.evaluate(RandomizedRunner.java:827)
	at com.carrotsearch.randomizedtesting.rules.StatementAdapter.evaluate(StatementAdapter.java:36)
	at com.carrotsearch.randomizedtesting.rules.SystemPropertiesRestoreRule$1.evaluate(SystemPropertiesRestoreRule.java:57)
	at org.apache.lucene.util.AbstractBeforeAfterRule$1.evaluate(AbstractBeforeAfterRule.java:45)
	at com.carrotsearch.randomizedtesting.rules.StatementAdapter.evaluate(StatementAdapter.java:36)
	at org.apache.lucene.util.TestRuleStoreClassName$1.evaluate(TestRuleStoreClassName.java:41)
	at com.carrotsearch.randomizedtesting.rules.NoShadowingOrOverridesOnMethodsRule$1.evaluate(NoShadowingOrOverridesOnMethodsRule.java:40)
	at com.carrotsearch.randomizedtesting.rules.NoShadowingOrOverridesOnMethodsRule$1.evaluate(NoShadowingOrOverridesOnMethodsRule.java:40)
	at com.carrotsearch.randomizedtesting.rules.StatementAdapter.evaluate(StatementAdapter.java:36)
	at com.carrotsearch.randomizedtesting.rules.StatementAdapter.evaluate(StatementAdapter.java:36)
	at com.carrotsearch.randomizedtesting.rules.StatementAdapter.evaluate(StatementAdapter.java:36)
	at org.apache.lucene.util.TestRuleAssertionsRequired$1.evaluate(TestRuleAssertionsRequired.java:53)
	at org.apache.lucene.util.TestRuleMarkFailure$1.evaluate(TestRuleMarkFailure.java:47)
	at org.apache.lucene.util.TestRuleIgnoreAfterMaxFailures$1.evaluate(TestRuleIgnoreAfterMaxFailures.java:64)
	at org.apache.lucene.util.TestRuleIgnoreTestSuites$1.evaluate(TestRuleIgnoreTestSuites.java:54)
	at com.carrotsearch.randomizedtesting.rules.StatementAdapter.evaluate(StatementAdapter.java:36)
	at com.carrotsearch.randomizedtesting.ThreadLeakControl$StatementRunner.run(ThreadLeakControl.java:367)
	at java.lang.Thread.run(Thread.java:745)


FAILED:  org.apache.solr.cloud.hdfs.StressHdfsTest.test

Error Message:
Error from server at http://127.0.0.1:39939/ikhy/v/delete_data_dir: Async exception during distributed update: 127.0.0.1:33618 failed to respond

Stack Trace:
org.apache.solr.client.solrj.impl.HttpSolrClient$RemoteSolrException: Error from server at http://127.0.0.1:39939/ikhy/v/delete_data_dir: Async exception during distributed update: 127.0.0.1:33618 failed to respond
	at __randomizedtesting.SeedInfo.seed([5183B715ACE3B7E2:D9D788CF021FDA1A]:0)
	at org.apache.solr.client.solrj.impl.HttpSolrClient.executeMethod(HttpSolrClient.java:590)
	at org.apache.solr.client.solrj.impl.HttpSolrClient.request(HttpSolrClient.java:259)
	at org.apache.solr.client.solrj.impl.HttpSolrClient.request(HttpSolrClient.java:248)
	at org.apache.solr.client.solrj.SolrRequest.process(SolrRequest.java:149)
	at org.apache.solr.client.solrj.SolrClient.add(SolrClient.java:173)
	at org.apache.solr.client.solrj.SolrClient.add(SolrClient.java:138)
	at org.apache.solr.client.solrj.SolrClient.add(SolrClient.java:152)
	at org.apache.solr.cloud.hdfs.StressHdfsTest.createAndDeleteCollection(StressHdfsTest.java:171)
	at org.apache.solr.cloud.hdfs.StressHdfsTest.test(StressHdfsTest.java:99)
	at sun.reflect.NativeMethodAccessorImpl.invoke0(Native Method)
	at sun.reflect.NativeMethodAccessorImpl.invoke(NativeMethodAccessorImpl.java:62)
	at sun.reflect.DelegatingMethodAccessorImpl.invoke(DelegatingMethodAccessorImpl.java:43)
	at java.lang.reflect.Method.invoke(Method.java:498)
	at com.carrotsearch.randomizedtesting.RandomizedRunner.invoke(RandomizedRunner.java:1764)
	at com.carrotsearch.randomizedtesting.RandomizedRunner$8.evaluate(RandomizedRunner.java:871)
	at com.carrotsearch.randomizedtesting.RandomizedRunner$9.evaluate(RandomizedRunner.java:907)
	at com.carrotsearch.randomizedtesting.RandomizedRunner$10.evaluate(RandomizedRunner.java:921)
	at org.apache.solr.BaseDistributedSearchTestCase$ShardsRepeatRule$ShardsFixedStatement.callStatement(BaseDistributedSearchTestCase.java:992)
	at org.apache.solr.BaseDistributedSearchTestCase$ShardsRepeatRule$ShardsStatement.evaluate(BaseDistributedSearchTestCase.java:967)
	at com.carrotsearch.randomizedtesting.rules.SystemPropertiesRestoreRule$1.evaluate(SystemPropertiesRestoreRule.java:57)
	at org.apache.lucene.util.TestRuleSetupTeardownChained$1.evaluate(TestRuleSetupTeardownChained.java:49)
	at org.apache.lucene.util.AbstractBeforeAfterRule$1.evaluate(AbstractBeforeAfterRule.java:45)
	at org.apache.lucene.util.TestRuleThreadAndTestName$1.evaluate(TestRuleThreadAndTestName.java:48)
	at org.apache.lucene.util.TestRuleIgnoreAfterMaxFailures$1.evaluate(TestRuleIgnoreAfterMaxFailures.java:64)
	at org.apache.lucene.util.TestRuleMarkFailure$1.evaluate(TestRuleMarkFailure.java:47)
	at com.carrotsearch.randomizedtesting.rules.StatementAdapter.evaluate(StatementAdapter.java:36)
	at com.carrotsearch.randomizedtesting.ThreadLeakControl$StatementRunner.run(ThreadLeakControl.java:367)
	at com.carrotsearch.randomizedtesting.ThreadLeakControl.forkTimeoutingTask(ThreadLeakControl.java:809)
	at com.carrotsearch.randomizedtesting.ThreadLeakControl$3.evaluate(ThreadLeakControl.java:460)
	at com.carrotsearch.randomizedtesting.RandomizedRunner.runSingleTest(RandomizedRunner.java:880)
	at com.carrotsearch.randomizedtesting.RandomizedRunner$5.evaluate(RandomizedRunner.java:781)
	at com.carrotsearch.randomizedtesting.RandomizedRunner$6.evaluate(RandomizedRunner.java:816)
	at com.carrotsearch.randomizedtesting.RandomizedRunner$7.evaluate(RandomizedRunner.java:827)
	at com.carrotsearch.randomizedtesting.rules.StatementAdapter.evaluate(StatementAdapter.java:36)
	at com.carrotsearch.randomizedtesting.rules.SystemPropertiesRestoreRule$1.evaluate(SystemPropertiesRestoreRule.java:57)
	at org.apache.lucene.util.AbstractBeforeAfterRule$1.evaluate(AbstractBeforeAfterRule.java:45)
	at com.carrotsearch.randomizedtesting.rules.StatementAdapter.evaluate(StatementAdapter.java:36)
	at org.apache.lucene.util.TestRuleStoreClassName$1.evaluate(TestRuleStoreClassName.java:41)
	at com.carrotsearch.randomizedtesting.rules.NoShadowingOrOverridesOnMethodsRule$1.evaluate(NoShadowingOrOverridesOnMethodsRule.java:40)
	at com.carrotsearch.randomizedtesting.rules.NoShadowingOrOverridesOnMethodsRule$1.evaluate(NoShadowingOrOverridesOnMethodsRule.java:40)
	at com.carrotsearch.randomizedtesting.rules.StatementAdapter.evaluate(StatementAdapter.java:36)
	at com.carrotsearch.randomizedtesting.rules.StatementAdapter.evaluate(StatementAdapter.java:36)
	at com.carrotsearch.randomizedtesting.rules.StatementAdapter.evaluate(StatementAdapter.java:36)
	at org.apache.lucene.util.TestRuleAssertionsRequired$1.evaluate(TestRuleAssertionsRequired.java:53)
	at org.apache.lucene.util.TestRuleMarkFailure$1.evaluate(TestRuleMarkFailure.java:47)
	at org.apache.lucene.util.TestRuleIgnoreAfterMaxFailures$1.evaluate(TestRuleIgnoreAfterMaxFailures.java:64)
	at org.apache.lucene.util.TestRuleIgnoreTestSuites$1.evaluate(TestRuleIgnoreTestSuites.java:54)
	at com.carrotsearch.randomizedtesting.rules.StatementAdapter.evaluate(StatementAdapter.java:36)
	at com.carrotsearch.randomizedtesting.ThreadLeakControl$StatementRunner.run(ThreadLeakControl.java:367)
	at java.lang.Thread.run(Thread.java:745)


FAILED:  org.apache.solr.cloud.CollectionsAPIDistributedZkTest.test

Error Message:
Captured an uncaught exception in thread: Thread[id=35565, name=collection4, state=RUNNABLE, group=TGRP-CollectionsAPIDistributedZkTest]

Stack Trace:
com.carrotsearch.randomizedtesting.UncaughtExceptionError: Captured an uncaught exception in thread: Thread[id=35565, name=collection4, state=RUNNABLE, group=TGRP-CollectionsAPIDistributedZkTest]
Caused by: org.apache.solr.client.solrj.impl.HttpSolrClient$RemoteSolrException: Error from server at http://127.0.0.1:40769: collection already exists: awholynewstresscollection_collection4_0
	at __randomizedtesting.SeedInfo.seed([5183B715ACE3B7E2]:0)
	at org.apache.solr.client.solrj.impl.HttpSolrClient.executeMethod(HttpSolrClient.java:590)
	at org.apache.solr.client.solrj.impl.HttpSolrClient.request(HttpSolrClient.java:259)
	at org.apache.solr.client.solrj.impl.HttpSolrClient.request(HttpSolrClient.java:248)
	at org.apache.solr.client.solrj.impl.LBHttpSolrClient.doRequest(LBHttpSolrClient.java:404)
	at org.apache.solr.client.solrj.impl.LBHttpSolrClient.request(LBHttpSolrClient.java:357)
	at org.apache.solr.client.solrj.impl.CloudSolrClient.sendRequest(CloudSolrClient.java:1192)
	at org.apache.solr.client.solrj.impl.CloudSolrClient.requestWithRetryOnStaleState(CloudSolrClient.java:962)
	at org.apache.solr.client.solrj.impl.CloudSolrClient.request(CloudSolrClient.java:898)
	at org.apache.solr.client.solrj.SolrClient.request(SolrClient.java:1219)
	at org.apache.solr.cloud.AbstractFullDistribZkTestBase.createCollection(AbstractFullDistribZkTestBase.java:1593)
	at org.apache.solr.cloud.AbstractFullDistribZkTestBase.createCollection(AbstractFullDistribZkTestBase.java:1614)
	at org.apache.solr.cloud.CollectionsAPIDistributedZkTest$1CollectionThread.run(CollectionsAPIDistributedZkTest.java:970)


FAILED:  org.apache.solr.cloud.hdfs.HdfsCollectionsAPIDistributedZkTest.test

Error Message:
Timeout occured while waiting response from server at: http://127.0.0.1:53348

Stack Trace:
org.apache.solr.client.solrj.SolrServerException: Timeout occured while waiting response from server at: http://127.0.0.1:53348
	at org.apache.solr.client.solrj.impl.HttpSolrClient.executeMethod(HttpSolrClient.java:601)
	at org.apache.solr.client.solrj.impl.HttpSolrClient.request(HttpSolrClient.java:259)
	at org.apache.solr.client.solrj.impl.HttpSolrClient.request(HttpSolrClient.java:248)
	at org.apache.solr.client.solrj.SolrClient.request(SolrClient.java:1219)
	at org.apache.solr.cloud.CollectionsAPIDistributedZkTest.makeRequest(CollectionsAPIDistributedZkTest.java:381)
	at org.apache.solr.cloud.CollectionsAPIDistributedZkTest.testErrorHandling(CollectionsAPIDistributedZkTest.java:497)
	at org.apache.solr.cloud.CollectionsAPIDistributedZkTest.test(CollectionsAPIDistributedZkTest.java:169)
	at sun.reflect.NativeMethodAccessorImpl.invoke0(Native Method)
	at sun.reflect.NativeMethodAccessorImpl.invoke(NativeMethodAccessorImpl.java:62)
	at sun.reflect.DelegatingMethodAccessorImpl.invoke(DelegatingMethodAccessorImpl.java:43)
	at java.lang.reflect.Method.invoke(Method.java:498)
	at com.carrotsearch.randomizedtesting.RandomizedRunner.invoke(RandomizedRunner.java:1764)
	at com.carrotsearch.randomizedtesting.RandomizedRunner$8.evaluate(RandomizedRunner.java:871)
	at com.carrotsearch.randomizedtesting.RandomizedRunner$9.evaluate(RandomizedRunner.java:907)
	at com.carrotsearch.randomizedtesting.RandomizedRunner$10.evaluate(RandomizedRunner.java:921)
	at org.apache.solr.BaseDistributedSearchTestCase$ShardsRepeatRule$ShardsFixedStatement.callStatement(BaseDistributedSearchTestCase.java:992)
	at org.apache.solr.BaseDistributedSearchTestCase$ShardsRepeatRule$ShardsStatement.evaluate(BaseDistributedSearchTestCase.java:967)
	at com.carrotsearch.randomizedtesting.rules.SystemPropertiesRestoreRule$1.evaluate(SystemPropertiesRestoreRule.java:57)
	at org.apache.lucene.util.TestRuleSetupTeardownChained$1.evaluate(TestRuleSetupTeardownChained.java:49)
	at org.apache.lucene.util.AbstractBeforeAfterRule$1.evaluate(AbstractBeforeAfterRule.java:45)
	at org.apache.lucene.util.TestRuleThreadAndTestName$1.evaluate(TestRuleThreadAndTestName.java:48)
	at org.apache.lucene.util.TestRuleIgnoreAfterMaxFailures$1.evaluate(TestRuleIgnoreAfterMaxFailures.java:64)
	at org.apache.lucene.util.TestRuleMarkFailure$1.evaluate(TestRuleMarkFailure.java:47)
	at com.carrotsearch.randomizedtesting.rules.StatementAdapter.evaluate(StatementAdapter.java:36)
	at com.carrotsearch.randomizedtesting.ThreadLeakControl$StatementRunner.run(ThreadLeakControl.java:367)
	at com.carrotsearch.randomizedtesting.ThreadLeakControl.forkTimeoutingTask(ThreadLeakControl.java:809)
	at com.carrotsearch.randomizedtesting.ThreadLeakControl$3.evaluate(ThreadLeakControl.java:460)
	at com.carrotsearch.randomizedtesting.RandomizedRunner.runSingleTest(RandomizedRunner.java:880)
	at com.carrotsearch.randomizedtesting.RandomizedRunner$5.evaluate(RandomizedRunner.java:781)
	at com.carrotsearch.randomizedtesting.RandomizedRunner$6.evaluate(RandomizedRunner.java:816)
	at com.carrotsearch.randomizedtesting.RandomizedRunner$7.evaluate(RandomizedRunner.java:827)
	at com.carrotsearch.randomizedtesting.rules.StatementAdapter.evaluate(StatementAdapter.java:36)
	at com.carrotsearch.randomizedtesting.rules.SystemPropertiesRestoreRule$1.evaluate(SystemPropertiesRestoreRule.java:57)
	at org.apache.lucene.util.AbstractBeforeAfterRule$1.evaluate(AbstractBeforeAfterRule.java:45)
	at com.carrotsearch.randomizedtesting.rules.StatementAdapter.evaluate(StatementAdapter.java:36)
	at org.apache.lucene.util.TestRuleStoreClassName$1.evaluate(TestRuleStoreClassName.java:41)
	at com.carrotsearch.randomizedtesting.rules.NoShadowingOrOverridesOnMethodsRule$1.evaluate(NoShadowingOrOverridesOnMethodsRule.java:40)
	at com.carrotsearch.randomizedtesting.rules.NoShadowingOrOverridesOnMethodsRule$1.evaluate(NoShadowingOrOverridesOnMethodsRule.java:40)
	at com.carrotsearch.randomizedtesting.rules.StatementAdapter.evaluate(StatementAdapter.java:36)
	at com.carrotsearch.randomizedtesting.rules.StatementAdapter.evaluate(StatementAdapter.java:36)
	at com.carrotsearch.randomizedtesting.rules.StatementAdapter.evaluate(StatementAdapter.java:36)
	at org.apache.lucene.util.TestRuleAssertionsRequired$1.evaluate(TestRuleAssertionsRequired.java:53)
	at org.apache.lucene.util.TestRuleMarkFailure$1.evaluate(TestRuleMarkFailure.java:47)
	at org.apache.lucene.util.TestRuleIgnoreAfterMaxFailures$1.evaluate(TestRuleIgnoreAfterMaxFailures.java:64)
	at org.apache.lucene.util.TestRuleIgnoreTestSuites$1.evaluate(TestRuleIgnoreTestSuites.java:54)
	at com.carrotsearch.randomizedtesting.rules.StatementAdapter.evaluate(StatementAdapter.java:36)
	at com.carrotsearch.randomizedtesting.ThreadLeakControl$StatementRunner.run(ThreadLeakControl.java:367)
	at java.lang.Thread.run(Thread.java:745)
Caused by: java.net.SocketTimeoutException: Read timed out
	at java.net.SocketInputStream.socketRead0(Native Method)
	at java.net.SocketInputStream.socketRead(SocketInputStream.java:116)
	at java.net.SocketInputStream.read(SocketInputStream.java:170)
	at java.net.SocketInputStream.read(SocketInputStream.java:141)
	at org.apache.http.impl.io.AbstractSessionInputBuffer.fillBuffer(AbstractSessionInputBuffer.java:160)
	at org.apache.http.impl.io.SocketInputBuffer.fillBuffer(SocketInputBuffer.java:84)
	at org.apache.http.impl.io.AbstractSessionInputBuffer.readLine(AbstractSessionInputBuffer.java:273)
	at org.apache.http.impl.conn.DefaultHttpResponseParser.parseHead(DefaultHttpResponseParser.java:140)
	at org.apache.http.impl.conn.DefaultHttpResponseParser.parseHead(DefaultHttpResponseParser.java:57)
	at org.apache.http.impl.io.AbstractMessageParser.parse(AbstractMessageParser.java:261)
	at org.apache.http.impl.AbstractHttpClientConnection.receiveResponseHeader(AbstractHttpClientConnection.java:283)
	at org.apache.http.impl.conn.DefaultClientConnection.receiveResponseHeader(DefaultClientConnection.java:251)
	at org.apache.http.impl.conn.ManagedClientConnectionImpl.receiveResponseHeader(ManagedClientConnectionImpl.java:197)
	at org.apache.http.protocol.HttpRequestExecutor.doReceiveResponse(HttpRequestExecutor.java:272)
	at org.apache.http.protocol.HttpRequestExecutor.execute(HttpRequestExecutor.java:124)
	at org.apache.http.impl.client.DefaultRequestDirector.tryExecute(DefaultRequestDirector.java:685)
	at org.apache.http.impl.client.DefaultRequestDirector.execute(DefaultRequestDirector.java:487)
	at org.apache.http.impl.client.AbstractHttpClient.doExecute(AbstractHttpClient.java:882)
	at org.apache.http.impl.client.CloseableHttpClient.execute(CloseableHttpClient.java:82)
	at org.apache.http.impl.client.CloseableHttpClient.execute(CloseableHttpClient.java:107)
	at org.apache.http.impl.client.CloseableHttpClient.execute(CloseableHttpClient.java:55)
	at org.apache.solr.client.solrj.impl.HttpSolrClient.executeMethod(HttpSolrClient.java:495)
	... 47 more


FAILED:  org.apache.solr.cloud.overseer.ZkStateReaderTest.testStateFormatUpdateWithExplicitRefreshLazy

Error Message:
Could not find collection : c1

Stack Trace:
org.apache.solr.common.SolrException: Could not find collection : c1
	at __randomizedtesting.SeedInfo.seed([5183B715ACE3B7E2:3ACC1768D5EC6AD8]:0)
	at org.apache.solr.common.cloud.ClusterState.getCollection(ClusterState.java:170)
	at org.apache.solr.cloud.overseer.ZkStateReaderTest.testStateFormatUpdate(ZkStateReaderTest.java:135)
	at org.apache.solr.cloud.overseer.ZkStateReaderTest.testStateFormatUpdateWithExplicitRefreshLazy(ZkStateReaderTest.java:46)
	at sun.reflect.NativeMethodAccessorImpl.invoke0(Native Method)
	at sun.reflect.NativeMethodAccessorImpl.invoke(NativeMethodAccessorImpl.java:62)
	at sun.reflect.DelegatingMethodAccessorImpl.invoke(DelegatingMethodAccessorImpl.java:43)
	at java.lang.reflect.Method.invoke(Method.java:498)
	at com.carrotsearch.randomizedtesting.RandomizedRunner.invoke(RandomizedRunner.java:1764)
	at com.carrotsearch.randomizedtesting.RandomizedRunner$8.evaluate(RandomizedRunner.java:871)
	at com.carrotsearch.randomizedtesting.RandomizedRunner$9.evaluate(RandomizedRunner.java:907)
	at com.carrotsearch.randomizedtesting.RandomizedRunner$10.evaluate(RandomizedRunner.java:921)
	at com.carrotsearch.randomizedtesting.rules.SystemPropertiesRestoreRule$1.evaluate(SystemPropertiesRestoreRule.java:57)
	at org.apache.lucene.util.TestRuleSetupTeardownChained$1.evaluate(TestRuleSetupTeardownChained.java:49)
	at org.apache.lucene.util.AbstractBeforeAfterRule$1.evaluate(AbstractBeforeAfterRule.java:45)
	at org.apache.lucene.util.TestRuleThreadAndTestName$1.evaluate(TestRuleThreadAndTestName.java:48)
	at org.apache.lucene.util.TestRuleIgnoreAfterMaxFailures$1.evaluate(TestRuleIgnoreAfterMaxFailures.java:64)
	at org.apache.lucene.util.TestRuleMarkFailure$1.evaluate(TestRuleMarkFailure.java:47)
	at com.carrotsearch.randomizedtesting.rules.StatementAdapter.evaluate(StatementAdapter.java:36)
	at com.carrotsearch.randomizedtesting.ThreadLeakControl$StatementRunner.run(ThreadLeakControl.java:367)
	at com.carrotsearch.randomizedtesting.ThreadLeakControl.forkTimeoutingTask(ThreadLeakControl.java:809)
	at com.carrotsearch.randomizedtesting.ThreadLeakControl$3.evaluate(ThreadLeakControl.java:460)
	at com.carrotsearch.randomizedtesting.RandomizedRunner.runSingleTest(RandomizedRunner.java:880)
	at com.carrotsearch.randomizedtesting.RandomizedRunner$5.evaluate(RandomizedRunner.java:781)
	at com.carrotsearch.randomizedtesting.RandomizedRunner$6.evaluate(RandomizedRunner.java:816)
	at com.carrotsearch.randomizedtesting.RandomizedRunner$7.evaluate(RandomizedRunner.java:827)
	at com.carrotsearch.randomizedtesting.rules.StatementAdapter.evaluate(StatementAdapter.java:36)
	at com.carrotsearch.randomizedtesting.rules.SystemPropertiesRestoreRule$1.evaluate(SystemPropertiesRestoreRule.java:57)
	at org.apache.lucene.util.AbstractBeforeAfterRule$1.evaluate(AbstractBeforeAfterRule.java:45)
	at com.carrotsearch.randomizedtesting.rules.StatementAdapter.evaluate(StatementAdapter.java:36)
	at org.apache.lucene.util.TestRuleStoreClassName$1.evaluate(TestRuleStoreClassName.java:41)
	at com.carrotsearch.randomizedtesting.rules.NoShadowingOrOverridesOnMethodsRule$1.evaluate(NoShadowingOrOverridesOnMethodsRule.java:40)
	at com.carrotsearch.randomizedtesting.rules.NoShadowingOrOverridesOnMethodsRule$1.evaluate(NoShadowingOrOverridesOnMethodsRule.java:40)
	at com.carrotsearch.randomizedtesting.rules.StatementAdapter.evaluate(StatementAdapter.java:36)
	at com.carrotsearch.randomizedtesting.rules.StatementAdapter.evaluate(StatementAdapter.java:36)
	at com.carrotsearch.randomizedtesting.rules.StatementAdapter.evaluate(StatementAdapter.java:36)
	at org.apache.lucene.util.TestRuleAssertionsRequired$1.evaluate(TestRuleAssertionsRequired.java:53)
	at org.apache.lucene.util.TestRuleMarkFailure$1.evaluate(TestRuleMarkFailure.java:47)
	at org.apache.lucene.util.TestRuleIgnoreAfterMaxFailures$1.evaluate(TestRuleIgnoreAfterMaxFailures.java:64)
	at org.apache.lucene.util.TestRuleIgnoreTestSuites$1.evaluate(TestRuleIgnoreTestSuites.java:54)
	at com.carrotsearch.randomizedtesting.rules.StatementAdapter.evaluate(StatementAdapter.java:36)
	at com.carrotsearch.randomizedtesting.ThreadLeakControl$StatementRunner.run(ThreadLeakControl.java:367)
	at java.lang.Thread.run(Thread.java:745)




Build Log:
[...truncated 11285 lines...]
   [junit4] Suite: org.apache.solr.cloud.hdfs.StressHdfsTest
   [junit4]   2> Creating dataDir: /x1/jenkins/jenkins-slave/workspace/Lucene-Solr-NightlyTests-6.x/solr/build/solr-core/test/J1/temp/solr.cloud.hdfs.StressHdfsTest_5183B715ACE3B7E2-001/init-core-data-001
   [junit4]   2> 51610 INFO  (SUITE-StressHdfsTest-seed#[5183B715ACE3B7E2]-worker) [    ] o.a.s.BaseDistributedSearchTestCase Setting hostContext system property: /ikhy/v
   [junit4]   2> 54713 WARN  (SUITE-StressHdfsTest-seed#[5183B715ACE3B7E2]-worker) [    ] o.a.h.u.NativeCodeLoader Unable to load native-hadoop library for your platform... using builtin-java classes where applicable
   [junit4]   1> Formatting using clusterid: testClusterID
   [junit4]   2> 57610 WARN  (SUITE-StressHdfsTest-seed#[5183B715ACE3B7E2]-worker) [    ] o.a.h.m.i.MetricsConfig Cannot locate configuration: tried hadoop-metrics2-namenode.properties,hadoop-metrics2.properties
   [junit4]   2> 58343 INFO  (SUITE-StressHdfsTest-seed#[5183B715ACE3B7E2]-worker) [    ] o.m.log Logging to org.slf4j.impl.Log4jLoggerAdapter(org.mortbay.log) via org.mortbay.log.Slf4jLog
   [junit4]   2> 58519 WARN  (SUITE-StressHdfsTest-seed#[5183B715ACE3B7E2]-worker) [    ] o.a.h.h.HttpRequestLog Jetty request log can only be enabled using Log4j
   [junit4]   2> 58719 INFO  (SUITE-StressHdfsTest-seed#[5183B715ACE3B7E2]-worker) [    ] o.m.log jetty-6.1.26
   [junit4]   2> 59003 INFO  (SUITE-StressHdfsTest-seed#[5183B715ACE3B7E2]-worker) [    ] o.m.log Extract jar:file:/x1/jenkins/.ivy2/cache/org.apache.hadoop/hadoop-hdfs/tests/hadoop-hdfs-2.6.0-tests.jar!/webapps/hdfs to ./temp/Jetty_localhost_45790_hdfs____v1k17b/webapp
   [junit4]   2> 59261 INFO  (SUITE-StressHdfsTest-seed#[5183B715ACE3B7E2]-worker) [    ] o.m.log NO JSP Support for /, did not find org.apache.jasper.servlet.JspServlet
   [junit4]   2> 61627 INFO  (SUITE-StressHdfsTest-seed#[5183B715ACE3B7E2]-worker) [    ] o.m.log Started HttpServer2$SelectChannelConnectorWithSafeStartup@localhost:45790
   [junit4]   2> 64561 WARN  (SUITE-StressHdfsTest-seed#[5183B715ACE3B7E2]-worker) [    ] o.a.h.h.HttpRequestLog Jetty request log can only be enabled using Log4j
   [junit4]   2> 64566 INFO  (SUITE-StressHdfsTest-seed#[5183B715ACE3B7E2]-worker) [    ] o.m.log jetty-6.1.26
   [junit4]   2> 64670 INFO  (SUITE-StressHdfsTest-seed#[5183B715ACE3B7E2]-worker) [    ] o.m.log Extract jar:file:/x1/jenkins/.ivy2/cache/org.apache.hadoop/hadoop-hdfs/tests/hadoop-hdfs-2.6.0-tests.jar!/webapps/datanode to ./temp/Jetty_localhost_47265_datanode____i514l/webapp
   [junit4]   2> 64957 INFO  (SUITE-StressHdfsTest-seed#[5183B715ACE3B7E2]-worker) [    ] o.m.log NO JSP Support for /, did not find org.apache.jasper.servlet.JspServlet
   [junit4]   2> 65838 INFO  (SUITE-StressHdfsTest-seed#[5183B715ACE3B7E2]-worker) [    ] o.m.log Started HttpServer2$SelectChannelConnectorWithSafeStartup@localhost:47265
   [junit4]   2> 66764 WARN  (SUITE-StressHdfsTest-seed#[5183B715ACE3B7E2]-worker) [    ] o.a.h.h.HttpRequestLog Jetty request log can only be enabled using Log4j
   [junit4]   2> 66765 INFO  (SUITE-StressHdfsTest-seed#[5183B715ACE3B7E2]-worker) [    ] o.m.log jetty-6.1.26
   [junit4]   2> 66794 INFO  (SUITE-StressHdfsTest-seed#[5183B715ACE3B7E2]-worker) [    ] o.m.log Extract jar:file:/x1/jenkins/.ivy2/cache/org.apache.hadoop/hadoop-hdfs/tests/hadoop-hdfs-2.6.0-tests.jar!/webapps/datanode to ./temp/Jetty_localhost_60053_datanode____1jfvzv/webapp
   [junit4]   2> 67316 INFO  (SUITE-StressHdfsTest-seed#[5183B715ACE3B7E2]-worker) [    ] o.m.log NO JSP Support for /, did not find org.apache.jasper.servlet.JspServlet
   [junit4]   2> 68518 INFO  (SUITE-StressHdfsTest-seed#[5183B715ACE3B7E2]-worker) [    ] o.m.log Started HttpServer2$SelectChannelConnectorWithSafeStartup@localhost:60053
   [junit4]   2> 70105 INFO  (IPC Server handler 4 on 44481) [    ] BlockStateChange BLOCK* processReport: from storage DS-4c3e0f1a-601e-4aec-9da0-9595f0d98d89 node DatanodeRegistration(127.0.0.1, datanodeUuid=6d849f19-ca7d-4a7a-b18f-df2028d62138, infoPort=60053, ipcPort=39527, storageInfo=lv=-56;cid=testClusterID;nsid=293820356;c=0), blocks: 0, hasStaleStorages: true, processing time: 3 msecs
   [junit4]   2> 70105 INFO  (IPC Server handler 5 on 44481) [    ] BlockStateChange BLOCK* processReport: from storage DS-b6d1009d-39cc-4d64-bbd5-6245509b30be node DatanodeRegistration(127.0.0.1, datanodeUuid=0f29ff74-2ec3-45f0-a14f-a5ff39e6d3f0, infoPort=47265, ipcPort=42828, storageInfo=lv=-56;cid=testClusterID;nsid=293820356;c=0), blocks: 0, hasStaleStorages: true, processing time: 0 msecs
   [junit4]   2> 70105 INFO  (IPC Server handler 4 on 44481) [    ] BlockStateChange BLOCK* processReport: from storage DS-27dbb4e8-08e9-414a-8025-a3e429c2359c node DatanodeRegistration(127.0.0.1, datanodeUuid=6d849f19-ca7d-4a7a-b18f-df2028d62138, infoPort=60053, ipcPort=39527, storageInfo=lv=-56;cid=testClusterID;nsid=293820356;c=0), blocks: 0, hasStaleStorages: false, processing time: 0 msecs
   [junit4]   2> 70110 INFO  (IPC Server handler 5 on 44481) [    ] BlockStateChange BLOCK* processReport: from storage DS-b76d4da9-04f7-4764-baff-feddacdfa88e node DatanodeRegistration(127.0.0.1, datanodeUuid=0f29ff74-2ec3-45f0-a14f-a5ff39e6d3f0, infoPort=47265, ipcPort=42828, storageInfo=lv=-56;cid=testClusterID;nsid=293820356;c=0), blocks: 0, hasStaleStorages: false, processing time: 0 msecs
   [junit4]   2> 73514 INFO  (TEST-StressHdfsTest.test-seed#[5183B715ACE3B7E2]) [    ] o.a.s.c.ZkTestServer STARTING ZK TEST SERVER
   [junit4]   2> 73522 INFO  (Thread-238) [    ] o.a.s.c.ZkTestServer client port:0.0.0.0/0.0.0.0:0
   [junit4]   2> 73522 INFO  (Thread-238) [    ] o.a.s.c.ZkTestServer Starting server
   [junit4]   2> 73750 INFO  (TEST-StressHdfsTest.test-seed#[5183B715ACE3B7E2]) [    ] o.a.s.c.ZkTestServer start zk server on port:51835
   [junit4]   2> 73774 INFO  (TEST-StressHdfsTest.test-seed#[5183B715ACE3B7E2]) [    ] o.a.s.c.c.SolrZkClient Using default ZkCredentialsProvider
   [junit4]   2> 74028 INFO  (TEST-StressHdfsTest.test-seed#[5183B715ACE3B7E2]) [    ] o.a.s.c.c.ConnectionManager Waiting for client to connect to ZooKeeper
   [junit4]   2> 74084 INFO  (zkCallback-31-thread-1) [    ] o.a.s.c.c.ConnectionManager Watcher org.apache.solr.common.cloud.ConnectionManager@341c90b6 name:ZooKeeperConnection Watcher:127.0.0.1:51835 got event WatchedEvent state:SyncConnected type:None path:null path:null type:None
   [junit4]   2> 74086 INFO  (TEST-StressHdfsTest.test-seed#[5183B715ACE3B7E2]) [    ] o.a.s.c.c.ConnectionManager Client is connected to ZooKeeper
   [junit4]   2> 74086 INFO  (TEST-StressHdfsTest.test-seed#[5183B715ACE3B7E2]) [    ] o.a.s.c.c.SolrZkClient Using default ZkACLProvider
   [junit4]   2> 74088 INFO  (TEST-StressHdfsTest.test-seed#[5183B715ACE3B7E2]) [    ] o.a.s.c.c.SolrZkClient makePath: /solr
   [junit4]   2> 74127 WARN  (NIOServerCxn.Factory:0.0.0.0/0.0.0.0:0) [    ] o.a.z.s.NIOServerCnxn caught end of stream exception
   [junit4]   2> EndOfStreamException: Unable to read additional data from client sessionid 0x153fd2997740000, likely client has closed socket
   [junit4]   2> 	at org.apache.zookeeper.server.NIOServerCnxn.doIO(NIOServerCnxn.java:228)
   [junit4]   2> 	at org.apache.zookeeper.server.NIOServerCnxnFactory.run(NIOServerCnxnFactory.java:208)
   [junit4]   2> 	at java.lang.Thread.run(Thread.java:745)
   [junit4]   2> 74148 INFO  (TEST-StressHdfsTest.test-seed#[5183B715ACE3B7E2]) [    ] o.a.s.c.c.SolrZkClient Using default ZkCredentialsProvider
   [junit4]   2> 74190 INFO  (TEST-StressHdfsTest.test-seed#[5183B715ACE3B7E2]) [    ] o.a.s.c.c.ConnectionManager Waiting for client to connect to ZooKeeper
   [junit4]   2> 74246 INFO  (zkCallback-32-thread-1) [    ] o.a.s.c.c.ConnectionManager Watcher org.apache.solr.common.cloud.ConnectionManager@3309a6b4 name:ZooKeeperConnection Watcher:127.0.0.1:51835/solr got event WatchedEvent state:SyncConnected type:None path:null path:null type:None
   [junit4]   2> 74246 INFO  (TEST-StressHdfsTest.test-seed#[5183B715ACE3B7E2]) [    ] o.a.s.c.c.ConnectionManager Client is connected to ZooKeeper
   [junit4]   2> 74246 INFO  (TEST-StressHdfsTest.test-seed#[5183B715ACE3B7E2]) [    ] o.a.s.c.c.SolrZkClient Using default ZkACLProvider
   [junit4]   2> 74249 INFO  (TEST-StressHdfsTest.test-seed#[5183B715ACE3B7E2]) [    ] o.a.s.c.c.SolrZkClient makePath: /collections/collection1
   [junit4]   2> 74262 INFO  (TEST-StressHdfsTest.test-seed#[5183B715ACE3B7E2]) [    ] o.a.s.c.c.SolrZkClient makePath: /collections/collection1/shards
   [junit4]   2> 74264 INFO  (TEST-StressHdfsTest.test-seed#[5183B715ACE3B7E2]) [    ] o.a.s.c.c.SolrZkClient makePath: /collections/control_collection
   [junit4]   2> 74266 INFO  (TEST-StressHdfsTest.test-seed#[5183B715ACE3B7E2]) [    ] o.a.s.c.c.SolrZkClient makePath: /collections/control_collection/shards
   [junit4]   2> 74269 INFO  (TEST-StressHdfsTest.test-seed#[5183B715ACE3B7E2]) [    ] o.a.s.c.AbstractZkTestCase put /x1/jenkins/jenkins-slave/workspace/Lucene-Solr-NightlyTests-6.x/solr/core/src/test-files/solr/collection1/conf/solrconfig-tlog.xml to /configs/conf1/solrconfig.xml
   [junit4]   2> 74270 INFO  (TEST-StressHdfsTest.test-seed#[5183B715ACE3B7E2]) [    ] o.a.s.c.c.SolrZkClient makePath: /configs/conf1/solrconfig.xml
   [junit4]   2> 74275 INFO  (TEST-StressHdfsTest.test-seed#[5183B715ACE3B7E2]) [    ] o.a.s.c.AbstractZkTestCase put /x1/jenkins/jenkins-slave/workspace/Lucene-Solr-NightlyTests-6.x/solr/core/src/test-files/solr/collection1/conf/schema.xml to /configs/conf1/schema.xml
   [junit4]   2> 74275 INFO  (TEST-StressHdfsTest.test-seed#[5183B715ACE3B7E2]) [    ] o.a.s.c.c.SolrZkClient makePath: /configs/conf1/schema.xml
   [junit4]   2> 74363 INFO  (TEST-StressHdfsTest.test-seed#[5183B715ACE3B7E2]) [    ] o.a.s.c.AbstractZkTestCase put /x1/jenkins/jenkins-slave/workspace/Lucene-Solr-NightlyTests-6.x/solr/core/src/test-files/solr/collection1/conf/solrconfig.snippet.randomindexconfig.xml to /configs/conf1/solrconfig.snippet.randomindexconfig.xml
   [junit4]   2> 74363 INFO  (TEST-StressHdfsTest.test-seed#[5183B715ACE3B7E2]) [    ] o.a.s.c.c.SolrZkClient makePath: /configs/conf1/solrconfig.snippet.randomindexconfig.xml
   [junit4]   2> 74365 INFO  (TEST-StressHdfsTest.test-seed#[5183B715ACE3B7E2]) [    ] o.a.s.c.AbstractZkTestCase put /x1/jenkins/jenkins-slave/workspace/Lucene-Solr-NightlyTests-6.x/solr/core/src/test-files/solr/collection1/conf/stopwords.txt to /configs/conf1/stopwords.txt
   [junit4]   2> 74366 INFO  (TEST-StressHdfsTest.test-seed#[5183B715ACE3B7E2]) [    ] o.a.s.c.c.SolrZkClient makePath: /configs/conf1/stopwords.txt
   [junit4]   2> 74367 INFO  (TEST-StressHdfsTest.test-seed#[5183B715ACE3B7E2]) [    ] o.a.s.c.AbstractZkTestCase put /x1/jenkins/jenkins-slave/workspace/Lucene-Solr-NightlyTests-6.x/solr/core/src/test-files/solr/collection1/conf/protwords.txt to /configs/conf1/protwords.txt
   [junit4]   2> 74367 INFO  (TEST-StressHdfsTest.test-seed#[5183B715ACE3B7E2]) [    ] o.a.s.c.c.SolrZkClient makePath: /configs/conf1/protwords.txt
   [junit4]   2> 74369 INFO  (TEST-StressHdfsTest.test-seed#[5183B715ACE3B7E2]) [    ] o.a.s.c.AbstractZkTestCase put /x1/jenkins/jenkins-slave/workspace/Lucene-Solr-NightlyTests-6.x/solr/core/src/test-files/solr/collection1/conf/currency.xml to /configs/conf1/currency.xml
   [junit4]   2> 74369 INFO  (TEST-StressHdfsTest.test-seed#[5183B715ACE3B7E2]) [    ] o.a.s.c.c.SolrZkClient makePath: /configs/conf1/currency.xml
   [junit4]   2> 74371 INFO  (TEST-StressHdfsTest.test-seed#[5183B715ACE3B7E2]) [    ] o.a.s.c.AbstractZkTestCase put /x1/jenkins/jenkins-slave/workspace/Lucene-Solr-NightlyTests-6.x/solr/core/src/test-files/solr/collection1/conf/enumsConfig.xml to /configs/conf1/enumsConfig.xml
   [junit4]   2> 74371 INFO  (TEST-StressHdfsTest.test-seed#[5183B715ACE3B7E2]) [    ] o.a.s.c.c.SolrZkClient makePath: /configs/conf1/enumsConfig.xml
   [junit4]   2> 74373 INFO  (TEST-StressHdfsTest.test-seed#[5183B715ACE3B7E2]) [    ] o.a.s.c.AbstractZkTestCase put /x1/jenkins/jenkins-slave/workspace/Lucene-Solr-NightlyTests-6.x/solr/core/src/test-files/solr/collection1/conf/open-exchange-rates.json to /configs/conf1/open-exchange-rates.json
   [junit4]   2> 74373 INFO  (TEST-StressHdfsTest.test-seed#[5183B715ACE3B7E2]) [    ] o.a.s.c.c.SolrZkClient makePath: /configs/conf1/open-exchange-rates.json
   [junit4]   2> 74375 INFO  (TEST-StressHdfsTest.test-seed#[5183B715ACE3B7E2]) [    ] o.a.s.c.AbstractZkTestCase put /x1/jenkins/jenkins-slave/workspace/Lucene-Solr-NightlyTests-6.x/solr/core/src/test-files/solr/collection1/conf/mapping-ISOLatin1Accent.txt to /configs/conf1/mapping-ISOLatin1Accent.txt
   [junit4]   2> 74375 INFO  (TEST-StressHdfsTest.test-seed#[5183B715ACE3B7E2]) [    ] o.a.s.c.c.SolrZkClient makePath: /configs/conf1/mapping-ISOLatin1Accent.txt
   [junit4]   2> 74386 INFO  (TEST-StressHdfsTest.test-seed#[5183B715ACE3B7E2]) [    ] o.a.s.c.AbstractZkTestCase put /x1/jenkins/jenkins-slave/workspace/Lucene-Solr-NightlyTests-6.x/solr/core/src/test-files/solr/collection1/conf/old_synonyms.txt to /configs/conf1/old_synonyms.txt
   [junit4]   2> 74386 INFO  (TEST-StressHdfsTest.test-seed#[5183B715ACE3B7E2]) [    ] o.a.s.c.c.SolrZkClient makePath: /configs/conf1/old_synonyms.txt
   [junit4]   2> 74388 INFO  (TEST-StressHdfsTest.test-seed#[5183B715ACE3B7E2]) [    ] o.a.s.c.AbstractZkTestCase put /x1/jenkins/jenkins-slave/workspace/Lucene-Solr-NightlyTests-6.x/solr/core/src/test-files/solr/collection1/conf/synonyms.txt to /configs/conf1/synonyms.txt
   [junit4]   2> 74388 INFO  (TEST-StressHdfsTest.test-seed#[5183B715ACE3B7E2]) [    ] o.a.s.c.c.SolrZkClient makePath: /configs/conf1/synonyms.txt
   [junit4]   2> 74609 INFO  (TEST-StressHdfsTest.test-seed#[5183B715ACE3B7E2]) [    ] o.a.s.SolrTestCaseJ4 Writing core.properties file to /x1/jenkins/jenkins-slave/workspace/Lucene-Solr-NightlyTests-6.x/solr/build/solr-core/test/J1/temp/solr.cloud.hdfs.StressHdfsTest_5183B715ACE3B7E2-001/control-001/cores/collection1
   [junit4]   2> 74634 INFO  (TEST-StressHdfsTest.test-seed#[5183B715ACE3B7E2]) [    ] o.e.j.s.Server jetty-9.3.8.v20160314
   [junit4]   2> 74686 INFO  (TEST-StressHdfsTest.test-seed#[5183B715ACE3B7E2]) [    ] o.e.j.s.h.ContextHandler Started o.e.j.s.ServletContextHandler@19d3718d{/ikhy/v,null,AVAILABLE}
   [junit4]   2> 74687 INFO  (TEST-StressHdfsTest.test-seed#[5183B715ACE3B7E2]) [    ] o.e.j.s.ServerConnector Started ServerConnector@4e7a025c{HTTP/1.1,[http/1.1]}{127.0.0.1:33618}
   [junit4]   2> 74687 INFO  (TEST-StressHdfsTest.test-seed#[5183B715ACE3B7E2]) [    ] o.e.j.s.Server Started @84229ms
   [junit4]   2> 74687 INFO  (TEST-StressHdfsTest.test-seed#[5183B715ACE3B7E2]) [    ] o.a.s.c.s.e.JettySolrRunner Jetty properties: {solr.data.dir=hdfs://localhost:44481/hdfs__localhost_44481__x1_jenkins_jenkins-slave_workspace_Lucene-Solr-NightlyTests-6.x_solr_build_solr-core_test_J1_temp_solr.cloud.hdfs.StressHdfsTest_5183B715ACE3B7E2-001_tempDir-002_control_data, hostContext=/ikhy/v, hostPort=33618, coreRootDirectory=/x1/jenkins/jenkins-slave/workspace/Lucene-Solr-NightlyTests-6.x/solr/build/solr-core/test/J1/temp/solr.cloud.hdfs.StressHdfsTest_5183B715ACE3B7E2-001/control-001/cores}
   [junit4]   2> 74687 INFO  (TEST-StressHdfsTest.test-seed#[5183B715ACE3B7E2]) [    ] o.a.s.s.SolrDispatchFilter SolrDispatchFilter.init(): sun.misc.Launcher$AppClassLoader@73d16e93
   [junit4]   2> 74687 INFO  (TEST-StressHdfsTest.test-seed#[5183B715ACE3B7E2]) [    ] o.a.s.c.SolrResourceLoader new SolrResourceLoader for directory: '/x1/jenkins/jenkins-slave/workspace/Lucene-Solr-NightlyTests-6.x/solr/build/solr-core/test/J1/temp/solr.cloud.hdfs.StressHdfsTest_5183B715ACE3B7E2-001/control-001'
   [junit4]   2> 74687 INFO  (TEST-StressHdfsTest.test-seed#[5183B715ACE3B7E2]) [    ] o.a.s.c.SolrResourceLoader JNDI not configured for solr (NoInitialContextEx)
   [junit4]   2> 74687 INFO  (TEST-StressHdfsTest.test-seed#[5183B715ACE3B7E2]) [    ] o.a.s.c.SolrResourceLoader solr home defaulted to 'solr/' (could not find system property or JNDI)
   [junit4]   2> 74687 INFO  (TEST-StressHdfsTest.test-seed#[5183B715ACE3B7E2]) [    ] o.a.s.c.c.SolrZkClient Using default ZkCredentialsProvider
   [junit4]   2> 74718 INFO  (TEST-StressHdfsTest.test-seed#[5183B715ACE3B7E2]) [    ] o.a.s.c.c.ConnectionManager Waiting for client to connect to ZooKeeper
   [junit4]   2> 74878 INFO  (zkCallback-33-thread-1) [    ] o.a.s.c.c.ConnectionManager Watcher org.apache.solr.common.cloud.ConnectionManager@64deb79b name:ZooKeeperConnection Watcher:127.0.0.1:51835/solr got event WatchedEvent state:SyncConnected type:None path:null path:null type:None
   [junit4]   2> 74879 INFO  (TEST-StressHdfsTest.test-seed#[5183B715ACE3B7E2]) [    ] o.a.s.c.c.ConnectionManager Client is connected to ZooKeeper
   [junit4]   2> 74880 INFO  (TEST-StressHdfsTest.test-seed#[5183B715ACE3B7E2]) [    ] o.a.s.c.c.SolrZkClient Using default ZkACLProvider
   [junit4]   2> 75051 INFO  (TEST-StressHdfsTest.test-seed#[5183B715ACE3B7E2]) [    ] o.a.s.s.SolrDispatchFilter Loading solr.xml from SolrHome (not found in ZooKeeper)
   [junit4]   2> 75051 INFO  (TEST-StressHdfsTest.test-seed#[5183B715ACE3B7E2]) [    ] o.a.s.c.SolrXmlConfig Loading container configuration from /x1/jenkins/jenkins-slave/workspace/Lucene-Solr-NightlyTests-6.x/solr/build/solr-core/test/J1/temp/solr.cloud.hdfs.StressHdfsTest_5183B715ACE3B7E2-001/control-001/solr.xml
   [junit4]   2> 75066 INFO  (TEST-StressHdfsTest.test-seed#[5183B715ACE3B7E2]) [    ] o.a.s.c.CorePropertiesLocator Config-defined core root directory: /x1/jenkins/jenkins-slave/workspace/Lucene-Solr-NightlyTests-6.x/solr/build/solr-core/test/J1/temp/solr.cloud.hdfs.StressHdfsTest_5183B715ACE3B7E2-001/control-001/cores
   [junit4]   2> 75066 INFO  (TEST-StressHdfsTest.test-seed#[5183B715ACE3B7E2]) [    ] o.a.s.c.CoreContainer New CoreContainer 119396957
   [junit4]   2> 75066 INFO  (TEST-StressHdfsTest.test-seed#[5183B715ACE3B7E2]) [    ] o.a.s.c.CoreContainer Loading cores into CoreContainer [instanceDir=/x1/jenkins/jenkins-slave/workspace/Lucene-Solr-NightlyTests-6.x/solr/build/solr-core/test/J1/temp/solr.cloud.hdfs.StressHdfsTest_5183B715ACE3B7E2-001/control-001]
   [junit4]   2> 75066 WARN  (TEST-StressHdfsTest.test-seed#[5183B715ACE3B7E2]) [    ] o.a.s.c.CoreContainer Couldn't add files from /x1/jenkins/jenkins-slave/workspace/Lucene-Solr-NightlyTests-6.x/solr/build/solr-core/test/J1/temp/solr.cloud.hdfs.StressHdfsTest_5183B715ACE3B7E2-001/control-001/lib to classpath: /x1/jenkins/jenkins-slave/workspace/Lucene-Solr-NightlyTests-6.x/solr/build/solr-core/test/J1/temp/solr.cloud.hdfs.StressHdfsTest_5183B715ACE3B7E2-001/control-001/lib
   [junit4]   2> 75067 INFO  (TEST-StressHdfsTest.test-seed#[5183B715ACE3B7E2]) [    ] o.a.s.h.c.HttpShardHandlerFactory created with socketTimeout : 90000,urlScheme : ,connTimeout : 15000,maxConnectionsPerHost : 20,maxConnections : 10000,corePoolSize : 0,maximumPoolSize : 2147483647,maxThreadIdleTime : 5,sizeOfQueue : -1,fairnessPolicy : false,useRetries : false,
   [junit4]   2> 75072 INFO  (TEST-StressHdfsTest.test-seed#[5183B715ACE3B7E2]) [    ] o.a.s.u.UpdateShardHandler Creating UpdateShardHandler HTTP client with params: socketTimeout=340000&connTimeout=45000&retry=true
   [junit4]   2> 75074 INFO  (TEST-StressHdfsTest.test-seed#[5183B715ACE3B7E2]) [    ] o.a.s.l.LogWatcher SLF4J impl is org.slf4j.impl.Log4jLoggerFactory
   [junit4]   2> 75074 INFO  (TEST-StressHdfsTest.test-seed#[5183B715ACE3B7E2]) [    ] o.a.s.l.LogWatcher Registering Log Listener [Log4j (org.slf4j.impl.Log4jLoggerFactory)]
   [junit4]   2> 75074 INFO  (TEST-StressHdfsTest.test-seed#[5183B715ACE3B7E2]) [    ] o.a.s.c.ZkContainer Zookeeper client=127.0.0.1:51835/solr
   [junit4]   2> 75117 INFO  (TEST-StressHdfsTest.test-seed#[5183B715ACE3B7E2]) [    ] o.a.s.c.ZkController zkHost includes chroot
   [junit4]   2> 75117 INFO  (TEST-StressHdfsTest.test-seed#[5183B715ACE3B7E2]) [    ] o.a.s.c.c.SolrZkClient Using default ZkCredentialsProvider
   [junit4]   2> 75172 INFO  (TEST-StressHdfsTest.test-seed#[5183B715ACE3B7E2]) [    ] o.a.s.c.c.ConnectionManager Waiting for client to connect to ZooKeeper
   [junit4]   2> 75208 INFO  (zkCallback-36-thread-1) [    ] o.a.s.c.c.ConnectionManager Watcher org.apache.solr.common.cloud.ConnectionManager@75884d85 name:ZooKeeperConnection Watcher:127.0.0.1:51835 got event WatchedEvent state:SyncConnected type:None path:null path:null type:None
   [junit4]   2> 75208 INFO  (TEST-StressHdfsTest.test-seed#[5183B715ACE3B7E2]) [    ] o.a.s.c.c.ConnectionManager Client is connected to ZooKeeper
   [junit4]   2> 75209 INFO  (TEST-StressHdfsTest.test-seed#[5183B715ACE3B7E2]) [    ] o.a.s.c.c.SolrZkClient Using default ZkACLProvider
   [junit4]   2> 75237 INFO  (TEST-StressHdfsTest.test-seed#[5183B715ACE3B7E2]) [n:127.0.0.1:33618_ikhy%2Fv    ] o.a.s.c.c.ConnectionManager Waiting for client to connect to ZooKeeper
   [junit4]   2> 75251 INFO  (zkCallback-37-thread-1-processing-n:127.0.0.1:33618_ikhy%2Fv) [n:127.0.0.1:33618_ikhy%2Fv    ] o.a.s.c.c.ConnectionManager Watcher org.apache.solr.common.cloud.ConnectionManager@b3fd0b5 name:ZooKeeperConnection Watcher:127.0.0.1:51835/solr got event WatchedEvent state:SyncConnected type:None path:null path:null type:None
   [junit4]   2> 75251 INFO  (TEST-StressHdfsTest.test-seed#[5183B715ACE3B7E2]) [n:127.0.0.1:33618_ikhy%2Fv    ] o.a.s.c.c.ConnectionManager Client is connected to ZooKeeper
   [junit4]   2> 75266 INFO  (TEST-StressHdfsTest.test-seed#[5183B715ACE3B7E2]) [n:127.0.0.1:33618_ikhy%2Fv    ] o.a.s.c.c.SolrZkClient makePath: /overseer/queue
   [junit4]   2> 75278 INFO  (TEST-StressHdfsTest.test-seed#[5183B715ACE3B7E2]) [n:127.0.0.1:33618_ikhy%2Fv    ] o.a.s.c.c.SolrZkClient makePath: /overseer/collection-queue-work
   [junit4]   2> 75310 INFO  (TEST-StressHdfsTest.test-seed#[5183B715ACE3B7E2]) [n:127.0.0.1:33618_ikhy%2Fv    ] o.a.s.c.c.SolrZkClient makePath: /overseer/collection-map-running
   [junit4]   2> 75325 INFO  (TEST-StressHdfsTest.test-seed#[5183B715ACE3B7E2]) [n:127.0.0.1:33618_ikhy%2Fv    ] o.a.s.c.c.SolrZkClient makePath: /overseer/collection-map-completed
   [junit4]   2> 75334 INFO  (TEST-StressHdfsTest.test-seed#[5183B715ACE3B7E2]) [n:127.0.0.1:33618_ikhy%2Fv    ] o.a.s.c.c.SolrZkClient makePath: /overseer/collection-map-failure
   [junit4]   2> 75407 INFO  (TEST-StressHdfsTest.test-seed#[5183B715ACE3B7E2]) [n:127.0.0.1:33618_ikhy%2Fv    ] o.a.s.c.c.SolrZkClient makePath: /live_nodes
   [junit4]   2> 75410 INFO  (TEST-StressHdfsTest.test-seed#[5183B715ACE3B7E2]) [n:127.0.0.1:33618_ikhy%2Fv    ] o.a.s.c.c.SolrZkClient makePath: /aliases.json
   [junit4]   2> 75411 INFO  (TEST-StressHdfsTest.test-seed#[5183B715ACE3B7E2]) [n:127.0.0.1:33618_ikhy%2Fv    ] o.a.s.c.c.SolrZkClient makePath: /clusterstate.json
   [junit4]   2> 75413 INFO  (TEST-StressHdfsTest.test-seed#[5183B715ACE3B7E2]) [n:127.0.0.1:33618_ikhy%2Fv    ] o.a.s.c.c.SolrZkClient makePath: /security.json
   [junit4]   2> 75414 INFO  (TEST-StressHdfsTest.test-seed#[5183B715ACE3B7E2]) [n:127.0.0.1:33618_ikhy%2Fv    ] o.a.s.c.c.ZkStateReader Updating cluster state from ZooKeeper... 
   [junit4]   2> 75478 INFO  (TEST-StressHdfsTest.test-seed#[5183B715ACE3B7E2]) [n:127.0.0.1:33618_ikhy%2Fv    ] o.a.s.c.c.ZkStateReader Updated live nodes from ZooKeeper... (0) -> (0)
   [junit4]   2> 75534 INFO  (TEST-StressHdfsTest.test-seed#[5183B715ACE3B7E2]) [n:127.0.0.1:33618_ikhy%2Fv    ] o.a.s.c.c.SolrZkClient makePath: /overseer_elect
   [junit4]   2> 75537 INFO  (TEST-StressHdfsTest.test-seed#[5183B715ACE3B7E2]) [n:127.0.0.1:33618_ikhy%2Fv    ] o.a.s.c.c.SolrZkClient makePath: /overseer_elect/election
   [junit4]   2> 75541 INFO  (TEST-StressHdfsTest.test-seed#[5183B715ACE3B7E2]) [n:127.0.0.1:33618_ikhy%2Fv    ] o.a.s.c.Overseer Overseer (id=null) closing
   [junit4]   2> 75545 INFO  (TEST-StressHdfsTest.test-seed#[5183B715ACE3B7E2]) [n:127.0.0.1:33618_ikhy%2Fv    ] o.a.s.c.LeaderElector Joined leadership election with path: /overseer_elect/election/95698372181360644-127.0.0.1:33618_ikhy%2Fv-n_0000000000
   [junit4]   2> 75546 INFO  (TEST-StressHdfsTest.test-seed#[5183B715ACE3B7E2]) [n:127.0.0.1:33618_ikhy%2Fv    ] o.a.s.c.OverseerElectionContext I am going to be the leader 127.0.0.1:33618_ikhy%2Fv
   [junit4]   2> 75546 INFO  (TEST-StressHdfsTest.test-seed#[5183B715ACE3B7E2]) [n:127.0.0.1:33618_ikhy%2Fv    ] o.a.s.c.c.SolrZkClient makePath: /overseer_elect/leader
   [junit4]   2> 75552 INFO  (TEST-StressHdfsTest.test-seed#[5183B715ACE3B7E2]) [n:127.0.0.1:33618_ikhy%2Fv    ] o.a.s.c.Overseer Overseer (id=95698372181360644-127.0.0.1:33618_ikhy%2Fv-n_0000000000) starting
   [junit4]   2> 75572 INFO  (TEST-StressHdfsTest.test-seed#[5183B715ACE3B7E2]) [n:127.0.0.1:33618_ikhy%2Fv    ] o.a.s.c.c.SolrZkClient makePath: /overseer/queue-work
   [junit4]   2> 75789 INFO  (TEST-StressHdfsTest.test-seed#[5183B715ACE3B7E2]) [n:127.0.0.1:33618_ikhy%2Fv    ] o.a.s.c.OverseerAutoReplicaFailoverThread Starting OverseerAutoReplicaFailoverThread autoReplicaFailoverWorkLoopDelay=10000 autoReplicaFailoverWaitAfterExpiration=10000 autoReplicaFailoverBadNodeExpiration=60000
   [junit4]   2> 75805 INFO  (OverseerStateUpdate-95698372181360644-127.0.0.1:33618_ikhy%2Fv-n_0000000000) [n:127.0.0.1:33618_ikhy%2Fv    ] o.a.s.c.Overseer Starting to work on the main queue
   [junit4]   2> 75805 INFO  (OverseerCollectionConfigSetProcessor-95698372181360644-127.0.0.1:33618_ikhy%2Fv-n_0000000000) [n:127.0.0.1:33618_ikhy%2Fv    ] o.a.s.c.OverseerTaskProcessor Process current queue of overseer operations
   [junit4]   2> 76010 INFO  (TEST-StressHdfsTest.test-seed#[5183B715ACE3B7E2]) [n:127.0.0.1:33618_ikhy%2Fv    ] o.a.s.c.ZkController Register node as live in ZooKeeper:/live_nodes/127.0.0.1:33618_ikhy%2Fv
   [junit4]   2> 76014 INFO  (OverseerStateUpdate-95698372181360644-127.0.0.1:33618_ikhy%2Fv-n_0000000000) [n:127.0.0.1:33618_ikhy%2Fv    ] o.a.s.c.c.ZkStateReader Updated live nodes from ZooKeeper... (0) -> (0)
   [junit4]   2> 76023 INFO  (TEST-StressHdfsTest.test-seed#[5183B715ACE3B7E2]) [n:127.0.0.1:33618_ikhy%2Fv    ] o.a.s.c.c.SolrZkClient makePath: /live_nodes/127.0.0.1:33618_ikhy%2Fv
   [junit4]   2> 76029 INFO  (zkCallback-37-thread-1-processing-n:127.0.0.1:33618_ikhy%2Fv) [n:127.0.0.1:33618_ikhy%2Fv    ] o.a.s.c.c.ZkStateReader A live node change: [WatchedEvent state:SyncConnected type:NodeChildrenChanged path:/live_nodes], has occurred - updating... (live nodes size: [0])
   [junit4]   2> 76029 INFO  (zkCallback-37-thread-1-processing-n:127.0.0.1:33618_ikhy%2Fv) [n:127.0.0.1:33618_ikhy%2Fv    ] o.a.s.c.c.ZkStateReader Updated live nodes from ZooKeeper... (0) -> (1)
   [junit4]   2> 76315 INFO  (TEST-StressHdfsTest.test-seed#[5183B715ACE3B7E2]) [n:127.0.0.1:33618_ikhy%2Fv    ] o.a.s.c.CoreContainer Security conf doesn't exist. Skipping setup for authorization module.
   [junit4]   2> 76315 INFO  (TEST-StressHdfsTest.test-seed#[5183B715ACE3B7E2]) [n:127.0.0.1:33618_ikhy%2Fv    ] o.a.s.c.CoreContainer No authentication plugin used.
   [junit4]   2> 76320 INFO  (TEST-StressHdfsTest.test-seed#[5183B715ACE3B7E2]) [n:127.0.0.1:33618_ikhy%2Fv    ] o.a.s.c.CorePropertiesLocator Looking for core definitions underneath /x1/jenkins/jenkins-slave/workspace/Lucene-Solr-NightlyTests-6.x/solr/build/solr-core/test/J1/temp/solr.cloud.hdfs.StressHdfsTest_5183B715ACE3B7E2-001/control-001/cores
   [junit4]   2> 76322 INFO  (TEST-StressHdfsTest.test-seed#[5183B715ACE3B7E2]) [n:127.0.0.1:33618_ikhy%2Fv    ] o.a.s.c.CoreDescriptor Created CoreDescriptor: {name=collection1, config=solrconfig.xml, transient=false, schema=schema.xml, loadOnStartup=true, configSetProperties=configsetprops.json, collection=control_collection, coreNodeName=, dataDir=data/, shard=}
   [junit4]   2> 76322 INFO  (TEST-StressHdfsTest.test-seed#[5183B715ACE3B7E2]) [n:127.0.0.1:33618_ikhy%2Fv    ] o.a.s.c.CorePropertiesLocator Found core collection1 in /x1/jenkins/jenkins-slave/workspace/Lucene-Solr-NightlyTests-6.x/solr/build/solr-core/test/J1/temp/solr.cloud.hdfs.StressHdfsTest_5183B715ACE3B7E2-001/control-001/cores/collection1
   [junit4]   2> 76322 INFO  (TEST-StressHdfsTest.test-seed#[5183B715ACE3B7E2]) [n:127.0.0.1:33618_ikhy%2Fv    ] o.a.s.c.CorePropertiesLocator Found 1 core definitions
   [junit4]   2> 76663 INFO  (coreLoadExecutor-197-thread-1-processing-n:127.0.0.1:33618_ikhy%2Fv) [n:127.0.0.1:33618_ikhy%2Fv c:control_collection   x:collection1] o.a.s.c.ZkController publishing state=down
   [junit4]   2> 76663 INFO  (coreLoadExecutor-197-thread-1-processing-n:127.0.0.1:33618_ikhy%2Fv) [n:127.0.0.1:33618_ikhy%2Fv c:control_collection   x:collection1] o.a.s.c.ZkController numShards not found on descriptor - reading it from system property
   [junit4]   2> 76802 INFO  (TEST-StressHdfsTest.test-seed#[5183B715ACE3B7E2]) [n:127.0.0.1:33618_ikhy%2Fv    ] o.a.s.s.SolrDispatchFilter user.dir=/x1/jenkins/jenkins-slave/workspace/Lucene-Solr-NightlyTests-6.x/solr/build/solr-core/test/J1
   [junit4]   2> 76802 INFO  (TEST-StressHdfsTest.test-seed#[5183B715ACE3B7E2]) [n:127.0.0.1:33618_ikhy%2Fv    ] o.a.s.s.SolrDispatchFilter SolrDispatchFilter.init() done
   [junit4]   2> 76805 INFO  (OverseerStateUpdate-95698372181360644-127.0.0.1:33618_ikhy%2Fv-n_0000000000) [n:127.0.0.1:33618_ikhy%2Fv    ] o.a.s.c.Overseer processMessage: queueSize: 1, message = {
   [junit4]   2>   "core":"collection1",
   [junit4]   2>   "roles":null,
   [junit4]   2>   "base_url":"http://127.0.0.1:33618/ikhy/v",
   [junit4]   2>   "node_name":"127.0.0.1:33618_ikhy%2Fv",
   [junit4]   2>   "numShards":"1",
   [junit4]   2>   "state":"down",
   [junit4]   2>   "shard":null,
   [junit4]   2>   "collection":"control_collection",
   [junit4]   2>   "operation":"state"} current state version: 0
   [junit4]   2> 76812 INFO  (OverseerStateUpdate-95698372181360644-127.0.0.1:33618_ikhy%2Fv-n_0000000000) [n:127.0.0.1:33618_ikhy%2Fv    ] o.a.s.c.o.ReplicaMutator Update state numShards=1 message={
   [junit4]   2>   "core":"collection1",
   [junit4]   2>   "roles":null,
   [junit4]   2>   "base_url":"http://127.0.0.1:33618/ikhy/v",
   [junit4]   2>   "node_name":"127.0.0.1:33618_ikhy%2Fv",
   [junit4]   2>   "numShards":"1",
   [junit4]   2>   "state":"down",
   [junit4]   2>   "shard":null,
   [junit4]   2>   "collection":"control_collection",
   [junit4]   2>   "operation":"state"}
   [junit4]   2> 76814 INFO  (OverseerStateUpdate-95698372181360644-127.0.0.1:33618_ikhy%2Fv-n_0000000000) [n:127.0.0.1:33618_ikhy%2Fv    ] o.a.s.c.o.ClusterStateMutator building a new cName: control_collection
   [junit4]   2> 76831 INFO  (coreLoadExecutor-197-thread-1-processing-n:127.0.0.1:33618_ikhy%2Fv) [n:127.0.0.1:33618_ikhy%2Fv c:control_collection   x:collection1] o.a.s.c.ZkController look for our core node name
   [junit4]   2> 76833 INFO  (OverseerStateUpdate-95698372181360644-127.0.0.1:33618_ikhy%2Fv-n_0000000000) [n:127.0.0.1:33618_ikhy%2Fv    ] o.a.s.c.o.ReplicaMutator Assigning new node to shard shard=shard1
   [junit4]   2> 76890 INFO  (zkCallback-37-thread-1-processing-n:127.0.0.1:33618_ikhy%2Fv) [n:127.0.0.1:33618_ikhy%2Fv    ] o.a.s.c.c.ZkStateReader A cluster state change: [WatchedEvent state:SyncConnected type:NodeDataChanged path:/clusterstate.json], has occurred - updating... (live nodes size: [1])
   [junit4]   2> 77874 INFO  (coreLoadExecutor-197-thread-1-processing-n:127.0.0.1:33618_ikhy%2Fv) [n:127.0.0.1:33618_ikhy%2Fv c:control_collection   x:collection1] o.a.s.c.ZkController waiting to find shard id in clusterstate for collection1
   [junit4]   2> 77874 INFO  (coreLoadExecutor-197-thread-1-processing-n:127.0.0.1:33618_ikhy%2Fv) [n:127.0.0.1:33618_ikhy%2Fv c:control_collection   x:collection1] o.a.s.c.ZkController Check for collection zkNode:control_collection
   [junit4]   2> 77875 INFO  (coreLoadExecutor-197-thread-1-processing-n:127.0.0.1:33618_ikhy%2Fv) [n:127.0.0.1:33618_ikhy%2Fv c:control_collection   x:collection1] o.a.s.c.ZkController Collection zkNode exists
   [junit4]   2> 77875 INFO  (coreLoadExecutor-197-thread-1-processing-n:127.0.0.1:33618_ikhy%2Fv) [n:127.0.0.1:33618_ikhy%2Fv c:control_collection   x:collection1] o.a.s.c.c.ZkStateReader Load collection config from: [/collections/control_collection]
   [junit4]   2> 77876 INFO  (coreLoadExecutor-197-thread-1-processing-n:127.0.0.1:33618_ikhy%2Fv) [n:127.0.0.1:33618_ikhy%2Fv c:control_collection   x:collection1] o.a.s.c.c.ZkStateReader path=[/collections/control_collection] [configName]=[conf1] specified config exists in ZooKeeper
   [junit4]   2> 77876 INFO  (coreLoadExecutor-197-thread-1-processing-n:127.0.0.1:33618_ikhy%2Fv) [n:127.0.0.1:33618_ikhy%2Fv c:control_collection   x:collection1] o.a.s.c.SolrResourceLoader new SolrResourceLoader for directory: '/x1/jenkins/jenkins-slave/workspace/Lucene-Solr-NightlyTests-6.x/solr/build/solr-core/test/J1/temp/solr.cloud.hdfs.StressHdfsTest_5183B715ACE3B7E2-001/control-001/cores/collection1'
   [junit4]   2> 77876 INFO  (coreLoadExecutor-197-thread-1-processing-n:127.0.0.1:33618_ikhy%2Fv) [n:127.0.0.1:33618_ikhy%2Fv c:control_collection   x:collection1] o.a.s.c.SolrResourceLoader JNDI not configured for solr (NoInitialContextEx)
   [junit4]   2> 77876 INFO  (coreLoadExecutor-197-thread-1-processing-n:127.0.0.1:33618_ikhy%2Fv) [n:127.0.0.1:33618_ikhy%2Fv c:control_collection   x:collection1] o.a.s.c.SolrResourceLoader solr home defaulted to 'solr/' (could not find system property or JNDI)
   [junit4]   2> 77890 INFO  (coreLoadExecutor-197-thread-1-processing-n:127.0.0.1:33618_ikhy%2Fv) [n:127.0.0.1:33618_ikhy%2Fv c:control_collection   x:collection1] o.a.s.c.Config loaded config solrconfig.xml with version 0 
   [junit4]   2> 78105 INFO  (coreLoadExecutor-197-thread-1-processing-n:127.0.0.1:33618_ikhy%2Fv) [n:127.0.0.1:33618_ikhy%2Fv c:control_collection   x:collection1] o.a.s.c.SolrConfig current version of requestparams : -1
   [junit4]   2> 78108 WARN  (coreLoadExecutor-197-thread-1-processing-n:127.0.0.1:33618_ikhy%2Fv) [n:127.0.0.1:33618_ikhy%2Fv c:control_collection   x:collection1] o.a.s.c.Config Beginning with Solr 5.5, <mergePolicy> is deprecated, use <mergePolicyFactory> instead.
   [junit4]   2> 78109 INFO  (coreLoadExecutor-197-thread-1-processing-n:127.0.0.1:33618_ikhy%2Fv) [n:127.0.0.1:33618_ikhy%2Fv c:control_collection   x:collection1] o.a.s.c.SolrConfig Using Lucene MatchVersion: 6.1.0
   [junit4]   2> 78170 INFO  (coreLoadExecutor-197-thread-1-processing-n:127.0.0.1:33618_ikhy%2Fv) [n:127.0.0.1:33618_ikhy%2Fv c:control_collection   x:collection1] o.a.s.c.SolrConfig Loaded SolrConfig: solrconfig.xml
   [junit4]   2> 78208 INFO  (coreLoadExecutor-197-thread-1-processing-n:127.0.0.1:33618_ikhy%2Fv) [n:127.0.0.1:33618_ikhy%2Fv c:control_collection   x:collection1] o.a.s.s.IndexSchema [collection1] Schema name=test
   [junit4]   2> 78591 INFO  (coreLoadExecutor-197-thread-1-processing-n:127.0.0.1:33618_ikhy%2Fv) [n:127.0.0.1:33618_ikhy%2Fv c:control_collection   x:collection1] o.a.s.s.OpenExchangeRatesOrgProvider Initialized with rates=open-exchange-rates.json, refreshInterval=1440.
   [junit4]   2> 78616 INFO  (coreLoadExecutor-197-thread-1-processing-n:127.0.0.1:33618_ikhy%2Fv) [n:127.0.0.1:33618_ikhy%2Fv c:control_collection   x:collection1] o.a.s.s.IndexSchema default search field in schema is text
   [junit4]   2> 78617 INFO  (coreLoadExecutor-197-thread-1-processing-n:127.0.0.1:33618_ikhy%2Fv) [n:127.0.0.1:33618_ikhy%2Fv c:control_collection   x:collection1] o.a.s.s.IndexSchema unique key field: id
   [junit4]   2> 78674 INFO  (coreLoadExecutor-197-thread-1-processing-n:127.0.0.1:33618_ikhy%2Fv) [n:127.0.0.1:33618_ikhy%2Fv c:control_collection   x:collection1] o.a.s.s.FileExchangeRateProvider Reloading exchange rates from file currency.xml
   [junit4]   2> 78676 INFO  (coreLoadExecutor-197-thread-1-processing-n:127.0.0.1:33618_ikhy%2Fv) [n:127.0.0.1:33618_ikhy%2Fv c:control_collection   x:collection1] o.a.s.s.FileExchangeRateProvider Reloading exchange rates from file currency.xml
   [junit4]   2> 78682 INFO  (coreLoadExecutor-197-thread-1-processing-n:127.0.0.1:33618_ikhy%2Fv) [n:127.0.0.1:33618_ikhy%2Fv c:control_collection   x:collection1] o.a.s.s.OpenExchangeRatesOrgProvider Reloading exchange rates from open-exchange-rates.json
   [junit4]   2> 78682 INFO  (coreLoadExecutor-197-thread-1-processing-n:127.0.0.1:33618_ikhy%2Fv) [n:127.0.0.1:33618_ikhy%2Fv c:control_collection   x:collection1] o.a.s.s.OpenExchangeRatesOrgProvider Reloading exchange rates from open-exchange-rates.json
   [junit4]   2> 78684 INFO  (coreLoadExecutor-197-thread-1-processing-n:127.0.0.1:33618_ikhy%2Fv) [n:127.0.0.1:33618_ikhy%2Fv c:control_collection   x:collection1] o.a.s.c.ConfigSetProperties Did not find ConfigSet properties, assuming default properties: Can't find resource 'configsetprops.json' in classpath or '/configs/conf1', cwd=/x1/jenkins/jenkins-slave/workspace/Lucene-Solr-NightlyTests-6.x/solr/build/solr-core/test/J1
   [junit4]   2> 78684 INFO  (coreLoadExecutor-197-thread-1-processing-n:127.0.0.1:33618_ikhy%2Fv) [n:127.0.0.1:33618_ikhy%2Fv c:control_collection   x:collection1] o.a.s.c.CoreContainer Creating SolrCore 'collection1' using configuration from collection control_collection
   [junit4]   2> 78684 INFO  (coreLoadExecutor-197-thread-1-processing-n:127.0.0.1:33618_ikhy%2Fv) [n:127.0.0.1:33618_ikhy%2Fv c:control_collection s:shard1 r:core_node1 x:collection1] o.a.s.c.SolrCore org.apache.solr.core.HdfsDirectoryFactory
   [junit4]   2> 78709 INFO  (coreLoadExecutor-197-thread-1-processing-n:127.0.0.1:33618_ikhy%2Fv) [n:127.0.0.1:33618_ikhy%2Fv c:control_collection s:shard1 r:core_node1 x:collection1] o.a.s.c.HdfsDirectoryFactory solr.hdfs.home=hdfs://localhost:44481/solr_hdfs_home
   [junit4]   2> 78709 INFO  (coreLoadExecutor-197-thread-1-processing-n:127.0.0.1:33618_ikhy%2Fv) [n:127.0.0.1:33618_ikhy%2Fv c:control_collection s:shard1 r:core_node1 x:collection1] o.a.s.c.HdfsDirectoryFactory Solr Kerberos Authentication disabled
   [junit4]   2> 78709 INFO  (coreLoadExecutor-197-thread-1-processing-n:127.0.0.1:33618_ikhy%2Fv) [n:127.0.0.1:33618_ikhy%2Fv c:control_collection s:shard1 r:core_node1 x:collection1] o.a.s.c.SolrCore [[collection1] ] Opening new SolrCore at [/x1/jenkins/jenkins-slave/workspace/Lucene-Solr-NightlyTests-6.x/solr/build/solr-core/test/J1/temp/solr.cloud.hdfs.StressHdfsTest_5183B715ACE3B7E2-001/control-001/cores/collection1], dataDir=[hdfs://localhost:44481/solr_hdfs_home/control_collection/core_node1/data/]
   [junit4]   2> 78709 INFO  (coreLoadExecutor-197-thread-1-processing-n:127.0.0.1:33618_ikhy%2Fv) [n:127.0.0.1:33618_ikhy%2Fv c:control_collection s:shard1 r:core_node1 x:collection1] o.a.s.c.JmxMonitoredMap JMX monitoring is enabled. Adding Solr mbeans to JMX Server: com.sun.jmx.mbeanserver.JmxMBeanServer@42dcbe83
   [junit4]   2> 78722 INFO  (coreLoadExecutor-197-thread-1-processing-n:127.0.0.1:33618_ikhy%2Fv) [n:127.0.0.1:33618_ikhy%2Fv c:control_collection s:shard1 r:core_node1 x:collection1] o.a.s.c.HdfsDirectoryFactory creating directory factory for path hdfs://localhost:44481/solr_hdfs_home/control_collection/core_node1/data
   [junit4]   2> 79309 INFO  (coreLoadExecutor-197-thread-1-processing-n:127.0.0.1:33618_ikhy%2Fv) [n:127.0.0.1:33618_ikhy%2Fv c:control_collection s:shard1 r:core_node1 x:collection1] o.a.s.c.CachingDirectoryFactory return new directory for hdfs://localhost:44481/solr_hdfs_home/control_collection/core_node1/data
   [junit4]   2> 79327 INFO  (coreLoadExecutor-197-thread-1-processing-n:127.0.0.1:33618_ikhy%2Fv) [n:127.0.0.1:33618_ikhy%2Fv c:control_collection s:shard1 r:core_node1 x:collection1] o.a.s.c.SolrCore New index directory detected: old=null new=hdfs://localhost:44481/solr_hdfs_home/control_collection/core_node1/data/index/
   [junit4]   2> 79526 WARN  (coreLoadExecutor-197-thread-1-processing-n:127.0.0.1:33618_ikhy%2Fv) [n:127.0.0.1:33618_ikhy%2Fv c:control_collection s:shard1 r:core_node1 x:collection1] o.a.s.c.SolrCore [collection1] Solr index directory 'hdfs:/localhost:44481/solr_hdfs_home/control_collection/core_node1/data/index' doesn't exist. Creating new index...
   [junit4]   2> 79526 INFO  (coreLoadExecutor-197-thread-1-processing-n:127.0.0.1:33618_ikhy%2Fv) [n:127.0.0.1:33618_ikhy%2Fv c:control_collection s:shard1 r:core_node1 x:collection1] o.a.s.c.HdfsDirectoryFactory creating directory factory for path hdfs://localhost:44481/solr_hdfs_home/control_collection/core_node1/data/index
   [junit4]   2> 79536 INFO  (coreLoadExecutor-197-thread-1-processing-n:127.0.0.1:33618_ikhy%2Fv) [n:127.0.0.1:33618_ikhy%2Fv c:control_collection s:shard1 r:core_node1 x:collection1] o.a.s.c.HdfsDirectoryFactory Number of slabs of block cache [1] with direct memory allocation set to [true]
   [junit4]   2> 79536 INFO  (coreLoadExecutor-197-thread-1-processing-n:127.0.0.1:33618_ikhy%2Fv) [n:127.0.0.1:33618_ikhy%2Fv c:control_collection s:shard1 r:core_node1 x:collection1] o.a.s.c.HdfsDirectoryFactory Block cache target memory usage, slab size of [8388608] will allocate [1] slabs and use ~[8388608] bytes
   [junit4]   2> 79537 INFO  (coreLoadExecutor-197-thread-1-processing-n:127.0.0.1:33618_ikhy%2Fv) [n:127.0.0.1:33618_ikhy%2Fv c:control_collection s:shard1 r:core_node1 x:collection1] o.a.s.c.HdfsDirectoryFactory Creating new global HDFS BlockCache
   [junit4]   2> 83884 INFO  (coreLoadExecutor-197-thread-1-processing-n:127.0.0.1:33618_ikhy%2Fv) [n:127.0.0.1:33618_ikhy%2Fv c:control_collection s:shard1 r:core_node1 x:collection1] o.a.s.s.b.BlockDirectory Block cache on write is disabled
   [junit4]   2> 83884 INFO  (coreLoadExecutor-197-thread-1-processing-n:127.0.0.1:33618_ikhy%2Fv) [n:127.0.0.1:33618_ikhy%2Fv c:control_collection s:shard1 r:core_node1 x:collection1] o.a.s.c.CachingDirectoryFactory return new directory for hdfs://localhost:44481/solr_hdfs_home/control_collection/core_node1/data/index
   [junit4]   2> 83884 INFO  (coreLoadExecutor-197-thread-1-processing-n:127.0.0.1:33618_ikhy%2Fv) [n:127.0.0.1:33618_ikhy%2Fv c:control_collection s:shard1 r:core_node1 x:collection1] o.a.s.u.RandomMergePolicy RandomMergePolicy wrapping class org.apache.lucene.index.LogDocMergePolicy: [LogDocMergePolicy: minMergeSize=1000, mergeFactor=15, maxMergeSize=9223372036854775807, maxMergeSizeForForcedMerge=9223372036854775807, calibrateSizeByDeletes=true, maxMergeDocs=2147483647, maxCFSSegmentSizeMB=8.796093022207999E12, noCFSRatio=0.1465111180179477]
   [junit4]   2> 85390 INFO  (IPC Server handler 9 on 44481) [    ] BlockStateChange BLOCK* addStoredBlock: blockMap updated: 127.0.0.1:59273 is added to blk_1073741825_1001{blockUCState=COMMITTED, primaryNodeIndex=-1, replicas=[ReplicaUnderConstruction[[DISK]DS-4c3e0f1a-601e-4aec-9da0-9595f0d98d89:NORMAL:127.0.0.1:59273|RBW], ReplicaUnderConstruction[[DISK]DS-b6d1009d-39cc-4d64-bbd5-6245509b30be:NORMAL:127.0.0.1:59003|RBW]]} size 71
   [junit4]   2> 85394 INFO  (IPC Server handler 0 on 44481) [    ] BlockStateChange BLOCK* addStoredBlock: blockMap updated: 127.0.0.1:59003 is added to blk_1073741825_1001 size 71
   [junit4]   2> 85790 INFO  (coreLoadExecutor-197-thread-1-processing-n:127.0.0.1:33618_ikhy%2Fv) [n:127.0.0.1:33618_ikhy%2Fv c:control_collection s:shard1 r:core_node1 x:collection1] o.a.s.c.SolrDeletionPolicy SolrDeletionPolicy.onCommit: commits: num=1
   [junit4]   2> 	commit{dir=NRTCachingDirectory(BlockDirectory(HdfsDirectory@hdfs://localhost:44481/solr_hdfs_home/control_collection/core_node1/data/index lockFactory=org.apache.lucene.store.SingleInstanceLockFactory@72ee4eca); maxCacheMB=192.0 maxMergeSizeMB=16.0),segFN=segments_1,generation=1}
   [junit4]   2> 85790 INFO  (coreLoadExecutor-197-thread-1-processing-n:127.0.0.1:33618_ikhy%2Fv) [n:127.0.0.1:33618_ikhy%2Fv c:control_collection s:shard1 r:core_node1 x:collection1] o.a.s.c.SolrDeletionPolicy newest commit generation = 1
   [junit4]   2> 85843 INFO  (OldIndexDirectoryCleanupThreadForCore-collection1) [n:127.0.0.1:33618_ikhy%2Fv c:control_collection s:shard1 r:core_node1 x:collection1] o.a.s.c.SolrCore Looking for old index directories to cleanup for core collection1 in hdfs://localhost:44481/solr_hdfs_home/control_collection/core_node1/data/
   [junit4]   2> 85852 INFO  (coreLoadExecutor-197-thread-1-processing-n:127.0.0.1:33618_ikhy%2Fv) [n:127.0.0.1:33618_ikhy%2Fv c:control_collection s:shard1 r:core_node1 x:collection1] o.a.s.u.p.UpdateRequestProcessorChain creating updateRequestProcessorChain "nodistrib"
   [junit4]   2> 85861 INFO  (coreLoadExecutor-197-thread-1-processing-n:127.0.0.1:33618_ikhy%2Fv) [n:127.0.0.1:33618_ikhy%2Fv c:control_collection s:shard1 r:core_node1 x:collection1] o.a.s.u.p.UpdateRequestProcessorChain creating updateRequestProcessorChain "dedupe"
   [junit4]   2> 85862 INFO  (coreLoadExecutor-197-thread-1-processing-n:127.0.0.1:33618_ikhy%2Fv) [n:127.0.0.1:33618_ikhy%2Fv c:control_collection s:shard1 r:core_node1 x:collection1] o.a.s.u.p.UpdateRequestProcessorChain inserting DistributedUpdateProcessorFactory into updateRequestProcessorChain "dedupe"
   [junit4]   2> 85862 INFO  (coreLoadExecutor-197-thread-1-processing-n:127.0.0.1:33618_ikhy%2Fv) [n:127.0.0.1:33618_ikhy%2Fv c:control_collection s:shard1 r:core_node1 x:collection1] o.a.s.u.p.UpdateRequestProcessorChain creating updateRequestProcessorChain "stored_sig"
   [junit4]   2> 85862 INFO  (coreLoadExecutor-197-thread-1-processing-n:127.0.0.1:33618_ikhy%2Fv) [n:127.0.0.1:33618_ikhy%2Fv c:control_collection s:shard1 r:core_node1 x:collection1] o.a.s.u.p.UpdateRequestProcessorChain inserting DistributedUpdateProcessorFactory into updateRequestProcessorChain "stored_sig"
   [junit4]   2> 85862 INFO  (coreLoadExecutor-197-thread-1-processing-n:127.0.0.1:33618_ikhy%2Fv) [n:127.0.0.1:33618_ikhy%2Fv c:control_collection s:shard1 r:core_node1 x:collection1] o.a.s.u.p.UpdateRequestProcessorChain creating updateRequestProcessorChain "distrib-dup-test-chain-explicit"
   [junit4]   2> 85864 INFO  (coreLoadExecutor-197-thread-1-processing-n:127.0.0.1:33618_ikhy%2Fv) [n:127.0.0.1:33618_ikhy%2Fv c:control_collection s:shard1 r:core_node1 x:collection1] o.a.s.u.p.UpdateRequestProcessorChain creating updateRequestProcessorChain "distrib-dup-test-chain-implicit"
   [junit4]   2> 85865 INFO  (coreLoadExecutor-197-thread-1-processing-n:127.0.0.1:33618_ikhy%2Fv) [n:127.0.0.1:33618_ikhy%2Fv c:control_collection s:shard1 r:core_node1 x:collection1] o.a.s.u.p.UpdateRequestProcessorChain inserting DistributedUpdateProcessorFactory into updateRequestProcessorChain "distrib-dup-test-chain-implicit"
   [junit4]   2> 85865 INFO  (coreLoadExecutor-197-thread-1-processing-n:127.0.0.1:33618_ikhy%2Fv) [n:127.0.0.1:33618_ikhy%2Fv c:control_collection s:shard1 r:core_node1 x:collection1] o.a.s.c.SolrCore no updateRequestProcessorChain defined as default, creating implicit default
   [junit4]   2> 85867 WARN  (coreLoadExecutor-197-thread-1-processing-n:127.0.0.1:33618_ikhy%2Fv) [n:127.0.0.1:33618_ikhy%2Fv c:control_collection s:shard1 r:core_node1 x:collection1] o.a.s.c.RequestHandlers INVALID paramSet a in requestHandler {type = requestHandler,name = /dump,class = DumpRequestHandler,args = {defaults={a=A,b=B}}}
   [junit4]   2> 85868 INFO  (coreLoadExecutor-197-thread-1-processing-n:127.0.0.1:33618_ikhy%2Fv) [n:127.0.0.1:33618_ikhy%2Fv c:control_collection s:shard1 r:core_node1 x:collection1] o.a.s.h.l.XMLLoader xsltCacheLifetimeSeconds=60
   [junit4]   2> 85871 INFO  (coreLoadExecutor-197-thread-1-processing-n:127.0.0.1:33618_ikhy%2Fv) [n:127.0.0.1:33618_ikhy%2Fv c:control_collection s:shard1 r:core_node1 x:collection1] o.a.s.h.l.XMLLoader xsltCacheLifetimeSeconds=60
   [junit4]   2> 85872 INFO  (coreLoadExecutor-197-thread-1-processing-n:127.0.0.1:33618_ikhy%2Fv) [n:127.0.0.1:33618_ikhy%2Fv c:control_collection s:shard1 r:core_node1 x:collection1] o.a.s.h.l.XMLLoader xsltCacheLifetimeSeconds=60
   [junit4]   2> 85880 INFO  (coreLoadExecutor-197-thread-1-processing-n:127.0.0.1:33618_ikhy%2Fv) [n:127.0.0.1:33618_ikhy%2Fv c:control_collection s:shard1 r:core_node1 x:collection1] o.a.s.h.l.XMLLoader xsltCacheLifetimeSeconds=60
   [junit4]   2> 85940 INFO  (coreLoadExecutor-197-thread-1-processing-n:127.0.0.1:33618_ikhy%2Fv) [n:127.0.0.1:33618_ikhy%2Fv c:control_collection s:shard1 r:core_node1 x:collection1] o.a.s.c.RequestHandlers Registered paths: /admin/mbeans,standard,/dump,/update/csv,/sql,/update/json/docs,/admin/luke,/export,/admin/segments,/get,/admin/system,/replication,/admin/properties,/config,/stream,/schema,/admin/plugins,/admin/logging,/update/json,/admin/ping,/admin/threads,/update,/admin/file
   [junit4]   2> 85940 INFO  (coreLoadExecutor-197-thread-1-processing-n:127.0.0.1:33618_ikhy%2Fv) [n:127.0.0.1:33618_ikhy%2Fv c:control_collection s:shard1 r:core_node1 x:collection1] o.a.s.c.SolrCore Using default statsCache cache: org.apache.solr.search.stats.LocalStatsCache
   [junit4]   2> 85944 INFO  (coreLoadExecutor-197-thread-1-processing-n:127.0.0.1:33618_ikhy%2Fv) [n:127.0.0.1:33618_ikhy%2Fv c:control_collection s:shard1 r:core_node1 x:collection1] o.a.s.u.UpdateHandler Using UpdateLog implementation: org.apache.solr.update.HdfsUpdateLog
   [junit4]   2> 85944 INFO  (coreLoadExecutor-197-thread-1-processing-n:127.0.0.1:33618_ikhy%2Fv) [n:127.0.0.1:33618_ikhy%2Fv c:control_collection s:shard1 r:core_node1 x:collection1] o.a.s.u.UpdateLog Initializing UpdateLog: dataDir= defaultSyncLevel=FLUSH numRecordsToKeep=100 maxNumLogsToKeep=10 numVersionBuckets=65536
   [junit4]   2> 85944 INFO  (coreLoadExecutor-197-thread-1-processing-n:127.0.0.1:33618_ikhy%2Fv) [n:127.0.0.1:33618_ikhy%2Fv c:control_collection s:shard1 r:core_node1 x:collection1] o.a.s.u.HdfsUpdateLog Initializing HdfsUpdateLog: tlogDfsReplication=2
   [junit4]   2> 86230 INFO  (coreLoadExecutor-197-thread-1-processing-n:127.0.0.1:33618_ikhy%2Fv) [n:127.0.0.1:33618_ikhy%2Fv c:control_collection s:shard1 r:core_node1 x:collection1] o.a.s.u.CommitTracker Hard AutoCommit: disabled
   [junit4]   2> 86230 INFO  (coreLoadExecutor-197-thread-1-processing-n:127.0.0.1:33618_ikhy%2Fv) [n:127.0.0.1:33618_ikhy%2Fv c:control_collection s:shard1 r:core_node1 x:collection1] o.a.s.u.CommitTracker Soft AutoCommit: disabled
   [junit4]   2> 86232 INFO  (coreLoadExecutor-197-thread-1-processing-n:127.0.0.1:33618_ikhy%2Fv) [n:127.0.0.1:33618_ikhy%2Fv c:control_collection s:shard1 r:core_node1 x:collection1] o.a.s.u.RandomMergePolicy RandomMergePolicy wrapping class org.apache.lucene.index.AlcoholicMergePolicy: [AlcoholicMergePolicy: minMergeSize=0, mergeFactor=10, maxMergeSize=595380499, maxMergeSizeForForcedMerge=9223372036854775807, calibrateSizeByDeletes=true, maxMergeDocs=2147483647, maxCFSSegmentSizeMB=8.796093022207999E12, noCFSRatio=0.1]
   [junit4]   2> 86536 INFO  (coreLoadExecutor-197-thread-1-processing-n:127.0.0.1:33618_ikhy%2Fv) [n:127.0.0.1:33618_ikhy%2Fv c:control_collection s:shard1 r:core_node1 x:collection1] o.a.s.c.SolrDeletionPolicy SolrDeletionPolicy.onInit: commits: num=1
   [junit4]   2> 	commit{dir=NRTCachingDirectory(BlockDirectory(HdfsDirectory@hdfs://localhost:44481/solr_hdfs_home/control_collection/core_node1/data/index lockFactory=org.apache.lucene.store.SingleInstanceLockFactory@72ee4eca); maxCacheMB=192.0 maxMergeSizeMB=16.0),segFN=segments_1,generation=1}
   [junit4]   2> 86537 INFO  (coreLoadExecutor-197-thread-1-processing-n:127.0.0.1:33618_ikhy%2Fv) [n:127.0.0.1:33618_ikhy%2Fv c:control_collection s:shard1 r:core_node1 x:collection1] o.a.s.c.SolrDeletionPolicy newest commit generation = 1
   [junit4]   2> 86537 INFO  (coreLoadExecutor-197-thread-1-processing-n:127.0.0.1:33618_ikhy%2Fv) [n:127.0.0.1:33618_ikhy%2Fv c:control_collection s:shard1 r:core_node1 x:collection1] o.a.s.s.SolrIndexSearcher Opening [Searcher@13f47306[collection1] main]
   [junit4]   2> 86537 INFO  (coreLoadExecutor-197-thread-1-processing-n:127.0.0.1:33618_ikhy%2Fv) [n:127.0.0.1:33618_ikhy%2Fv c:control_collection s:shard1 r:core_node1 x:collection1] o.a.s.c.c.ZkStateReader Load collection config from: [/collections/control_collection]
   [junit4]   2> 86562 INFO  (coreLoadExecutor-197-thread-1-processing-n:127.0.0.1:33618_ikhy%2Fv) [n:127.0.0.1:33618_ikhy%2Fv c:control_collection s:shard1 r:core_node1 x:collection1] o.a.s.c.c.ZkStateReader path=[/collections/control_collection] [configName]=[conf1] specified config exists in ZooKeeper
   [junit4]   2> 86562 INFO  (coreLoadExecutor-197-thread-1-processing-n:127.0.0.1:33618_ikhy%2Fv) [n:127.0.0.1:33618_ikhy%2Fv c:control_collection s:shard1 r:core_node1 x:collection1] o.a.s.r.ManagedResourceStorage Setting up ZooKeeper-based storage for the RestManager with znodeBase: /configs/conf1
   [junit4]   2> 86578 INFO  (coreLoadExecutor-197-thread-1-processing-n:127.0.0.1:33618_ikhy%2Fv) [n:127.0.0.1:33618_ikhy%2Fv c:control_collection s:shard1 r:core_node1 x:collection1] o.a.s.r.ManagedResourceStorage Configured ZooKeeperStorageIO with znodeBase: /configs/conf1
   [junit4]   2> 86578 INFO  (coreLoadExecutor-197-thread-1-processing-n:127.0.0.1:33618_ikhy%2Fv) [n:127.0.0.1:33618_ikhy%2Fv c:control_collection s:shard1 r:core_node1 x:collection1] o.a.s.r.RestManager Initializing RestManager with initArgs: {}
   [junit4]   2> 86578 INFO  (coreLoadExecutor-197-thread-1-processing-n:127.0.0.1:33618_ikhy%2Fv) [n:127.0.0.1:33618_ikhy%2Fv c:control_collection s:shard1 r:core_node1 x:collection1] o.a.s.r.ManagedResourceStorage Reading _rest_managed.json using ZooKeeperStorageIO:path=/configs/conf1
   [junit4]   2> 86578 INFO  (coreLoadExecutor-197-thread-1-processing-n:127.0.0.1:33618_ikhy%2Fv) [n:127.0.0.1:33618_ikhy%2Fv c:control_collection s:shard1 r:core_node1 x:collection1] o.a.s.r.ManagedResourceStorage No data found for znode /configs/conf1/_rest_managed.json
   [junit4]   2> 86579 INFO  (coreLoadExecutor-197-thread-1-processing-n:127.0.0.1:33618_ikhy%2Fv) [n:127.0.0.1:33618_ikhy%2Fv c:control_collection s:shard1 r:core_node1 x:collection1] o.a.s.r.ManagedResourceStorage Loaded null at path _rest_managed.json using ZooKeeperStorageIO:path=/configs/conf1
   [junit4]   2> 86579 INFO  (coreLoadExecutor-197-thread-1-processing-n:127.0.0.1:33618_ikhy%2Fv) [n:127.0.0.1:33618_ikhy%2Fv c:control_collection s:shard1 r:core_node1 x:collection1] o.a.s.r.RestManager Initializing 0 registered ManagedResources
   [junit4]   2> 86581 INFO  (coreLoadExecutor-197-thread-1-processing-n:127.0.0.1:33618_ikhy%2Fv) [n:127.0.0.1:33618_ikhy%2Fv c:control_collection s:shard1 r:core_node1 x:collection1] o.a.s.h.ReplicationHandler Commits will be reserved for  10000
   [junit4]   2> 86591 INFO  (searcherExecutor-198-thread-1-processing-n:127.0.0.1:33618_ikhy%2Fv x:collection1 s:shard1 c:control_collection r:core_node1) [n:127.0.0.1:33618_ikhy%2Fv c:control_collection s:shard1 r:core_node1 x:collection1] o.a.s.c.SolrCore [collection1] Registered new searcher Searcher@13f47306[collection1] main{ExitableDirectoryReader(UninvertingDirectoryReader())}
   [junit4]   2> 86595 INFO  (coreLoadExecutor-197-thread-1-processing-n:127.0.0.1:33618_ikhy%2Fv) [n:127.0.0.1:33618_ikhy%2Fv c:control_collection s:shard1 r:core_node1 x:collection1] o.a.s.u.UpdateLog Looking up max value of version field to seed version buckets
   [junit4]   2> 86595 INFO  (coreLoadExecutor-197-thread-1-processing-n:127.0.0.1:33618_ikhy%2Fv) [n:127.0.0.1:33618_ikhy%2Fv c:control_collection s:shard1 r:core_node1 x:collection1] o.a.s.u.VersionInfo Refreshing highest value of _version_ for 65536 version buckets from index
   [junit4]   2> 86595 INFO  (coreLoadExecutor-197-thread-1-processing-n:127.0.0.1:33618_ikhy%2Fv) [n:127.0.0.1:33618_ikhy%2Fv c:control_collection s:shard1 r:core_node1 x:collection1] o.a.s.u.VersionInfo No terms found for _version_, cannot seed version bucket highest value from index
   [junit4]   2> 86595 INFO  (coreLoadExecutor-197-thread-1-processing-n:127.0.0.1:33618_ikhy%2Fv) [n:127.0.0.1:33618_ikhy%2Fv c:control_collection s:shard1 r:core_node1 x:collection1] o.a.s.u.UpdateLog Could not find max version in index or recent updates, using new clock 1531173968287891456
   [junit4]   2> 86596 INFO  (coreLoadExecutor-197-thread-1-processing-n:127.0.0.1:33618_ikhy%2Fv) [n:127.0.0.1:33618_ikhy%2Fv c:control_collection s:shard1 r:core_node1 x:collection1] o.a.s.u.UpdateLog Took 1.0ms to seed version buckets with highest version 1531173968287891456
   [junit4]   2> 86614 INFO  (coreLoadExecutor-197-thread-1-processing-n:127.0.0.1:33618_ikhy%2Fv) [n:127.0.0.1:33618_ikhy%2Fv c:control_collection s:shard1 r:core_node1 x:collection1] o.a.s.c.ZkController watch zkdir /configs/conf1
   [junit4]   2> 86622 INFO  (coreLoadExecutor-197-thread-1-processing-n:127.0.0.1:33618_ikhy%2Fv) [n:127.0.0.1:33618_ikhy%2Fv c:control_collection s:shard1 r:core_node1 x:collection1] o.a.s.c.CoreContainer registering core: collection1
   [junit4]   2> 86642 INFO  (coreZkRegister-191-thread-1-processing-n:127.0.0.1:33618_ikhy%2Fv x:collection1 s:shard1 c:control_collection r:core_node1) [n:127.0.0.1:33618_ikhy%2Fv c:control_collection s:shard1 r:core_node1 x:collection1] o.a.s.c.ZkController Register replica - core:collection1 address:http://127.0.0.1:33618/ikhy/v collection:control_collection shard:shard1
   [junit4]   2> 86656 INFO  (coreZkRegister-191-thread-1-processing-n:127.0.0.1:33618_ikhy%2Fv x:collection1 s:shard1 c:control_collection r:core_node1) [n:127.0.0.1:33618_ikhy%2Fv c:control_collection s:shard1 r:core_node1 x:collection1] o.a.s.c.c.SolrZkClient makePath: /collections/control_collection/leader_elect/shard1/election
   [junit4]   2> 86698 INFO  (coreZkRegister-191-thread-1-processing-n:127.0.0.1:33618_ikhy%2Fv x:collection1 s:shard1 c:control_collection r:core_node1) [n:127.0.0.1:33618_ikhy%2Fv c:control_collection s:shard1 r:core_node1 x:collection1] o.a.s.c.LeaderElector Joined leadership election with path: /collections/control_collection/leader_elect/shard1/election/95698372181360644-core_node1-n_0000000000
   [junit4]   2> 86698 INFO  (coreZkRegister-191-thread-1-processing-n:127.0.0.1:33618_ikhy%2Fv x:collection1 s:shard1 c:control_collection r:core_node1) [n:127.0.0.1:33618_ikhy%2Fv c:control_collection s:shard1 r:core_node1 x:collection1] o.a.s.c.ShardLeaderElectionContext Running the leader process for shard=shard1 and weAreReplacement=false and leaderVoteWait=180000
   [junit4]   2> 86702 INFO  (coreZkRegister-191-thread-1-processing-n:127.0.0.1:33618_ikhy%2Fv x:collection1 s:shard1 c:control_collection r:core_node1) [n:127.0.0.1:33618_ikhy%2Fv c:control_collection s:shard1 r:core_node1 x:collection1] o.a.s.c.ShardLeaderElectionContext Enough replicas found to continue.
   [junit4]   2> 86702 INFO  (coreZkRegister-191-thread-1-processing-n:127.0.0.1:33618_ikhy%2Fv x:collection1 s:shard1 c:control_collection r:core_node1) [n:127.0.0.1:33618_ikhy%2Fv c:control_collection s:shard1 r:core_node1 x:collection1] o.a.s.c.ShardLeaderElectionContext I may be the new leader - try and sync
   [junit4]   2> 86702 INFO  (coreZkRegister-191-thread-1-processing-n:127.0.0.1:33618_ikhy%2Fv x:collection1 s:shard1 c:control_collection r:core_node1) [n:127.0.0.1:33618_ikhy%2Fv c:control_collection s:shard1 r:core_node1 x:collection1] o.a.s.c.SyncStrategy Sync replicas to http://127.0.0.1:33618/ikhy/v/collection1/
   [junit4]   2> 86702 INFO  (coreZkRegister-191-thread-1-processing-n:127.0.0.1:33618_ikhy%2Fv x:collection1 s:shard1 c:control_collection r:core_node1) [n:127.0.0.1:33618_ikhy%2Fv c:control_collection s:shard1 r:core_node1 x:collection1] o.a.s.c.SyncStrategy Sync Success - now sync replicas to me
   [junit4]   2> 86702 INFO  (coreZkRegister-191-thread-1-processing-n:127.0.0.1:33618_ikhy%2Fv x:collection1 s:shard1 c:control_collection r:core_node1) [n:127.0.0.1:33618_ikhy%2Fv c:control_collection s:shard1 r:core_node1 x:collection1] o.a.s.c.SyncStrategy http://127.0.0.1:33618/ikhy/v/collection1/ has no replicas
   [junit4]   2> 86703 INFO  (coreZkRegister-191-thread-1-processing-n:12

[...truncated too long message...]

)
   [junit4]   2> 	at org.apache.lucene.util.TestRuleStoreClassName$1.evaluate(TestRuleStoreClassName.java:41)
   [junit4]   2> 	at com.carrotsearch.randomizedtesting.rules.NoShadowingOrOverridesOnMethodsRule$1.evaluate(NoShadowingOrOverridesOnMethodsRule.java:40)
   [junit4]   2> 	at com.carrotsearch.randomizedtesting.rules.NoShadowingOrOverridesOnMethodsRule$1.evaluate(NoShadowingOrOverridesOnMethodsRule.java:40)
   [junit4]   2> 	at com.carrotsearch.randomizedtesting.rules.StatementAdapter.evaluate(StatementAdapter.java:36)
   [junit4]   2> 	at com.carrotsearch.randomizedtesting.rules.StatementAdapter.evaluate(StatementAdapter.java:36)
   [junit4]   2> 	at com.carrotsearch.randomizedtesting.rules.StatementAdapter.evaluate(StatementAdapter.java:36)
   [junit4]   2> 	at org.apache.lucene.util.TestRuleAssertionsRequired$1.evaluate(TestRuleAssertionsRequired.java:53)
   [junit4]   2> 	at org.apache.lucene.util.TestRuleMarkFailure$1.evaluate(TestRuleMarkFailure.java:47)
   [junit4]   2> 	at org.apache.lucene.util.TestRuleIgnoreAfterMaxFailures$1.evaluate(TestRuleIgnoreAfterMaxFailures.java:64)
   [junit4]   2> 	at org.apache.lucene.util.TestRuleIgnoreTestSuites$1.evaluate(TestRuleIgnoreTestSuites.java:54)
   [junit4]   2> 	at com.carrotsearch.randomizedtesting.rules.StatementAdapter.evaluate(StatementAdapter.java:36)
   [junit4]   2> 	at com.carrotsearch.randomizedtesting.ThreadLeakControl$StatementRunner.run(ThreadLeakControl.java:367)
   [junit4]   2> 	at java.lang.Thread.run(Thread.java:745)
   [junit4]   2> Caused by: java.lang.NullPointerException
   [junit4]   2> 	at org.apache.hadoop.hdfs.server.blockmanagement.BlocksMap.size(BlocksMap.java:198)
   [junit4]   2> 	at org.apache.hadoop.hdfs.server.blockmanagement.BlockManager.getTotalBlocks(BlockManager.java:3291)
   [junit4]   2> 	at org.apache.hadoop.hdfs.server.namenode.FSNamesystem.getBlocksTotal(FSNamesystem.java:6223)
   [junit4]   2> 	... 54 more
   [junit4]   2> 5690237 INFO  (SUITE-HdfsCollectionsAPIDistributedZkTest-seed#[5183B715ACE3B7E2]-worker) [    ] o.a.s.SolrTestCaseJ4 ###deleteCore
   [junit4]   2> NOTE: leaving temporary files on disk at: /x1/jenkins/jenkins-slave/workspace/Lucene-Solr-NightlyTests-6.x/solr/build/solr-core/test/J1/temp/solr.cloud.hdfs.HdfsCollectionsAPIDistributedZkTest_5183B715ACE3B7E2-001
   [junit4]   2> Apr 10, 2016 12:08:11 AM com.carrotsearch.randomizedtesting.ThreadLeakControl checkThreadLeaks
   [junit4]   2> WARNING: Will linger awaiting termination of 2 leaked thread(s).
   [junit4]   2> NOTE: test params are: codec=Asserting(Lucene60): {other_tl1=PostingsFormat(name=LuceneVarGapFixedInterval), range_facet_l_dv=PostingsFormat(name=Direct), _version_=PostingsFormat(name=LuceneVarGapFixedInterval), multiDefault=PostingsFormat(name=Memory doPackFST= true), a_t=PostingsFormat(name=Memory doPackFST= true), intDefault=PostingsFormat(name=LuceneVarGapFixedInterval), a_i1=PostingsFormat(name=Memory doPackFST= true), id=PostingsFormat(name=Direct), range_facet_i_dv=PostingsFormat(name=Memory doPackFST= true), text=PostingsFormat(name=Asserting), range_facet_l=PostingsFormat(name=Memory doPackFST= true), timestamp=PostingsFormat(name=Memory doPackFST= true)}, docValues:{range_facet_l_dv=DocValuesFormat(name=Lucene54), range_facet_i_dv=DocValuesFormat(name=Lucene54), timestamp=DocValuesFormat(name=Lucene54)}, maxPointsInLeafNode=945, maxMBSortInHeap=4.17361962605737, sim=RandomSimilarity(queryNorm=false,coord=no): {}, locale=he-IL, timezone=PRC
   [junit4]   2> NOTE: Linux 3.13.0-52-generic amd64/Oracle Corporation 1.8.0_74 (64-bit)/cpus=4,threads=2,free=86320160,total=489684992
   [junit4]   2> NOTE: All tests run in this JVM: [BigEndianAscendingWordDeserializerTest, MoreLikeThisHandlerTest, TestNonDefinedSimilarityFactory, TestSolrDeletionPolicy2, TestDocumentBuilder, TestExactSharedStatsCache, SpellCheckCollatorTest, TestNoOpRegenerator, StressHdfsTest, TestReloadAndDeleteDocs, AtomicUpdatesTest, TestFieldSortValues, TestRecoveryHdfs, ConvertedLegacyTest, DocValuesTest, DistributedMLTComponentTest, ConfigSetsAPITest, TestFieldResource, OpenCloseCoreStressTest, TestReqParamsAPI, DocExpirationUpdateProcessorFactoryTest, UpdateRequestProcessorFactoryTest, DeleteShardTest, TestManagedResourceStorage, TestTrieFacet, DistanceFunctionTest, TestSurroundQueryParser, ClusterStateUpdateTest, TestQuerySenderNoQuery, TestCursorMarkWithoutUniqueKey, TestBM25SimilarityFactory, TestRTimerTree, TestFiltering, SimplePostToolTest, TestSchemaNameResource, SoftAutoCommitTest, HighlighterTest, TestConfigOverlay, SortSpecParsingTest, TestQuerySenderListener, DistributedExpandComponentTest, DeleteInactiveReplicaTest, ShardRoutingTest, NotRequiredUniqueKeyTest, CursorMarkTest, SpatialFilterTest, TestMacros, ExplicitHLLTest, TestTolerantUpdateProcessorRandomCloud, RollingRestartTest, TestPartialUpdateDeduplication, TestScoreJoinQPScore, CSVRequestHandlerTest, TermVectorComponentTest, TestHighFrequencyDictionaryFactory, TestPKIAuthenticationPlugin, MinimalSchemaTest, TestRandomCollapseQParserPlugin, TestLeaderElectionZkExpiry, TestCoreContainer, MigrateRouteKeyTest, CoreAdminRequestStatusTest, TestQueryUtils, LeaderFailoverAfterPartitionTest, ExitableDirectoryReaderTest, SpellPossibilityIteratorTest, TestCloudPivotFacet, ChaosMonkeySafeLeaderTest, DistributedQueryComponentCustomSortTest, SpellCheckComponentTest, TestQueryTypes, SimpleCollectionCreateDeleteTest, SolrInfoMBeanTest, PreAnalyzedUpdateProcessorTest, TestSimpleQParserPlugin, DistributedFacetPivotSmallAdvancedTest, NumericFieldsTest, MultiTermTest, FacetPivotSmallTest, TestEmbeddedSolrServerConstructors, BJQParserTest, TestConfigSets, CollectionsAPIDistributedZkTest, HdfsNNFailoverTest, TermsComponentTest, SchemaVersionSpecificBehaviorTest, TestUpdate, BasicAuthIntegrationTest, AsyncMigrateRouteKeyTest, BasicFunctionalityTest, DateRangeFieldTest, AutoCommitTest, TestDistributedGrouping, TestFaceting, TestHashPartitioner, TermVectorComponentDistributedTest, ZkControllerTest, TestJoin, TestStressVersions, HardAutoCommitTest, DistributedTermsComponentTest, SolrCoreTest, SolrCmdDistributorTest, QueryElevationComponentTest, DirectUpdateHandlerTest, TestIndexSearcher, ShowFileRequestHandlerTest, DistributedQueryElevationComponentTest, SolrIndexSplitterTest, TestCoreDiscovery, SignatureUpdateProcessorFactoryTest, SuggesterFSTTest, SolrRequestParserTest, TestFoldingMultitermQuery, SuggesterTSTTest, SuggesterTest, TestStressLucene, TestTrie, SuggesterWFSTTest, PolyFieldTest, NoCacheHeaderTest, WordBreakSolrSpellCheckerTest, TestPseudoReturnFields, TestWordDelimiterFilterFactory, QueryEqualityTest, SortByFunctionTest, CacheHeaderTest, IndexBasedSpellCheckerTest, DisMaxRequestHandlerTest, StandardRequestHandlerTest, DirectSolrSpellCheckerTest, TestReversedWildcardFilterFactory, PrimitiveFieldTypeTest, TestOmitPositions, FileBasedSpellCheckerTest, XmlUpdateRequestHandlerTest, RequestHandlersTest, DocumentBuilderTest, PathHierarchyTokenizerFactoryTest, TestIndexingPerformance, RequiredFieldsTest, FastVectorHighlighterTest, LoggingHandlerTest, RegexBoostProcessorTest, SolrPluginUtilsTest, IndexSchemaTest, TestJmxIntegration, TestCollationField, TestCSVResponseWriter, MBeansHandlerTest, TestAnalyzedSuggestions, UniqFieldsUpdateProcessorFactoryTest, PingRequestHandlerTest, SearchHandlerTest, TestBinaryResponseWriter, TestLFUCache, HighlighterConfigTest, AlternateDirectoryTest, TestSolrIndexConfig, ResponseLogComponentTest, SolrIndexConfigTest, BadComponentTest, TestStressRecovery, PreAnalyzedFieldTest, SpellingQueryConverterTest, RAMDirectoryFactoryTest, TestSolrJ, SliceStateTest, FileUtilsTest, TestDistributedMissingSort, TestSimpleTrackingShardHandler, ConnectionReuseTest, CdcrRequestHandlerTest, CollectionsAPIAsyncDistributedZkTest, ConnectionManagerTest, DistributedQueueTest, DistributedVersionInfoTest, OutOfBoxZkACLAndCredentialsProvidersTest, OverriddenZkACLAndCredentialsProvidersTest, OverseerRolesTest, OverseerStatusTest, OverseerTaskQueueTest, RemoteQueryErrorTest, SSLMigrationTest, SaslZkACLProviderTest, SharedFSAutoReplicaFailoverTest, TestCryptoKeys, TestLeaderInitiatedRecoveryThread, TestMiniSolrCloudClusterBase, TestRandomRequestDistribution, TestReplicaProperties, TestShortCircuitedRequests, TestSolrCloudWithKerberosAlt, TestTolerantUpdateProcessorCloud, VMParamsZkACLAndCredentialsProvidersTest, HdfsBasicDistributedZk2Test, HdfsChaosMonkeyNothingIsSafeTest, HdfsChaosMonkeySafeLeaderTest, HdfsCollectionsAPIDistributedZkTest]
   [junit4] Completed [477/585 (6!)] on J1 in 607.99s, 1 test, 1 error <<< FAILURES!

[...truncated 357 lines...]
BUILD FAILED
/x1/jenkins/jenkins-slave/workspace/Lucene-Solr-NightlyTests-6.x/build.xml:747: The following error occurred while executing this line:
/x1/jenkins/jenkins-slave/workspace/Lucene-Solr-NightlyTests-6.x/build.xml:684: The following error occurred while executing this line:
/x1/jenkins/jenkins-slave/workspace/Lucene-Solr-NightlyTests-6.x/build.xml:59: The following error occurred while executing this line:
/x1/jenkins/jenkins-slave/workspace/Lucene-Solr-NightlyTests-6.x/solr/build.xml:233: The following error occurred while executing this line:
/x1/jenkins/jenkins-slave/workspace/Lucene-Solr-NightlyTests-6.x/solr/common-build.xml:529: The following error occurred while executing this line:
/x1/jenkins/jenkins-slave/workspace/Lucene-Solr-NightlyTests-6.x/lucene/common-build.xml:1457: The following error occurred while executing this line:
/x1/jenkins/jenkins-slave/workspace/Lucene-Solr-NightlyTests-6.x/lucene/common-build.xml:1014: There were test failures: 585 suites (10 ignored), 2363 tests, 4 errors, 2 failures, 31 ignored (16 assumptions) [seed: 5183B715ACE3B7E2]

Total time: 299 minutes 19 seconds
Build step 'Invoke Ant' marked build as failure
Archiving artifacts
No prior successful build to compare, so performing full copy of artifacts
Recording test results
Email was triggered for: Failure - Any
Sending email for trigger: Failure - Any




Mime
View raw message