lucene-dev mailing list archives

Site index · List index
Message view « Date » · « Thread »
Top « Date » · « Thread »
From Policeman Jenkins Server <jenk...@thetaphi.de>
Subject [JENKINS] Lucene-Solr-master-Windows (64bit/jdk1.8.0_72) - Build # 5750 - Failure!
Date Fri, 01 Apr 2016 08:57:10 GMT
Build: http://jenkins.thetaphi.de/job/Lucene-Solr-master-Windows/5750/
Java: 64bit/jdk1.8.0_72 -XX:+UseCompressedOops -XX:+UseSerialGC

2 tests failed.
FAILED:  org.apache.solr.cloud.DistribDocExpirationUpdateProcessorTest.test

Error Message:
There are still nodes recoverying - waited for 45 seconds

Stack Trace:
java.lang.AssertionError: There are still nodes recoverying - waited for 45 seconds
	at __randomizedtesting.SeedInfo.seed([4D3DC056018109F6:C569FF8CAF7D640E]:0)
	at org.junit.Assert.fail(Assert.java:93)
	at org.apache.solr.cloud.AbstractDistribZkTestBase.waitForRecoveriesToFinish(AbstractDistribZkTestBase.java:173)
	at org.apache.solr.cloud.AbstractFullDistribZkTestBase.waitForRecoveriesToFinish(AbstractFullDistribZkTestBase.java:856)
	at org.apache.solr.cloud.DistribDocExpirationUpdateProcessorTest.test(DistribDocExpirationUpdateProcessorTest.java:73)
	at sun.reflect.NativeMethodAccessorImpl.invoke0(Native Method)
	at sun.reflect.NativeMethodAccessorImpl.invoke(NativeMethodAccessorImpl.java:62)
	at sun.reflect.DelegatingMethodAccessorImpl.invoke(DelegatingMethodAccessorImpl.java:43)
	at java.lang.reflect.Method.invoke(Method.java:498)
	at com.carrotsearch.randomizedtesting.RandomizedRunner.invoke(RandomizedRunner.java:1764)
	at com.carrotsearch.randomizedtesting.RandomizedRunner$8.evaluate(RandomizedRunner.java:871)
	at com.carrotsearch.randomizedtesting.RandomizedRunner$9.evaluate(RandomizedRunner.java:907)
	at com.carrotsearch.randomizedtesting.RandomizedRunner$10.evaluate(RandomizedRunner.java:921)
	at org.apache.solr.BaseDistributedSearchTestCase$ShardsRepeatRule$ShardsFixedStatement.callStatement(BaseDistributedSearchTestCase.java:992)
	at org.apache.solr.BaseDistributedSearchTestCase$ShardsRepeatRule$ShardsStatement.evaluate(BaseDistributedSearchTestCase.java:967)
	at com.carrotsearch.randomizedtesting.rules.SystemPropertiesRestoreRule$1.evaluate(SystemPropertiesRestoreRule.java:57)
	at org.apache.lucene.util.TestRuleSetupTeardownChained$1.evaluate(TestRuleSetupTeardownChained.java:49)
	at org.apache.lucene.util.AbstractBeforeAfterRule$1.evaluate(AbstractBeforeAfterRule.java:45)
	at org.apache.lucene.util.TestRuleThreadAndTestName$1.evaluate(TestRuleThreadAndTestName.java:48)
	at org.apache.lucene.util.TestRuleIgnoreAfterMaxFailures$1.evaluate(TestRuleIgnoreAfterMaxFailures.java:64)
	at org.apache.lucene.util.TestRuleMarkFailure$1.evaluate(TestRuleMarkFailure.java:47)
	at com.carrotsearch.randomizedtesting.rules.StatementAdapter.evaluate(StatementAdapter.java:36)
	at com.carrotsearch.randomizedtesting.ThreadLeakControl$StatementRunner.run(ThreadLeakControl.java:367)
	at com.carrotsearch.randomizedtesting.ThreadLeakControl.forkTimeoutingTask(ThreadLeakControl.java:809)
	at com.carrotsearch.randomizedtesting.ThreadLeakControl$3.evaluate(ThreadLeakControl.java:460)
	at com.carrotsearch.randomizedtesting.RandomizedRunner.runSingleTest(RandomizedRunner.java:880)
	at com.carrotsearch.randomizedtesting.RandomizedRunner$5.evaluate(RandomizedRunner.java:781)
	at com.carrotsearch.randomizedtesting.RandomizedRunner$6.evaluate(RandomizedRunner.java:816)
	at com.carrotsearch.randomizedtesting.RandomizedRunner$7.evaluate(RandomizedRunner.java:827)
	at com.carrotsearch.randomizedtesting.rules.StatementAdapter.evaluate(StatementAdapter.java:36)
	at com.carrotsearch.randomizedtesting.rules.SystemPropertiesRestoreRule$1.evaluate(SystemPropertiesRestoreRule.java:57)
	at org.apache.lucene.util.AbstractBeforeAfterRule$1.evaluate(AbstractBeforeAfterRule.java:45)
	at com.carrotsearch.randomizedtesting.rules.StatementAdapter.evaluate(StatementAdapter.java:36)
	at org.apache.lucene.util.TestRuleStoreClassName$1.evaluate(TestRuleStoreClassName.java:41)
	at com.carrotsearch.randomizedtesting.rules.NoShadowingOrOverridesOnMethodsRule$1.evaluate(NoShadowingOrOverridesOnMethodsRule.java:40)
	at com.carrotsearch.randomizedtesting.rules.NoShadowingOrOverridesOnMethodsRule$1.evaluate(NoShadowingOrOverridesOnMethodsRule.java:40)
	at com.carrotsearch.randomizedtesting.rules.StatementAdapter.evaluate(StatementAdapter.java:36)
	at com.carrotsearch.randomizedtesting.rules.StatementAdapter.evaluate(StatementAdapter.java:36)
	at com.carrotsearch.randomizedtesting.rules.StatementAdapter.evaluate(StatementAdapter.java:36)
	at org.apache.lucene.util.TestRuleAssertionsRequired$1.evaluate(TestRuleAssertionsRequired.java:53)
	at org.apache.lucene.util.TestRuleMarkFailure$1.evaluate(TestRuleMarkFailure.java:47)
	at org.apache.lucene.util.TestRuleIgnoreAfterMaxFailures$1.evaluate(TestRuleIgnoreAfterMaxFailures.java:64)
	at org.apache.lucene.util.TestRuleIgnoreTestSuites$1.evaluate(TestRuleIgnoreTestSuites.java:54)
	at com.carrotsearch.randomizedtesting.rules.StatementAdapter.evaluate(StatementAdapter.java:36)
	at com.carrotsearch.randomizedtesting.ThreadLeakControl$StatementRunner.run(ThreadLeakControl.java:367)
	at java.lang.Thread.run(Thread.java:745)


FAILED:  org.apache.solr.handler.TestReqParamsAPI.test

Error Message:
Could not get expected value  'CY val' for path 'params/c' full output: {   "responseHeader":{     "status":0,     "QTime":0},   "params":{     "a":"A val",     "b":"B val",     "wt":"json",     "useParams":""},   "context":{     "webapp":"",     "path":"/dump1",     "httpMethod":"GET"}}

Stack Trace:
java.lang.AssertionError: Could not get expected value  'CY val' for path 'params/c' full output: {
  "responseHeader":{
    "status":0,
    "QTime":0},
  "params":{
    "a":"A val",
    "b":"B val",
    "wt":"json",
    "useParams":""},
  "context":{
    "webapp":"",
    "path":"/dump1",
    "httpMethod":"GET"}}
	at __randomizedtesting.SeedInfo.seed([4D3DC056018109F6:C569FF8CAF7D640E]:0)
	at org.junit.Assert.fail(Assert.java:93)
	at org.junit.Assert.assertTrue(Assert.java:43)
	at org.apache.solr.core.TestSolrConfigHandler.testForResponseElement(TestSolrConfigHandler.java:458)
	at org.apache.solr.handler.TestReqParamsAPI.testReqParams(TestReqParamsAPI.java:177)
	at org.apache.solr.handler.TestReqParamsAPI.test(TestReqParamsAPI.java:67)
	at sun.reflect.NativeMethodAccessorImpl.invoke0(Native Method)
	at sun.reflect.NativeMethodAccessorImpl.invoke(NativeMethodAccessorImpl.java:62)
	at sun.reflect.DelegatingMethodAccessorImpl.invoke(DelegatingMethodAccessorImpl.java:43)
	at java.lang.reflect.Method.invoke(Method.java:498)
	at com.carrotsearch.randomizedtesting.RandomizedRunner.invoke(RandomizedRunner.java:1764)
	at com.carrotsearch.randomizedtesting.RandomizedRunner$8.evaluate(RandomizedRunner.java:871)
	at com.carrotsearch.randomizedtesting.RandomizedRunner$9.evaluate(RandomizedRunner.java:907)
	at com.carrotsearch.randomizedtesting.RandomizedRunner$10.evaluate(RandomizedRunner.java:921)
	at org.apache.solr.BaseDistributedSearchTestCase$ShardsRepeatRule$ShardsFixedStatement.callStatement(BaseDistributedSearchTestCase.java:992)
	at org.apache.solr.BaseDistributedSearchTestCase$ShardsRepeatRule$ShardsStatement.evaluate(BaseDistributedSearchTestCase.java:967)
	at com.carrotsearch.randomizedtesting.rules.SystemPropertiesRestoreRule$1.evaluate(SystemPropertiesRestoreRule.java:57)
	at org.apache.lucene.util.TestRuleSetupTeardownChained$1.evaluate(TestRuleSetupTeardownChained.java:49)
	at org.apache.lucene.util.AbstractBeforeAfterRule$1.evaluate(AbstractBeforeAfterRule.java:45)
	at org.apache.lucene.util.TestRuleThreadAndTestName$1.evaluate(TestRuleThreadAndTestName.java:48)
	at org.apache.lucene.util.TestRuleIgnoreAfterMaxFailures$1.evaluate(TestRuleIgnoreAfterMaxFailures.java:64)
	at org.apache.lucene.util.TestRuleMarkFailure$1.evaluate(TestRuleMarkFailure.java:47)
	at com.carrotsearch.randomizedtesting.rules.StatementAdapter.evaluate(StatementAdapter.java:36)
	at com.carrotsearch.randomizedtesting.ThreadLeakControl$StatementRunner.run(ThreadLeakControl.java:367)
	at com.carrotsearch.randomizedtesting.ThreadLeakControl.forkTimeoutingTask(ThreadLeakControl.java:809)
	at com.carrotsearch.randomizedtesting.ThreadLeakControl$3.evaluate(ThreadLeakControl.java:460)
	at com.carrotsearch.randomizedtesting.RandomizedRunner.runSingleTest(RandomizedRunner.java:880)
	at com.carrotsearch.randomizedtesting.RandomizedRunner$5.evaluate(RandomizedRunner.java:781)
	at com.carrotsearch.randomizedtesting.RandomizedRunner$6.evaluate(RandomizedRunner.java:816)
	at com.carrotsearch.randomizedtesting.RandomizedRunner$7.evaluate(RandomizedRunner.java:827)
	at com.carrotsearch.randomizedtesting.rules.StatementAdapter.evaluate(StatementAdapter.java:36)
	at com.carrotsearch.randomizedtesting.rules.SystemPropertiesRestoreRule$1.evaluate(SystemPropertiesRestoreRule.java:57)
	at org.apache.lucene.util.AbstractBeforeAfterRule$1.evaluate(AbstractBeforeAfterRule.java:45)
	at com.carrotsearch.randomizedtesting.rules.StatementAdapter.evaluate(StatementAdapter.java:36)
	at org.apache.lucene.util.TestRuleStoreClassName$1.evaluate(TestRuleStoreClassName.java:41)
	at com.carrotsearch.randomizedtesting.rules.NoShadowingOrOverridesOnMethodsRule$1.evaluate(NoShadowingOrOverridesOnMethodsRule.java:40)
	at com.carrotsearch.randomizedtesting.rules.NoShadowingOrOverridesOnMethodsRule$1.evaluate(NoShadowingOrOverridesOnMethodsRule.java:40)
	at com.carrotsearch.randomizedtesting.rules.StatementAdapter.evaluate(StatementAdapter.java:36)
	at com.carrotsearch.randomizedtesting.rules.StatementAdapter.evaluate(StatementAdapter.java:36)
	at com.carrotsearch.randomizedtesting.rules.StatementAdapter.evaluate(StatementAdapter.java:36)
	at org.apache.lucene.util.TestRuleAssertionsRequired$1.evaluate(TestRuleAssertionsRequired.java:53)
	at org.apache.lucene.util.TestRuleMarkFailure$1.evaluate(TestRuleMarkFailure.java:47)
	at org.apache.lucene.util.TestRuleIgnoreAfterMaxFailures$1.evaluate(TestRuleIgnoreAfterMaxFailures.java:64)
	at org.apache.lucene.util.TestRuleIgnoreTestSuites$1.evaluate(TestRuleIgnoreTestSuites.java:54)
	at com.carrotsearch.randomizedtesting.rules.StatementAdapter.evaluate(StatementAdapter.java:36)
	at com.carrotsearch.randomizedtesting.ThreadLeakControl$StatementRunner.run(ThreadLeakControl.java:367)
	at java.lang.Thread.run(Thread.java:745)




Build Log:
[...truncated 10731 lines...]
   [junit4] Suite: org.apache.solr.cloud.DistribDocExpirationUpdateProcessorTest
   [junit4]   2> Creating dataDir: C:\Users\jenkins\workspace\Lucene-Solr-master-Windows\solr\build\solr-core\test\J0\temp\solr.cloud.DistribDocExpirationUpdateProcessorTest_4D3DC056018109F6-001\init-core-data-001
   [junit4]   2> 217950 INFO  (SUITE-DistribDocExpirationUpdateProcessorTest-seed#[4D3DC056018109F6]-worker) [    ] o.a.s.SolrTestCaseJ4 Randomized ssl (false) and clientAuth (false)
   [junit4]   2> 217950 INFO  (SUITE-DistribDocExpirationUpdateProcessorTest-seed#[4D3DC056018109F6]-worker) [    ] o.a.s.BaseDistributedSearchTestCase Setting hostContext system property: /hb_mrp/
   [junit4]   2> 217954 INFO  (TEST-DistribDocExpirationUpdateProcessorTest.test-seed#[4D3DC056018109F6]) [    ] o.a.s.c.ZkTestServer STARTING ZK TEST SERVER
   [junit4]   2> 217954 INFO  (Thread-377) [    ] o.a.s.c.ZkTestServer client port:0.0.0.0/0.0.0.0:0
   [junit4]   2> 217954 INFO  (Thread-377) [    ] o.a.s.c.ZkTestServer Starting server
   [junit4]   2> 218055 INFO  (TEST-DistribDocExpirationUpdateProcessorTest.test-seed#[4D3DC056018109F6]) [    ] o.a.s.c.ZkTestServer start zk server on port:57774
   [junit4]   2> 218055 INFO  (TEST-DistribDocExpirationUpdateProcessorTest.test-seed#[4D3DC056018109F6]) [    ] o.a.s.c.c.SolrZkClient Using default ZkCredentialsProvider
   [junit4]   2> 218056 INFO  (TEST-DistribDocExpirationUpdateProcessorTest.test-seed#[4D3DC056018109F6]) [    ] o.a.s.c.c.ConnectionManager Waiting for client to connect to ZooKeeper
   [junit4]   2> 218064 INFO  (zkCallback-133-thread-1) [    ] o.a.s.c.c.ConnectionManager Watcher org.apache.solr.common.cloud.ConnectionManager@2536706d name:ZooKeeperConnection Watcher:127.0.0.1:57774 got event WatchedEvent state:SyncConnected type:None path:null path:null type:None
   [junit4]   2> 218064 INFO  (TEST-DistribDocExpirationUpdateProcessorTest.test-seed#[4D3DC056018109F6]) [    ] o.a.s.c.c.ConnectionManager Client is connected to ZooKeeper
   [junit4]   2> 218064 INFO  (TEST-DistribDocExpirationUpdateProcessorTest.test-seed#[4D3DC056018109F6]) [    ] o.a.s.c.c.SolrZkClient Using default ZkACLProvider
   [junit4]   2> 218064 INFO  (TEST-DistribDocExpirationUpdateProcessorTest.test-seed#[4D3DC056018109F6]) [    ] o.a.s.c.c.SolrZkClient makePath: /solr
   [junit4]   2> 218073 INFO  (TEST-DistribDocExpirationUpdateProcessorTest.test-seed#[4D3DC056018109F6]) [    ] o.a.s.c.c.SolrZkClient Using default ZkCredentialsProvider
   [junit4]   2> 218080 INFO  (TEST-DistribDocExpirationUpdateProcessorTest.test-seed#[4D3DC056018109F6]) [    ] o.a.s.c.c.ConnectionManager Waiting for client to connect to ZooKeeper
   [junit4]   2> 218084 INFO  (zkCallback-134-thread-1) [    ] o.a.s.c.c.ConnectionManager Watcher org.apache.solr.common.cloud.ConnectionManager@3f549bdf name:ZooKeeperConnection Watcher:127.0.0.1:57774/solr got event WatchedEvent state:SyncConnected type:None path:null path:null type:None
   [junit4]   2> 218084 INFO  (TEST-DistribDocExpirationUpdateProcessorTest.test-seed#[4D3DC056018109F6]) [    ] o.a.s.c.c.ConnectionManager Client is connected to ZooKeeper
   [junit4]   2> 218084 INFO  (TEST-DistribDocExpirationUpdateProcessorTest.test-seed#[4D3DC056018109F6]) [    ] o.a.s.c.c.SolrZkClient Using default ZkACLProvider
   [junit4]   2> 218084 INFO  (TEST-DistribDocExpirationUpdateProcessorTest.test-seed#[4D3DC056018109F6]) [    ] o.a.s.c.c.SolrZkClient makePath: /collections/collection1
   [junit4]   2> 218089 INFO  (TEST-DistribDocExpirationUpdateProcessorTest.test-seed#[4D3DC056018109F6]) [    ] o.a.s.c.c.SolrZkClient makePath: /collections/collection1/shards
   [junit4]   2> 218091 INFO  (TEST-DistribDocExpirationUpdateProcessorTest.test-seed#[4D3DC056018109F6]) [    ] o.a.s.c.c.SolrZkClient makePath: /collections/control_collection
   [junit4]   2> 218093 INFO  (TEST-DistribDocExpirationUpdateProcessorTest.test-seed#[4D3DC056018109F6]) [    ] o.a.s.c.c.SolrZkClient makePath: /collections/control_collection/shards
   [junit4]   2> 218096 INFO  (TEST-DistribDocExpirationUpdateProcessorTest.test-seed#[4D3DC056018109F6]) [    ] o.a.s.c.AbstractZkTestCase put C:\Users\jenkins\workspace\Lucene-Solr-master-Windows\solr\core\src\test-files\solr\collection1\conf\solrconfig-doc-expire-update-processor.xml to /configs/conf1/solrconfig.xml
   [junit4]   2> 218097 INFO  (TEST-DistribDocExpirationUpdateProcessorTest.test-seed#[4D3DC056018109F6]) [    ] o.a.s.c.c.SolrZkClient makePath: /configs/conf1/solrconfig.xml
   [junit4]   2> 218102 INFO  (TEST-DistribDocExpirationUpdateProcessorTest.test-seed#[4D3DC056018109F6]) [    ] o.a.s.c.AbstractZkTestCase put C:\Users\jenkins\workspace\Lucene-Solr-master-Windows\solr\core\src\test-files\solr\collection1\conf\schema15.xml to /configs/conf1/schema.xml
   [junit4]   2> 218102 INFO  (TEST-DistribDocExpirationUpdateProcessorTest.test-seed#[4D3DC056018109F6]) [    ] o.a.s.c.c.SolrZkClient makePath: /configs/conf1/schema.xml
   [junit4]   2> 218105 INFO  (TEST-DistribDocExpirationUpdateProcessorTest.test-seed#[4D3DC056018109F6]) [    ] o.a.s.c.AbstractZkTestCase put C:\Users\jenkins\workspace\Lucene-Solr-master-Windows\solr\core\src\test-files\solr\collection1\conf\solrconfig.snippet.randomindexconfig.xml to /configs/conf1/solrconfig.snippet.randomindexconfig.xml
   [junit4]   2> 218105 INFO  (TEST-DistribDocExpirationUpdateProcessorTest.test-seed#[4D3DC056018109F6]) [    ] o.a.s.c.c.SolrZkClient makePath: /configs/conf1/solrconfig.snippet.randomindexconfig.xml
   [junit4]   2> 218108 INFO  (TEST-DistribDocExpirationUpdateProcessorTest.test-seed#[4D3DC056018109F6]) [    ] o.a.s.c.AbstractZkTestCase put C:\Users\jenkins\workspace\Lucene-Solr-master-Windows\solr\core\src\test-files\solr\collection1\conf\stopwords.txt to /configs/conf1/stopwords.txt
   [junit4]   2> 218108 INFO  (TEST-DistribDocExpirationUpdateProcessorTest.test-seed#[4D3DC056018109F6]) [    ] o.a.s.c.c.SolrZkClient makePath: /configs/conf1/stopwords.txt
   [junit4]   2> 218111 INFO  (TEST-DistribDocExpirationUpdateProcessorTest.test-seed#[4D3DC056018109F6]) [    ] o.a.s.c.AbstractZkTestCase put C:\Users\jenkins\workspace\Lucene-Solr-master-Windows\solr\core\src\test-files\solr\collection1\conf\protwords.txt to /configs/conf1/protwords.txt
   [junit4]   2> 218112 INFO  (TEST-DistribDocExpirationUpdateProcessorTest.test-seed#[4D3DC056018109F6]) [    ] o.a.s.c.c.SolrZkClient makePath: /configs/conf1/protwords.txt
   [junit4]   2> 218115 INFO  (TEST-DistribDocExpirationUpdateProcessorTest.test-seed#[4D3DC056018109F6]) [    ] o.a.s.c.AbstractZkTestCase put C:\Users\jenkins\workspace\Lucene-Solr-master-Windows\solr\core\src\test-files\solr\collection1\conf\currency.xml to /configs/conf1/currency.xml
   [junit4]   2> 218115 INFO  (TEST-DistribDocExpirationUpdateProcessorTest.test-seed#[4D3DC056018109F6]) [    ] o.a.s.c.c.SolrZkClient makePath: /configs/conf1/currency.xml
   [junit4]   2> 218119 INFO  (TEST-DistribDocExpirationUpdateProcessorTest.test-seed#[4D3DC056018109F6]) [    ] o.a.s.c.AbstractZkTestCase put C:\Users\jenkins\workspace\Lucene-Solr-master-Windows\solr\core\src\test-files\solr\collection1\conf\enumsConfig.xml to /configs/conf1/enumsConfig.xml
   [junit4]   2> 218119 INFO  (TEST-DistribDocExpirationUpdateProcessorTest.test-seed#[4D3DC056018109F6]) [    ] o.a.s.c.c.SolrZkClient makePath: /configs/conf1/enumsConfig.xml
   [junit4]   2> 218123 INFO  (TEST-DistribDocExpirationUpdateProcessorTest.test-seed#[4D3DC056018109F6]) [    ] o.a.s.c.AbstractZkTestCase put C:\Users\jenkins\workspace\Lucene-Solr-master-Windows\solr\core\src\test-files\solr\collection1\conf\open-exchange-rates.json to /configs/conf1/open-exchange-rates.json
   [junit4]   2> 218124 INFO  (TEST-DistribDocExpirationUpdateProcessorTest.test-seed#[4D3DC056018109F6]) [    ] o.a.s.c.c.SolrZkClient makePath: /configs/conf1/open-exchange-rates.json
   [junit4]   2> 218127 INFO  (TEST-DistribDocExpirationUpdateProcessorTest.test-seed#[4D3DC056018109F6]) [    ] o.a.s.c.AbstractZkTestCase put C:\Users\jenkins\workspace\Lucene-Solr-master-Windows\solr\core\src\test-files\solr\collection1\conf\mapping-ISOLatin1Accent.txt to /configs/conf1/mapping-ISOLatin1Accent.txt
   [junit4]   2> 218128 INFO  (TEST-DistribDocExpirationUpdateProcessorTest.test-seed#[4D3DC056018109F6]) [    ] o.a.s.c.c.SolrZkClient makePath: /configs/conf1/mapping-ISOLatin1Accent.txt
   [junit4]   2> 218130 INFO  (TEST-DistribDocExpirationUpdateProcessorTest.test-seed#[4D3DC056018109F6]) [    ] o.a.s.c.AbstractZkTestCase put C:\Users\jenkins\workspace\Lucene-Solr-master-Windows\solr\core\src\test-files\solr\collection1\conf\old_synonyms.txt to /configs/conf1/old_synonyms.txt
   [junit4]   2> 218130 INFO  (TEST-DistribDocExpirationUpdateProcessorTest.test-seed#[4D3DC056018109F6]) [    ] o.a.s.c.c.SolrZkClient makePath: /configs/conf1/old_synonyms.txt
   [junit4]   2> 218132 INFO  (TEST-DistribDocExpirationUpdateProcessorTest.test-seed#[4D3DC056018109F6]) [    ] o.a.s.c.AbstractZkTestCase put C:\Users\jenkins\workspace\Lucene-Solr-master-Windows\solr\core\src\test-files\solr\collection1\conf\synonyms.txt to /configs/conf1/synonyms.txt
   [junit4]   2> 218132 INFO  (TEST-DistribDocExpirationUpdateProcessorTest.test-seed#[4D3DC056018109F6]) [    ] o.a.s.c.c.SolrZkClient makePath: /configs/conf1/synonyms.txt
   [junit4]   2> 218601 INFO  (TEST-DistribDocExpirationUpdateProcessorTest.test-seed#[4D3DC056018109F6]) [    ] o.a.s.SolrTestCaseJ4 Writing core.properties file to C:\Users\jenkins\workspace\Lucene-Solr-master-Windows\solr\build\solr-core\test\J0\temp\solr.cloud.DistribDocExpirationUpdateProcessorTest_4D3DC056018109F6-001\control-001\cores\collection1
   [junit4]   2> 218605 INFO  (TEST-DistribDocExpirationUpdateProcessorTest.test-seed#[4D3DC056018109F6]) [    ] o.e.j.s.Server jetty-9.3.8.v20160314
   [junit4]   2> 218606 INFO  (TEST-DistribDocExpirationUpdateProcessorTest.test-seed#[4D3DC056018109F6]) [    ] o.e.j.s.h.ContextHandler Started o.e.j.s.ServletContextHandler@28c8b080{/hb_mrp,null,AVAILABLE}
   [junit4]   2> 218608 INFO  (TEST-DistribDocExpirationUpdateProcessorTest.test-seed#[4D3DC056018109F6]) [    ] o.e.j.s.ServerConnector Started ServerConnector@44004d1f{HTTP/1.1,[http/1.1]}{127.0.0.1:57781}
   [junit4]   2> 218608 INFO  (TEST-DistribDocExpirationUpdateProcessorTest.test-seed#[4D3DC056018109F6]) [    ] o.e.j.s.Server Started @223190ms
   [junit4]   2> 218608 INFO  (TEST-DistribDocExpirationUpdateProcessorTest.test-seed#[4D3DC056018109F6]) [    ] o.a.s.c.s.e.JettySolrRunner Jetty properties: {solr.data.dir=C:\Users\jenkins\workspace\Lucene-Solr-master-Windows\solr\build\solr-core\test\J0\temp\solr.cloud.DistribDocExpirationUpdateProcessorTest_4D3DC056018109F6-001\tempDir-001/control/data, hostContext=/hb_mrp, hostPort=57781, coreRootDirectory=C:\Users\jenkins\workspace\Lucene-Solr-master-Windows\solr\build\solr-core\test\J0\temp\solr.cloud.DistribDocExpirationUpdateProcessorTest_4D3DC056018109F6-001\control-001\cores}
   [junit4]   2> 218609 INFO  (TEST-DistribDocExpirationUpdateProcessorTest.test-seed#[4D3DC056018109F6]) [    ] o.a.s.s.SolrDispatchFilter SolrDispatchFilter.init(): sun.misc.Launcher$AppClassLoader@73d16e93
   [junit4]   2> 218610 INFO  (TEST-DistribDocExpirationUpdateProcessorTest.test-seed#[4D3DC056018109F6]) [    ] o.a.s.c.SolrResourceLoader new SolrResourceLoader for directory: 'C:\Users\jenkins\workspace\Lucene-Solr-master-Windows\solr\build\solr-core\test\J0\temp\solr.cloud.DistribDocExpirationUpdateProcessorTest_4D3DC056018109F6-001\control-001'
   [junit4]   2> 218610 INFO  (TEST-DistribDocExpirationUpdateProcessorTest.test-seed#[4D3DC056018109F6]) [    ] o.a.s.c.SolrResourceLoader JNDI not configured for solr (NoInitialContextEx)
   [junit4]   2> 218610 INFO  (TEST-DistribDocExpirationUpdateProcessorTest.test-seed#[4D3DC056018109F6]) [    ] o.a.s.c.SolrResourceLoader solr home defaulted to 'solr/' (could not find system property or JNDI)
   [junit4]   2> 218611 INFO  (TEST-DistribDocExpirationUpdateProcessorTest.test-seed#[4D3DC056018109F6]) [    ] o.a.s.c.c.SolrZkClient Using default ZkCredentialsProvider
   [junit4]   2> 218611 INFO  (TEST-DistribDocExpirationUpdateProcessorTest.test-seed#[4D3DC056018109F6]) [    ] o.a.s.c.c.ConnectionManager Waiting for client to connect to ZooKeeper
   [junit4]   2> 218624 INFO  (zkCallback-135-thread-1) [    ] o.a.s.c.c.ConnectionManager Watcher org.apache.solr.common.cloud.ConnectionManager@55e5354 name:ZooKeeperConnection Watcher:127.0.0.1:57774/solr got event WatchedEvent state:SyncConnected type:None path:null path:null type:None
   [junit4]   2> 218625 INFO  (TEST-DistribDocExpirationUpdateProcessorTest.test-seed#[4D3DC056018109F6]) [    ] o.a.s.c.c.ConnectionManager Client is connected to ZooKeeper
   [junit4]   2> 218625 INFO  (TEST-DistribDocExpirationUpdateProcessorTest.test-seed#[4D3DC056018109F6]) [    ] o.a.s.c.c.SolrZkClient Using default ZkACLProvider
   [junit4]   2> 218630 INFO  (TEST-DistribDocExpirationUpdateProcessorTest.test-seed#[4D3DC056018109F6]) [    ] o.a.s.s.SolrDispatchFilter Loading solr.xml from SolrHome (not found in ZooKeeper)
   [junit4]   2> 218630 INFO  (TEST-DistribDocExpirationUpdateProcessorTest.test-seed#[4D3DC056018109F6]) [    ] o.a.s.c.SolrXmlConfig Loading container configuration from C:\Users\jenkins\workspace\Lucene-Solr-master-Windows\solr\build\solr-core\test\J0\temp\solr.cloud.DistribDocExpirationUpdateProcessorTest_4D3DC056018109F6-001\control-001\solr.xml
   [junit4]   2> 218643 INFO  (TEST-DistribDocExpirationUpdateProcessorTest.test-seed#[4D3DC056018109F6]) [    ] o.a.s.c.CorePropertiesLocator Config-defined core root directory: C:\Users\jenkins\workspace\Lucene-Solr-master-Windows\solr\build\solr-core\test\J0\temp\solr.cloud.DistribDocExpirationUpdateProcessorTest_4D3DC056018109F6-001\control-001\cores
   [junit4]   2> 218643 INFO  (TEST-DistribDocExpirationUpdateProcessorTest.test-seed#[4D3DC056018109F6]) [    ] o.a.s.c.CoreContainer New CoreContainer 1162682118
   [junit4]   2> 218643 INFO  (TEST-DistribDocExpirationUpdateProcessorTest.test-seed#[4D3DC056018109F6]) [    ] o.a.s.c.CoreContainer Loading cores into CoreContainer [instanceDir=C:\Users\jenkins\workspace\Lucene-Solr-master-Windows\solr\build\solr-core\test\J0\temp\solr.cloud.DistribDocExpirationUpdateProcessorTest_4D3DC056018109F6-001\control-001]
   [junit4]   2> 218644 WARN  (TEST-DistribDocExpirationUpdateProcessorTest.test-seed#[4D3DC056018109F6]) [    ] o.a.s.c.CoreContainer Couldn't add files from C:\Users\jenkins\workspace\Lucene-Solr-master-Windows\solr\build\solr-core\test\J0\temp\solr.cloud.DistribDocExpirationUpdateProcessorTest_4D3DC056018109F6-001\control-001\lib to classpath: C:\Users\jenkins\workspace\Lucene-Solr-master-Windows\solr\build\solr-core\test\J0\temp\solr.cloud.DistribDocExpirationUpdateProcessorTest_4D3DC056018109F6-001\control-001\lib
   [junit4]   2> 218645 INFO  (TEST-DistribDocExpirationUpdateProcessorTest.test-seed#[4D3DC056018109F6]) [    ] o.a.s.h.c.HttpShardHandlerFactory created with socketTimeout : 90000,urlScheme : ,connTimeout : 15000,maxConnectionsPerHost : 20,maxConnections : 10000,corePoolSize : 0,maximumPoolSize : 2147483647,maxThreadIdleTime : 5,sizeOfQueue : -1,fairnessPolicy : false,useRetries : false,
   [junit4]   2> 218649 INFO  (TEST-DistribDocExpirationUpdateProcessorTest.test-seed#[4D3DC056018109F6]) [    ] o.a.s.u.UpdateShardHandler Creating UpdateShardHandler HTTP client with params: socketTimeout=340000&connTimeout=45000&retry=true
   [junit4]   2> 218650 INFO  (TEST-DistribDocExpirationUpdateProcessorTest.test-seed#[4D3DC056018109F6]) [    ] o.a.s.l.LogWatcher SLF4J impl is org.slf4j.impl.Log4jLoggerFactory
   [junit4]   2> 218650 INFO  (TEST-DistribDocExpirationUpdateProcessorTest.test-seed#[4D3DC056018109F6]) [    ] o.a.s.l.LogWatcher Registering Log Listener [Log4j (org.slf4j.impl.Log4jLoggerFactory)]
   [junit4]   2> 218650 INFO  (TEST-DistribDocExpirationUpdateProcessorTest.test-seed#[4D3DC056018109F6]) [    ] o.a.s.c.ZkContainer Zookeeper client=127.0.0.1:57774/solr
   [junit4]   2> 218650 INFO  (TEST-DistribDocExpirationUpdateProcessorTest.test-seed#[4D3DC056018109F6]) [    ] o.a.s.c.ZkController zkHost includes chroot
   [junit4]   2> 218650 INFO  (TEST-DistribDocExpirationUpdateProcessorTest.test-seed#[4D3DC056018109F6]) [    ] o.a.s.c.c.SolrZkClient Using default ZkCredentialsProvider
   [junit4]   2> 218651 INFO  (TEST-DistribDocExpirationUpdateProcessorTest.test-seed#[4D3DC056018109F6]) [    ] o.a.s.c.c.ConnectionManager Waiting for client to connect to ZooKeeper
   [junit4]   2> 218654 INFO  (zkCallback-138-thread-1) [    ] o.a.s.c.c.ConnectionManager Watcher org.apache.solr.common.cloud.ConnectionManager@32dca45 name:ZooKeeperConnection Watcher:127.0.0.1:57774 got event WatchedEvent state:SyncConnected type:None path:null path:null type:None
   [junit4]   2> 218655 INFO  (TEST-DistribDocExpirationUpdateProcessorTest.test-seed#[4D3DC056018109F6]) [    ] o.a.s.c.c.ConnectionManager Client is connected to ZooKeeper
   [junit4]   2> 218655 INFO  (TEST-DistribDocExpirationUpdateProcessorTest.test-seed#[4D3DC056018109F6]) [    ] o.a.s.c.c.SolrZkClient Using default ZkACLProvider
   [junit4]   2> 218661 INFO  (TEST-DistribDocExpirationUpdateProcessorTest.test-seed#[4D3DC056018109F6]) [n:127.0.0.1:57781_hb_mrp    ] o.a.s.c.c.ConnectionManager Waiting for client to connect to ZooKeeper
   [junit4]   2> 218664 INFO  (zkCallback-139-thread-1-processing-n:127.0.0.1:57781_hb_mrp) [n:127.0.0.1:57781_hb_mrp    ] o.a.s.c.c.ConnectionManager Watcher org.apache.solr.common.cloud.ConnectionManager@57cc3d94 name:ZooKeeperConnection Watcher:127.0.0.1:57774/solr got event WatchedEvent state:SyncConnected type:None path:null path:null type:None
   [junit4]   2> 218664 INFO  (TEST-DistribDocExpirationUpdateProcessorTest.test-seed#[4D3DC056018109F6]) [n:127.0.0.1:57781_hb_mrp    ] o.a.s.c.c.ConnectionManager Client is connected to ZooKeeper
   [junit4]   2> 218666 INFO  (TEST-DistribDocExpirationUpdateProcessorTest.test-seed#[4D3DC056018109F6]) [n:127.0.0.1:57781_hb_mrp    ] o.a.s.c.c.SolrZkClient makePath: /overseer/queue
   [junit4]   2> 218668 INFO  (TEST-DistribDocExpirationUpdateProcessorTest.test-seed#[4D3DC056018109F6]) [n:127.0.0.1:57781_hb_mrp    ] o.a.s.c.c.SolrZkClient makePath: /overseer/collection-queue-work
   [junit4]   2> 218673 INFO  (TEST-DistribDocExpirationUpdateProcessorTest.test-seed#[4D3DC056018109F6]) [n:127.0.0.1:57781_hb_mrp    ] o.a.s.c.c.SolrZkClient makePath: /overseer/collection-map-running
   [junit4]   2> 218677 INFO  (TEST-DistribDocExpirationUpdateProcessorTest.test-seed#[4D3DC056018109F6]) [n:127.0.0.1:57781_hb_mrp    ] o.a.s.c.c.SolrZkClient makePath: /overseer/collection-map-completed
   [junit4]   2> 218678 INFO  (TEST-DistribDocExpirationUpdateProcessorTest.test-seed#[4D3DC056018109F6]) [n:127.0.0.1:57781_hb_mrp    ] o.a.s.c.c.SolrZkClient makePath: /overseer/collection-map-failure
   [junit4]   2> 218681 INFO  (TEST-DistribDocExpirationUpdateProcessorTest.test-seed#[4D3DC056018109F6]) [n:127.0.0.1:57781_hb_mrp    ] o.a.s.c.c.SolrZkClient makePath: /live_nodes
   [junit4]   2> 218683 INFO  (TEST-DistribDocExpirationUpdateProcessorTest.test-seed#[4D3DC056018109F6]) [n:127.0.0.1:57781_hb_mrp    ] o.a.s.c.c.SolrZkClient makePath: /aliases.json
   [junit4]   2> 218685 INFO  (TEST-DistribDocExpirationUpdateProcessorTest.test-seed#[4D3DC056018109F6]) [n:127.0.0.1:57781_hb_mrp    ] o.a.s.c.c.SolrZkClient makePath: /clusterstate.json
   [junit4]   2> 218686 INFO  (TEST-DistribDocExpirationUpdateProcessorTest.test-seed#[4D3DC056018109F6]) [n:127.0.0.1:57781_hb_mrp    ] o.a.s.c.c.SolrZkClient makePath: /security.json
   [junit4]   2> 218688 INFO  (TEST-DistribDocExpirationUpdateProcessorTest.test-seed#[4D3DC056018109F6]) [n:127.0.0.1:57781_hb_mrp    ] o.a.s.c.c.ZkStateReader Updating cluster state from ZooKeeper... 
   [junit4]   2> 218690 INFO  (TEST-DistribDocExpirationUpdateProcessorTest.test-seed#[4D3DC056018109F6]) [n:127.0.0.1:57781_hb_mrp    ] o.a.s.c.c.ZkStateReader Updated live nodes from ZooKeeper... (0) -> (0)
   [junit4]   2> 218692 INFO  (TEST-DistribDocExpirationUpdateProcessorTest.test-seed#[4D3DC056018109F6]) [n:127.0.0.1:57781_hb_mrp    ] o.a.s.c.c.SolrZkClient makePath: /overseer_elect
   [junit4]   2> 218694 INFO  (TEST-DistribDocExpirationUpdateProcessorTest.test-seed#[4D3DC056018109F6]) [n:127.0.0.1:57781_hb_mrp    ] o.a.s.c.c.SolrZkClient makePath: /overseer_elect/election
   [junit4]   2> 218695 INFO  (TEST-DistribDocExpirationUpdateProcessorTest.test-seed#[4D3DC056018109F6]) [n:127.0.0.1:57781_hb_mrp    ] o.a.s.c.Overseer Overseer (id=null) closing
   [junit4]   2> 218696 INFO  (TEST-DistribDocExpirationUpdateProcessorTest.test-seed#[4D3DC056018109F6]) [n:127.0.0.1:57781_hb_mrp    ] o.a.s.c.LeaderElector Joined leadership election with path: /overseer_elect/election/95649657099845636-127.0.0.1:57781_hb_mrp-n_0000000000
   [junit4]   2> 218696 INFO  (TEST-DistribDocExpirationUpdateProcessorTest.test-seed#[4D3DC056018109F6]) [n:127.0.0.1:57781_hb_mrp    ] o.a.s.c.OverseerElectionContext I am going to be the leader 127.0.0.1:57781_hb_mrp
   [junit4]   2> 218696 INFO  (TEST-DistribDocExpirationUpdateProcessorTest.test-seed#[4D3DC056018109F6]) [n:127.0.0.1:57781_hb_mrp    ] o.a.s.c.c.SolrZkClient makePath: /overseer_elect/leader
   [junit4]   2> 218698 INFO  (TEST-DistribDocExpirationUpdateProcessorTest.test-seed#[4D3DC056018109F6]) [n:127.0.0.1:57781_hb_mrp    ] o.a.s.c.Overseer Overseer (id=95649657099845636-127.0.0.1:57781_hb_mrp-n_0000000000) starting
   [junit4]   2> 218701 INFO  (TEST-DistribDocExpirationUpdateProcessorTest.test-seed#[4D3DC056018109F6]) [n:127.0.0.1:57781_hb_mrp    ] o.a.s.c.c.SolrZkClient makePath: /overseer/queue-work
   [junit4]   2> 218708 INFO  (TEST-DistribDocExpirationUpdateProcessorTest.test-seed#[4D3DC056018109F6]) [n:127.0.0.1:57781_hb_mrp    ] o.a.s.c.OverseerAutoReplicaFailoverThread Starting OverseerAutoReplicaFailoverThread autoReplicaFailoverWorkLoopDelay=10000 autoReplicaFailoverWaitAfterExpiration=30000 autoReplicaFailoverBadNodeExpiration=60000
   [junit4]   2> 218709 INFO  (OverseerCollectionConfigSetProcessor-95649657099845636-127.0.0.1:57781_hb_mrp-n_0000000000) [n:127.0.0.1:57781_hb_mrp    ] o.a.s.c.OverseerTaskProcessor Process current queue of overseer operations
   [junit4]   2> 218709 INFO  (TEST-DistribDocExpirationUpdateProcessorTest.test-seed#[4D3DC056018109F6]) [n:127.0.0.1:57781_hb_mrp    ] o.a.s.c.ZkController Register node as live in ZooKeeper:/live_nodes/127.0.0.1:57781_hb_mrp
   [junit4]   2> 218709 INFO  (OverseerStateUpdate-95649657099845636-127.0.0.1:57781_hb_mrp-n_0000000000) [n:127.0.0.1:57781_hb_mrp    ] o.a.s.c.Overseer Starting to work on the main queue
   [junit4]   2> 218709 INFO  (TEST-DistribDocExpirationUpdateProcessorTest.test-seed#[4D3DC056018109F6]) [n:127.0.0.1:57781_hb_mrp    ] o.a.s.c.c.SolrZkClient makePath: /live_nodes/127.0.0.1:57781_hb_mrp
   [junit4]   2> 218713 INFO  (zkCallback-139-thread-1-processing-n:127.0.0.1:57781_hb_mrp) [n:127.0.0.1:57781_hb_mrp    ] o.a.s.c.c.ZkStateReader A live node change: [WatchedEvent state:SyncConnected type:NodeChildrenChanged path:/live_nodes], has occurred - updating... (live nodes size: [0])
   [junit4]   2> 218713 INFO  (OverseerStateUpdate-95649657099845636-127.0.0.1:57781_hb_mrp-n_0000000000) [n:127.0.0.1:57781_hb_mrp    ] o.a.s.c.c.ZkStateReader Updated live nodes from ZooKeeper... (0) -> (1)
   [junit4]   2> 218714 INFO  (zkCallback-139-thread-1-processing-n:127.0.0.1:57781_hb_mrp) [n:127.0.0.1:57781_hb_mrp    ] o.a.s.c.c.ZkStateReader Updated live nodes from ZooKeeper... (1) -> (1)
   [junit4]   2> 218722 INFO  (TEST-DistribDocExpirationUpdateProcessorTest.test-seed#[4D3DC056018109F6]) [n:127.0.0.1:57781_hb_mrp    ] o.a.s.c.CoreContainer Security conf doesn't exist. Skipping setup for authorization module.
   [junit4]   2> 218722 INFO  (TEST-DistribDocExpirationUpdateProcessorTest.test-seed#[4D3DC056018109F6]) [n:127.0.0.1:57781_hb_mrp    ] o.a.s.c.CoreContainer No authentication plugin used.
   [junit4]   2> 218724 INFO  (TEST-DistribDocExpirationUpdateProcessorTest.test-seed#[4D3DC056018109F6]) [n:127.0.0.1:57781_hb_mrp    ] o.a.s.c.CorePropertiesLocator Looking for core definitions underneath C:\Users\jenkins\workspace\Lucene-Solr-master-Windows\solr\build\solr-core\test\J0\temp\solr.cloud.DistribDocExpirationUpdateProcessorTest_4D3DC056018109F6-001\control-001\cores
   [junit4]   2> 218725 INFO  (TEST-DistribDocExpirationUpdateProcessorTest.test-seed#[4D3DC056018109F6]) [n:127.0.0.1:57781_hb_mrp    ] o.a.s.c.CoreDescriptor Created CoreDescriptor: {name=collection1, config=solrconfig.xml, transient=false, schema=schema.xml, loadOnStartup=true, configSetProperties=configsetprops.json, collection=control_collection, coreNodeName=, dataDir=data\, shard=}
   [junit4]   2> 218725 INFO  (TEST-DistribDocExpirationUpdateProcessorTest.test-seed#[4D3DC056018109F6]) [n:127.0.0.1:57781_hb_mrp    ] o.a.s.c.CorePropertiesLocator Found core collection1 in C:\Users\jenkins\workspace\Lucene-Solr-master-Windows\solr\build\solr-core\test\J0\temp\solr.cloud.DistribDocExpirationUpdateProcessorTest_4D3DC056018109F6-001\control-001\cores\collection1
   [junit4]   2> 218725 INFO  (TEST-DistribDocExpirationUpdateProcessorTest.test-seed#[4D3DC056018109F6]) [n:127.0.0.1:57781_hb_mrp    ] o.a.s.c.CorePropertiesLocator Found 1 core definitions
   [junit4]   2> 218726 INFO  (TEST-DistribDocExpirationUpdateProcessorTest.test-seed#[4D3DC056018109F6]) [n:127.0.0.1:57781_hb_mrp    ] o.a.s.s.SolrDispatchFilter user.dir=C:\Users\jenkins\workspace\Lucene-Solr-master-Windows\solr\build\solr-core\test\J0
   [junit4]   2> 218726 INFO  (TEST-DistribDocExpirationUpdateProcessorTest.test-seed#[4D3DC056018109F6]) [n:127.0.0.1:57781_hb_mrp    ] o.a.s.s.SolrDispatchFilter SolrDispatchFilter.init() done
   [junit4]   2> 218728 INFO  (coreLoadExecutor-521-thread-1-processing-n:127.0.0.1:57781_hb_mrp) [n:127.0.0.1:57781_hb_mrp c:control_collection   x:collection1] o.a.s.c.ZkController publishing state=down
   [junit4]   2> 218728 INFO  (coreLoadExecutor-521-thread-1-processing-n:127.0.0.1:57781_hb_mrp) [n:127.0.0.1:57781_hb_mrp c:control_collection   x:collection1] o.a.s.c.ZkController numShards not found on descriptor - reading it from system property
   [junit4]   2> 218732 INFO  (OverseerStateUpdate-95649657099845636-127.0.0.1:57781_hb_mrp-n_0000000000) [n:127.0.0.1:57781_hb_mrp    ] o.a.s.c.Overseer processMessage: queueSize: 1, message = {
   [junit4]   2>   "core":"collection1",
   [junit4]   2>   "roles":null,
   [junit4]   2>   "base_url":"http://127.0.0.1:57781/hb_mrp",
   [junit4]   2>   "node_name":"127.0.0.1:57781_hb_mrp",
   [junit4]   2>   "numShards":"1",
   [junit4]   2>   "state":"down",
   [junit4]   2>   "shard":null,
   [junit4]   2>   "collection":"control_collection",
   [junit4]   2>   "operation":"state"} current state version: 0
   [junit4]   2> 218732 INFO  (coreLoadExecutor-521-thread-1-processing-n:127.0.0.1:57781_hb_mrp) [n:127.0.0.1:57781_hb_mrp c:control_collection   x:collection1] o.a.s.c.ZkController look for our core node name
   [junit4]   2> 218733 INFO  (OverseerStateUpdate-95649657099845636-127.0.0.1:57781_hb_mrp-n_0000000000) [n:127.0.0.1:57781_hb_mrp    ] o.a.s.c.o.ReplicaMutator Update state numShards=1 message={
   [junit4]   2>   "core":"collection1",
   [junit4]   2>   "roles":null,
   [junit4]   2>   "base_url":"http://127.0.0.1:57781/hb_mrp",
   [junit4]   2>   "node_name":"127.0.0.1:57781_hb_mrp",
   [junit4]   2>   "numShards":"1",
   [junit4]   2>   "state":"down",
   [junit4]   2>   "shard":null,
   [junit4]   2>   "collection":"control_collection",
   [junit4]   2>   "operation":"state"}
   [junit4]   2> 218733 INFO  (OverseerStateUpdate-95649657099845636-127.0.0.1:57781_hb_mrp-n_0000000000) [n:127.0.0.1:57781_hb_mrp    ] o.a.s.c.o.ClusterStateMutator building a new cName: control_collection
   [junit4]   2> 218734 INFO  (OverseerStateUpdate-95649657099845636-127.0.0.1:57781_hb_mrp-n_0000000000) [n:127.0.0.1:57781_hb_mrp    ] o.a.s.c.o.ReplicaMutator Assigning new node to shard shard=shard1
   [junit4]   2> 218736 INFO  (zkCallback-139-thread-1-processing-n:127.0.0.1:57781_hb_mrp) [n:127.0.0.1:57781_hb_mrp    ] o.a.s.c.c.ZkStateReader A cluster state change: [WatchedEvent state:SyncConnected type:NodeDataChanged path:/clusterstate.json], has occurred - updating... (live nodes size: [1])
   [junit4]   2> 219733 INFO  (coreLoadExecutor-521-thread-1-processing-n:127.0.0.1:57781_hb_mrp) [n:127.0.0.1:57781_hb_mrp c:control_collection   x:collection1] o.a.s.c.ZkController waiting to find shard id in clusterstate for collection1
   [junit4]   2> 219733 INFO  (coreLoadExecutor-521-thread-1-processing-n:127.0.0.1:57781_hb_mrp) [n:127.0.0.1:57781_hb_mrp c:control_collection   x:collection1] o.a.s.c.ZkController Check for collection zkNode:control_collection
   [junit4]   2> 219733 INFO  (coreLoadExecutor-521-thread-1-processing-n:127.0.0.1:57781_hb_mrp) [n:127.0.0.1:57781_hb_mrp c:control_collection   x:collection1] o.a.s.c.ZkController Collection zkNode exists
   [junit4]   2> 219734 INFO  (coreLoadExecutor-521-thread-1-processing-n:127.0.0.1:57781_hb_mrp) [n:127.0.0.1:57781_hb_mrp c:control_collection   x:collection1] o.a.s.c.c.ZkStateReader Load collection config from: [/collections/control_collection]
   [junit4]   2> 219735 INFO  (coreLoadExecutor-521-thread-1-processing-n:127.0.0.1:57781_hb_mrp) [n:127.0.0.1:57781_hb_mrp c:control_collection   x:collection1] o.a.s.c.c.ZkStateReader path=[/collections/control_collection] [configName]=[conf1] specified config exists in ZooKeeper
   [junit4]   2> 219735 INFO  (coreLoadExecutor-521-thread-1-processing-n:127.0.0.1:57781_hb_mrp) [n:127.0.0.1:57781_hb_mrp c:control_collection   x:collection1] o.a.s.c.SolrResourceLoader new SolrResourceLoader for directory: 'C:\Users\jenkins\workspace\Lucene-Solr-master-Windows\solr\build\solr-core\test\J0\temp\solr.cloud.DistribDocExpirationUpdateProcessorTest_4D3DC056018109F6-001\control-001\cores\collection1'
   [junit4]   2> 219735 INFO  (coreLoadExecutor-521-thread-1-processing-n:127.0.0.1:57781_hb_mrp) [n:127.0.0.1:57781_hb_mrp c:control_collection   x:collection1] o.a.s.c.SolrResourceLoader JNDI not configured for solr (NoInitialContextEx)
   [junit4]   2> 219735 INFO  (coreLoadExecutor-521-thread-1-processing-n:127.0.0.1:57781_hb_mrp) [n:127.0.0.1:57781_hb_mrp c:control_collection   x:collection1] o.a.s.c.SolrResourceLoader solr home defaulted to 'solr/' (could not find system property or JNDI)
   [junit4]   2> 219741 INFO  (coreLoadExecutor-521-thread-1-processing-n:127.0.0.1:57781_hb_mrp) [n:127.0.0.1:57781_hb_mrp c:control_collection   x:collection1] o.a.s.c.Config loaded config solrconfig.xml with version 0 
   [junit4]   2> 219760 INFO  (coreLoadExecutor-521-thread-1-processing-n:127.0.0.1:57781_hb_mrp) [n:127.0.0.1:57781_hb_mrp c:control_collection   x:collection1] o.a.s.c.SolrConfig current version of requestparams : -1
   [junit4]   2> 219763 WARN  (coreLoadExecutor-521-thread-1-processing-n:127.0.0.1:57781_hb_mrp) [n:127.0.0.1:57781_hb_mrp c:control_collection   x:collection1] o.a.s.c.Config Beginning with Solr 5.5, <mergePolicy> is deprecated, use <mergePolicyFactory> instead.
   [junit4]   2> 219764 INFO  (coreLoadExecutor-521-thread-1-processing-n:127.0.0.1:57781_hb_mrp) [n:127.0.0.1:57781_hb_mrp c:control_collection   x:collection1] o.a.s.c.SolrConfig Using Lucene MatchVersion: 7.0.0
   [junit4]   2> 219771 INFO  (coreLoadExecutor-521-thread-1-processing-n:127.0.0.1:57781_hb_mrp) [n:127.0.0.1:57781_hb_mrp c:control_collection   x:collection1] o.a.s.c.SolrConfig Loaded SolrConfig: solrconfig.xml
   [junit4]   2> 219782 INFO  (coreLoadExecutor-521-thread-1-processing-n:127.0.0.1:57781_hb_mrp) [n:127.0.0.1:57781_hb_mrp c:control_collection   x:collection1] o.a.s.s.IndexSchema [collection1] Schema name=test
   [junit4]   2> 219858 INFO  (coreLoadExecutor-521-thread-1-processing-n:127.0.0.1:57781_hb_mrp) [n:127.0.0.1:57781_hb_mrp c:control_collection   x:collection1] o.a.s.s.IndexSchema default search field in schema is text
   [junit4]   2> 219859 INFO  (coreLoadExecutor-521-thread-1-processing-n:127.0.0.1:57781_hb_mrp) [n:127.0.0.1:57781_hb_mrp c:control_collection   x:collection1] o.a.s.s.IndexSchema unique key field: id
   [junit4]   2> 219859 INFO  (coreLoadExecutor-521-thread-1-processing-n:127.0.0.1:57781_hb_mrp) [n:127.0.0.1:57781_hb_mrp c:control_collection   x:collection1] o.a.s.s.FileExchangeRateProvider Reloading exchange rates from file currency.xml
   [junit4]   2> 219863 INFO  (coreLoadExecutor-521-thread-1-processing-n:127.0.0.1:57781_hb_mrp) [n:127.0.0.1:57781_hb_mrp c:control_collection   x:collection1] o.a.s.s.FileExchangeRateProvider Reloading exchange rates from file currency.xml
   [junit4]   2> 219893 INFO  (coreLoadExecutor-521-thread-1-processing-n:127.0.0.1:57781_hb_mrp) [n:127.0.0.1:57781_hb_mrp c:control_collection   x:collection1] o.a.s.c.ConfigSetProperties Did not find ConfigSet properties, assuming default properties: Can't find resource 'configsetprops.json' in classpath or '/configs/conf1', cwd=C:\Users\jenkins\workspace\Lucene-Solr-master-Windows\solr\build\solr-core\test\J0
   [junit4]   2> 219893 INFO  (coreLoadExecutor-521-thread-1-processing-n:127.0.0.1:57781_hb_mrp) [n:127.0.0.1:57781_hb_mrp c:control_collection   x:collection1] o.a.s.c.CoreContainer Creating SolrCore 'collection1' using configuration from collection control_collection
   [junit4]   2> 219893 INFO  (coreLoadExecutor-521-thread-1-processing-n:127.0.0.1:57781_hb_mrp) [n:127.0.0.1:57781_hb_mrp c:control_collection s:shard1 r:core_node1 x:collection1] o.a.s.c.SolrCore org.apache.solr.core.MockDirectoryFactory
   [junit4]   2> 219893 INFO  (coreLoadExecutor-521-thread-1-processing-n:127.0.0.1:57781_hb_mrp) [n:127.0.0.1:57781_hb_mrp c:control_collection s:shard1 r:core_node1 x:collection1] o.a.s.c.SolrCore [[collection1] ] Opening new SolrCore at [C:\Users\jenkins\workspace\Lucene-Solr-master-Windows\solr\build\solr-core\test\J0\temp\solr.cloud.DistribDocExpirationUpdateProcessorTest_4D3DC056018109F6-001\control-001\cores\collection1], dataDir=[C:\Users\jenkins\workspace\Lucene-Solr-master-Windows\solr\build\solr-core\test\J0\temp\solr.cloud.DistribDocExpirationUpdateProcessorTest_4D3DC056018109F6-001\control-001\cores\collection1\data\]
   [junit4]   2> 219893 INFO  (coreLoadExecutor-521-thread-1-processing-n:127.0.0.1:57781_hb_mrp) [n:127.0.0.1:57781_hb_mrp c:control_collection s:shard1 r:core_node1 x:collection1] o.a.s.c.SolrCore JMX monitoring not detected for core: collection1
   [junit4]   2> 219893 INFO  (coreLoadExecutor-521-thread-1-processing-n:127.0.0.1:57781_hb_mrp) [n:127.0.0.1:57781_hb_mrp c:control_collection s:shard1 r:core_node1 x:collection1] o.a.s.c.CachingDirectoryFactory return new directory for C:\Users\jenkins\workspace\Lucene-Solr-master-Windows\solr\build\solr-core\test\J0\temp\solr.cloud.DistribDocExpirationUpdateProcessorTest_4D3DC056018109F6-001\control-001\cores\collection1\data\
   [junit4]   2> 219894 INFO  (coreLoadExecutor-521-thread-1-processing-n:127.0.0.1:57781_hb_mrp) [n:127.0.0.1:57781_hb_mrp c:control_collection s:shard1 r:core_node1 x:collection1] o.a.s.c.SolrCore New index directory detected: old=null new=C:\Users\jenkins\workspace\Lucene-Solr-master-Windows\solr\build\solr-core\test\J0\temp\solr.cloud.DistribDocExpirationUpdateProcessorTest_4D3DC056018109F6-001\control-001\cores\collection1\data\index/
   [junit4]   2> 219894 WARN  (coreLoadExecutor-521-thread-1-processing-n:127.0.0.1:57781_hb_mrp) [n:127.0.0.1:57781_hb_mrp c:control_collection s:shard1 r:core_node1 x:collection1] o.a.s.c.SolrCore [collection1] Solr index directory 'C:\Users\jenkins\workspace\Lucene-Solr-master-Windows\solr\build\solr-core\test\J0\temp\solr.cloud.DistribDocExpirationUpdateProcessorTest_4D3DC056018109F6-001\control-001\cores\collection1\data\index' doesn't exist. Creating new index...
   [junit4]   2> 219894 INFO  (coreLoadExecutor-521-thread-1-processing-n:127.0.0.1:57781_hb_mrp) [n:127.0.0.1:57781_hb_mrp c:control_collection s:shard1 r:core_node1 x:collection1] o.a.s.c.CachingDirectoryFactory return new directory for C:\Users\jenkins\workspace\Lucene-Solr-master-Windows\solr\build\solr-core\test\J0\temp\solr.cloud.DistribDocExpirationUpdateProcessorTest_4D3DC056018109F6-001\control-001\cores\collection1\data\index
   [junit4]   2> 219894 INFO  (coreLoadExecutor-521-thread-1-processing-n:127.0.0.1:57781_hb_mrp) [n:127.0.0.1:57781_hb_mrp c:control_collection s:shard1 r:core_node1 x:collection1] o.a.s.u.RandomMergePolicy RandomMergePolicy wrapping class org.apache.lucene.index.TieredMergePolicy: [TieredMergePolicy: maxMergeAtOnce=20, maxMergeAtOnceExplicit=17, maxMergedSegmentMB=14.107421875, floorSegmentMB=1.1796875, forceMergeDeletesPctAllowed=20.818300506369734, segmentsPerTier=31.0, maxCFSSegmentSizeMB=8.796093022207999E12, noCFSRatio=0.0
   [junit4]   2> 219895 INFO  (coreLoadExecutor-521-thread-1-processing-n:127.0.0.1:57781_hb_mrp) [n:127.0.0.1:57781_hb_mrp c:control_collection s:shard1 r:core_node1 x:collection1] o.a.s.c.SolrDeletionPolicy SolrDeletionPolicy.onCommit: commits: num=1
   [junit4]   2> 	commit{dir=MockDirectoryWrapper(RAMDirectory@70b4a859 lockFactory=org.apache.lucene.store.SingleInstanceLockFactory@2ff123c0),segFN=segments_1,generation=1}
   [junit4]   2> 219895 INFO  (coreLoadExecutor-521-thread-1-processing-n:127.0.0.1:57781_hb_mrp) [n:127.0.0.1:57781_hb_mrp c:control_collection s:shard1 r:core_node1 x:collection1] o.a.s.c.SolrDeletionPolicy newest commit generation = 1
   [junit4]   2> 219896 INFO  (OldIndexDirectoryCleanupThreadForCore-collection1) [n:127.0.0.1:57781_hb_mrp c:control_collection s:shard1 r:core_node1 x:collection1] o.a.s.c.SolrCore Looking for old index directories to cleanup for core collection1 in C:\Users\jenkins\workspace\Lucene-Solr-master-Windows\solr\build\solr-core\test\J0\temp\solr.cloud.DistribDocExpirationUpdateProcessorTest_4D3DC056018109F6-001\control-001\cores\collection1\data\
   [junit4]   2> 219896 INFO  (coreLoadExecutor-521-thread-1-processing-n:127.0.0.1:57781_hb_mrp) [n:127.0.0.1:57781_hb_mrp c:control_collection s:shard1 r:core_node1 x:collection1] o.a.s.u.p.UpdateRequestProcessorChain creating updateRequestProcessorChain "convert-ttl-defaults"
   [junit4]   2> 219896 WARN  (OldIndexDirectoryCleanupThreadForCore-collection1) [n:127.0.0.1:57781_hb_mrp c:control_collection s:shard1 r:core_node1 x:collection1] o.a.s.c.DirectoryFactory C:\Users\jenkins\workspace\Lucene-Solr-master-Windows\solr\build\solr-core\test\J0\temp\solr.cloud.DistribDocExpirationUpdateProcessorTest_4D3DC056018109F6-001\control-001\cores\collection1\data\ does not point to a valid data directory; skipping clean-up of old index directories.
   [junit4]   2> 220000 INFO  (coreLoadExecutor-521-thread-1-processing-n:127.0.0.1:57781_hb_mrp) [n:127.0.0.1:57781_hb_mrp c:control_collection s:shard1 r:core_node1 x:collection1] o.a.s.u.p.UpdateRequestProcessorChain creating updateRequestProcessorChain "convert-ttl-field"
   [junit4]   2> 220072 INFO  (coreLoadExecutor-521-thread-1-processing-n:127.0.0.1:57781_hb_mrp) [n:127.0.0.1:57781_hb_mrp c:control_collection s:shard1 r:core_node1 x:collection1] o.a.s.u.p.UpdateRequestProcessorChain creating updateRequestProcessorChain "convert-ttl-param"
   [junit4]   2> 220072 INFO  (coreLoadExecutor-521-thread-1-processing-n:127.0.0.1:57781_hb_mrp) [n:127.0.0.1:57781_hb_mrp c:control_collection s:shard1 r:core_node1 x:collection1] o.a.s.u.p.UpdateRequestProcessorChain creating updateRequestProcessorChain "convert-ttl-field-with-param-default"
   [junit4]   2> 220072 INFO  (coreLoadExecutor-521-thread-1-processing-n:127.0.0.1:57781_hb_mrp) [n:127.0.0.1:57781_hb_mrp c:control_collection s:shard1 r:core_node1 x:collection1] o.a.s.u.p.UpdateRequestProcessorChain creating updateRequestProcessorChain "scheduled-delete" (default)
   [junit4]   2> 220225 INFO  (coreLoadExecutor-521-thread-1-processing-n:127.0.0.1:57781_hb_mrp) [n:127.0.0.1:57781_hb_mrp c:control_collection s:shard1 r:core_node1 x:collection1] o.a.s.u.p.UpdateRequestProcessorChain inserting DistributedUpdateProcessorFactory into updateRequestProcessorChain "scheduled-delete" (default)
   [junit4]   2> 220238 INFO  (coreLoadExecutor-521-thread-1-processing-n:127.0.0.1:57781_hb_mrp) [n:127.0.0.1:57781_hb_mrp c:control_collection s:shard1 r:core_node1 x:collection1] o.a.s.h.l.XMLLoader xsltCacheLifetimeSeconds=60
   [junit4]   2> 220241 INFO  (coreLoadExecutor-521-thread-1-processing-n:127.0.0.1:57781_hb_mrp) [n:127.0.0.1:57781_hb_mrp c:control_collection s:shard1 r:core_node1 x:collection1] o.a.s.h.l.XMLLoader xsltCacheLifetimeSeconds=60
   [junit4]   2> 220243 INFO  (coreLoadExecutor-521-thread-1-processing-n:127.0.0.1:57781_hb_mrp) [n:127.0.0.1:57781_hb_mrp c:control_collection s:shard1 r:core_node1 x:collection1] o.a.s.h.l.XMLLoader xsltCacheLifetimeSeconds=60
   [junit4]   2> 220245 INFO  (coreLoadExecutor-521-thread-1-processing-n:127.0.0.1:57781_hb_mrp) [n:127.0.0.1:57781_hb_mrp c:control_collection s:shard1 r:core_node1 x:collection1] o.a.s.h.l.XMLLoader xsltCacheLifetimeSeconds=60
   [junit4]   2> 220247 INFO  (coreLoadExecutor-521-thread-1-processing-n:127.0.0.1:57781_hb_mrp) [n:127.0.0.1:57781_hb_mrp c:control_collection s:shard1 r:core_node1 x:collection1] o.a.s.c.RequestHandlers Registered paths: /admin/mbeans,,/update/csv,/sql,/update/json/docs,/admin/luke,/export,/select,/admin/segments,/get,/admin/system,/replication,/admin/properties,/config,/stream,/schema,/admin/plugins,/admin/logging,/update/json,/admin/ping,/admin/threads,/update,/admin/file
   [junit4]   2> 220247 INFO  (coreLoadExecutor-521-thread-1-processing-n:127.0.0.1:57781_hb_mrp) [n:127.0.0.1:57781_hb_mrp c:control_collection s:shard1 r:core_node1 x:collection1] o.a.s.c.SolrCore Using default statsCache cache: org.apache.solr.search.stats.LocalStatsCache
   [junit4]   2> 220248 INFO  (coreLoadExecutor-521-thread-1-processing-n:127.0.0.1:57781_hb_mrp) [n:127.0.0.1:57781_hb_mrp c:control_collection s:shard1 r:core_node1 x:collection1] o.a.s.u.UpdateHandler Using UpdateLog implementation: org.apache.solr.update.UpdateLog
   [junit4]   2> 220248 INFO  (coreLoadExecutor-521-thread-1-processing-n:127.0.0.1:57781_hb_mrp) [n:127.0.0.1:57781_hb_mrp c:control_collection s:shard1 r:core_node1 x:collection1] o.a.s.u.UpdateLog Initializing UpdateLog: dataDir= defaultSyncLevel=FLUSH numRecordsToKeep=100 maxNumLogsToKeep=10 numVersionBuckets=65536
   [junit4]   2> 220249 INFO  (coreLoadExecutor-521-thread-1-processing-n:127.0.0.1:57781_hb_mrp) [n:127.0.0.1:57781_hb_mrp c:control_collection s:shard1 r:core_node1 x:collection1] o.a.s.u.CommitTracker Hard AutoCommit: disabled
   [junit4]   2> 220249 INFO  (coreLoadExecutor-521-thread-1-processing-n:127.0.0.1:57781_hb_mrp) [n:127.0.0.1:57781_hb_mrp c:control_collection s:shard1 r:core_node1 x:collection1] o.a.s.u.CommitTracker Soft AutoCommit: disabled
   [junit4]   2> 220249 INFO  (coreLoadExecutor-521-thread-1-processing-n:127.0.0.1:57781_hb_mrp) [n:127.0.0.1:57781_hb_mrp c:control_collection s:shard1 r:core_node1 x:collection1] o.a.s.u.RandomMergePolicy RandomMergePolicy wrapping class org.apache.lucene.index.TieredMergePolicy: [TieredMergePolicy: maxMergeAtOnce=13, maxMergeAtOnceExplicit=30, maxMergedSegmentMB=55.9677734375, floorSegmentMB=1.58984375, forceMergeDeletesPctAllowed=1.697720513395623, segmentsPerTier=49.0, maxCFSSegmentSizeMB=8.796093022207999E12, noCFSRatio=1.0
   [junit4]   2> 220250 INFO  (coreLoadExecutor-521-thread-1-processing-n:127.0.0.1:57781_hb_mrp) [n:127.0.0.1:57781_hb_mrp c:control_collection s:shard1 r:core_node1 x:collection1] o.a.s.c.SolrDeletionPolicy SolrDeletionPolicy.onInit: commits: num=1
   [junit4]   2> 	commit{dir=MockDirectoryWrapper(RAMDirectory@70b4a859 lockFactory=org.apache.lucene.store.SingleInstanceLockFactory@2ff123c0),segFN=segments_1,generation=1}
   [junit4]   2> 220250 INFO  (coreLoadExecutor-521-thread-1-processing-n:127.0.0.1:57781_hb_mrp) [n:127.0.0.1:57781_hb_mrp c:control_collection s:shard1 r:core_node1 x:collection1] o.a.s.c.SolrDeletionPolicy newest commit generation = 1
   [junit4]   2> 220250 INFO  (coreLoadExecutor-521-thread-1-processing-n:127.0.0.1:57781_hb_mrp) [n:127.0.0.1:57781_hb_mrp c:control_collection s:shard1 r:core_node1 x:collection1] o.a.s.s.SolrIndexSearcher Opening [Searcher@7000ec2b[collection1] main]
   [junit4]   2> 220250 INFO  (coreLoadExecutor-521-thread-1-processing-n:127.0.0.1:57781_hb_mrp) [n:127.0.0.1:57781_hb_mrp c:control_collection s:shard1 r:core_node1 x:collection1] o.a.s.c.c.ZkStateReader Load collection config from: [/collections/control_collection]
   [junit4]   2> 220251 INFO  (coreLoadExecutor-521-thread-1-processing-n:127.0.0.1:57781_hb_mrp) [n:127.0.0.1:57781_hb_mrp c:control_collection s:shard1 r:core_node1 x:collection1] o.a.s.c.c.ZkStateReader path=[/collections/control_collection] [configName]=[conf1] specified config exists in ZooKeeper
   [junit4]   2> 220251 INFO  (coreLoadExecutor-521-thread-1-processing-n:127.0.0.1:57781_hb_mrp) [n:127.0.0.1:57781_hb_mrp c:control_collection s:shard1 r:core_node1 x:collection1] o.a.s.r.ManagedResourceStorage Setting up ZooKeeper-based storage for the RestManager with znodeBase: /configs/conf1
   [junit4]   2> 220252 INFO  (coreLoadExecutor-521-thread-1-processing-n:127.0.0.1:57781_hb_mrp) [n:127.0.0.1:57781_hb_mrp c:control_collection s:shard1 r:core_node1 x:collection1] o.a.s.r.ManagedResourceStorage Configured ZooKeeperStorageIO with znodeBase: /configs/conf1
   [junit4]   2> 220252 INFO  (coreLoadExecutor-521-thread-1-processing-n:127.0.0.1:57781_hb_mrp) [n:127.0.0.1:57781_hb_mrp c:control_collection s:shard1 r:core_node1 x:collection1] o.a.s.r.RestManager Initializing RestManager with initArgs: {}
   [junit4]   2> 220252 INFO  (coreLoadExecutor-521-thread-1-processing-n:127.0.0.1:57781_hb_mrp) [n:127.0.0.1:57781_hb_mrp c:control_collection s:shard1 r:core_node1 x:collection1] o.a.s.r.ManagedResourceStorage Reading _rest_managed.json using ZooKeeperStorageIO:path=/configs/conf1
   [junit4]   2> 220252 INFO  (coreLoadExecutor-521-thread-1-processing-n:127.0.0.1:57781_hb_mrp) [n:127.0.0.1:57781_hb_mrp c:control_collection s:shard1 r:core_node1 x:collection1] o.a.s.r.ManagedResourceStorage No data found for znode /configs/conf1/_rest_managed.json
   [junit4]   2> 220252 INFO  (coreLoadExecutor-521-thread-1-processing-n:127.0.0.1:57781_hb_mrp) [n:127.0.0.1:57781_hb_mrp c:control_collection s:shard1 r:core_node1 x:collection1] o.a.s.r.ManagedResourceStorage Loaded null at path _rest_managed.json using ZooKeeperStorageIO:path=/configs/conf1
   [junit4]   2> 220252 INFO  (coreLoadExecutor-521-thread-1-processing-n:127.0.0.1:57781_hb_mrp) [n:127.0.0.1:57781_hb_mrp c:control_collection s:shard1 r:core_node1 x:collection1] o.a.s.r.RestManager Initializing 0 registered ManagedResources
   [junit4]   2> 220265 INFO  (coreLoadExecutor-521-thread-1-processing-n:127.0.0.1:57781_hb_mrp) [n:127.0.0.1:57781_hb_mrp c:control_collection s:shard1 r:core_node1 x:collection1] o.a.s.h.ReplicationHandler Commits will be reserved for  10000
   [junit4]   2> 220265 INFO  (searcherExecutor-522-thread-1-processing-n:127.0.0.1:57781_hb_mrp x:collection1 s:shard1 c:control_collection r:core_node1) [n:127.0.0.1:57781_hb_mrp c:control_collection s:shard1 r:core_node1 x:collection1] o.a.s.c.SolrCore [collection1] Registered new searcher Searcher@7000ec2b[collection1] main{ExitableDirectoryReader(UninvertingDirectoryReader())}
   [junit4]   2> 220265 INFO  (coreLoadExecutor-521-thread-1-processing-n:127.0.0.1:57781_hb_mrp) [n:127.0.0.1:57781_hb_mrp c:control_collection s:shard1 r:core_node1 x:collection1] o.a.s.u.UpdateLog Looking up max value of version field to seed version buckets
   [junit4]   2> 220265 INFO  (coreLoadExecutor-521-thread-1-processing-n:127.0.0.1:57781_hb_mrp) [n:127.0.0.1:57781_hb_mrp c:control_collection s:shard1 r:core_node1 x:collection1] o.a.s.u.VersionInfo Refreshing highest value of _version_ for 65536 version buckets from index
   [junit4]   2> 220265 INFO  (coreLoadExecutor-521-thread-1-processing-n:127.0.0.1:57781_hb_mrp) [n:127.0.0.1:57781_hb_mrp c:control_collection s:shard1 r:core_node1 x:collection1] o.a.s.u.VersionInfo No terms found for _version_, cannot seed version bucket highest value from index
   [junit4]   2> 220265 INFO  (coreLoadExecutor-521-thread-1-processing-n:127.0.0.1:57781_hb_mrp) [n:127.0.0.1:57781_hb_mrp c:control_collection s:shard1 r:core_node1 x:collection1] o.a.s.u.UpdateLog Could not find max version in index or recent updates, using new clock 1530394516005060608
   [junit4]   2> 220268 INFO  (coreLoadExecutor-521-thread-1-processing-n:127.0.0.1:57781_hb_mrp) [n:127.0.0.1:57781_hb_mrp c:control_collection s:shard1 r:core_node1 x:collection1] o.a.s.u.UpdateLog Took 2.0ms to seed version buckets with highest version 1530394516005060608
   [junit4]   2> 220268 INFO  (coreLoadExecutor-521-thread-1-processing-n:127.0.0.1:57781_hb_mrp) [n:127.0.0.1:57781_hb_mrp c:control_collection s:shard1 r:core_node1 x:collection1] o.a.s.c.ZkController watch zkdir /configs/conf1
   [junit4]   2> 220270 INFO  (coreLoadExecutor-521-thread-1-processing-n:127.0.0.1:57781_hb_mrp) [n:127.0.0.1:57781_hb_mrp c:control_collection s:shard1 r:core_node1 x:collection1] o.a.s.c.CoreContainer registering core: collection1
   [junit4]   2> 220281 INFO  (coreZkRegister-515-thread-1-processing-n:127.0.0.1:57781_hb_mrp x:collection1 s:shard1 c:control_collection r:core_node1) [n:127.0.0.1:57781_hb_mrp c:control_collection s:shard1 r:core_node1 x:collection1] o.a.s.c.ZkController Register replica - core:collection1 address:http://127.0.0.1:57781/hb_mrp collection:control_collection shard:shard1
   [junit4]   2> 220284 INFO  (coreZkRegister-515-thread-1-processing-n:127.0.0.1:57781_hb_mrp x:collection1 s:shard1 c:control_collection r:core_node1) [n:127.0.0.1:57781_hb_mrp c:control_collection s:shard1 r:core_node1 x:collection1] o.a.s.c.c.SolrZkClient makePath: /collections/control_collection/leader_elect/shard1/election
   [junit4]   2> 220290 INFO  (coreZkRegister-515-thread-1-processing-n:127.0.0.1:57781_hb_mrp x:collection1 s:shard1 c:control_collection r:core_node1) [n:127.0.0.1:57781_hb_mrp c:control_collection s:shard1 r:core_node1 x:collection1] o.a.s.c.LeaderElector Joined leadership election with path: /collections/control_collection/leader_elect/shard1/election/95649657099845636-core_node1-n_0000000000
   [junit4]   2> 220291 INFO  (coreZkRegister-515-thread-1-processing-n:127.0.0.1:57781_hb_mrp x:collection1 s:shard1 c:control_collection r:core_node1) [n:127.0.0.1:57781_hb_mrp c:control_collection s:shard1 r:core_node1 x:collection1] o.a.s.c.ShardLeaderElectionContext Running the leader process for shard=shard1 and weAreReplacement=false and leaderVoteWait=10000
   [junit4]   2> 220294 INFO  (coreZkRegister-515-thread-1-processing-n:127.0.0.1:57781_hb_mrp x:collection1 s:shard1 c:control_collection r:core_node1) [n:127.0.0.1:57781_hb_mrp c:control_collection s:shard1 r:core_node1 x:collection1] o.a.s.c.ShardLeaderElectionContext Enough replicas found to continue.
   [junit4]   2> 220294 INFO  (coreZkRegister-515-thread-1-processing-n:127.0.0.1:57781_hb_mrp x:collection1 s:shard1 c:control_collection r:core_node1) [n:127.0.0.1:57781_hb_mrp c:control_collection s:shard1 r:core_node1 x:collection1] o.a.s.c.ShardLeaderElectionContext I may be the new leader - try and sync
   [junit4]   2> 220294 INFO  (coreZkRegister-515-thread-1-processing-n:127.0.0.1:57781_hb_mrp x:collection1 s:shard1 c:control_collection r:core_node1) [n:127.0.0.1:57781_hb_mrp c:control_collection s:shard1 r:core_node1 x:collection1] o.a.s.c.SyncStrategy Sync replicas to http://127.0.0.1:57781/hb_mrp/collection1/
   [junit4]   2> 220294 INFO  (coreZkRegister-515-thread-1-processing-n:127.0.0.1:57781_hb_mrp x:collection1 s:shard1 c:control_collection r:core_node1) [n:127.0.0.1:57781_hb_mrp c:control_collection s:shard1 r:core_node1 x:collection1] o.a.s.c.SyncStrategy Sync Success - now sync replicas to me
   [junit4]   2> 220294 INFO  (coreZkRegister-515-thread-1-processing-n:127.0.0.1:57781_hb_mrp x:collection1 s:shard1 c:control_collection r:core_node1) [n:127.0.0.1:57781_hb_mrp c:control_collection s:shard1 r:core_node1 x:collection1] o.a.s.c.SyncStrategy http://127.0.0.1:57781/hb_mrp/collection1/ has no replicas
   [junit4]   2> 220296 INFO  (OverseerStateUpdate-95649657099845636-127.0.0.1:57781_hb_mrp-n_0000000000) [n:127.0.0.1:57781_hb_mrp    ] o.a.s.c.Overseer processMessage: queueSize: 1, message = {
   [junit4]   2>   "operation":"leader",
   [junit4]   2>   "shard":"shard1",
   [junit4]   2>   "collection":"control_collection"} current state version: 1
   [junit4]   2> 220298 INFO  (coreZkRegister-515-thread-1-processing-n:127.0.0.1:57781_hb_mrp x:collection1 s:shard1 c:control_collection r:core_node1) [n:127.0.0.1:57781_hb_mrp c:control_collection s:shard1 r:core_node1 x:collection1] o.a.s.c.c.SolrZkClient makePath: /collections/control_collection/leaders/shard1
   [junit4]   2> 220300 INFO  (zkCallback-139-thread-1-processing-n:127.0.0.1:57781_hb_mrp) [n:127.0.0.1:57781_hb_mrp    ] o.a.s.c.c.ZkStateReader A cluster state change: [WatchedEvent state:SyncConnected type:NodeDataChanged path:/clusterstate.json], has occurred - updating... (live nodes size: [1])
   [junit4]   2> 220303 INFO  (coreZkRegister-515-thread-1-processing-n:127.0.0.1:57781_hb_mrp x:collection1 s:shard1 c:control_collection r:core_node1) [n:127.0.0.1:57781_hb_mrp c:control_collection s:shard1 r:core_node1 x:collection1] o.a.s.c.ShardLeaderElectionContextBase Creating leader registration node /collections/control_collection/leaders/shard1/leader after winning as /collections/control_collection/leader_elect/shard1/election/95649657099845636-core_node1-n_0000000000
   [junit4]   2> 220307 INFO  (coreZkRegister-515-thread-1-processing-n:127.0.0.1:57781_hb_mrp x:collection1 s:shard1 c:control_collection r:core_node1) [n:127.0.0.1:57781_hb_mrp c:control_collection s:shard1 r:core_node1 x:collection1] o.a.s.c.ShardLeaderElectionContext I am the new leader: http://127.0.0.1:57781/hb_mrp/collection1/ shard1
   [junit4]   2> 220309 INFO  (OverseerStateUpdate-95649657099845636-127.0.0.1:57781_hb_mrp-n_0000000000) [n:127.0.0.1:57781_hb_mrp    ] o.a.s.c.Overseer processMessage: queueSize: 1, message = {
   [junit4]   2>   "operation":"leader",
   [junit4]   2>   "shard":"shard1",
   [junit4]   2>   "collection":"control_collection",
   [junit4]   2>   "base_url":"http://127.0.0.1:57781/hb_mrp",
   [junit4]   2>   "core":"collection1",
   [junit4]   2>   "state":"active"} current state version: 2
   [junit4]   2> 220413 INFO  (zkCallback-139-thread-1-processing-n:127.0.0.1:57781_hb_mrp) [n:127.0.0.1:57781_hb_mrp    ] o.a.s.c.c.ZkStateReader A cluster state change: [WatchedEvent state:SyncConnected type:NodeDataChanged path:/clusterstate.json], has occurred - updating... (live nodes size: [1])
   [junit4]   2> 220462 INFO  (coreZkRegister-515-thread-1-processing-n:127.0.0.1:57781_hb_mrp x:collection1 s:shard1 c:control_collection r:core_node1) [n:127.0.0.1:57781_hb_mrp c:control_collection s:shard1 r:core_node1 x:collection1] o.a.s.c.ZkController We are http://127.0.0.1:57781/hb_mrp/collection1/ and leader is http://127.0.0.1:57781/hb_mrp/collection1/
   [junit4]   2> 220462 INFO  (coreZkRegister-515-thread-1-processing-n:127.0.0.1:57781_hb_mrp x:collection1 s:shard1 c:control_collection r:core_node1) [n:127.0.0.1:57781_hb_mrp c:control_collection s:shard1 r:core_node1 x:collection1] o.a.s.c.ZkController No LogReplay needed for core=collection1 baseURL=http://127.0.0.1:57781/hb_mrp
   [junit4]   2> 220462 INFO  (coreZkRegister-515-thread-1-processing-n:127.0.0.1:57781_hb_mrp x:collection1 s:shard1 c:control_collection r:core_node1) [n:127.0.0.1:57781_hb_mrp c:control_collection s:shard1 r:core_node1 x:collection1] o.a.s.c.ZkController I am the leader, no recovery necessary
   [junit4]   2> 220462 INFO  (coreZkRegister-515-thread-1-processing-n:127.0.0.1:57781_hb_mrp x:collection1 s:shard1 c:control_collection r:core_node1) [n:127.0.0.1:57781_hb_mrp c:control_collection s:shard1 r:core_node1 x:collection1] o.a.s.c.ZkController publishing state=active
   [junit4]   2> 220462 INFO  (coreZkRegister-515-thread-1-processing-n:127.0.0.1:57781_hb_mrp x:collection1 s:shard1 c:control_collection r:core_node1) [n:127.0.0.1:57781_hb_mrp c:control_collection s:shard1 r:core_node1 x:collection1] o.a.s.c.ZkController numShards not found on descriptor - reading it from system property
   [junit4]   2> 220465 INFO  (OverseerStateUpdate-95649657099845636-127.0.0.1:57781_hb_mrp-n_0000000000) [n:127.0.0.1:57781_hb_mrp    ] o.a.s.c.Overseer processMessage: queueSize: 1, message = {
   [junit4]   2>   "core":"collection1",
   [junit4]   2>   "core_node_name":"core_node1",
   [junit4]   2>   "roles":null,
   [junit4]   2>   "base_url":"http://127.0.0.1:57781/hb_mrp",
   [junit4]   2>   "node_name":"127.0.0.1:57781_hb_mrp",
   [junit4]   2>   "numShards":"1",
   [junit4]   2>   "state":"active",
   [junit4]   2>   "shard":"shard1",
   [junit4]   2>   "collection":"control_collection",
   [junit4]   2>   "operation":"state"} current state version: 3
   [junit4]   2> 220465 INFO  (OverseerStateUpdate-95649657099845636-127.0.0.1:57781_hb_mrp-n_0000000000) [n:127.0.0.1:57781_hb_mrp    ] o.a.s.c.o.ReplicaMutator Update state numShards=1 message={
   [junit4]   2>   "core":"collection1",
   [junit4]   2>   "core_node_name":"core_node1",
   [junit4]   2>   "roles":null,
   [junit4]   2>   "base_url":"http://127.0.0.1:57781/hb_mrp",
   [junit4]   2>   "node_name":"127.0.0.1:57781_hb_mrp",
   [junit4]   2>   "numShards":"1",
   [junit4]   2>   "state":"active",
   [junit4]   2>   "shard":"shard1",
   [junit4]   2>   "collection":"control_collection",
   [junit4]   2>   "operation":"state"}
   [junit4]   2> 220570 INFO  (zkCallback-139-thread-1-processing-n:127.0.0.1:57781_hb_mrp) [n:127.0.0.1:57781_hb_mrp    ] o.a.s.c.c.ZkStateReader A cluster state change: [WatchedEvent state:SyncConnected type:NodeDataChanged path:/clusterstate.json], has occurred - updating... (live nodes size: [1])
   [junit4]   2> 220743 INFO  (TEST-DistribDocExpirationUpdateProcessorTest.test-seed#[4D3DC056018109F6]) [    ] o.a.s.c.c.SolrZkClient Using default ZkCredentialsProvider
   [junit4]   2> 220745 INFO  (TEST-DistribDocExpirationUpdateProcessorTest.test-seed#[4D3DC056018109F6]) [    ] o.a.s.c.c.ConnectionManager Waiting for client to connect to ZooKeeper
   [junit4]   2> 220749 INFO  (zkCallback-141-thread-1) [    ] o.a.s.c.c.ConnectionManager Watcher org.apache.solr.common.cloud.ConnectionManager@4f315882 name:ZooKeeperConnection Watcher:127.0.0.1:57774/solr got event WatchedEvent state:SyncConnected type:None path:null path:null type:None
   [junit4]   2> 220749 INFO  (TEST-DistribDocExpirationUpdateProcessorTest.test-seed#[4D3DC056018109F6]) [    ] o.a.s.c.c.ConnectionManager Client is connected to ZooKeeper
   [junit4]   2> 220749 INFO  (TEST-DistribDocExpirationUpdateProcessorTest.test-seed#[4D3DC056018109F6]) [    ] o.a.s.c.c.SolrZkClient Using default ZkACLProvider
   [junit4]   2> 220749 INFO  (TEST-DistribDocExpirationUpdateProcessorTest.test-seed#[4D3DC056018109F6]) [    ] o.a.s.c.c.ZkStateReader Updating cluster state from ZooKeeper... 
   [junit4]   2> 220751 INFO  (TEST-DistribDocExpirationUpdateProcessorTest.test-seed#[4D3DC056018109F6]) [    ] o.a.s.c.c.ZkStateReader Updated live nodes from ZooKeeper... (0) -> (1)
   [junit4]   2> 220752 INFO  (TEST-DistribDocExpirationUpdateProcessorTest.test-seed#[4D3DC056018109F6]) [    ] o.a.s.c.ChaosMonkey monkey: init - expire sessions:false cause connection loss:false
   [junit4]   2> 220752 INFO  (TEST-DistribDocExpirationUpdateProcessorTest.test-seed#[4D3DC056018109F6]) [    ] o.a.s.c.AbstractFullDistribZkTestBase Creating collection1 with stateFormat=2
   [junit4]   2> 220752 INFO  (TEST-DistribDocExpirationUpdateProcessorTest.test-seed#[4D3DC056018109F6]) [    ] o.a.s.c.c.SolrZkClient Using default ZkCredentialsProvider
   [junit4]   2> 220754 INFO  (TEST-DistribDocExpirationUpdateProcessorTest.test-seed#[4D3DC056018109F6]) [    ] o.a.s.c.c.ConnectionManager Waiting for client to connect to ZooKeeper
   [junit4]   2> 220757 INFO  (zkCallback-142-thread-1) [    ] o.a.s.c.c.ConnectionManager Watcher org.apache.solr.common.cloud.ConnectionManager@3e6f17c6 name:ZooKeeperConnection Watcher:127.0.0.1:57774/solr got event WatchedEvent state:SyncConnected type:None path:null path:null type:None
   [junit4]   2> 220757 INFO  (TEST-DistribDocExpirationUpdateProcessorTest.test-seed#[4D3DC056018109F6]) [    ] o.a.s.c.c.ConnectionManager Client is connected to ZooKeeper
   [junit4]   2> 220757 INFO  (TEST-DistribDocExpirationUpdateProcessorTest.test-seed#[4D3DC056018109F6]) [    ] o.a.s.c.c.SolrZkClient Using default ZkACLProvider
   [junit4]   2> 220764 INFO  (OverseerStateUpdate-95649657099845636-127.0.0.1:57781_hb_mrp-n_0000000000) [n:127.0.0.1:57781_hb_mrp    ] o.a.s.c.Overseer processMessage: queueSize: 1, message = {
   [junit4]   2>   "operation":"create",
   [junit4]   2>   "name":"collection1",
   [junit4]   2>   "numShards":"2",
   [junit4]   2>   "stateFormat":"2"} current state version: 4
   [junit4]   2> 220764 INFO  (OverseerStateUpdate-95649657099845636-127.0.0.1:57781_hb_mrp-n_0000000000) [n:127.0.0.1:57781_hb_mrp    ] o.a.s.c.o.ClusterStateMutator building a new cName: collection1
   [junit4]   2> 220876 INFO  (OverseerStateUpdate-95649657099845636-127.0.0.1:57781_hb_mrp-n_0000000000) [n:127.0.0.1:57781_hb_mrp    ] o.a.s.c.o.ZkStateWriter going to create_collection /collections/collection1/state.json
   [junit4]   2> 221385 INFO  (TEST-DistribDocExpirationUpdateProcessorTest.test-seed#[4D3DC056018109F6]) [    ] o.a.s.SolrTestCaseJ4 Writing core.properties file to C:\Users\jenkins\workspace\Lucene-Solr-master-Windows\solr\build\solr-core\test\J0\temp\solr.cloud.DistribDocExpirationUpdateProcessorTest_4D3DC056018109F6-001\shard-1-001\cores\collection1
   [junit4]   2> 221388 INFO  (TEST-DistribDocExpirationUpdateProcessorTest.test-seed#[4D3DC056018109F6]) [    ] o.a.s.c.AbstractFullDistribZkTestBase create jetty 1 in directory C:\Users\jenkins\workspace\Lucene-Solr-master-Windows\solr\build\solr-core\test\J0\temp\solr.cloud.DistribDocExpirationUpdateProcessorTest_4D3DC056018109F6-001\shard-1-001
   [junit4]   2> 221389 INFO  (TEST-DistribDocExpirationUpdateProcessorTest.test-seed#[4D3DC056018109F6]) [    ] o.e.j.s.Server jetty-9.3.8.v20160314
   [junit4]   2> 221390 INFO  (TEST-DistribDocExpirationUpdateProcessorTest.test-seed#[4D3DC056018109F6]) [    ] o.e.j.s.h.ContextHandler Started o.e.j.s.ServletContextHandler@76d7b071{/hb_mrp,null,AVAILABLE}
   [junit4]   2> 221394 INFO  (TEST-DistribDocExpirationUpdateProcessorTest.test-seed#[4D3DC056018109F6]) [    ] o.e.j.s.ServerConnector Started ServerConnector@7902e700{HTTP/1.1,[http/1.1]}{127.0.0.1:57813}
   [junit4]   2> 221394 INFO  (TEST-DistribDocExpirationUpdateProcessorTest.test-seed#[4D3DC056018109F6]) [    ] o.e.j.s.Server Started @225976ms
   [junit4]   2> 221394 INFO  (TEST-DistribDocExpirationUpdateProcessorTest.test-seed#[4D3DC056018109F6]) [    ] o.a.s.c.s.e.JettySolrRunner Jetty properties: {solr.data.dir=C:\Users\jenkins\workspace\Lucene-Solr-master-Windows\solr\build\solr-core\test\J0\temp\solr.cloud.DistribDocExpirationUpdateProcessorTest_4D3DC056018109F6-001\tempDir-001/jetty1, solrconfig=solrconfig.xml, hostContext=/hb_mrp, hostPort=57813, coreRootDirectory=C:\Users\jenkins\workspace\Lucene-Solr-master-Windows\solr\build\solr-core\test\J0\temp\solr.cloud.DistribDocExpirationUpdateProcessorTest_4D3DC056018109F6-001\shard-1-001\cores}
   [junit4]   2> 221394 INFO  (TEST-DistribDocExpirationUpdateProcessorTest.test-seed#[4D3DC056018109F6]) [    ] o.a.s.s.SolrDispatchFilter SolrDispatchFilter.init(): sun.misc.Launcher$AppClassLoader@73d16e93
   [junit4]   2> 221394 INFO  (TEST-DistribDocExpirationUpdateProcessorTest.test-seed#[4D3DC056018109F6]) [    ] o.a.s.c.SolrResourceLoader new SolrResourceLoader for directory: 'C:\Users\jenkins\workspace\Lucene-Solr-master-Windows\solr\build\solr-core\test\J0\temp\solr.cloud.DistribDocExpirationUpdateProcessorTest_4D3DC056018109F6-001\shard-1-001'
   [junit4]   2> 221394 INFO  (TEST-DistribDocExpirationUpdateProcessorTest.test-seed#[4D3DC056018109F6]) [    ] o.a.s.c.SolrResourceLoader JNDI not configured for solr (NoInitialContextEx)
   [junit4]   2> 221394 INFO  (TEST-DistribDocExpirationUpdateProcessorTest.test-seed#[4D3DC056018109F6]) [    ] o.a.s.c.SolrResourceLoader solr home defaulted to 'solr/' (could not find system property or JNDI)
   [junit4]   2> 221395 INFO  (TEST-DistribDocExpirationUpdateProcessorTest.test-seed#[4D3DC056018109F6]) [    ] o.a.s.c.c.SolrZkClient Using default ZkCredentialsProvider
   [junit4]   2> 221396 INFO  (TEST-DistribDocExpirationUpdateProcessorTest.test-seed#[4D3DC056018109F6]) [    ] o.a.s.c.c.ConnectionManager Waiting for client to connect to ZooKeeper
   [junit4]   2> 221411 INFO  (zkCallback-143-thread-1) [    ] o.a.s.c.c.ConnectionManager Watcher org.apache.solr.common.cloud.ConnectionManager@24d7580f name:ZooKeeperConnection Watcher:127.0.0.1:57774/solr got event WatchedEvent state:SyncConnected type:None path:null path:null type:None
   [junit4]   2> 221411 INFO  (TEST-DistribDocExpirationUpdateProcessorTest.test-seed#[4D3DC056018109F6]) [    ] o.a.s.c.c.ConnectionManager Client is connected to ZooKeeper
   [junit4]   2> 221411 INFO  (TEST-DistribDocExpirationUpdateProcessorTest.test-seed#[4D3DC056018109F6]) [    ] o.a.s.c.c.SolrZkClient Using default ZkACLProvider
   [junit4]   2> 221414 INFO  (TEST-DistribDocExpirationUpdateProcessorTest.test-seed#[4D3DC056018109F6]) [    ] o.a.s.s.SolrDispatchFilter Loading solr.xml from SolrHome (not found in ZooKeeper)
   [junit4]   2> 221414 INFO  (TEST-DistribDocExpirationUpdateProcessorTest.test-seed#[4D3DC056018109F6]) [    ] o.a.s.c.SolrXmlConfig Loading container configuration from C:\Users\jenkins\workspace\Lucene-Solr-master-Windows\solr\build\solr-core\test\J0\temp\solr.cloud.DistribDocExpirationUpdateProcessorTest_4D3DC056018109F6-001\shard-1-001\solr.xml
   [junit4]   2> 221415 WARN  (NIOServerCxn.Factory:0.0.0.0/0.0.0.0:0) [    ] o.a.z.s.NIOServerCnxn caught end of stream exception
   [junit4]   2> EndOfStreamException: Unable to read additional data from client sessionid 0x153d0db3a530007, likely client has closed socket
   [junit4]   2> 	at org.apache.zookeeper.server.NIOServerCnxn.doIO(NIOServerCnxn.java:228)
   [junit4]   2> 	at org.apache.zookeeper.server.NIOServerCnxnFactory.run(NIOServerCnxnFactory.java:208)
   [junit4]   2> 	at java.lang.Thread.run(Thread.java:745)
   [junit4]   2> 221427 INFO  (TEST-DistribDocExpirationUpdateProcessorTest.test-seed#[4D3DC056018109F6]) [    ] o.a.s.c.CorePropertiesLocator Config-defined core root directory: C:\Users\jenkins\workspace\Lucene-Solr-master-Windows\solr\build\solr-core\test\J0\temp\solr.cloud.DistribDocExpirationUpdateProcessorTest_4D3DC056018109F6-001\shard-1-001\cores
   [junit4]   2> 221427 INFO  (TEST-DistribDocExpirationUpdateProcessorTest.test-seed#[4D3DC056018109F6]) [    ] o.a.s.c.CoreContainer New CoreContainer 2110244158
   [junit4]   2> 221427 INFO  (TEST-DistribDocExpirationUpdateProcessorTest.test-seed#[4D3DC056018109F6]) [    ] o.a.s.c.CoreContainer Loading cores into CoreContainer [instanceDir=C:\Users\jenkins\workspace\Lucene-Solr-master-Windows\solr\build\solr-core\test\J0\temp\solr.cloud.DistribDocExpirationUpdateProcessorTest_4D3DC056018109F6-001\shard-1-001]
   [junit4]   2> 221427 WARN  (TEST-DistribDocExpirationUpdateProcessorTest.test-seed#[4D3DC056018109F6]) [    ] o.a.s.c.CoreContainer Couldn't add files from C:\Users\jenkins\workspace\Lucene-Solr-master-Windows\solr\build\solr-core\test\J0\temp\solr.cloud.DistribDocExpirationUpdateProcessorTest_4D3DC056018109F6-001\shard-1-001\lib to classpath: C:\Users\jenkins\workspace\Lucene-Solr-master-Windows\solr\build\solr-core\test\J0\temp\solr.cloud.DistribDocExpirationUpdateProcessorTest_4D3DC056018109F6-001\shard-1-001\lib
   [junit4]   2> 221427 INFO  (TEST-DistribDocExpirationUpdateProcessorTest.test-seed#[4D3DC056018109F6]) [    ] o.a.s.h.c.HttpShardHandlerFactory created with socketTimeout : 90000,urlScheme : ,connTimeout : 15000,maxConnectionsPerHost : 20,maxConnections : 10000,corePoolSize : 0,maximumPoolSize : 2147483647,maxThreadIdleTime : 5,sizeOfQueue : -1,fairnessPolicy : false,useRetries : false,
   [junit4]   2> 221432 INFO  (TEST-DistribDocExpirationUpdateProcessorTest.test-seed#[4D3DC056018109F6]) [    ] o.a.s.u.UpdateShardHandler Creating UpdateShardHandler HTTP client with params: socketTimeout=340000&connTimeout=45000&retry=true
   [junit4]   2> 221432 INFO  (TEST-DistribDocExpirationUpdateProcessorTest.test-seed#[4D3DC056018109F6]) [    ] o.a.s.l.LogWatcher SLF4J impl is org.slf4j.impl.Log4jLoggerFactory
   [junit4]   2> 221432 INFO  (TEST-DistribDocExpirationUpdateProcessorTest.test-seed#[4D3DC056018109F6]) [    ] o.a.s.l.LogWatcher Registering Log Listener [Log4j (org.slf4j.impl.Log4jLoggerFactory)]
   [junit4]   2> 221432 INFO  (TEST-DistribDocExpirationUpdateProcessorTest.test-seed#[4D3DC056018109F6]) [    ] o.a.s.c.ZkContainer Zookeeper client=127.0.0.1:57774/solr
   [junit4]   2> 221433 INFO  (TEST-DistribDocExpirationUpdateProcessorTest.test-seed#[4D3DC056018109F6]) [    ] o.a.s.c.ZkController zkHost includes chroot
   [junit4]   2> 221433 INFO  (TEST-DistribDocExpirationUpdateProcessorTest.test-seed#[4D3DC056018109F6]) [    ] o.a.s.c.c.SolrZkClient Using default ZkCredentialsProvider
   [junit4]   2> 221433 INFO  (TEST-DistribDocExpirationUpdateProcessorTest.test-seed#[4D3DC056018109F6]) [    ] o.a.s.c.c.ConnectionManager Waiting for client to connect to ZooKeeper
   [junit4]   2> 221438 INFO  (zkCallback-146-thread-1) [    ] o.a.s.c.c.ConnectionManager Watcher org.apache.solr.common.cloud.ConnectionManager@505e39c9 name:ZooKeeperConnection Watcher:127.0.0.1:57774 got event WatchedEvent state:SyncConnected type:None path:null path:null type:None
   [junit4]   2> 221438 INFO  (TEST-DistribDocExpirationUpdateProcessorTest.test-seed#[4D3DC056018109F6]) [    ] o.a.s.c.c.ConnectionManager Client is connected to ZooKeeper
   [junit4]   2> 221438 INFO  (TEST-DistribDocExpirationUpdateProcessorTest.test-seed#[4D3DC056018109F6]) [    ] o.a.s.c.c.SolrZkClient Using default ZkACLProvider
   [junit4]   2> 221441 WARN  (NIOServerCxn.Factory:0.0.0.0/0.0.0.0:0) [    ] o.a.z.s.NIOServerCnxn caught end of stream exception
   [junit4]   2> EndOfStreamException: Unable to read additional data from client sessionid 0x153d0db3a530008, likely client has closed socket
   [junit4]   2> 	at org.apache.zookeeper.server.NIOServerCnxn.doIO(NIOServerCnxn.java:228)
   [junit4]   2> 	at org.apache.zookeeper.server.NIOServerCnxnFactory.run(NIOServerCnxnFactory.java:208)
   [junit4]   2> 	at java.lang.Thread.run(Thread.java:745)
   [junit4]   2> 221444 INFO  (TEST-DistribDocExpirationUpdateProcessorTest.test-seed#[4D3DC056018109F6]) [n:127.0.0.1:57813_hb_mrp    ] o.a.s.c.c.ConnectionManager Waiting for client to connect to ZooKeeper
   [junit4]   2> 221446 INFO  (zkCallback-147-thread-1-processing-n:127.0.0.1:57813_hb_mrp) [n:127.0.0.1:57813_hb_mrp    ] o.a.s.c.c.ConnectionManager Watcher org.apache.solr.common.cloud.ConnectionManager@4ea71edb name:ZooKeeperConnection Watcher:127.0.0.1:57774/solr got event WatchedEvent state:SyncConnected type:None path:null path:null type:None
   [junit4]   2> 221446 INFO  (TEST-DistribDocExpirationUpdateProcessorTest.test-seed#[4D3DC056018109F6]) [n:127.0.0.1:57813_hb_mrp    ] o.a.s.c.c.ConnectionManager Client is connected to ZooKeeper
   [junit4]   2> 221454 INFO  (TEST-DistribDocExpirationUpdateProcessorTest.test-seed#[4D3DC056018109F6]) [n:127.0.0.1:57813_hb_mrp    ] o.a.s.c.c.ZkStateReader Updating cluster state from ZooKeeper... 
   [junit4]   2> 221456 INFO  (TEST-DistribDocExpirationUpdateProcessorTest.test-seed#[4D3DC056018109F6]) [n:127.0.0.1:57813_hb_mrp    ] o.a.s.c.c.ZkStateReader Updated live nodes from ZooKeeper... (0) -> (1)
   [junit4]   2> 221457 INFO  (TEST-DistribDocExpirationUpdateProcessorTest.test-seed#[4D3DC056018109F6]) [n:127.0.0.1:57813_hb_mrp    ] o.a.s.c.Overseer Overseer (id=null) closing
   [junit4]   2> 221458 INFO  (TEST-DistribDocExpirationUpdateProcessorTest.test-seed#[4D3DC056018109F6]) [n:127.0.0.1:57813_hb_mrp    ] o.a.s.c.LeaderElector Joined leadership election with path: /overseer_elect/election/95649657099845641-127.0.0.1:57813_hb_mrp-n_0000000001
   [junit4]   2> 221459 INFO  (TEST-DistribDocExpirationUpdateProcessorTest.test-seed#[4D3DC056018109F6]) [n:127.0.0.1:57813_hb_mrp    ] o.a.s.c.LeaderElector Watching path /overseer_elect/election/95649657099845636-127.0.0.1:57781_hb_mrp-n_0000000000 to know if I could be the leader
   [junit4]   2> 221460 INFO  (TEST-DistribDocExpirationUpdateProcessorTest.test-seed#[4D3DC056018109F6]) [n:127.0.0.1:57813_hb_mrp    ] o.a.s.c.ZkController Publish node=127.0.0.1:57813_hb_mrp as DOWN
   [junit4]   2> 221463 INFO  (OverseerStateUpdate-95649657099845636-127.0.0.1:57781_hb_mrp-n_0000000000) [n:127.0.0.1:57781_hb_mrp    ] o.a.s.c.Overseer processMessage: queueSize: 1, message = {
   [junit4]   2>   "operation":"downnode",
   [junit4]   2>   "node_name":"127.0.0.1:57813_hb_mrp"} current state version: 4
   [junit4]   2> 221463 INFO  (OverseerStateUpdate-95649657099845636-127.0.0.1:57781_hb_mrp-n_0000000000) [n:127.0.0.1:57781_hb_mrp    ] o.a.s.c.o.NodeMutator DownNode state invoked for node: 127.0.0.1:57813_hb_mrp
   [junit4]   2> 221465 INFO  (OverseerStateUpdate-95649657099845636-127.0.0.1:57781_hb_mrp-n_0000000000) [n:127.0.0.1:57781_hb_mrp    ] o.a.s.c.o.ZkStateWriter going to update_collection /collections/collection1/state.json version: 0
   [junit4]   2> 221570 INFO  (zkCallback-141-thread-1) [    ] o.a.s.c.c.ZkStateReader A cluster state change: [WatchedEvent state:SyncConnected type:NodeDataChanged path:/clusterstate.json], has occurred - updating... (live nodes size: [1])
   [junit4]   2> 221570 INFO  (zkCallback-147-thread-1-processing-n:127.0.0.1:57813_hb_mrp) [n:127.0.0.1:57813_hb_mrp    ] o.a.s.c.c.ZkStateReader A cluster state change: [WatchedEvent state:SyncConnected type:NodeDataChanged path:/clusterstate.json], has occurred - updating... (live nodes size: [1])
   [junit4]   2> 221570 INFO  (zkCallback-139-thread-1-processing-n:127.0.0.1:57781_hb_mrp) [n:127.0.0.1:57781_hb_mrp    ] o.a.s.c.c.ZkStateReader A cluster state change: [WatchedEvent state:SyncConnected type:NodeDataChanged path:/clusterstate.json], has occurred - updating... (live nodes size: [1])
   [junit4]   2> 222464 INFO  (TEST-DistribDocExpirationUpdateProcessorTest.test-seed#[4D3DC056018109F6]) [n:127.0.0.1:57813_hb_mrp    ] o.a.s.c.ZkController Register node as live in ZooKeeper:/live_nodes/127.0.0.1:57813_hb_mrp
   [junit4]   2> 222464 INFO  (TEST-DistribDocExpirationUpdateProcessorTest.test-seed#[4D3DC056018109F6]) [n:127.0.0.1:57813_hb_mrp    ] o.a.s.c.c.SolrZkClient makePath: /live_nodes/127.0.0.1:57813_hb_mrp
   [junit4]   2> 222465 INFO  (zkCallback-139-thread-1-processing-n:127.0.0.1:57781_hb_mrp) [n:127.0.0.1:57781_hb_mrp    ] o.a.s.c.c.ZkStateReader A live node change: [WatchedEvent state:SyncConnected type:NodeChildrenChanged path:/live_nodes], has occurred - updating... (live nodes size: [1])
   [junit4]   2> 222465 INFO  (zkCallback-141-thread-1) [    ] o.a.s.c.c.ZkStateReader A live node change: [WatchedEvent state:SyncConnected type:NodeChildrenChanged path:/live_nodes], has occurred - updating... (live nodes size: [1])
   [junit4]   2> 222465 INFO  (zkCallback-147-thread-1-processing-n:127.0.0.1:57813_hb_mrp) [n:127.0.0.1:57813_hb_mrp    ] o.a.s.c.c.ZkStateReader A live node change: [WatchedEvent state:SyncConnected type:NodeChildrenChanged path:/live_nodes], has occurred - updating... (live nodes size: [1])
   [junit4]   2> 222466 INFO  (zkCallback-139-thread-1-processing-n:127.0.0.1:57781_hb_mrp) [n:127.0.0.1:57781_hb_mrp    ] o.a.s.c.c.ZkStateReader Updated live nodes from ZooKeeper... (1) -> (2)
   [junit4]   2> 222466 INFO  (zkCallback-141-thread-1) [    ] o.a.s.c.c.ZkStateReader Updated live nodes from ZooKeeper... (1) -> (2)
   [junit4]   2> 222466 INFO  (zkCallback-147-thread-1-processing-n:127.0.0.1:57813_hb_mrp) [n:127.0.0.1:57813_hb_mrp    ] o.a.s.c.c.ZkStateReader Updated live nodes from ZooKeeper... (1) -> (2)
   [junit4]   2> 222475 INFO  (TEST-DistribDocExpirationUpdateProcessorTest.test-seed#[4D3DC056018109F6]) [n:127.0.0.1:57813_hb_mrp    ] o.a.s.c.CoreContainer Security conf doesn't exist. Skipping setup for authorization module.
   [junit4]   2> 222475 INFO  (TEST-DistribDocExpirationUpdateProcessorTest.test-seed#[4D3DC056018109F6]) [n:127.0.0.1:57813_hb_mrp    ] o.a.s.c.CoreContainer No authentication plugin used.
   [junit4]   2> 222476 INFO  (TEST-DistribDocExpirationUpdateProcessorTest.test-seed#[4D3DC056018109F6]) [n:127.0.0.1:57813_hb_mrp    ] o.a.s.c.CorePropertiesLocator Looking for core definitions underneath C:\Users\jenkins\workspace\Lucene-Solr-master-Windows\solr\build\solr-core\test\J0\temp\solr.cloud.DistribDocExpirationUpdateProcessorTest_4D3DC056018109F6-001\shard-1-001\cores
   [junit4]   2> 222478 INFO  (TEST-DistribDocExpirationUpdateProcessorTest.test-seed#[4D3DC056018109F6]) [n:127.0.0.1:57813_hb_mrp    ] o.a.s.c.CoreDescriptor Created CoreDescriptor: {name=collection1, config=solrconfig.xml, transient=false, schema=schema.xml, loadOnStartup=true, configSetProperties=configsetprops.json, collection=collection1, coreNodeName=, dataDir=data\, shard=}
   [junit4]   2> 222478 INFO  (TEST-DistribDocExpirationUpdateProcessorTest.test-seed#[4D3DC056018109F6]) [n:127.0.0.1:57813_hb_mrp    ] o.a.s.c.CorePropertiesLocator Found core collection1 in C:\Users\jenkins\workspace\Lucene-Solr-master-Windows\solr\build\solr-core\test\J0\temp\solr.cloud.DistribDocExpirationUpdateProcessorTest_4D3DC056018109F6-001\shard-1-001\cores\collection1
   [junit4]   2> 222478 INFO  (TEST-DistribDocExpirationUpdateProcessorTest.test-seed#[4D3DC056018109F6]) [n:127.0.0.1:57813_hb_mrp    ] o.a.s.c.CorePropertiesLocator Found 1 core definitions
   [junit4]   2> 222480 INFO  (TEST-DistribDocExpirationUpdateProcessorTest.test-seed#[4D3DC056018109F6]) [n:127.0.0.1:57813_hb_mrp    ] o.a.s.s.SolrDispatchFilter user.dir=C:\Users\jenkins\workspace\Lucene-Solr-master-Windows\solr\build\solr-core\test\J0
   [junit4]   2> 222480 INFO  (TEST-DistribDocExpirationUpdateProcessorTest.test-seed#[4D3DC056018109F6]) [n:127.0.0.1:57813_hb_mrp    ] o.a.s.s.SolrDispatchFilter SolrDispatchFilter.init() done
   [junit4]   2> 222490 INFO  (coreLoadExecutor-533-thread-1-processing-n:127.0.0.1:57813_hb_mrp) [n:127.0.0.1:57813_hb_mrp c:collection1   x:collection1] o.a.s.c.ZkController publishing state=down
   [junit4]   2> 222490 INFO  (coreLoadExecutor-533-thread-1-processing-n:127.0.0.1:57813_hb_mrp) [n:127.0.0.1:57813_hb_mrp c:collection1   x:collection1] o.a.s.c.ZkController numShards not found on descriptor - reading it from system property
   [junit4]   2> 222494 INFO  (coreLoadExecutor-533-thread-1-processing-n:127.0.0.1:57813_hb_mrp) [n:127.0.0.1:57813_hb_mrp c:col

[...truncated too long message...]

overseer/queue
   [junit4]   2> 	4	/solr/overseer/collection-queue-work
   [junit4]   2> 
   [junit4]   2> NOTE: reproduce with: ant test  -Dtestcase=TestReqParamsAPI -Dtests.method=test -Dtests.seed=4D3DC056018109F6 -Dtests.slow=true -Dtests.locale=fr-LU -Dtests.timezone=America/Indiana/Vevay -Dtests.asserts=true -Dtests.file.encoding=US-ASCII
   [junit4] FAILURE 28.2s J1 | TestReqParamsAPI.test <<<
   [junit4]    > Throwable #1: java.lang.AssertionError: Could not get expected value  'CY val' for path 'params/c' full output: {
   [junit4]    >   "responseHeader":{
   [junit4]    >     "status":0,
   [junit4]    >     "QTime":0},
   [junit4]    >   "params":{
   [junit4]    >     "a":"A val",
   [junit4]    >     "b":"B val",
   [junit4]    >     "wt":"json",
   [junit4]    >     "useParams":""},
   [junit4]    >   "context":{
   [junit4]    >     "webapp":"",
   [junit4]    >     "path":"/dump1",
   [junit4]    >     "httpMethod":"GET"}}
   [junit4]    > 	at __randomizedtesting.SeedInfo.seed([4D3DC056018109F6:C569FF8CAF7D640E]:0)
   [junit4]    > 	at org.apache.solr.core.TestSolrConfigHandler.testForResponseElement(TestSolrConfigHandler.java:458)
   [junit4]    > 	at org.apache.solr.handler.TestReqParamsAPI.testReqParams(TestReqParamsAPI.java:177)
   [junit4]    > 	at org.apache.solr.handler.TestReqParamsAPI.test(TestReqParamsAPI.java:67)
   [junit4]    > 	at org.apache.solr.BaseDistributedSearchTestCase$ShardsRepeatRule$ShardsFixedStatement.callStatement(BaseDistributedSearchTestCase.java:992)
   [junit4]    > 	at org.apache.solr.BaseDistributedSearchTestCase$ShardsRepeatRule$ShardsStatement.evaluate(BaseDistributedSearchTestCase.java:967)
   [junit4]    > 	at java.lang.Thread.run(Thread.java:745)
   [junit4]   2> 2986111 INFO  (SUITE-TestReqParamsAPI-seed#[4D3DC056018109F6]-worker) [    ] o.a.s.SolrTestCaseJ4 ###deleteCore
   [junit4]   2> NOTE: leaving temporary files on disk at: C:\Users\jenkins\workspace\Lucene-Solr-master-Windows\solr\build\solr-core\test\J1\temp\solr.handler.TestReqParamsAPI_4D3DC056018109F6-001
   [junit4]   2> Apr 01, 2016 8:51:49 AM com.carrotsearch.randomizedtesting.ThreadLeakControl checkThreadLeaks
   [junit4]   2> WARNING: Will linger awaiting termination of 1 leaked thread(s).
   [junit4]   2> NOTE: test params are: codec=Asserting(Lucene60): {}, docValues:{}, maxPointsInLeafNode=561, maxMBSortInHeap=5.159787021832804, sim=RandomSimilarity(queryNorm=false,coord=yes): {}, locale=fr-LU, timezone=America/Indiana/Vevay
   [junit4]   2> NOTE: Windows 10 10.0 amd64/Oracle Corporation 1.8.0_72 (64-bit)/cpus=3,threads=1,free=322539960,total=518979584
   [junit4]   2> NOTE: All tests run in this JVM: [BasicAuthIntegrationTest, DateFieldTest, TestExpandComponent, BitVectorTest, BJQParserTest, SolrCmdDistributorTest, ResponseLogComponentTest, TestCharFilters, TestExclusionRuleCollectionAccess, SaslZkACLProviderTest, DocValuesMissingTest, DeleteLastCustomShardedReplicaTest, TestNRTOpen, DirectUpdateHandlerOptimizeTest, TestDynamicFieldResource, DistributedTermsComponentTest, TestAuthorizationFramework, TestCustomSort, TestFileDictionaryLookup, OutOfBoxZkACLAndCredentialsProvidersTest, SearchHandlerTest, ParsingFieldUpdateProcessorsTest, SuggesterTest, InfoHandlerTest, TestTrieFacet, TestObjectReleaseTracker, TestFieldTypeResource, GraphQueryTest, QueryParsingTest, HdfsUnloadDistributedZkTest, TestSystemIdResolver, HdfsThreadLeakTest, DistributedFacetPivotLongTailTest, TestConfigReload, TestPerFieldSimilarity, TestRecovery, FieldAnalysisRequestHandlerTest, DistributedQueryComponentCustomSortTest, TestShortCircuitedRequests, HighlighterMaxOffsetTest, MinimalSchemaTest, SpellPossibilityIteratorTest, CollectionsAPISolrJTest, DistribJoinFromCollectionTest, TestQuerySenderListener, DistributedIntervalFacetingTest, MultiTermTest, TestManagedSchema, TestCloudSchemaless, DebugComponentTest, BasicFunctionalityTest, TestValueSourceCache, RAMDirectoryFactoryTest, TriLevelCompositeIdRoutingTest, BadIndexSchemaTest, TestCollapseQParserPlugin, DefaultValueUpdateProcessorTest, TestRangeQuery, TestTrackingShardHandlerFactory, AliasIntegrationTest, SynonymTokenizerTest, CleanupOldIndexTest, OverseerCollectionConfigSetProcessorTest, TestReversedWildcardFilterFactory, CurrencyFieldOpenExchangeTest, TestSolrConfigHandlerConcurrent, TestRuleBasedAuthorizationPlugin, BasicDistributedZk2Test, TestNonDefinedSimilarityFactory, HdfsDirectoryTest, HdfsRecoverLeaseTest, TestCustomDocTransformer, TermVectorComponentTest, DistribCursorPagingTest, ZkStateReaderTest, TestFieldResource, ResponseHeaderTest, ClassificationUpdateProcessorFactoryTest, ShardRoutingCustomTest, CollectionTooManyReplicasTest, TestConfigSetsAPIZkFailure, TestCSVResponseWriter, TestConfigOverlay, FullSolrCloudDistribCmdsTest, TestRandomFaceting, TestFilteredDocIdSet, TermVectorComponentDistributedTest, TestMissingGroups, HLLUtilTest, TestJsonFacets, TestExactStatsCache, TestShardHandlerFactory, TestFoldingMultitermQuery, ConfigSetsAPITest, SuggesterWFSTTest, LukeRequestHandlerTest, CoreAdminRequestStatusTest, TestCloudDeleteByQuery, StressHdfsTest, TestJoin, NoCacheHeaderTest, DistributedVersionInfoTest, DistributedFacetPivotSmallTest, TestSchemaVersionResource, RankQueryTest, TestFiltering, OutputWriterTest, CheckHdfsIndexTest, DistributedSuggestComponentTest, TestSolrIndexConfig, TestRealTimeGet, TestDynamicLoading, BinaryUpdateRequestHandlerTest, SolrCoreCheckLockOnStartupTest, TestAtomicUpdateErrorCases, HighlighterConfigTest, HdfsChaosMonkeyNothingIsSafeTest, TestOverriddenPrefixQueryForCustomFieldType, EchoParamsTest, TestUniqueKeyFieldResource, TestNamedUpdateProcessors, CollectionsAPIDistributedZkTest, TestConfigSetsAPI, TestBinaryField, RequestLoggingTest, SpellCheckComponentTest, TestDistributedMissingSort, TestStandardQParsers, ChangedSchemaMergeTest, FileBasedSpellCheckerTest, DistributedMLTComponentTest, TestJettySolrRunner, TestManagedSynonymFilterFactory, TestWriterPerf, TestUtils, SolrPluginUtilsTest, TestIndexSearcher, UUIDUpdateProcessorFallbackTest, CSVRequestHandlerTest, AnalyticsMergeStrategyTest, TestHdfsUpdateLog, TestManagedResource, ChaosMonkeySafeLeaderTest, UnloadDistributedZkTest, SyncSliceTest, OpenCloseCoreStressTest, LeaderElectionIntegrationTest, ShardRoutingTest, BasicZkTest, ClusterStateUpdateTest, TestZkChroot, ZkCLITest, TestDistributedSearch, DirectUpdateHandlerTest, ShowFileRequestHandlerTest, TestCoreDiscovery, TestExtendedDismaxParser, CoreAdminHandlerTest, DocValuesTest, TestPseudoReturnFields, TestWordDelimiterFilterFactory, DocValuesMultiTest, SolrInfoMBeanTest, TestSurroundQueryParser, TestQueryUtils, DocumentAnalysisRequestHandlerTest, TestOmitPositions, RequestHandlersTest, TestIndexingPerformance, TestSolrQueryParser, IndexSchemaRuntimeFieldTest, RegexBoostProcessorTest, TestCollationField, UpdateRequestProcessorFactoryTest, UniqFieldsUpdateProcessorFactoryTest, TestPartialUpdateDeduplication, TestPHPSerializedResponseWriter, TestComponentsName, TestBinaryResponseWriter, SOLR749Test, UpdateParamsTest, AlternateDirectoryTest, CopyFieldTest, SolrIndexConfigTest, TestStressRecovery, TestMergePolicyConfig, TestSolrDeletionPolicy2, TestDocSet, NumericFieldsTest, TestElisionMultitermQuery, TestFuzzyAnalyzedSuggestions, TestSolrCoreProperties, DirectSolrConnectionTest, NotRequiredUniqueKeyTest, TestLuceneMatchVersion, TestPhraseSuggestions, TestCodecSupport, TestSweetSpotSimilarityFactory, TestLMJelinekMercerSimilarityFactory, TestBM25SimilarityFactory, TestFastWriter, ResourceLoaderTest, TestFastOutputStream, OpenExchangeRatesOrgProviderTest, URLClassifyProcessorTest, TestCrossCoreJoin, TestSimpleTrackingShardHandler, AssignTest, AsyncCallRequestStatusResponseTest, CloudExitableDirectoryReaderTest, CollectionsAPIAsyncDistributedZkTest, CustomCollectionTest, LeaderInitiatedRecoveryOnCommitTest, MigrateRouteKeyTest, MultiThreadedOCPTest, OverseerStatusTest, RecoveryAfterSoftCommitTest, ReplicationFactorTest, RestartWhileUpdatingTest, RollingRestartTest, SolrXmlInZkTest, TestCloudInspectUtil, TestCloudPivotFacet, TestDistribDocBasedVersion, TestLeaderElectionZkExpiry, TestMiniSolrCloudCluster, TestRequestForwarding, TestSizeLimitedDistributedMap, TestTolerantUpdateProcessorCloud, TestTolerantUpdateProcessorRandomCloud, CachingDirectoryFactoryTest, DirectoryFactoryTest, ExitableDirectoryReaderTest, HdfsDirectoryFactoryTest, TestConfigSetImmutable, TestConfigSetProperties, TestConfigSets, TestImplicitCoreProperties, TestInfoStreamLogging, TestSolrDynamicMBean, TestReplicationHandlerBackup, TestReqParamsAPI]
   [junit4] Completed [499/584 (2!)] on J1 in 28.96s, 1 test, 1 failure <<< FAILURES!

[...truncated 306 lines...]
BUILD FAILED
C:\Users\jenkins\workspace\Lucene-Solr-master-Windows\build.xml:740: The following error occurred while executing this line:
C:\Users\jenkins\workspace\Lucene-Solr-master-Windows\build.xml:684: The following error occurred while executing this line:
C:\Users\jenkins\workspace\Lucene-Solr-master-Windows\build.xml:59: The following error occurred while executing this line:
C:\Users\jenkins\workspace\Lucene-Solr-master-Windows\solr\build.xml:233: The following error occurred while executing this line:
C:\Users\jenkins\workspace\Lucene-Solr-master-Windows\solr\common-build.xml:529: The following error occurred while executing this line:
C:\Users\jenkins\workspace\Lucene-Solr-master-Windows\lucene\common-build.xml:1457: The following error occurred while executing this line:
C:\Users\jenkins\workspace\Lucene-Solr-master-Windows\lucene\common-build.xml:1014: There were test failures: 584 suites (10 ignored), 2353 tests, 2 failures, 123 ignored (79 assumptions) [seed: 4D3DC056018109F6]

Total time: 79 minutes 16 seconds
Build step 'Invoke Ant' marked build as failure
Archiving artifacts
[WARNINGS] Skipping publisher since build result is FAILURE
Recording test results
Email was triggered for: Failure - Any
Sending email for trigger: Failure - Any



Mime
View raw message