lucene-dev mailing list archives

Site index · List index
Message view « Date » · « Thread »
Top « Date » · « Thread »
From Policeman Jenkins Server <jenk...@thetaphi.de>
Subject [JENKINS] Lucene-Solr-master-Solaris (64bit/jdk1.8.0) - Build # 548 - Still Failing!
Date Thu, 28 Apr 2016 07:21:11 GMT
Build: http://jenkins.thetaphi.de/job/Lucene-Solr-master-Solaris/548/
Java: 64bit/jdk1.8.0 -XX:-UseCompressedOops -XX:+UseConcMarkSweepGC

2 tests failed.
FAILED:  junit.framework.TestSuite.org.apache.solr.handler.TestSolrConfigHandlerCloud

Error Message:
1 thread leaked from SUITE scope at org.apache.solr.handler.TestSolrConfigHandlerCloud:     1) Thread[id=2456, name=Thread-474, state=TIMED_WAITING, group=TGRP-TestSolrConfigHandlerCloud]         at java.lang.Thread.sleep(Native Method)         at org.apache.solr.cloud.ZkSolrResourceLoader.openResource(ZkSolrResourceLoader.java:101)         at org.apache.solr.core.SolrResourceLoader.openSchema(SolrResourceLoader.java:333)         at org.apache.solr.schema.IndexSchemaFactory.create(IndexSchemaFactory.java:48)         at org.apache.solr.schema.IndexSchemaFactory.buildIndexSchema(IndexSchemaFactory.java:75)         at org.apache.solr.core.ConfigSetService.createIndexSchema(ConfigSetService.java:108)         at org.apache.solr.core.ConfigSetService.getConfig(ConfigSetService.java:79)         at org.apache.solr.core.CoreContainer.reload(CoreContainer.java:937)         at org.apache.solr.core.SolrCore.lambda$getConfListener$6(SolrCore.java:2489)         at org.apache.solr.core.SolrCore$$Lambda$55/1937889192.run(Unknown Source)         at org.apache.solr.cloud.ZkController$4.run(ZkController.java:2425)

Stack Trace:
com.carrotsearch.randomizedtesting.ThreadLeakError: 1 thread leaked from SUITE scope at org.apache.solr.handler.TestSolrConfigHandlerCloud: 
   1) Thread[id=2456, name=Thread-474, state=TIMED_WAITING, group=TGRP-TestSolrConfigHandlerCloud]
        at java.lang.Thread.sleep(Native Method)
        at org.apache.solr.cloud.ZkSolrResourceLoader.openResource(ZkSolrResourceLoader.java:101)
        at org.apache.solr.core.SolrResourceLoader.openSchema(SolrResourceLoader.java:333)
        at org.apache.solr.schema.IndexSchemaFactory.create(IndexSchemaFactory.java:48)
        at org.apache.solr.schema.IndexSchemaFactory.buildIndexSchema(IndexSchemaFactory.java:75)
        at org.apache.solr.core.ConfigSetService.createIndexSchema(ConfigSetService.java:108)
        at org.apache.solr.core.ConfigSetService.getConfig(ConfigSetService.java:79)
        at org.apache.solr.core.CoreContainer.reload(CoreContainer.java:937)
        at org.apache.solr.core.SolrCore.lambda$getConfListener$6(SolrCore.java:2489)
        at org.apache.solr.core.SolrCore$$Lambda$55/1937889192.run(Unknown Source)
        at org.apache.solr.cloud.ZkController$4.run(ZkController.java:2425)
	at __randomizedtesting.SeedInfo.seed([72331824A3FF58EE]:0)


FAILED:  org.apache.solr.handler.component.SpellCheckComponentTest.testNumericQuery

Error Message:
List size mismatch @ spellcheck/suggestions

Stack Trace:
java.lang.RuntimeException: List size mismatch @ spellcheck/suggestions
	at __randomizedtesting.SeedInfo.seed([72331824A3FF58EE:791F4FE43C36E441]:0)
	at org.apache.solr.SolrTestCaseJ4.assertJQ(SolrTestCaseJ4.java:868)
	at org.apache.solr.SolrTestCaseJ4.assertJQ(SolrTestCaseJ4.java:815)
	at org.apache.solr.handler.component.SpellCheckComponentTest.testNumericQuery(SpellCheckComponentTest.java:154)
	at sun.reflect.NativeMethodAccessorImpl.invoke0(Native Method)
	at sun.reflect.NativeMethodAccessorImpl.invoke(NativeMethodAccessorImpl.java:62)
	at sun.reflect.DelegatingMethodAccessorImpl.invoke(DelegatingMethodAccessorImpl.java:43)
	at java.lang.reflect.Method.invoke(Method.java:498)
	at com.carrotsearch.randomizedtesting.RandomizedRunner.invoke(RandomizedRunner.java:1764)
	at com.carrotsearch.randomizedtesting.RandomizedRunner$8.evaluate(RandomizedRunner.java:871)
	at com.carrotsearch.randomizedtesting.RandomizedRunner$9.evaluate(RandomizedRunner.java:907)
	at com.carrotsearch.randomizedtesting.RandomizedRunner$10.evaluate(RandomizedRunner.java:921)
	at com.carrotsearch.randomizedtesting.rules.SystemPropertiesRestoreRule$1.evaluate(SystemPropertiesRestoreRule.java:57)
	at org.apache.lucene.util.TestRuleSetupTeardownChained$1.evaluate(TestRuleSetupTeardownChained.java:49)
	at org.apache.lucene.util.AbstractBeforeAfterRule$1.evaluate(AbstractBeforeAfterRule.java:45)
	at org.apache.lucene.util.TestRuleThreadAndTestName$1.evaluate(TestRuleThreadAndTestName.java:48)
	at org.apache.lucene.util.TestRuleIgnoreAfterMaxFailures$1.evaluate(TestRuleIgnoreAfterMaxFailures.java:64)
	at org.apache.lucene.util.TestRuleMarkFailure$1.evaluate(TestRuleMarkFailure.java:47)
	at com.carrotsearch.randomizedtesting.rules.StatementAdapter.evaluate(StatementAdapter.java:36)
	at com.carrotsearch.randomizedtesting.ThreadLeakControl$StatementRunner.run(ThreadLeakControl.java:367)
	at com.carrotsearch.randomizedtesting.ThreadLeakControl.forkTimeoutingTask(ThreadLeakControl.java:809)
	at com.carrotsearch.randomizedtesting.ThreadLeakControl$3.evaluate(ThreadLeakControl.java:460)
	at com.carrotsearch.randomizedtesting.RandomizedRunner.runSingleTest(RandomizedRunner.java:880)
	at com.carrotsearch.randomizedtesting.RandomizedRunner$5.evaluate(RandomizedRunner.java:781)
	at com.carrotsearch.randomizedtesting.RandomizedRunner$6.evaluate(RandomizedRunner.java:816)
	at com.carrotsearch.randomizedtesting.RandomizedRunner$7.evaluate(RandomizedRunner.java:827)
	at com.carrotsearch.randomizedtesting.rules.StatementAdapter.evaluate(StatementAdapter.java:36)
	at com.carrotsearch.randomizedtesting.rules.SystemPropertiesRestoreRule$1.evaluate(SystemPropertiesRestoreRule.java:57)
	at org.apache.lucene.util.AbstractBeforeAfterRule$1.evaluate(AbstractBeforeAfterRule.java:45)
	at com.carrotsearch.randomizedtesting.rules.StatementAdapter.evaluate(StatementAdapter.java:36)
	at org.apache.lucene.util.TestRuleStoreClassName$1.evaluate(TestRuleStoreClassName.java:41)
	at com.carrotsearch.randomizedtesting.rules.NoShadowingOrOverridesOnMethodsRule$1.evaluate(NoShadowingOrOverridesOnMethodsRule.java:40)
	at com.carrotsearch.randomizedtesting.rules.NoShadowingOrOverridesOnMethodsRule$1.evaluate(NoShadowingOrOverridesOnMethodsRule.java:40)
	at com.carrotsearch.randomizedtesting.rules.StatementAdapter.evaluate(StatementAdapter.java:36)
	at com.carrotsearch.randomizedtesting.rules.StatementAdapter.evaluate(StatementAdapter.java:36)
	at com.carrotsearch.randomizedtesting.rules.StatementAdapter.evaluate(StatementAdapter.java:36)
	at org.apache.lucene.util.TestRuleAssertionsRequired$1.evaluate(TestRuleAssertionsRequired.java:53)
	at org.apache.lucene.util.TestRuleMarkFailure$1.evaluate(TestRuleMarkFailure.java:47)
	at org.apache.lucene.util.TestRuleIgnoreAfterMaxFailures$1.evaluate(TestRuleIgnoreAfterMaxFailures.java:64)
	at org.apache.lucene.util.TestRuleIgnoreTestSuites$1.evaluate(TestRuleIgnoreTestSuites.java:54)
	at com.carrotsearch.randomizedtesting.rules.StatementAdapter.evaluate(StatementAdapter.java:36)
	at com.carrotsearch.randomizedtesting.ThreadLeakControl$StatementRunner.run(ThreadLeakControl.java:367)
	at java.lang.Thread.run(Thread.java:745)




Build Log:
[...truncated 10539 lines...]
   [junit4] Suite: org.apache.solr.handler.TestSolrConfigHandlerCloud
   [junit4]   2> Creating dataDir: /export/home/jenkins/workspace/Lucene-Solr-master-Solaris/solr/build/solr-core/test/J1/temp/solr.handler.TestSolrConfigHandlerCloud_72331824A3FF58EE-001/init-core-data-001
   [junit4]   2> 79868 INFO  (SUITE-TestSolrConfigHandlerCloud-seed#[72331824A3FF58EE]-worker) [    ] o.a.s.SolrTestCaseJ4 Randomized ssl (false) and clientAuth (false)
   [junit4]   2> 79869 INFO  (SUITE-TestSolrConfigHandlerCloud-seed#[72331824A3FF58EE]-worker) [    ] o.a.s.BaseDistributedSearchTestCase Setting hostContext system property: /iuujy/wa
   [junit4]   2> 79872 INFO  (TEST-TestSolrConfigHandlerCloud.test-seed#[72331824A3FF58EE]) [    ] o.a.s.c.ZkTestServer STARTING ZK TEST SERVER
   [junit4]   2> 79872 INFO  (Thread-194) [    ] o.a.s.c.ZkTestServer client port:0.0.0.0/0.0.0.0:0
   [junit4]   2> 79872 INFO  (Thread-194) [    ] o.a.s.c.ZkTestServer Starting server
   [junit4]   2> 79972 INFO  (TEST-TestSolrConfigHandlerCloud.test-seed#[72331824A3FF58EE]) [    ] o.a.s.c.ZkTestServer start zk server on port:44376
   [junit4]   2> 79972 INFO  (TEST-TestSolrConfigHandlerCloud.test-seed#[72331824A3FF58EE]) [    ] o.a.s.c.c.SolrZkClient Using default ZkCredentialsProvider
   [junit4]   2> 79973 INFO  (TEST-TestSolrConfigHandlerCloud.test-seed#[72331824A3FF58EE]) [    ] o.a.s.c.c.ConnectionManager Waiting for client to connect to ZooKeeper
   [junit4]   2> 79984 INFO  (zkCallback-72-thread-1) [    ] o.a.s.c.c.ConnectionManager Watcher org.apache.solr.common.cloud.ConnectionManager@3f436b1c name:ZooKeeperConnection Watcher:127.0.0.1:44376 got event WatchedEvent state:SyncConnected type:None path:null path:null type:None
   [junit4]   2> 79984 INFO  (TEST-TestSolrConfigHandlerCloud.test-seed#[72331824A3FF58EE]) [    ] o.a.s.c.c.ConnectionManager Client is connected to ZooKeeper
   [junit4]   2> 79984 INFO  (TEST-TestSolrConfigHandlerCloud.test-seed#[72331824A3FF58EE]) [    ] o.a.s.c.c.SolrZkClient Using default ZkACLProvider
   [junit4]   2> 79984 INFO  (TEST-TestSolrConfigHandlerCloud.test-seed#[72331824A3FF58EE]) [    ] o.a.s.c.c.SolrZkClient makePath: /solr
   [junit4]   2> 80003 INFO  (TEST-TestSolrConfigHandlerCloud.test-seed#[72331824A3FF58EE]) [    ] o.a.s.c.c.SolrZkClient Using default ZkCredentialsProvider
   [junit4]   2> 80004 INFO  (TEST-TestSolrConfigHandlerCloud.test-seed#[72331824A3FF58EE]) [    ] o.a.s.c.c.ConnectionManager Waiting for client to connect to ZooKeeper
   [junit4]   2> 80026 INFO  (zkCallback-73-thread-1) [    ] o.a.s.c.c.ConnectionManager Watcher org.apache.solr.common.cloud.ConnectionManager@4227c5b8 name:ZooKeeperConnection Watcher:127.0.0.1:44376/solr got event WatchedEvent state:SyncConnected type:None path:null path:null type:None
   [junit4]   2> 80026 INFO  (TEST-TestSolrConfigHandlerCloud.test-seed#[72331824A3FF58EE]) [    ] o.a.s.c.c.ConnectionManager Client is connected to ZooKeeper
   [junit4]   2> 80026 INFO  (TEST-TestSolrConfigHandlerCloud.test-seed#[72331824A3FF58EE]) [    ] o.a.s.c.c.SolrZkClient Using default ZkACLProvider
   [junit4]   2> 80026 INFO  (TEST-TestSolrConfigHandlerCloud.test-seed#[72331824A3FF58EE]) [    ] o.a.s.c.c.SolrZkClient makePath: /collections/collection1
   [junit4]   2> 80042 INFO  (TEST-TestSolrConfigHandlerCloud.test-seed#[72331824A3FF58EE]) [    ] o.a.s.c.c.SolrZkClient makePath: /collections/collection1/shards
   [junit4]   2> 80044 INFO  (TEST-TestSolrConfigHandlerCloud.test-seed#[72331824A3FF58EE]) [    ] o.a.s.c.c.SolrZkClient makePath: /collections/control_collection
   [junit4]   2> 80046 INFO  (TEST-TestSolrConfigHandlerCloud.test-seed#[72331824A3FF58EE]) [    ] o.a.s.c.c.SolrZkClient makePath: /collections/control_collection/shards
   [junit4]   2> 80049 INFO  (TEST-TestSolrConfigHandlerCloud.test-seed#[72331824A3FF58EE]) [    ] o.a.s.c.AbstractZkTestCase put /export/home/jenkins/workspace/Lucene-Solr-master-Solaris/solr/core/src/test-files/solr/collection1/conf/solrconfig-tlog.xml to /configs/conf1/solrconfig.xml
   [junit4]   2> 80049 INFO  (TEST-TestSolrConfigHandlerCloud.test-seed#[72331824A3FF58EE]) [    ] o.a.s.c.c.SolrZkClient makePath: /configs/conf1/solrconfig.xml
   [junit4]   2> 80056 INFO  (TEST-TestSolrConfigHandlerCloud.test-seed#[72331824A3FF58EE]) [    ] o.a.s.c.AbstractZkTestCase put /export/home/jenkins/workspace/Lucene-Solr-master-Solaris/solr/core/src/test-files/solr/collection1/conf/schema.xml to /configs/conf1/schema.xml
   [junit4]   2> 80056 INFO  (TEST-TestSolrConfigHandlerCloud.test-seed#[72331824A3FF58EE]) [    ] o.a.s.c.c.SolrZkClient makePath: /configs/conf1/schema.xml
   [junit4]   2> 80062 INFO  (TEST-TestSolrConfigHandlerCloud.test-seed#[72331824A3FF58EE]) [    ] o.a.s.c.AbstractZkTestCase put /export/home/jenkins/workspace/Lucene-Solr-master-Solaris/solr/core/src/test-files/solr/collection1/conf/solrconfig.snippet.randomindexconfig.xml to /configs/conf1/solrconfig.snippet.randomindexconfig.xml
   [junit4]   2> 80062 INFO  (TEST-TestSolrConfigHandlerCloud.test-seed#[72331824A3FF58EE]) [    ] o.a.s.c.c.SolrZkClient makePath: /configs/conf1/solrconfig.snippet.randomindexconfig.xml
   [junit4]   2> 80065 INFO  (TEST-TestSolrConfigHandlerCloud.test-seed#[72331824A3FF58EE]) [    ] o.a.s.c.AbstractZkTestCase put /export/home/jenkins/workspace/Lucene-Solr-master-Solaris/solr/core/src/test-files/solr/collection1/conf/stopwords.txt to /configs/conf1/stopwords.txt
   [junit4]   2> 80066 INFO  (TEST-TestSolrConfigHandlerCloud.test-seed#[72331824A3FF58EE]) [    ] o.a.s.c.c.SolrZkClient makePath: /configs/conf1/stopwords.txt
   [junit4]   2> 80077 INFO  (TEST-TestSolrConfigHandlerCloud.test-seed#[72331824A3FF58EE]) [    ] o.a.s.c.AbstractZkTestCase put /export/home/jenkins/workspace/Lucene-Solr-master-Solaris/solr/core/src/test-files/solr/collection1/conf/protwords.txt to /configs/conf1/protwords.txt
   [junit4]   2> 80078 INFO  (TEST-TestSolrConfigHandlerCloud.test-seed#[72331824A3FF58EE]) [    ] o.a.s.c.c.SolrZkClient makePath: /configs/conf1/protwords.txt
   [junit4]   2> 80080 INFO  (TEST-TestSolrConfigHandlerCloud.test-seed#[72331824A3FF58EE]) [    ] o.a.s.c.AbstractZkTestCase put /export/home/jenkins/workspace/Lucene-Solr-master-Solaris/solr/core/src/test-files/solr/collection1/conf/currency.xml to /configs/conf1/currency.xml
   [junit4]   2> 80080 INFO  (TEST-TestSolrConfigHandlerCloud.test-seed#[72331824A3FF58EE]) [    ] o.a.s.c.c.SolrZkClient makePath: /configs/conf1/currency.xml
   [junit4]   2> 80082 INFO  (TEST-TestSolrConfigHandlerCloud.test-seed#[72331824A3FF58EE]) [    ] o.a.s.c.AbstractZkTestCase put /export/home/jenkins/workspace/Lucene-Solr-master-Solaris/solr/core/src/test-files/solr/collection1/conf/enumsConfig.xml to /configs/conf1/enumsConfig.xml
   [junit4]   2> 80082 INFO  (TEST-TestSolrConfigHandlerCloud.test-seed#[72331824A3FF58EE]) [    ] o.a.s.c.c.SolrZkClient makePath: /configs/conf1/enumsConfig.xml
   [junit4]   2> 80086 INFO  (TEST-TestSolrConfigHandlerCloud.test-seed#[72331824A3FF58EE]) [    ] o.a.s.c.AbstractZkTestCase put /export/home/jenkins/workspace/Lucene-Solr-master-Solaris/solr/core/src/test-files/solr/collection1/conf/open-exchange-rates.json to /configs/conf1/open-exchange-rates.json
   [junit4]   2> 80086 INFO  (TEST-TestSolrConfigHandlerCloud.test-seed#[72331824A3FF58EE]) [    ] o.a.s.c.c.SolrZkClient makePath: /configs/conf1/open-exchange-rates.json
   [junit4]   2> 80088 INFO  (TEST-TestSolrConfigHandlerCloud.test-seed#[72331824A3FF58EE]) [    ] o.a.s.c.AbstractZkTestCase put /export/home/jenkins/workspace/Lucene-Solr-master-Solaris/solr/core/src/test-files/solr/collection1/conf/mapping-ISOLatin1Accent.txt to /configs/conf1/mapping-ISOLatin1Accent.txt
   [junit4]   2> 80088 INFO  (TEST-TestSolrConfigHandlerCloud.test-seed#[72331824A3FF58EE]) [    ] o.a.s.c.c.SolrZkClient makePath: /configs/conf1/mapping-ISOLatin1Accent.txt
   [junit4]   2> 80090 INFO  (TEST-TestSolrConfigHandlerCloud.test-seed#[72331824A3FF58EE]) [    ] o.a.s.c.AbstractZkTestCase put /export/home/jenkins/workspace/Lucene-Solr-master-Solaris/solr/core/src/test-files/solr/collection1/conf/old_synonyms.txt to /configs/conf1/old_synonyms.txt
   [junit4]   2> 80091 INFO  (TEST-TestSolrConfigHandlerCloud.test-seed#[72331824A3FF58EE]) [    ] o.a.s.c.c.SolrZkClient makePath: /configs/conf1/old_synonyms.txt
   [junit4]   2> 80093 INFO  (TEST-TestSolrConfigHandlerCloud.test-seed#[72331824A3FF58EE]) [    ] o.a.s.c.AbstractZkTestCase put /export/home/jenkins/workspace/Lucene-Solr-master-Solaris/solr/core/src/test-files/solr/collection1/conf/synonyms.txt to /configs/conf1/synonyms.txt
   [junit4]   2> 80093 INFO  (TEST-TestSolrConfigHandlerCloud.test-seed#[72331824A3FF58EE]) [    ] o.a.s.c.c.SolrZkClient makePath: /configs/conf1/synonyms.txt
   [junit4]   2> 80582 INFO  (TEST-TestSolrConfigHandlerCloud.test-seed#[72331824A3FF58EE]) [    ] o.a.s.SolrTestCaseJ4 Writing core.properties file to /export/home/jenkins/workspace/Lucene-Solr-master-Solaris/solr/build/solr-core/test/J1/temp/solr.handler.TestSolrConfigHandlerCloud_72331824A3FF58EE-001/control-001/cores/collection1
   [junit4]   2> 80583 INFO  (TEST-TestSolrConfigHandlerCloud.test-seed#[72331824A3FF58EE]) [    ] o.e.j.s.Server jetty-9.3.8.v20160314
   [junit4]   2> 80585 INFO  (TEST-TestSolrConfigHandlerCloud.test-seed#[72331824A3FF58EE]) [    ] o.e.j.s.h.ContextHandler Started o.e.j.s.ServletContextHandler@3b4cbdd9{/iuujy/wa,null,AVAILABLE}
   [junit4]   2> 80586 INFO  (TEST-TestSolrConfigHandlerCloud.test-seed#[72331824A3FF58EE]) [    ] o.e.j.s.ServerConnector Started ServerConnector@650099a5{HTTP/1.1,[http/1.1]}{127.0.0.1:44965}
   [junit4]   2> 80602 INFO  (TEST-TestSolrConfigHandlerCloud.test-seed#[72331824A3FF58EE]) [    ] o.e.j.s.Server Started @83231ms
   [junit4]   2> 80602 INFO  (TEST-TestSolrConfigHandlerCloud.test-seed#[72331824A3FF58EE]) [    ] o.a.s.c.s.e.JettySolrRunner Jetty properties: {solr.data.dir=/export/home/jenkins/workspace/Lucene-Solr-master-Solaris/solr/build/solr-core/test/J1/temp/solr.handler.TestSolrConfigHandlerCloud_72331824A3FF58EE-001/tempDir-001/control/data, hostContext=/iuujy/wa, hostPort=44965, coreRootDirectory=/export/home/jenkins/workspace/Lucene-Solr-master-Solaris/solr/build/solr-core/test/J1/../../../../../../../../../../export/home/jenkins/workspace/Lucene-Solr-master-Solaris/solr/build/solr-core/test/J1/temp/solr.handler.TestSolrConfigHandlerCloud_72331824A3FF58EE-001/control-001/cores}
   [junit4]   2> 80604 INFO  (TEST-TestSolrConfigHandlerCloud.test-seed#[72331824A3FF58EE]) [    ] o.a.s.s.SolrDispatchFilter SolrDispatchFilter.init(): sun.misc.Launcher$AppClassLoader@6d06d69c
   [junit4]   2> 80604 INFO  (TEST-TestSolrConfigHandlerCloud.test-seed#[72331824A3FF58EE]) [    ] o.a.s.c.SolrResourceLoader new SolrResourceLoader for directory: '/export/home/jenkins/workspace/Lucene-Solr-master-Solaris/solr/build/solr-core/test/J1/temp/solr.handler.TestSolrConfigHandlerCloud_72331824A3FF58EE-001/control-001'
   [junit4]   2> 80604 INFO  (TEST-TestSolrConfigHandlerCloud.test-seed#[72331824A3FF58EE]) [    ] o.a.s.c.SolrResourceLoader JNDI not configured for solr (NoInitialContextEx)
   [junit4]   2> 80604 INFO  (TEST-TestSolrConfigHandlerCloud.test-seed#[72331824A3FF58EE]) [    ] o.a.s.c.SolrResourceLoader solr home defaulted to 'solr/' (could not find system property or JNDI)
   [junit4]   2> 80604 INFO  (TEST-TestSolrConfigHandlerCloud.test-seed#[72331824A3FF58EE]) [    ] o.a.s.c.c.SolrZkClient Using default ZkCredentialsProvider
   [junit4]   2> 80613 INFO  (TEST-TestSolrConfigHandlerCloud.test-seed#[72331824A3FF58EE]) [    ] o.a.s.c.c.ConnectionManager Waiting for client to connect to ZooKeeper
   [junit4]   2> 80621 INFO  (zkCallback-74-thread-1) [    ] o.a.s.c.c.ConnectionManager Watcher org.apache.solr.common.cloud.ConnectionManager@3222118 name:ZooKeeperConnection Watcher:127.0.0.1:44376/solr got event WatchedEvent state:SyncConnected type:None path:null path:null type:None
   [junit4]   2> 80621 INFO  (TEST-TestSolrConfigHandlerCloud.test-seed#[72331824A3FF58EE]) [    ] o.a.s.c.c.ConnectionManager Client is connected to ZooKeeper
   [junit4]   2> 80622 INFO  (TEST-TestSolrConfigHandlerCloud.test-seed#[72331824A3FF58EE]) [    ] o.a.s.c.c.SolrZkClient Using default ZkACLProvider
   [junit4]   2> 80658 INFO  (TEST-TestSolrConfigHandlerCloud.test-seed#[72331824A3FF58EE]) [    ] o.a.s.s.SolrDispatchFilter Loading solr.xml from SolrHome (not found in ZooKeeper)
   [junit4]   2> 80658 INFO  (TEST-TestSolrConfigHandlerCloud.test-seed#[72331824A3FF58EE]) [    ] o.a.s.c.SolrXmlConfig Loading container configuration from /export/home/jenkins/workspace/Lucene-Solr-master-Solaris/solr/build/solr-core/test/J1/temp/solr.handler.TestSolrConfigHandlerCloud_72331824A3FF58EE-001/control-001/solr.xml
   [junit4]   2> 80677 INFO  (TEST-TestSolrConfigHandlerCloud.test-seed#[72331824A3FF58EE]) [    ] o.a.s.c.CorePropertiesLocator Config-defined core root directory: /export/home/jenkins/workspace/Lucene-Solr-master-Solaris/solr/build/solr-core/test/J1/../../../../../../../../../../export/home/jenkins/workspace/Lucene-Solr-master-Solaris/solr/build/solr-core/test/J1/temp/solr.handler.TestSolrConfigHandlerCloud_72331824A3FF58EE-001/control-001/cores
   [junit4]   2> 80677 INFO  (TEST-TestSolrConfigHandlerCloud.test-seed#[72331824A3FF58EE]) [    ] o.a.s.c.CoreContainer New CoreContainer 1550138395
   [junit4]   2> 80677 INFO  (TEST-TestSolrConfigHandlerCloud.test-seed#[72331824A3FF58EE]) [    ] o.a.s.c.CoreContainer Loading cores into CoreContainer [instanceDir=/export/home/jenkins/workspace/Lucene-Solr-master-Solaris/solr/build/solr-core/test/J1/temp/solr.handler.TestSolrConfigHandlerCloud_72331824A3FF58EE-001/control-001]
   [junit4]   2> 80678 WARN  (TEST-TestSolrConfigHandlerCloud.test-seed#[72331824A3FF58EE]) [    ] o.a.s.c.CoreContainer Couldn't add files from /export/home/jenkins/workspace/Lucene-Solr-master-Solaris/solr/build/solr-core/test/J1/temp/solr.handler.TestSolrConfigHandlerCloud_72331824A3FF58EE-001/control-001/lib to classpath: /export/home/jenkins/workspace/Lucene-Solr-master-Solaris/solr/build/solr-core/test/J1/temp/solr.handler.TestSolrConfigHandlerCloud_72331824A3FF58EE-001/control-001/lib
   [junit4]   2> 80678 INFO  (TEST-TestSolrConfigHandlerCloud.test-seed#[72331824A3FF58EE]) [    ] o.a.s.h.c.HttpShardHandlerFactory created with socketTimeout : 90000,urlScheme : ,connTimeout : 15000,maxConnectionsPerHost : 20,maxConnections : 10000,corePoolSize : 0,maximumPoolSize : 2147483647,maxThreadIdleTime : 5,sizeOfQueue : -1,fairnessPolicy : false,
   [junit4]   2> 80680 INFO  (TEST-TestSolrConfigHandlerCloud.test-seed#[72331824A3FF58EE]) [    ] o.a.s.u.UpdateShardHandler Creating UpdateShardHandler HTTP client with params: 
   [junit4]   2> 80681 INFO  (TEST-TestSolrConfigHandlerCloud.test-seed#[72331824A3FF58EE]) [    ] o.a.s.l.LogWatcher SLF4J impl is org.slf4j.impl.Log4jLoggerFactory
   [junit4]   2> 80681 INFO  (TEST-TestSolrConfigHandlerCloud.test-seed#[72331824A3FF58EE]) [    ] o.a.s.l.LogWatcher Registering Log Listener [Log4j (org.slf4j.impl.Log4jLoggerFactory)]
   [junit4]   2> 80681 INFO  (TEST-TestSolrConfigHandlerCloud.test-seed#[72331824A3FF58EE]) [    ] o.a.s.c.ZkContainer Zookeeper client=127.0.0.1:44376/solr
   [junit4]   2> 80682 INFO  (TEST-TestSolrConfigHandlerCloud.test-seed#[72331824A3FF58EE]) [    ] o.a.s.c.ZkController zkHost includes chroot
   [junit4]   2> 80682 INFO  (TEST-TestSolrConfigHandlerCloud.test-seed#[72331824A3FF58EE]) [    ] o.a.s.c.c.SolrZkClient Using default ZkCredentialsProvider
   [junit4]   2> 80682 INFO  (TEST-TestSolrConfigHandlerCloud.test-seed#[72331824A3FF58EE]) [    ] o.a.s.c.c.ConnectionManager Waiting for client to connect to ZooKeeper
   [junit4]   2> 80732 INFO  (zkCallback-77-thread-1) [    ] o.a.s.c.c.ConnectionManager Watcher org.apache.solr.common.cloud.ConnectionManager@15425ea name:ZooKeeperConnection Watcher:127.0.0.1:44376 got event WatchedEvent state:SyncConnected type:None path:null path:null type:None
   [junit4]   2> 80733 INFO  (TEST-TestSolrConfigHandlerCloud.test-seed#[72331824A3FF58EE]) [    ] o.a.s.c.c.ConnectionManager Client is connected to ZooKeeper
   [junit4]   2> 80734 INFO  (TEST-TestSolrConfigHandlerCloud.test-seed#[72331824A3FF58EE]) [    ] o.a.s.c.c.SolrZkClient Using default ZkACLProvider
   [junit4]   2> 80743 INFO  (TEST-TestSolrConfigHandlerCloud.test-seed#[72331824A3FF58EE]) [n:127.0.0.1:44965_iuujy%2Fwa    ] o.a.s.c.ZkController Added new OnReconnect listener org.apache.solr.cloud.ZkController$$Lambda$50/578944638@2d235e99
   [junit4]   2> 80743 INFO  (TEST-TestSolrConfigHandlerCloud.test-seed#[72331824A3FF58EE]) [n:127.0.0.1:44965_iuujy%2Fwa    ] o.a.s.c.c.ConnectionManager Waiting for client to connect to ZooKeeper
   [junit4]   2> 80758 INFO  (zkCallback-78-thread-1-processing-n:127.0.0.1:44965_iuujy%2Fwa) [n:127.0.0.1:44965_iuujy%2Fwa    ] o.a.s.c.c.ConnectionManager Watcher org.apache.solr.common.cloud.ConnectionManager@500921 name:ZooKeeperConnection Watcher:127.0.0.1:44376/solr got event WatchedEvent state:SyncConnected type:None path:null path:null type:None
   [junit4]   2> 80758 INFO  (TEST-TestSolrConfigHandlerCloud.test-seed#[72331824A3FF58EE]) [n:127.0.0.1:44965_iuujy%2Fwa    ] o.a.s.c.c.ConnectionManager Client is connected to ZooKeeper
   [junit4]   2> 80768 INFO  (TEST-TestSolrConfigHandlerCloud.test-seed#[72331824A3FF58EE]) [n:127.0.0.1:44965_iuujy%2Fwa    ] o.a.s.c.c.SolrZkClient makePath: /overseer/queue
   [junit4]   2> 80775 INFO  (TEST-TestSolrConfigHandlerCloud.test-seed#[72331824A3FF58EE]) [n:127.0.0.1:44965_iuujy%2Fwa    ] o.a.s.c.c.SolrZkClient makePath: /overseer/collection-queue-work
   [junit4]   2> 80792 INFO  (TEST-TestSolrConfigHandlerCloud.test-seed#[72331824A3FF58EE]) [n:127.0.0.1:44965_iuujy%2Fwa    ] o.a.s.c.c.SolrZkClient makePath: /overseer/collection-map-running
   [junit4]   2> 80801 INFO  (TEST-TestSolrConfigHandlerCloud.test-seed#[72331824A3FF58EE]) [n:127.0.0.1:44965_iuujy%2Fwa    ] o.a.s.c.c.SolrZkClient makePath: /overseer/collection-map-completed
   [junit4]   2> 80804 INFO  (TEST-TestSolrConfigHandlerCloud.test-seed#[72331824A3FF58EE]) [n:127.0.0.1:44965_iuujy%2Fwa    ] o.a.s.c.c.SolrZkClient makePath: /overseer/collection-map-failure
   [junit4]   2> 80806 INFO  (TEST-TestSolrConfigHandlerCloud.test-seed#[72331824A3FF58EE]) [n:127.0.0.1:44965_iuujy%2Fwa    ] o.a.s.c.c.SolrZkClient makePath: /live_nodes
   [junit4]   2> 80809 INFO  (TEST-TestSolrConfigHandlerCloud.test-seed#[72331824A3FF58EE]) [n:127.0.0.1:44965_iuujy%2Fwa    ] o.a.s.c.c.SolrZkClient makePath: /aliases.json
   [junit4]   2> 80810 INFO  (TEST-TestSolrConfigHandlerCloud.test-seed#[72331824A3FF58EE]) [n:127.0.0.1:44965_iuujy%2Fwa    ] o.a.s.c.c.SolrZkClient makePath: /clusterstate.json
   [junit4]   2> 80812 INFO  (TEST-TestSolrConfigHandlerCloud.test-seed#[72331824A3FF58EE]) [n:127.0.0.1:44965_iuujy%2Fwa    ] o.a.s.c.c.SolrZkClient makePath: /security.json
   [junit4]   2> 80813 INFO  (TEST-TestSolrConfigHandlerCloud.test-seed#[72331824A3FF58EE]) [n:127.0.0.1:44965_iuujy%2Fwa    ] o.a.s.c.c.ZkStateReader Updating cluster state from ZooKeeper... 
   [junit4]   2> 80814 INFO  (TEST-TestSolrConfigHandlerCloud.test-seed#[72331824A3FF58EE]) [n:127.0.0.1:44965_iuujy%2Fwa    ] o.a.s.c.c.ZkStateReader Updated live nodes from ZooKeeper... (0) -> (0)
   [junit4]   2> 80817 INFO  (TEST-TestSolrConfigHandlerCloud.test-seed#[72331824A3FF58EE]) [n:127.0.0.1:44965_iuujy%2Fwa    ] o.a.s.c.c.SolrZkClient makePath: /overseer_elect
   [junit4]   2> 80818 INFO  (TEST-TestSolrConfigHandlerCloud.test-seed#[72331824A3FF58EE]) [n:127.0.0.1:44965_iuujy%2Fwa    ] o.a.s.c.c.SolrZkClient makePath: /overseer_elect/election
   [junit4]   2> 80820 INFO  (TEST-TestSolrConfigHandlerCloud.test-seed#[72331824A3FF58EE]) [n:127.0.0.1:44965_iuujy%2Fwa    ] o.a.s.c.Overseer Overseer (id=null) closing
   [junit4]   2> 80821 INFO  (TEST-TestSolrConfigHandlerCloud.test-seed#[72331824A3FF58EE]) [n:127.0.0.1:44965_iuujy%2Fwa    ] o.a.s.c.LeaderElector Joined leadership election with path: /overseer_elect/election/95802145318567940-127.0.0.1:44965_iuujy%2Fwa-n_0000000000
   [junit4]   2> 80821 INFO  (TEST-TestSolrConfigHandlerCloud.test-seed#[72331824A3FF58EE]) [n:127.0.0.1:44965_iuujy%2Fwa    ] o.a.s.c.OverseerElectionContext I am going to be the leader 127.0.0.1:44965_iuujy%2Fwa
   [junit4]   2> 80821 INFO  (TEST-TestSolrConfigHandlerCloud.test-seed#[72331824A3FF58EE]) [n:127.0.0.1:44965_iuujy%2Fwa    ] o.a.s.c.c.SolrZkClient makePath: /overseer_elect/leader
   [junit4]   2> 80822 INFO  (TEST-TestSolrConfigHandlerCloud.test-seed#[72331824A3FF58EE]) [n:127.0.0.1:44965_iuujy%2Fwa    ] o.a.s.c.Overseer Overseer (id=95802145318567940-127.0.0.1:44965_iuujy%2Fwa-n_0000000000) starting
   [junit4]   2> 80824 INFO  (TEST-TestSolrConfigHandlerCloud.test-seed#[72331824A3FF58EE]) [n:127.0.0.1:44965_iuujy%2Fwa    ] o.a.s.c.c.SolrZkClient makePath: /overseer/queue-work
   [junit4]   2> 80832 INFO  (TEST-TestSolrConfigHandlerCloud.test-seed#[72331824A3FF58EE]) [n:127.0.0.1:44965_iuujy%2Fwa    ] o.a.s.c.OverseerAutoReplicaFailoverThread Starting OverseerAutoReplicaFailoverThread autoReplicaFailoverWorkLoopDelay=10000 autoReplicaFailoverWaitAfterExpiration=30000 autoReplicaFailoverBadNodeExpiration=60000
   [junit4]   2> 80834 INFO  (OverseerCollectionConfigSetProcessor-95802145318567940-127.0.0.1:44965_iuujy%2Fwa-n_0000000000) [n:127.0.0.1:44965_iuujy%2Fwa    ] o.a.s.c.OverseerTaskProcessor Process current queue of overseer operations
   [junit4]   2> 80835 INFO  (TEST-TestSolrConfigHandlerCloud.test-seed#[72331824A3FF58EE]) [n:127.0.0.1:44965_iuujy%2Fwa    ] o.a.s.c.ZkController Register node as live in ZooKeeper:/live_nodes/127.0.0.1:44965_iuujy%2Fwa
   [junit4]   2> 80848 INFO  (OverseerStateUpdate-95802145318567940-127.0.0.1:44965_iuujy%2Fwa-n_0000000000) [n:127.0.0.1:44965_iuujy%2Fwa    ] o.a.s.c.Overseer Starting to work on the main queue
   [junit4]   2> 80853 INFO  (TEST-TestSolrConfigHandlerCloud.test-seed#[72331824A3FF58EE]) [n:127.0.0.1:44965_iuujy%2Fwa    ] o.a.s.c.c.SolrZkClient makePath: /live_nodes/127.0.0.1:44965_iuujy%2Fwa
   [junit4]   2> 80861 INFO  (zkCallback-78-thread-1-processing-n:127.0.0.1:44965_iuujy%2Fwa) [n:127.0.0.1:44965_iuujy%2Fwa    ] o.a.s.c.c.ZkStateReader A live node change: [WatchedEvent state:SyncConnected type:NodeChildrenChanged path:/live_nodes], has occurred - updating... (live nodes size: [0])
   [junit4]   2> 80861 INFO  (OverseerStateUpdate-95802145318567940-127.0.0.1:44965_iuujy%2Fwa-n_0000000000) [n:127.0.0.1:44965_iuujy%2Fwa    ] o.a.s.c.c.ZkStateReader Updated live nodes from ZooKeeper... (0) -> (1)
   [junit4]   2> 80874 INFO  (zkCallback-78-thread-1-processing-n:127.0.0.1:44965_iuujy%2Fwa) [n:127.0.0.1:44965_iuujy%2Fwa    ] o.a.s.c.c.ZkStateReader Updated live nodes from ZooKeeper... (1) -> (1)
   [junit4]   2> 80972 INFO  (TEST-TestSolrConfigHandlerCloud.test-seed#[72331824A3FF58EE]) [n:127.0.0.1:44965_iuujy%2Fwa    ] o.a.s.c.CoreContainer Security conf doesn't exist. Skipping setup for authorization module.
   [junit4]   2> 80972 INFO  (TEST-TestSolrConfigHandlerCloud.test-seed#[72331824A3FF58EE]) [n:127.0.0.1:44965_iuujy%2Fwa    ] o.a.s.c.CoreContainer No authentication plugin used.
   [junit4]   2> 80974 INFO  (TEST-TestSolrConfigHandlerCloud.test-seed#[72331824A3FF58EE]) [n:127.0.0.1:44965_iuujy%2Fwa    ] o.a.s.c.CorePropertiesLocator Looking for core definitions underneath /export/home/jenkins/workspace/Lucene-Solr-master-Solaris/solr/build/solr-core/test/J1/../../../../../../../../../../export/home/jenkins/workspace/Lucene-Solr-master-Solaris/solr/build/solr-core/test/J1/temp/solr.handler.TestSolrConfigHandlerCloud_72331824A3FF58EE-001/control-001/cores
   [junit4]   2> 80977 INFO  (TEST-TestSolrConfigHandlerCloud.test-seed#[72331824A3FF58EE]) [n:127.0.0.1:44965_iuujy%2Fwa    ] o.a.s.c.CoreDescriptor Created CoreDescriptor: {name=collection1, config=solrconfig.xml, transient=false, schema=schema.xml, loadOnStartup=true, configSetProperties=configsetprops.json, collection=control_collection, coreNodeName=, dataDir=data/, shard=}
   [junit4]   2> 80977 INFO  (TEST-TestSolrConfigHandlerCloud.test-seed#[72331824A3FF58EE]) [n:127.0.0.1:44965_iuujy%2Fwa    ] o.a.s.c.CorePropertiesLocator Found core collection1 in /export/home/jenkins/workspace/Lucene-Solr-master-Solaris/solr/build/solr-core/test/J1/../../../../../../../../../../export/home/jenkins/workspace/Lucene-Solr-master-Solaris/solr/build/solr-core/test/J1/temp/solr.handler.TestSolrConfigHandlerCloud_72331824A3FF58EE-001/control-001/cores/collection1
   [junit4]   2> 80977 INFO  (TEST-TestSolrConfigHandlerCloud.test-seed#[72331824A3FF58EE]) [n:127.0.0.1:44965_iuujy%2Fwa    ] o.a.s.c.CorePropertiesLocator Found 1 core definitions
   [junit4]   2> 80980 INFO  (TEST-TestSolrConfigHandlerCloud.test-seed#[72331824A3FF58EE]) [n:127.0.0.1:44965_iuujy%2Fwa    ] o.a.s.s.SolrDispatchFilter user.dir=/export/home/jenkins/workspace/Lucene-Solr-master-Solaris/solr/build/solr-core/test/J1
   [junit4]   2> 80980 INFO  (TEST-TestSolrConfigHandlerCloud.test-seed#[72331824A3FF58EE]) [n:127.0.0.1:44965_iuujy%2Fwa    ] o.a.s.s.SolrDispatchFilter SolrDispatchFilter.init() done
   [junit4]   2> 80981 INFO  (coreLoadExecutor-318-thread-1-processing-n:127.0.0.1:44965_iuujy%2Fwa) [n:127.0.0.1:44965_iuujy%2Fwa c:control_collection   x:collection1] o.a.s.c.ZkController publishing state=down
   [junit4]   2> 80981 INFO  (coreLoadExecutor-318-thread-1-processing-n:127.0.0.1:44965_iuujy%2Fwa) [n:127.0.0.1:44965_iuujy%2Fwa c:control_collection   x:collection1] o.a.s.c.ZkController numShards not found on descriptor - reading it from system property
   [junit4]   2> 80998 INFO  (coreLoadExecutor-318-thread-1-processing-n:127.0.0.1:44965_iuujy%2Fwa) [n:127.0.0.1:44965_iuujy%2Fwa c:control_collection   x:collection1] o.a.s.c.ZkController Collection control_collection not visible yet, but flagging it so a watch is registered when it becomes visible
   [junit4]   2> 80998 INFO  (coreLoadExecutor-318-thread-1-processing-n:127.0.0.1:44965_iuujy%2Fwa) [n:127.0.0.1:44965_iuujy%2Fwa c:control_collection   x:collection1] o.a.s.c.c.ZkStateReader addZkWatch [control_collection]
   [junit4]   2> 81011 INFO  (coreLoadExecutor-318-thread-1-processing-n:127.0.0.1:44965_iuujy%2Fwa) [n:127.0.0.1:44965_iuujy%2Fwa c:control_collection   x:collection1] o.a.s.c.c.ZkStateReader Deleting data for [control_collection]
   [junit4]   2> 81012 INFO  (OverseerStateUpdate-95802145318567940-127.0.0.1:44965_iuujy%2Fwa-n_0000000000) [n:127.0.0.1:44965_iuujy%2Fwa    ] o.a.s.c.Overseer processMessage: queueSize: 1, message = {
   [junit4]   2>   "core":"collection1",
   [junit4]   2>   "roles":null,
   [junit4]   2>   "base_url":"http://127.0.0.1:44965/iuujy/wa",
   [junit4]   2>   "node_name":"127.0.0.1:44965_iuujy%2Fwa",
   [junit4]   2>   "numShards":"1",
   [junit4]   2>   "state":"down",
   [junit4]   2>   "shard":null,
   [junit4]   2>   "collection":"control_collection",
   [junit4]   2>   "operation":"state"} current state version: 0
   [junit4]   2> 81016 INFO  (OverseerStateUpdate-95802145318567940-127.0.0.1:44965_iuujy%2Fwa-n_0000000000) [n:127.0.0.1:44965_iuujy%2Fwa    ] o.a.s.c.o.ReplicaMutator Update state numShards=1 message={
   [junit4]   2>   "core":"collection1",
   [junit4]   2>   "roles":null,
   [junit4]   2>   "base_url":"http://127.0.0.1:44965/iuujy/wa",
   [junit4]   2>   "node_name":"127.0.0.1:44965_iuujy%2Fwa",
   [junit4]   2>   "numShards":"1",
   [junit4]   2>   "state":"down",
   [junit4]   2>   "shard":null,
   [junit4]   2>   "collection":"control_collection",
   [junit4]   2>   "operation":"state"}
   [junit4]   2> 81021 INFO  (coreLoadExecutor-318-thread-1-processing-n:127.0.0.1:44965_iuujy%2Fwa) [n:127.0.0.1:44965_iuujy%2Fwa c:control_collection   x:collection1] o.a.s.c.ZkController look for our core node name
   [junit4]   2> 81024 INFO  (OverseerStateUpdate-95802145318567940-127.0.0.1:44965_iuujy%2Fwa-n_0000000000) [n:127.0.0.1:44965_iuujy%2Fwa    ] o.a.s.c.o.ClusterStateMutator building a new cName: control_collection
   [junit4]   2> 81026 INFO  (OverseerStateUpdate-95802145318567940-127.0.0.1:44965_iuujy%2Fwa-n_0000000000) [n:127.0.0.1:44965_iuujy%2Fwa    ] o.a.s.c.o.ReplicaMutator Assigning new node to shard shard=shard1
   [junit4]   2> 81029 INFO  (zkCallback-78-thread-1-processing-n:127.0.0.1:44965_iuujy%2Fwa) [n:127.0.0.1:44965_iuujy%2Fwa    ] o.a.s.c.c.ZkStateReader A cluster state change: [WatchedEvent state:SyncConnected type:NodeDataChanged path:/clusterstate.json], has occurred - updating... (live nodes size: [1])
   [junit4]   2> 82025 INFO  (coreLoadExecutor-318-thread-1-processing-n:127.0.0.1:44965_iuujy%2Fwa) [n:127.0.0.1:44965_iuujy%2Fwa c:control_collection   x:collection1] o.a.s.c.ZkController waiting to find shard id in clusterstate for collection1
   [junit4]   2> 82025 INFO  (coreLoadExecutor-318-thread-1-processing-n:127.0.0.1:44965_iuujy%2Fwa) [n:127.0.0.1:44965_iuujy%2Fwa c:control_collection   x:collection1] o.a.s.c.ZkController Check for collection zkNode:control_collection
   [junit4]   2> 82026 INFO  (coreLoadExecutor-318-thread-1-processing-n:127.0.0.1:44965_iuujy%2Fwa) [n:127.0.0.1:44965_iuujy%2Fwa c:control_collection   x:collection1] o.a.s.c.ZkController Collection zkNode exists
   [junit4]   2> 82026 INFO  (coreLoadExecutor-318-thread-1-processing-n:127.0.0.1:44965_iuujy%2Fwa) [n:127.0.0.1:44965_iuujy%2Fwa c:control_collection   x:collection1] o.a.s.c.c.ZkStateReader Load collection config from: [/collections/control_collection]
   [junit4]   2> 82027 INFO  (coreLoadExecutor-318-thread-1-processing-n:127.0.0.1:44965_iuujy%2Fwa) [n:127.0.0.1:44965_iuujy%2Fwa c:control_collection   x:collection1] o.a.s.c.c.ZkStateReader path=[/collections/control_collection] [configName]=[conf1] specified config exists in ZooKeeper
   [junit4]   2> 82027 INFO  (coreLoadExecutor-318-thread-1-processing-n:127.0.0.1:44965_iuujy%2Fwa) [n:127.0.0.1:44965_iuujy%2Fwa c:control_collection   x:collection1] o.a.s.c.SolrResourceLoader new SolrResourceLoader for directory: '/export/home/jenkins/workspace/Lucene-Solr-master-Solaris/solr/build/solr-core/test/J1/temp/solr.handler.TestSolrConfigHandlerCloud_72331824A3FF58EE-001/control-001/cores/collection1'
   [junit4]   2> 82028 INFO  (coreLoadExecutor-318-thread-1-processing-n:127.0.0.1:44965_iuujy%2Fwa) [n:127.0.0.1:44965_iuujy%2Fwa c:control_collection   x:collection1] o.a.s.c.SolrResourceLoader JNDI not configured for solr (NoInitialContextEx)
   [junit4]   2> 82028 INFO  (coreLoadExecutor-318-thread-1-processing-n:127.0.0.1:44965_iuujy%2Fwa) [n:127.0.0.1:44965_iuujy%2Fwa c:control_collection   x:collection1] o.a.s.c.SolrResourceLoader solr home defaulted to 'solr/' (could not find system property or JNDI)
   [junit4]   2> 82030 INFO  (coreLoadExecutor-318-thread-1-processing-n:127.0.0.1:44965_iuujy%2Fwa) [n:127.0.0.1:44965_iuujy%2Fwa c:control_collection   x:collection1] o.a.s.c.Config loaded config solrconfig.xml with version 0 
   [junit4]   2> 82038 INFO  (coreLoadExecutor-318-thread-1-processing-n:127.0.0.1:44965_iuujy%2Fwa) [n:127.0.0.1:44965_iuujy%2Fwa c:control_collection   x:collection1] o.a.s.c.SolrConfig current version of requestparams : -1
   [junit4]   2> 82051 INFO  (coreLoadExecutor-318-thread-1-processing-n:127.0.0.1:44965_iuujy%2Fwa) [n:127.0.0.1:44965_iuujy%2Fwa c:control_collection   x:collection1] o.a.s.c.SolrConfig Using Lucene MatchVersion: 7.0.0
   [junit4]   2> 82073 INFO  (coreLoadExecutor-318-thread-1-processing-n:127.0.0.1:44965_iuujy%2Fwa) [n:127.0.0.1:44965_iuujy%2Fwa c:control_collection   x:collection1] o.a.s.c.SolrConfig Loaded SolrConfig: solrconfig.xml
   [junit4]   2> 82082 INFO  (coreLoadExecutor-318-thread-1-processing-n:127.0.0.1:44965_iuujy%2Fwa) [n:127.0.0.1:44965_iuujy%2Fwa c:control_collection   x:collection1] o.a.s.s.IndexSchema [collection1] Schema name=test
   [junit4]   2> 82226 INFO  (coreLoadExecutor-318-thread-1-processing-n:127.0.0.1:44965_iuujy%2Fwa) [n:127.0.0.1:44965_iuujy%2Fwa c:control_collection   x:collection1] o.a.s.s.OpenExchangeRatesOrgProvider Initialized with rates=open-exchange-rates.json, refreshInterval=1440.
   [junit4]   2> 82235 INFO  (coreLoadExecutor-318-thread-1-processing-n:127.0.0.1:44965_iuujy%2Fwa) [n:127.0.0.1:44965_iuujy%2Fwa c:control_collection   x:collection1] o.a.s.s.IndexSchema default search field in schema is text
   [junit4]   2> 82237 INFO  (coreLoadExecutor-318-thread-1-processing-n:127.0.0.1:44965_iuujy%2Fwa) [n:127.0.0.1:44965_iuujy%2Fwa c:control_collection   x:collection1] o.a.s.s.IndexSchema unique key field: id
   [junit4]   2> 82252 INFO  (coreLoadExecutor-318-thread-1-processing-n:127.0.0.1:44965_iuujy%2Fwa) [n:127.0.0.1:44965_iuujy%2Fwa c:control_collection   x:collection1] o.a.s.s.FileExchangeRateProvider Reloading exchange rates from file currency.xml
   [junit4]   2> 82256 INFO  (coreLoadExecutor-318-thread-1-processing-n:127.0.0.1:44965_iuujy%2Fwa) [n:127.0.0.1:44965_iuujy%2Fwa c:control_collection   x:collection1] o.a.s.s.FileExchangeRateProvider Reloading exchange rates from file currency.xml
   [junit4]   2> 82261 INFO  (coreLoadExecutor-318-thread-1-processing-n:127.0.0.1:44965_iuujy%2Fwa) [n:127.0.0.1:44965_iuujy%2Fwa c:control_collection   x:collection1] o.a.s.s.OpenExchangeRatesOrgProvider Reloading exchange rates from open-exchange-rates.json
   [junit4]   2> 82263 INFO  (coreLoadExecutor-318-thread-1-processing-n:127.0.0.1:44965_iuujy%2Fwa) [n:127.0.0.1:44965_iuujy%2Fwa c:control_collection   x:collection1] o.a.s.s.OpenExchangeRatesOrgProvider Reloading exchange rates from open-exchange-rates.json
   [junit4]   2> 82266 INFO  (coreLoadExecutor-318-thread-1-processing-n:127.0.0.1:44965_iuujy%2Fwa) [n:127.0.0.1:44965_iuujy%2Fwa c:control_collection   x:collection1] o.a.s.c.ConfigSetProperties Did not find ConfigSet properties, assuming default properties: Can't find resource 'configsetprops.json' in classpath or '/configs/conf1', cwd=/export/home/jenkins/workspace/Lucene-Solr-master-Solaris/solr/build/solr-core/test/J1
   [junit4]   2> 82266 INFO  (coreLoadExecutor-318-thread-1-processing-n:127.0.0.1:44965_iuujy%2Fwa) [n:127.0.0.1:44965_iuujy%2Fwa c:control_collection   x:collection1] o.a.s.c.CoreContainer Creating SolrCore 'collection1' using configuration from collection control_collection
   [junit4]   2> 82266 INFO  (coreLoadExecutor-318-thread-1-processing-n:127.0.0.1:44965_iuujy%2Fwa) [n:127.0.0.1:44965_iuujy%2Fwa c:control_collection s:shard1 r:core_node1 x:collection1] o.a.s.c.SolrCore org.apache.solr.core.MockDirectoryFactory
   [junit4]   2> 82266 INFO  (coreLoadExecutor-318-thread-1-processing-n:127.0.0.1:44965_iuujy%2Fwa) [n:127.0.0.1:44965_iuujy%2Fwa c:control_collection s:shard1 r:core_node1 x:collection1] o.a.s.c.SolrCore [[collection1] ] Opening new SolrCore at [/export/home/jenkins/workspace/Lucene-Solr-master-Solaris/solr/build/solr-core/test/J1/temp/solr.handler.TestSolrConfigHandlerCloud_72331824A3FF58EE-001/control-001/cores/collection1], dataDir=[/export/home/jenkins/workspace/Lucene-Solr-master-Solaris/solr/build/solr-core/test/J1/../../../../../../../../../../export/home/jenkins/workspace/Lucene-Solr-master-Solaris/solr/build/solr-core/test/J1/temp/solr.handler.TestSolrConfigHandlerCloud_72331824A3FF58EE-001/control-001/cores/collection1/data/]
   [junit4]   2> 82266 INFO  (coreLoadExecutor-318-thread-1-processing-n:127.0.0.1:44965_iuujy%2Fwa) [n:127.0.0.1:44965_iuujy%2Fwa c:control_collection s:shard1 r:core_node1 x:collection1] o.a.s.c.JmxMonitoredMap JMX monitoring is enabled. Adding Solr mbeans to JMX Server: com.sun.jmx.mbeanserver.JmxMBeanServer@6ead7a4e
   [junit4]   2> 82267 INFO  (coreLoadExecutor-318-thread-1-processing-n:127.0.0.1:44965_iuujy%2Fwa) [n:127.0.0.1:44965_iuujy%2Fwa c:control_collection s:shard1 r:core_node1 x:collection1] o.a.s.c.CachingDirectoryFactory return new directory for /export/home/jenkins/workspace/Lucene-Solr-master-Solaris/solr/build/solr-core/test/J1/../../../../../../../../../../export/home/jenkins/workspace/Lucene-Solr-master-Solaris/solr/build/solr-core/test/J1/temp/solr.handler.TestSolrConfigHandlerCloud_72331824A3FF58EE-001/control-001/cores/collection1/data
   [junit4]   2> 82267 INFO  (coreLoadExecutor-318-thread-1-processing-n:127.0.0.1:44965_iuujy%2Fwa) [n:127.0.0.1:44965_iuujy%2Fwa c:control_collection s:shard1 r:core_node1 x:collection1] o.a.s.c.SolrCore New index directory detected: old=null new=/export/home/jenkins/workspace/Lucene-Solr-master-Solaris/solr/build/solr-core/test/J1/../../../../../../../../../../export/home/jenkins/workspace/Lucene-Solr-master-Solaris/solr/build/solr-core/test/J1/temp/solr.handler.TestSolrConfigHandlerCloud_72331824A3FF58EE-001/control-001/cores/collection1/data/index/
   [junit4]   2> 82267 WARN  (coreLoadExecutor-318-thread-1-processing-n:127.0.0.1:44965_iuujy%2Fwa) [n:127.0.0.1:44965_iuujy%2Fwa c:control_collection s:shard1 r:core_node1 x:collection1] o.a.s.c.SolrCore [collection1] Solr index directory '/export/home/jenkins/workspace/Lucene-Solr-master-Solaris/solr/build/solr-core/test/J1/../../../../../../../../../../export/home/jenkins/workspace/Lucene-Solr-master-Solaris/solr/build/solr-core/test/J1/temp/solr.handler.TestSolrConfigHandlerCloud_72331824A3FF58EE-001/control-001/cores/collection1/data/index' doesn't exist. Creating new index...
   [junit4]   2> 82267 INFO  (coreLoadExecutor-318-thread-1-processing-n:127.0.0.1:44965_iuujy%2Fwa) [n:127.0.0.1:44965_iuujy%2Fwa c:control_collection s:shard1 r:core_node1 x:collection1] o.a.s.c.CachingDirectoryFactory return new directory for /export/home/jenkins/workspace/Lucene-Solr-master-Solaris/solr/build/solr-core/test/J1/../../../../../../../../../../export/home/jenkins/workspace/Lucene-Solr-master-Solaris/solr/build/solr-core/test/J1/temp/solr.handler.TestSolrConfigHandlerCloud_72331824A3FF58EE-001/control-001/cores/collection1/data/index
   [junit4]   2> 82267 INFO  (coreLoadExecutor-318-thread-1-processing-n:127.0.0.1:44965_iuujy%2Fwa) [n:127.0.0.1:44965_iuujy%2Fwa c:control_collection s:shard1 r:core_node1 x:collection1] o.a.s.u.RandomMergePolicy RandomMergePolicy wrapping class org.apache.lucene.index.LogDocMergePolicy: [LogDocMergePolicy: minMergeSize=1000, mergeFactor=24, maxMergeSize=9223372036854775807, maxMergeSizeForForcedMerge=9223372036854775807, calibrateSizeByDeletes=true, maxMergeDocs=2147483647, maxCFSSegmentSizeMB=8.796093022207999E12, noCFSRatio=0.14100526388315454]
   [junit4]   2> 82268 INFO  (coreLoadExecutor-318-thread-1-processing-n:127.0.0.1:44965_iuujy%2Fwa) [n:127.0.0.1:44965_iuujy%2Fwa c:control_collection s:shard1 r:core_node1 x:collection1] o.a.s.c.SolrDeletionPolicy SolrDeletionPolicy.onCommit: commits: num=1
   [junit4]   2> 	commit{dir=MockDirectoryWrapper(RAMDirectory@7202879e lockFactory=org.apache.lucene.store.SingleInstanceLockFactory@3624f733),segFN=segments_1,generation=1}
   [junit4]   2> 82268 INFO  (coreLoadExecutor-318-thread-1-processing-n:127.0.0.1:44965_iuujy%2Fwa) [n:127.0.0.1:44965_iuujy%2Fwa c:control_collection s:shard1 r:core_node1 x:collection1] o.a.s.c.SolrDeletionPolicy newest commit generation = 1
   [junit4]   2> 82270 INFO  (OldIndexDirectoryCleanupThreadForCore-collection1) [n:127.0.0.1:44965_iuujy%2Fwa c:control_collection s:shard1 r:core_node1 x:collection1] o.a.s.c.SolrCore Looking for old index directories to cleanup for core collection1 in /export/home/jenkins/workspace/Lucene-Solr-master-Solaris/solr/build/solr-core/test/J1/../../../../../../../../../../export/home/jenkins/workspace/Lucene-Solr-master-Solaris/solr/build/solr-core/test/J1/temp/solr.handler.TestSolrConfigHandlerCloud_72331824A3FF58EE-001/control-001/cores/collection1/data/
   [junit4]   2> 82270 WARN  (OldIndexDirectoryCleanupThreadForCore-collection1) [n:127.0.0.1:44965_iuujy%2Fwa c:control_collection s:shard1 r:core_node1 x:collection1] o.a.s.c.DirectoryFactory /export/home/jenkins/workspace/Lucene-Solr-master-Solaris/solr/build/solr-core/test/J1/../../../../../../../../../../export/home/jenkins/workspace/Lucene-Solr-master-Solaris/solr/build/solr-core/test/J1/temp/solr.handler.TestSolrConfigHandlerCloud_72331824A3FF58EE-001/control-001/cores/collection1/data/ does not point to a valid data directory; skipping clean-up of old index directories.
   [junit4]   2> 82275 INFO  (coreLoadExecutor-318-thread-1-processing-n:127.0.0.1:44965_iuujy%2Fwa) [n:127.0.0.1:44965_iuujy%2Fwa c:control_collection s:shard1 r:core_node1 x:collection1] o.a.s.u.p.UpdateRequestProcessorChain creating updateRequestProcessorChain "nodistrib"
   [junit4]   2> 82275 INFO  (coreLoadExecutor-318-thread-1-processing-n:127.0.0.1:44965_iuujy%2Fwa) [n:127.0.0.1:44965_iuujy%2Fwa c:control_collection s:shard1 r:core_node1 x:collection1] o.a.s.u.p.UpdateRequestProcessorChain creating updateRequestProcessorChain "dedupe"
   [junit4]   2> 82275 INFO  (coreLoadExecutor-318-thread-1-processing-n:127.0.0.1:44965_iuujy%2Fwa) [n:127.0.0.1:44965_iuujy%2Fwa c:control_collection s:shard1 r:core_node1 x:collection1] o.a.s.u.p.UpdateRequestProcessorChain inserting DistributedUpdateProcessorFactory into updateRequestProcessorChain "dedupe"
   [junit4]   2> 82275 INFO  (coreLoadExecutor-318-thread-1-processing-n:127.0.0.1:44965_iuujy%2Fwa) [n:127.0.0.1:44965_iuujy%2Fwa c:control_collection s:shard1 r:core_node1 x:collection1] o.a.s.u.p.UpdateRequestProcessorChain creating updateRequestProcessorChain "stored_sig"
   [junit4]   2> 82276 INFO  (coreLoadExecutor-318-thread-1-processing-n:127.0.0.1:44965_iuujy%2Fwa) [n:127.0.0.1:44965_iuujy%2Fwa c:control_collection s:shard1 r:core_node1 x:collection1] o.a.s.u.p.UpdateRequestProcessorChain inserting DistributedUpdateProcessorFactory into updateRequestProcessorChain "stored_sig"
   [junit4]   2> 82276 INFO  (coreLoadExecutor-318-thread-1-processing-n:127.0.0.1:44965_iuujy%2Fwa) [n:127.0.0.1:44965_iuujy%2Fwa c:control_collection s:shard1 r:core_node1 x:collection1] o.a.s.u.p.UpdateRequestProcessorChain creating updateRequestProcessorChain "distrib-dup-test-chain-explicit"
   [junit4]   2> 82276 INFO  (coreLoadExecutor-318-thread-1-processing-n:127.0.0.1:44965_iuujy%2Fwa) [n:127.0.0.1:44965_iuujy%2Fwa c:control_collection s:shard1 r:core_node1 x:collection1] o.a.s.u.p.UpdateRequestProcessorChain creating updateRequestProcessorChain "distrib-dup-test-chain-implicit"
   [junit4]   2> 82276 INFO  (coreLoadExecutor-318-thread-1-processing-n:127.0.0.1:44965_iuujy%2Fwa) [n:127.0.0.1:44965_iuujy%2Fwa c:control_collection s:shard1 r:core_node1 x:collection1] o.a.s.u.p.UpdateRequestProcessorChain inserting DistributedUpdateProcessorFactory into updateRequestProcessorChain "distrib-dup-test-chain-implicit"
   [junit4]   2> 82276 INFO  (coreLoadExecutor-318-thread-1-processing-n:127.0.0.1:44965_iuujy%2Fwa) [n:127.0.0.1:44965_iuujy%2Fwa c:control_collection s:shard1 r:core_node1 x:collection1] o.a.s.c.SolrCore no updateRequestProcessorChain defined as default, creating implicit default
   [junit4]   2> 82276 WARN  (coreLoadExecutor-318-thread-1-processing-n:127.0.0.1:44965_iuujy%2Fwa) [n:127.0.0.1:44965_iuujy%2Fwa c:control_collection s:shard1 r:core_node1 x:collection1] o.a.s.c.RequestHandlers INVALID paramSet a in requestHandler {type = requestHandler,name = /dump,class = DumpRequestHandler,args = {defaults={a=A,b=B}}}
   [junit4]   2> 82278 INFO  (coreLoadExecutor-318-thread-1-processing-n:127.0.0.1:44965_iuujy%2Fwa) [n:127.0.0.1:44965_iuujy%2Fwa c:control_collection s:shard1 r:core_node1 x:collection1] o.a.s.h.l.XMLLoader xsltCacheLifetimeSeconds=60
   [junit4]   2> 82280 INFO  (coreLoadExecutor-318-thread-1-processing-n:127.0.0.1:44965_iuujy%2Fwa) [n:127.0.0.1:44965_iuujy%2Fwa c:control_collection s:shard1 r:core_node1 x:collection1] o.a.s.h.l.XMLLoader xsltCacheLifetimeSeconds=60
   [junit4]   2> 82282 INFO  (coreLoadExecutor-318-thread-1-processing-n:127.0.0.1:44965_iuujy%2Fwa) [n:127.0.0.1:44965_iuujy%2Fwa c:control_collection s:shard1 r:core_node1 x:collection1] o.a.s.h.l.XMLLoader xsltCacheLifetimeSeconds=60
   [junit4]   2> 82283 INFO  (coreLoadExecutor-318-thread-1-processing-n:127.0.0.1:44965_iuujy%2Fwa) [n:127.0.0.1:44965_iuujy%2Fwa c:control_collection s:shard1 r:core_node1 x:collection1] o.a.s.h.l.XMLLoader xsltCacheLifetimeSeconds=60
   [junit4]   2> 82294 INFO  (coreLoadExecutor-318-thread-1-processing-n:127.0.0.1:44965_iuujy%2Fwa) [n:127.0.0.1:44965_iuujy%2Fwa c:control_collection s:shard1 r:core_node1 x:collection1] o.a.s.c.RequestHandlers Registered paths: /admin/mbeans,standard,/dump,/update/csv,/sql,/update/json/docs,/admin/luke,/export,/admin/segments,/get,/admin/system,/replication,/admin/properties,/config,/stream,/schema,/admin/plugins,/admin/logging,/update/json,/admin/ping,/admin/threads,/update,/admin/file
   [junit4]   2> 82294 INFO  (coreLoadExecutor-318-thread-1-processing-n:127.0.0.1:44965_iuujy%2Fwa) [n:127.0.0.1:44965_iuujy%2Fwa c:control_collection s:shard1 r:core_node1 x:collection1] o.a.s.c.SolrCore Using default statsCache cache: org.apache.solr.search.stats.LocalStatsCache
   [junit4]   2> 82294 INFO  (coreLoadExecutor-318-thread-1-processing-n:127.0.0.1:44965_iuujy%2Fwa) [n:127.0.0.1:44965_iuujy%2Fwa c:control_collection s:shard1 r:core_node1 x:collection1] o.a.s.u.UpdateHandler Using UpdateLog implementation: org.apache.solr.update.UpdateLog
   [junit4]   2> 82294 INFO  (coreLoadExecutor-318-thread-1-processing-n:127.0.0.1:44965_iuujy%2Fwa) [n:127.0.0.1:44965_iuujy%2Fwa c:control_collection s:shard1 r:core_node1 x:collection1] o.a.s.u.UpdateLog Initializing UpdateLog: dataDir= defaultSyncLevel=FLUSH numRecordsToKeep=100 maxNumLogsToKeep=10 numVersionBuckets=65536
   [junit4]   2> 82295 INFO  (coreLoadExecutor-318-thread-1-processing-n:127.0.0.1:44965_iuujy%2Fwa) [n:127.0.0.1:44965_iuujy%2Fwa c:control_collection s:shard1 r:core_node1 x:collection1] o.a.s.u.CommitTracker Hard AutoCommit: disabled
   [junit4]   2> 82295 INFO  (coreLoadExecutor-318-thread-1-processing-n:127.0.0.1:44965_iuujy%2Fwa) [n:127.0.0.1:44965_iuujy%2Fwa c:control_collection s:shard1 r:core_node1 x:collection1] o.a.s.u.CommitTracker Soft AutoCommit: disabled
   [junit4]   2> 82296 INFO  (coreLoadExecutor-318-thread-1-processing-n:127.0.0.1:44965_iuujy%2Fwa) [n:127.0.0.1:44965_iuujy%2Fwa c:control_collection s:shard1 r:core_node1 x:collection1] o.a.s.u.RandomMergePolicy RandomMergePolicy wrapping class org.apache.lucene.index.LogDocMergePolicy: [LogDocMergePolicy: minMergeSize=1000, mergeFactor=44, maxMergeSize=9223372036854775807, maxMergeSizeForForcedMerge=9223372036854775807, calibrateSizeByDeletes=false, maxMergeDocs=2147483647, maxCFSSegmentSizeMB=8.796093022207999E12, noCFSRatio=1.0]
   [junit4]   2> 82296 INFO  (coreLoadExecutor-318-thread-1-processing-n:127.0.0.1:44965_iuujy%2Fwa) [n:127.0.0.1:44965_iuujy%2Fwa c:control_collection s:shard1 r:core_node1 x:collection1] o.a.s.c.SolrDeletionPolicy SolrDeletionPolicy.onInit: commits: num=1
   [junit4]   2> 	commit{dir=MockDirectoryWrapper(RAMDirectory@7202879e lockFactory=org.apache.lucene.store.SingleInstanceLockFactory@3624f733),segFN=segments_1,generation=1}
   [junit4]   2> 82296 INFO  (coreLoadExecutor-318-thread-1-processing-n:127.0.0.1:44965_iuujy%2Fwa) [n:127.0.0.1:44965_iuujy%2Fwa c:control_collection s:shard1 r:core_node1 x:collection1] o.a.s.c.SolrDeletionPolicy newest commit generation = 1
   [junit4]   2> 82297 INFO  (coreLoadExecutor-318-thread-1-processing-n:127.0.0.1:44965_iuujy%2Fwa) [n:127.0.0.1:44965_iuujy%2Fwa c:control_collection s:shard1 r:core_node1 x:collection1] o.a.s.s.SolrIndexSearcher Opening [Searcher@7aeebe6e[collection1] main]
   [junit4]   2> 82297 INFO  (coreLoadExecutor-318-thread-1-processing-n:127.0.0.1:44965_iuujy%2Fwa) [n:127.0.0.1:44965_iuujy%2Fwa c:control_collection s:shard1 r:core_node1 x:collection1] o.a.s.c.c.ZkStateReader Load collection config from: [/collections/control_collection]
   [junit4]   2> 82299 INFO  (coreLoadExecutor-318-thread-1-processing-n:127.0.0.1:44965_iuujy%2Fwa) [n:127.0.0.1:44965_iuujy%2Fwa c:control_collection s:shard1 r:core_node1 x:collection1] o.a.s.c.c.ZkStateReader path=[/collections/control_collection] [configName]=[conf1] specified config exists in ZooKeeper
   [junit4]   2> 82299 INFO  (coreLoadExecutor-318-thread-1-processing-n:127.0.0.1:44965_iuujy%2Fwa) [n:127.0.0.1:44965_iuujy%2Fwa c:control_collection s:shard1 r:core_node1 x:collection1] o.a.s.r.ManagedResourceStorage Setting up ZooKeeper-based storage for the RestManager with znodeBase: /configs/conf1
   [junit4]   2> 82301 INFO  (coreLoadExecutor-318-thread-1-processing-n:127.0.0.1:44965_iuujy%2Fwa) [n:127.0.0.1:44965_iuujy%2Fwa c:control_collection s:shard1 r:core_node1 x:collection1] o.a.s.r.ManagedResourceStorage Configured ZooKeeperStorageIO with znodeBase: /configs/conf1
   [junit4]   2> 82301 INFO  (coreLoadExecutor-318-thread-1-processing-n:127.0.0.1:44965_iuujy%2Fwa) [n:127.0.0.1:44965_iuujy%2Fwa c:control_collection s:shard1 r:core_node1 x:collection1] o.a.s.r.RestManager Initializing RestManager with initArgs: {}
   [junit4]   2> 82301 INFO  (coreLoadExecutor-318-thread-1-processing-n:127.0.0.1:44965_iuujy%2Fwa) [n:127.0.0.1:44965_iuujy%2Fwa c:control_collection s:shard1 r:core_node1 x:collection1] o.a.s.r.ManagedResourceStorage Reading _rest_managed.json using ZooKeeperStorageIO:path=/configs/conf1
   [junit4]   2> 82302 INFO  (coreLoadExecutor-318-thread-1-processing-n:127.0.0.1:44965_iuujy%2Fwa) [n:127.0.0.1:44965_iuujy%2Fwa c:control_collection s:shard1 r:core_node1 x:collection1] o.a.s.r.ManagedResourceStorage No data found for znode /configs/conf1/_rest_managed.json
   [junit4]   2> 82302 INFO  (coreLoadExecutor-318-thread-1-processing-n:127.0.0.1:44965_iuujy%2Fwa) [n:127.0.0.1:44965_iuujy%2Fwa c:control_collection s:shard1 r:core_node1 x:collection1] o.a.s.r.ManagedResourceStorage Loaded null at path _rest_managed.json using ZooKeeperStorageIO:path=/configs/conf1
   [junit4]   2> 82302 INFO  (coreLoadExecutor-318-thread-1-processing-n:127.0.0.1:44965_iuujy%2Fwa) [n:127.0.0.1:44965_iuujy%2Fwa c:control_collection s:shard1 r:core_node1 x:collection1] o.a.s.r.RestManager Initializing 0 registered ManagedResources
   [junit4]   2> 82302 INFO  (coreLoadExecutor-318-thread-1-processing-n:127.0.0.1:44965_iuujy%2Fwa) [n:127.0.0.1:44965_iuujy%2Fwa c:control_collection s:shard1 r:core_node1 x:collection1] o.a.s.h.ReplicationHandler Commits will be reserved for  10000
   [junit4]   2> 82303 INFO  (coreLoadExecutor-318-thread-1-processing-n:127.0.0.1:44965_iuujy%2Fwa) [n:127.0.0.1:44965_iuujy%2Fwa c:control_collection s:shard1 r:core_node1 x:collection1] o.a.s.u.UpdateLog Looking up max value of version field to seed version buckets
   [junit4]   2> 82303 INFO  (coreLoadExecutor-318-thread-1-processing-n:127.0.0.1:44965_iuujy%2Fwa) [n:127.0.0.1:44965_iuujy%2Fwa c:control_collection s:shard1 r:core_node1 x:collection1] o.a.s.u.VersionInfo Refreshing highest value of _version_ for 65536 version buckets from index
   [junit4]   2> 82303 INFO  (coreLoadExecutor-318-thread-1-processing-n:127.0.0.1:44965_iuujy%2Fwa) [n:127.0.0.1:44965_iuujy%2Fwa c:control_collection s:shard1 r:core_node1 x:collection1] o.a.s.u.VersionInfo No terms found for _version_, cannot seed version bucket highest value from index
   [junit4]   2> 82303 INFO  (coreLoadExecutor-318-thread-1-processing-n:127.0.0.1:44965_iuujy%2Fwa) [n:127.0.0.1:44965_iuujy%2Fwa c:control_collection s:shard1 r:core_node1 x:collection1] o.a.s.u.UpdateLog Could not find max version in index or recent updates, using new clock 1532834327645126656
   [junit4]   2> 82304 INFO  (coreLoadExecutor-318-thread-1-processing-n:127.0.0.1:44965_iuujy%2Fwa) [n:127.0.0.1:44965_iuujy%2Fwa c:control_collection s:shard1 r:core_node1 x:collection1] o.a.s.u.UpdateLog Took 1.0ms to seed version buckets with highest version 1532834327645126656
   [junit4]   2> 82304 INFO  (coreLoadExecutor-318-thread-1-processing-n:127.0.0.1:44965_iuujy%2Fwa) [n:127.0.0.1:44965_iuujy%2Fwa c:control_collection s:shard1 r:core_node1 x:collection1] o.a.s.c.ZkController watch zkdir /configs/conf1
   [junit4]   2> 82306 INFO  (coreLoadExecutor-318-thread-1-processing-n:127.0.0.1:44965_iuujy%2Fwa) [n:127.0.0.1:44965_iuujy%2Fwa c:control_collection s:shard1 r:core_node1 x:collection1] o.a.s.c.CoreContainer registering core: collection1
   [junit4]   2> 82307 INFO  (coreZkRegister-312-thread-1-processing-n:127.0.0.1:44965_iuujy%2Fwa x:collection1 s:shard1 c:control_collection r:core_node1) [n:127.0.0.1:44965_iuujy%2Fwa c:control_collection s:shard1 r:core_node1 x:collection1] o.a.s.c.ZkController Register replica - core:collection1 address:http://127.0.0.1:44965/iuujy/wa collection:control_collection shard:shard1
   [junit4]   2> 82310 INFO  (coreZkRegister-312-thread-1-processing-n:127.0.0.1:44965_iuujy%2Fwa x:collection1 s:shard1 c:control_collection r:core_node1) [n:127.0.0.1:44965_iuujy%2Fwa c:control_collection s:shard1 r:core_node1 x:collection1] o.a.s.c.c.SolrZkClient makePath: /collections/control_collection/leader_elect/shard1/election
   [junit4]   2> 82314 INFO  (searcherExecutor-319-thread-1-processing-n:127.0.0.1:44965_iuujy%2Fwa x:collection1 s:shard1 c:control_collection r:core_node1) [n:127.0.0.1:44965_iuujy%2Fwa c:control_collection s:shard1 r:core_node1 x:collection1] o.a.s.c.SolrCore [collection1] Registered new searcher Searcher@7aeebe6e[collection1] main{ExitableDirectoryReader(UninvertingDirectoryReader())}
   [junit4]   2> 82318 INFO  (coreZkRegister-312-thread-1-processing-n:127.0.0.1:44965_iuujy%2Fwa x:collection1 s:shard1 c:control_collection r:core_node1) [n:127.0.0.1:44965_iuujy%2Fwa c:control_collection s:shard1 r:core_node1 x:collection1] o.a.s.c.LeaderElector Joined leadership election with path: /collections/control_collection/leader_elect/shard1/election/95802145318567940-core_node1-n_0000000000
   [junit4]   2> 82319 INFO  (coreZkRegister-312-thread-1-processing-n:127.0.0.1:44965_iuujy%2Fwa x:collection1 s:shard1 c:control_collection r:core_node1) [n:127.0.0.1:44965_iuujy%2Fwa c:control_collection s:shard1 r:core_node1 x:collection1] o.a.s.c.ShardLeaderElectionContext Running the leader process for shard=shard1 and weAreReplacement=false and leaderVoteWait=10000
   [junit4]   2> 82323 INFO  (OverseerStateUpdate-95802145318567940-127.0.0.1:44965_iuujy%2Fwa-n_0000000000) [n:127.0.0.1:44965_iuujy%2Fwa    ] o.a.s.c.Overseer processMessage: queueSize: 1, message = {
   [junit4]   2>   "operation":"leader",
   [junit4]   2>   "shard":"shard1",
   [junit4]   2>   "collection":"control_collection"} current state version: 1
   [junit4]   2> 82324 INFO  (coreZkRegister-312-thread-1-processing-n:127.0.0.1:44965_iuujy%2Fwa x:collection1 s:shard1 c:control_collection r:core_node1) [n:127.0.0.1:44965_iuujy%2Fwa c:control_collection s:shard1 r:core_node1 x:collection1] o.a.s.c.ShardLeaderElectionContext Enough replicas found to continue.
   [junit4]   2> 82324 INFO  (coreZkRegister-312-thread-1-processing-n:127.0.0.1:44965_iuujy%2Fwa x:collection1 s:shard1 c:control_collection r:core_node1) [n:127.0.0.1:44965_iuujy%2Fwa c:control_collection s:shard1 r:core_node1 x:collection1] o.a.s.c.ShardLeaderElectionContext I may be the new leader - try and sync
   [junit4]   2> 82324 INFO  (coreZkRegister-312-thread-1-processing-n:127.0.0.1:44965_iuujy%2Fwa x:collection1 s:shard1 c:control_collection r:core_node1) [n:127.0.0.1:44965_iuujy%2Fwa c:control_collection s:shard1 r:core_node1 x:collection1] o.a.s.c.SyncStrategy Sync replicas to http://127.0.0.1:44965/iuujy/wa/collection1/
   [junit4]   2> 82324 INFO  (coreZkRegister-312-thread-1-processing-n:127.0.0.1:44965_iuujy%2Fwa x:collection1 s:shard1 c:control_collection r:core_node1) [n:127.0.0.1:44965_iuujy%2Fwa c:control_collection s:shard1 r:core_node1 x:collection1] o.a.s.c.SyncStrategy Sync Success - now sync replicas to me
   [junit4]   2> 82324 INFO  (coreZkRegister-312-thread-1-processing-n:127.0.0.1:44965_iuujy%2Fwa x:collection1 s:shard1 c:control_collection r:core_node1) [n:127.0.0.1:44965_iuujy%2Fwa c:control_collection s:shard1 r:core_node1 x:collection1] o.a.s.c.SyncStrategy http://127.0.0.1:44965/iuujy/wa/collection1/ has no replicas
   [junit4]   2> 82327 INFO  (coreZkRegister-312-thread-1-processing-n:127.0.0.1:44965_iuujy%2Fwa x:collection1 s:shard1 c:control_collection r:core_node1) [n:127.0.0.1:44965_iuujy%2Fwa c:control_collection s:shard1 r:core_node1 x:collection1] o.a.s.c.c.SolrZkClient makePath: /collections/control_collection/leaders/shard1
   [junit4]   2> 82331 INFO  (coreZkRegister-312-thread-1-processing-n:127.0.0.1:44965_iuujy%2Fwa x:collection1 s:shard1 c:control_collection r:core_node1) [n:127.0.0.1:44965_iuujy%2Fwa c:control_collection s:shard1 r:core_node1 x:collection1] o.a.s.c.ShardLeaderElectionContextBase Creating leader registration node /collections/control_collection/leaders/shard1/leader after winning as /collections/control_collection/leader_elect/shard1/election/95802145318567940-core_node1-n_0000000000
   [junit4]   2> 82335 INFO  (coreZkRegister-312-thread-1-processing-n:127.0.0.1:44965_iuujy%2Fwa x:collection1 s:shard1 c:control_collection r:core_node1) [n:127.0.0.1:44965_iuujy%2Fwa c:control_collection s:shard1 r:core_node1 x:collection1] o.a.s.c.ShardLeaderElectionContext I am the new leader: http://127.0.0.1:44965/iuujy/wa/collection1/ shard1
   [junit4]   2> 82337 INFO  (OverseerStateUpdate-95802145318567940-127.0.0.1:44965_iuujy%2Fwa-n_0000000000) [n:127.0.0.1:44965_iuujy%2Fwa    ] o.a.s.c.Overseer processMessage: queueSize: 1, message = {
   [junit4]   2>   "operation":"leader",
   [junit4]   2>   "shard":"shard1",
   [junit4]   2>   "collection":"control_collection",
   [junit4]   2>   "base_url":"http://127.0.0.1:44965/iuujy/wa",
   [junit4]   2>   "core":"collection1",
   [junit4]   2>   "state":"active"} current state version: 1
   [junit4]   2> 82441 INFO  (zkCallback-78-thread-1-processing-n:127.0.0.1:44965_iuujy%2Fwa) [n:127.0.0.1:44965_iuujy%2Fwa    ] o.a.s.c.c.ZkStateReader A cluster state change: [WatchedEvent state:SyncConnected type:NodeDataChanged path:/clusterstate.json], has occurred - updating... (live nodes size: [1])
   [junit4]   2> 82445 INFO  (coreZkRegister-312-thread-1-processing-n:127.0.0.1:44965_iuujy%2Fwa x:collection1 s:shard1 c:control_collection r:core_node1) [n:127.0.0.1:44965_iuujy%2Fwa c:control_collection s:shard1 r:core_node1 x:collection1] o.a.s.c.ZkController We are http://127.0.0.1:44965/iuujy/wa/collection1/ and leader is http://127.0.0.1:44965/iuujy/wa/collection1/
   [junit4]   2> 82445 INFO  (coreZkRegister-312-thread-1-processing-n:127.0.0.1:44965_iuujy%2Fwa x:collection1 s:shard1 c:control_collection r:core_node1) [n:127.0.0.1:44965_iuujy%2Fwa c:control_collection s:shard1 r:core_node1 x:collection1] o.a.s.c.ZkController No LogReplay needed for core=collection1 baseURL=http://127.0.0.1:44965/iuujy/wa
   [junit4]   2> 82445 INFO  (coreZkRegister-312-thread-1-processing-n:127.0.0.1:44965_iuujy%2Fwa x:collection1 s:shard1 c:control_collection r:core_node1) [n:127.0.0.1:44965_iuujy%2Fwa c:control_collection s:shard1 r:core_node1 x:collection1] o.a.s.c.ZkController I am the leader, no recovery necessary
   [junit4]   2> 82445 INFO  (coreZkRegister-312-thread-1-processing-n:127.0.0.1:44965_iuujy%2Fwa x:collection1 s:shard1 c:control_collection r:core_node1) [n:127.0.0.1:44965_iuujy%2Fwa c:control_collection s:shard1 r:core_node1 x:collection1] o.a.s.c.ZkController publishing state=active
   [junit4]   2> 82445 INFO  (coreZkRegister-312-thread-1-processing-n:127.0.0.1:44965_iuujy%2Fwa x:collection1 s:shard1 c:control_collection r:core_node1) [n:127.0.0.1:44965_iuujy%2Fwa c:control_collection s:shard1 r:core_node1 x:collection1] o.a.s.c.ZkController numShards not found on descriptor - reading it from system property
   [junit4]   2> 82449 INFO  (OverseerStateUpdate-95802145318567940-127.0.0.1:44965_iuujy%2Fwa-n_0000000000) [n:127.0.0.1:44965_iuujy%2Fwa    ] o.a.s.c.Overseer processMessage: queueSize: 1, message = {
   [junit4]   2>   "core":"collection1",
   [junit4]   2>   "core_node_name":"core_node1",
   [junit4]   2>   "roles":null,
   [junit4]   2>   "base_url":"http://127.0.0.1:44965/iuujy/wa",
   [junit4]   2>   "node_name":"127.0.0.1:44965_iuujy%2Fwa",
   [junit4]   2>   "numShards":"1",
   [junit4]   2>   "state":"active",
   [junit4]   2>   "shard":"shard1",
   [junit4]   2>   "collection":"control_collection",
   [junit4]   2>   "operation":"state"} current state version: 2
   [junit4]   2> 82450 INFO  (OverseerStateUpdate-95802145318567940-127.0.0.1:44965_iuujy%2Fwa-n_0000000000) [n:127.0.0.1:44965_iuujy%2Fwa    ] o.a.s.c.o.ReplicaMutator Update state numShards=1 message={
   [junit4]   2>   "core":"collection1",
   [junit4]   2>   "core_node_name":"core_node1",
   [junit4]   2>   "roles":null,
   [junit4]   2>   "base_url":"http://127.0.0.1:44965/iuujy/wa",
   [junit4]   2>   "node_name":"127.0.0.1:44965_iuujy%2Fwa",
   [junit4]   2>   "numShards":"1",
   [junit4]   2>   "state":"active",
   [junit4]   2>   "shard":"shard1",
   [junit4]   2>   "collection":"control_collection",
   [junit4]   2>   "operation":"state"}
   [junit4]   2> 82488 INFO  (TEST-TestSolrConfigHandlerCloud.test-seed#[72331824A3FF58EE]) [    ] o.a.s.c.c.SolrZkClient Using default ZkCredentialsProvider
   [junit4]   2> 82489 INFO  (TEST-TestSolrConfigHandlerCloud.test-seed#[72331824A3FF58EE]) [    ] o.a.s.c.c.ConnectionManager Waiting for client to connect to ZooKeeper
   [junit4]   2> 82492 INFO  (zkCallback-80-thread-1) [    ] o.a.s.c.c.ConnectionManager Watcher org.apache.solr.common.cloud.ConnectionManager@11b40693 name:ZooKeeperConnection Watcher:127.0.0.1:44376/solr got event WatchedEvent state:SyncConnected type:None path:null path:null type:None
   [junit4]   2> 82492 INFO  (TEST-TestSolrConfigHandlerCloud.test-seed#[72331824A3FF58EE]) [    ] o.a.s.c.c.ConnectionManager Client is connected to ZooKeeper
   [junit4]   2> 82493 INFO  (TEST-TestSolrConfigHandlerCloud.test-seed#[72331824A3FF58EE]) [    ] o.a.s.c.c.SolrZkClient Using default ZkACLProvider
   [junit4]   2> 82493 INFO  (TEST-TestSolrConfigHandlerCloud.test-seed#[72331824A3FF58EE]) [    ] o.a.s.c.c.ZkStateReader Updating cluster state from ZooKeeper... 
   [junit4]   2> 82496 INFO  (TEST-TestSolrConfigHandlerCloud.test-seed#[72331824A3FF58EE]) [    ] o.a.s.c.c.ZkStateReader Updated live nodes from ZooKeeper... (0) -> (1)
   [junit4]   2> 82497 INFO  (TEST-TestSolrConfigHandlerCloud.test-seed#[72331824A3FF58EE]) [    ] o.a.s.c.ChaosMonkey monkey: init - expire sessions:false cause connection loss:false
   [junit4]   2> 82498 INFO  (TEST-TestSolrConfigHandlerCloud.test-seed#[72331824A3FF58EE]) [    ] o.a.s.c.AbstractFullDistribZkTestBase Creating collection1 with stateFormat=2
   [junit4]   2> 82498 INFO  (TEST-TestSolrConfigHandlerCloud.test-seed#[72331824A3FF58EE]) [    ] o.a.s.c.c.SolrZkClient Using default ZkCredentialsProvider
   [junit4]   2> 82499 INFO  (TEST-TestSolrConfigHandlerCloud.test-seed#[72331824A3FF58EE]) [    ] o.a.s.c.c.ConnectionManager Waiting for client to connect to ZooKeeper
   [junit4]   2> 82503 INFO  (zkCallback-81-thread-1) [    ] o.a.s.c.c.ConnectionManager Watcher org.apache.solr.common.cloud.ConnectionManager@17816381 name:ZooKeeperConnection Watcher:127.0.0.1:44376/solr got event WatchedEvent state:SyncConnected type:None path:null path:null type:None
   [junit4]   2> 82503 INFO  (TEST-TestSolrConfigHandlerCloud.test-seed#[72331824A3FF58EE]) [    ] o.a.s.c.c.ConnectionManager Client is connected to ZooKeeper
   [junit4]   2> 82504 INFO  (TEST-TestSolrConfigHandlerCloud.test-seed#[72331824A3FF58EE]) [    ] o.a.s.c.c.SolrZkClient Using default ZkACLProvider
   [junit4]   2> 82509 INFO  (OverseerStateUpdate-95802145318567940-127.0.0.1:44965_iuujy%2Fwa-n_0000000000) [n:127.0.0.1:44965_iuujy%2Fwa    ] o.a.s.c.Overseer processMessage: queueSize: 1, message = {
   [junit4]   2>   "operation":"create",
   [junit4]   2>   "name":"collection1",
   [junit4]   2>   "numShards":"2",
   [junit4]   2>   "stateFormat":"2"} current state version: 2
   [junit4]   2> 82509 INFO  (OverseerStateUpdate-95802145318567940-127.0.0.1:44965_iuujy%2Fwa-n_0000000000) [n:127.0.0.1:44965_iuujy%2Fwa    ] o.a.s.c.o.ClusterStateMutator building a new cName: collection1
   [junit4]   2> 82516 INFO  (zkCallback-78-thread-1-processing-n:127.0.0.1:44965_iuujy%2Fwa) [n:127.0.0.1:44965_iuujy%2Fwa    ] o.a.s.c.c.ZkStateReader A cluster state change: [WatchedEvent state:SyncConnected type:NodeDataChanged path:/clusterstate.json], has occurred - updating... (live nodes size: [1])
   [junit4]   2> 82517 INFO  (zkCallback-80-thread-1) [    ] o.a.s.c.c.ZkStateReader A cluster state change: [WatchedEvent state:SyncConnected type:NodeDataChanged path:/clusterstate.json], has occurred - updating... (live nodes size: [1])
   [junit4]   2> 82618 INFO  (OverseerStateUpdate-95802145318567940-127.0.0.1:44965_iuujy%2Fwa-n_0000000000) [n:127.0.0.1:44965_iuujy%2Fwa    ] o.a.s.c.o.ZkStateWriter going to create_collection /collections/collection1/state.json
   [junit4]   2> 82658 INFO  (TEST-TestSolrConfigHandlerCloud.test-seed#[72331824A3FF58EE]) [    ] o.a.s.SolrTestCaseJ4 Writing core.properties file to /export/home/jenkins/workspace/Lucene-Solr-master-Solaris/solr/build/solr-core/test/J1/temp/solr.handler.TestSolrConfigHandlerCloud_72331824A3FF58EE-001/shard-1-001/cores/collection1
   [junit4]   2> 82658 INFO  (TEST-TestSolrConfigHandlerCloud.test-seed#[72331824A3FF58EE]) [    ] o.a.s.c.AbstractFullDistribZkTestBase create jetty 1 in directory /export/home/jenkins/workspace/Lucene-Solr-master-Solaris/solr/build/solr-core/test/J1/temp/solr.handler.TestSolrConfigHandlerCloud_72331824A3FF58EE-001/shard-1-001
   [junit4]   2> 82659 INFO  (TEST-TestSolrConfigHandlerCloud.test-seed#[72331824A3FF58EE]) [    ] o.e.j.s.Server jetty-9.3.8.v20160314
   [junit4]   2> 82662 INFO  (TEST-TestSolrConfigHandlerCloud.test-seed#[72331824A3FF58EE]) [    ] o.e.j.s.h.ContextHandler Started o.e.j.s.ServletContextHandler@8c2bd21{/iuujy/wa,null,AVAILABLE}
   [junit4]   2> 82663 INFO  (TEST-TestSolrConfigHandlerCloud.test-seed#[72331824A3FF58EE]) [    ] o.e.j.s.ServerConnector Started ServerConnector@7aa1518f{HTTP/1.1,[http/1.1]}{127.0.0.1:50509}
   [junit4]   2> 82663 INFO  (TEST-TestSolrConfigHandlerCloud.test-seed#[72331824A3FF58EE]) [    ] o.e.j.s.Server Started @85308ms
   [junit4]   2> 82663 INFO  (TEST-TestSolrConfigHandlerCloud.test-seed#[72331824A3FF58EE]) [    ] o.a.s.c.s.e.JettySolrRunner Jetty properties: {solr.data.dir=/export/home/jenkins/workspace/Lucene-Solr-master-Solaris/solr/build/solr-core/test/J1/temp/solr.handler.TestSolrConfigHandlerCloud_72331824A3FF58EE-001/tempDir-001/jetty1, solrconfig=solrconfig.xml, hostContext=/iuujy/wa, hostPort=50509, coreRootDirectory=/export/home/jenkins/workspace/Lucene-Solr-master-Solaris/solr/build/solr-core/test/J1/../../../../../../../../../../export/home/jenkins/workspace/Lucene-Solr-master-Solaris/solr/build/solr-core/test/J1/temp/solr.handler.TestSolrConfigHandlerCloud_72331824A3FF58EE-001/shard-1-001/cores}
   [junit4]   2> 82664 INFO  (TEST-TestSolrConfigHandlerCloud.test-seed#[72331824A3FF58EE]) [    ] o.a.s.s.SolrDispatchFilter SolrDispatchFilter.init(): sun.misc.Launcher$AppClassLoader@6d06d69c
   [junit4]   2> 82664 INFO  (TEST-TestSolrConfigHandlerCloud.test-seed#[72331824A3FF58EE]) [    ] o.a.s.c.SolrResourceLoader new SolrResourceLoader for directory: '/export/home/jenkins/workspace/Lucene-Solr-master-Solaris/solr/build/solr-core/test/J1/temp/solr.handler.TestSolrConfigHandlerCloud_72331824A3FF58EE-001/shard-1-001'
   [junit4]   2> 82664 INFO  (TEST-TestSolrConfigHandlerCloud.test-seed#[72331824A3FF58EE]) [    ] o.a.s.c.SolrResourceLoader JNDI not configured for solr (NoInitialContextEx)
   [junit4]   2> 82664 INFO  (TEST-TestSolrConfigHandlerCloud.test-seed#[72331824A3FF58EE]) [    ] o.a.s.c.SolrResourceLoader solr home defaulted to 'solr/' (could not find system property or JNDI)
   [junit4]   2> 82664 INFO  (TEST-TestSolrConfigHandlerCloud.test-seed#[72331824A3FF58EE]) [    ] o.a.s.c.c.SolrZkClient Using default ZkCredentialsProvider
   [junit4]   2> 82685 INFO  (TEST-TestSolrConfigHandlerCloud.test-seed#[72331824A3FF58EE]) [    ] o.a.s.c.c.ConnectionManager Waiting for client to connect to ZooKeeper
   [junit4]   2> 82688 INFO  (zkCallback-82-thread-1) [    ] o.a.s.c.c.ConnectionManager Watcher org.apache.solr.common.cloud.ConnectionManager@5eb2f571 name:ZooKeeperConnection Watcher:127.0.0.1:44376/solr got event WatchedEvent state:SyncConnected type:None path:null path:null type:None
   [junit4]   2> 82688 INFO  (TEST-TestSolrConfigHandlerCloud.test-seed#[72331824A3FF58EE]) [    ] o.a.s.c.c.ConnectionManager Client is connected to ZooKeeper
   [junit4]   2> 82689 INFO  (TEST-TestSolrConfigHandlerCloud.test-seed#[72331824A3FF58EE]) [    ] o.a.s.c.c.SolrZkClient Using default ZkACLProvider
   [junit4]   2> 82691 INFO  (TEST-TestSolrConfigHandlerCloud.test-seed#[72331824A3FF58EE]) [    ] o.a.s.s.SolrDispatchFilter Loading solr.xml from SolrHome (not found in ZooKeeper)
   [junit4]   2> 82691 INFO  (TEST-TestSolrConfigHandlerCloud.test-seed#[72331824A3FF58EE]) [    ] o.a.s.c.SolrXmlConfig Loading container configuration from /export/home/jenkins/workspace/Lucene-Solr-master-Solaris/solr/build/solr-core/test/J1/temp/solr.handler.TestSolrConfigHandlerCloud_72331824A3FF58EE-001/shard-1-001/solr.xml
   [junit4]   2> 82697 INFO  (TEST-TestSolrConfigHandlerCloud.test-seed#[72331824A3FF58EE]) [    ] o.a.s.c.CorePropertiesLocator Config-defined core root directory: /export/home/jenkins/workspace/Lucene-Solr-master-Solaris/solr/build/solr-core/test/J1/../../../../../../../../../../export/home/jenkins/workspace/Lucene-Solr-master-Solaris/solr/build/solr-core/test/J1/temp/solr.handler.TestSolrConfigHandlerCloud_72331824A3FF58EE-001/shard-1-001/cores
   [junit4]   2> 82698 INFO  (TEST-TestSolrConfigHandlerCloud.test-seed#[72331824A3FF58EE]) [    ] o.a.s.c.CoreContainer New CoreContainer 814574686
   [junit4]   2> 82698 INFO  (TEST-TestSolrConfigHandlerCloud.test-seed#[72331824A3FF58EE]) [    ] o.a.s.c.CoreContainer Loading cores into CoreContainer [instanceDir=/export/home/jenkins/workspace/Lucene-Solr-master-Solaris/solr/build/solr-core/test/J1/temp/solr.handler.TestSolrConfigHandlerCloud_72331824A3FF58EE-001/shard-1-001]
   [junit4]   2> 82698 WARN  (TEST-TestSolrConfigHandlerCloud.test-seed#[72331824A3FF58EE]) [    ] o.a.s.c.CoreContainer Couldn't add files from /export/home/jenkins/workspace/Lucene-Solr-master-Solaris/solr/build/solr-core/test/J1/temp/solr.handler.TestSolrConfigHandlerCloud_72331824A3FF58EE-001/shard-1-001/lib to classpath: /export/home/jenkins/workspace/Lucene-Solr-master-Solaris/solr/build/solr-core/test/J1/temp/solr.handler.TestSolrConfigHandlerCloud_72331824A3FF58EE-001/shard-1-001/lib
   [junit4]   2> 82698 INFO  (TEST-TestSolrConfigHandlerCloud.test-seed#[72331824A3FF58EE]) [    ] o.a.s.h.c.HttpShardHandlerFactory created with socketTimeout : 90000,urlScheme : ,connTimeout : 15000,maxConnectionsPerHost : 20,maxConnections : 10000,corePoolSize : 0,maximumPoolSize : 2147483647,maxThreadIdleTime : 5,sizeOfQueue : -1,fairnessPolicy : false,
   [junit4]   2> 82700 INFO  (TEST-TestSolrConfigHandlerCloud.test-seed#[72331824A3FF58EE]) [    ] o.a.s.u.UpdateShardHandler Creating UpdateShardHandler HTTP client with params: 
   [junit4]   2> 82700 INFO  (TEST-TestSolrConfigHandlerCloud.test-seed#[72331824A3FF58EE]) [    ] o.a.s.l.LogWatcher SLF4J impl is org.slf4j.impl.Log4jLoggerFactory
   [junit4]   2> 82701 INFO  (TEST-TestSolrConfigHandlerCloud.test-seed#[72331824A3FF58EE]) [    ] o.a.s.l.LogWatcher Registering Log Listener [Log4j (org.slf4j.impl.Log4jLoggerFactory)]
   [junit4]   2> 82701 INFO  (TEST-TestSolrConfigHandlerCloud.test-seed#[72331824A3FF58EE]) [    ] o.a.s.c.ZkContainer Zookeeper client=127.0.0.1:44376/solr
   [junit4]   2> 82701 INFO  (TEST-TestSolrConfigHandlerCloud.test-seed#[72331824A3FF58EE]) [    ] o.a.s.c.ZkController zkHost includes chroot
   [junit4]   2> 82701 INFO  (TEST-TestSolrConfigHandlerCloud.test-seed#[72331824A3FF58EE]) [    ] o.a.s.c.c.SolrZkClient Using default ZkCredentialsProvider
   [junit4]   2> 82701 INFO  (TEST-TestSolrConfigHandlerCloud.test-seed#[72331824A3FF58EE]) [    ] o.a.s.c.c.ConnectionManager Waiting for client to connect to ZooKeeper
   [junit4]   2> 82706 INFO  (zkCallback-85-thread-1) [    ] o.a.s.c.c.ConnectionManager Watcher org.apache.solr.common.cloud.ConnectionManager@2b588c9e name:ZooKeeperConnection Watcher:127.0.0.1:44376 got event WatchedEvent state:SyncConnected type:None path:null path:null type:None
   [junit4]   2> 82707 INFO  (TEST-TestSolrConfigHandlerCloud.test-seed#[72331824A3FF58EE]) [    ] o.a.s.c.c.ConnectionManager Client is connected to ZooKeeper
   [junit4]   2> 82707 INFO  (TEST-TestSolrConfigHandlerCloud.test-seed#[72331824A3FF58EE]) [    ] o.a.s.c.c.SolrZkClient Using default ZkACLProvider
   [junit4]   2> 82710 INFO  (TEST-TestSolrConfigHandlerCloud.test-seed#[72331824A3FF58EE]) [n:127.0.0.1:50509_iuujy%2Fwa    ] o.a.s.c.ZkController Added new OnReconnect listener org.apache.solr.cloud.ZkController$$Lambda$50/578944638@6937bf48
   [junit4]   2> 82711 INFO  (TEST-TestSolrConfigHandlerCloud.test-seed#[72331824A3FF58EE]) [n:127.0.0.1:50509_iuujy%2Fwa    ] o.a.s.c.c.ConnectionManager Waiting for client to connect to ZooKeeper
   [junit4]   2> 82714 INFO  (zkCallback-86-thread-1-processing-n:127.0.0.1:50509_iuujy%2Fwa) [n:127.0.0.1:50509_iuujy%2Fwa    ] o.a.s.c.c.ConnectionManager Watcher org.apache.solr.common.cloud.ConnectionManager@54e2a98b name:ZooKeeperConnection Watcher:127.0.0.1:44376/solr got event WatchedEvent state:SyncConnected type:None path:null path:null type:None
   [junit4]   2> 82714 INFO  (TEST-TestSolrConfigHandlerCloud.test-seed#[72331824A3FF58EE]) [n:127.0.0.1:50509_iuujy%2Fwa    ] o.a.s.c.c.ConnectionManager Client is connected to ZooKeeper
   [junit4]   2> 82726 INFO  (TEST-TestSolrConfigHandlerCloud.test-seed#[72331824A3FF58EE]) [n:127.0.0.1:50509_iuujy%2Fwa    ] o.a.s.c.c.ZkStateReader Updating cluster state from ZooKeeper... 
   [junit4]   2> 82730 INFO  (TEST-TestSolrConfigHandlerCloud.test-seed#[72331824A3FF58EE]) [n:127.0.0.1:50509_iuujy%2Fwa    ] o.a.s.c.c.ZkStateReader Updated live nodes from ZooKeeper... (0) -> (1)
   [junit4]   2> 82734 INFO  (TEST-TestSolrConfigHandlerCloud.test-seed#[72331824A3FF58EE]) [n:127.0.0.1:50509_iuujy%2Fwa    ] o.a.s.c.Overseer Overseer (id=null) closing
   [junit4]   2> 82735 INFO  (TEST-TestSolrConfigHandlerCloud.test-seed#[72331824A3FF58EE]) [n:127.0.0.1:50509_iuujy%2Fwa    ] o.a.s.c.LeaderElector Joined leadership election with path: /overseer_elect/election/95802145318567945-127.0.0.1:50509_iuujy%2Fwa-n_0000000001
   [junit4]   2> 82736 INFO  (TEST-TestSolrConfigHandlerCloud.test-seed#[72331824A3FF58EE]) [n:127.0.0.1:50509_iuujy%2Fwa    ] o.a.s.c.LeaderElector Watching path /overseer_elect/election/95802145318567940-127.0.0.1:44965_iuujy%2Fwa-n_0000000000 to know if I could be the leader
   [junit4]   2> 82736 INFO  (TEST-TestSolrConfigHandlerCloud.test-seed#[72331824A3FF58EE]) [n:127.0.0.1:50509_iuujy%2Fwa    ] o.a.s.c.ZkController Publish node=127.0.0.1:50509_iuujy%2Fwa as DOWN
   [junit4]   2> 82741 INFO  (OverseerStateUpdate-95802145318567940-127.0.0.1:44965_iuujy%2Fwa-n_0000000000) [n:127.0.0.1:44965_iuujy%2Fwa    ] o.a.s.c.Overseer processMessage: queueSize: 1, message = {
   [junit4]   2>   "operation":"downnode",
   [junit4]   2>   "node_name":"127.0.0.1:50509_iuujy%2Fwa"} current state version: 3
   [junit4]   2> 82741 INFO  (OverseerStateUpdate-95802145318567940-127.0.0.1:44965_iuujy%2Fwa-n_0000000000) [n:127.0.0.1:44965_iuujy%2Fwa    ] o.a.s.c.o.NodeMutator DownNode state invoked for node: 127.0.0.1:50509_iuujy%2Fwa
   [junit4]   2> 82742 INFO  (OverseerStateUpdate-95802145318567940-127.0.0.1:44965_iuujy%2Fwa-n_0000000000) [n:127.0.0.1:44965_iuujy%2Fwa    ] o.a.s.c.o.ZkStateWriter going to update_collection /collections/collection1/state.json version: 0
   [junit4]   2> 82850 INFO  (zkCallback-78-thread-1-processing-n:127.0.0.1:44965_iuujy%2Fwa) [n:127.0.0.1:44965_iuujy%2Fwa    ] o.a.s.c.c.ZkStateReader A cluster state change: [WatchedEvent state:SyncConnected type:NodeDataChanged path:/clusterstate.json], has occurred - updating... (live nodes size: [1])
   [junit4]   2> 82850 INFO  (zkCallback-80-thread-1) [    ] o.a.s.c.c.ZkStateReader A cluster state change: [WatchedEvent state:SyncConnected type:NodeDataChanged path:/clusterstate.json], has occurred - updating... (live nodes size: [1])
   [junit4]   2> 82851 INFO  (zkCallback-86-thread-1-processing-n:127.0.0.1:50509_iuujy%2Fwa) [n:127.0.0.1:50509_iuujy%2Fwa    ] o.a.s.c.c.ZkStateReader A cluster state change: [WatchedEvent state:SyncConnected type:NodeDataChanged path:/clusterstate.json], has occurred - updating... (live nodes size: [1])
   [junit4]   2> 83745 INFO  (TEST-TestSolrConfigHandlerCloud.test-seed#[72331824A3FF58EE]) [n:127.0.0.1:50509_iuujy%2Fwa    ] o.a.s.c.ZkController Register node as live in ZooKeeper:/live_nodes/127.0.0.1:50509_iuujy%2Fwa
   [junit4]   2> 83746 INFO  (TEST-TestSolrConfigHandlerCloud.test-seed#[72331824A3FF58EE]) [n:127.0.0.1:50509_iuujy%2Fwa    ] o.a.s.c.c.SolrZkClient makePath: /live_nodes/127.0.0.1:50509_iuujy%2Fwa
   [junit4]   2> 83749 INFO  (zkCallback-86-thread-1-processing-n:127.0.0.1:50509_iuujy%2Fwa) [n:127.0.0.1:50509_iuujy%2Fwa    ] o.a.s.c.c.ZkStateReader A live node change: [WatchedEvent state:SyncConnected type:NodeChildrenChanged path:/live_nodes], has occurred - updating... (live nodes size: [1])
   [junit4]   2> 83749 INFO  (zkCallback-80-thread-1) [    ] o.a.s.c.c.ZkStateReader A live node change: [WatchedEvent state:SyncConnected type:NodeChildrenChanged path:/live_nodes], has occurred - updating... (live nodes size: [1])
   [junit4]   2> 83749 INFO  (zkCallback-78-thread-1-processing-n:127.0.0.1:44965_iuujy%2Fwa) [n:127.0.0.1:44965_iuujy%2Fwa    ] o.a.s.c.c.ZkStateReader A live node change: [WatchedEvent state:SyncConnected type:NodeChildrenChanged path:/live_nodes], has occurred - updating... (live nodes size: [1])
   [junit4]   2> 83750 INFO  (zkCallback-86-thread-1-processing-n:127.0.0.1:50509_iuujy%2Fwa) [n:127.0.0.1:50509_iuujy%2Fwa    ] o.a.s.c.c.ZkStateReader Updated live nodes from ZooKeeper... (1) -> (2)
   [junit4]   2> 83750 INFO  (zkCallback-80-thread-1) [    ] o.a.s.c.c.ZkStateReader Updated live nodes from ZooKeeper... (1) -> (2)
   [junit4]   2> 83750 INFO  (zkCallback-78-thread-1-processing-n:127.0.0.1:44965_iuujy%2Fwa) [n:127.0.0.1:44965_iuujy%2Fwa    ] o.a.s.c.c.ZkStateReader Updated live nodes from ZooKeeper... (1) -> (2)
   [junit4]   2> 83806 INFO  (TEST-TestSolrConfigHandlerCloud.test-seed#[72331824A3FF58EE]) [n:127.0.0.1:50509_iuujy%2Fwa    ] o.a.s.c.CoreContainer Security conf doesn't exist. Skipping setup for authorization module.
   [junit4]   2> 83806 INFO  (TEST-TestSolrConfigHandlerCloud.test-seed#[72331824A3FF58EE]) [n:127.0.0.1:50509_iuujy%2Fwa    ] o.a.s.c.CoreContainer No authentication plugin used.
   [junit4]   2> 83807 INFO  (TEST-TestSolrConfigHandlerCloud.test-seed#[72331824A3FF58EE]) [n:127.0.0.1:50509_iuujy%2Fwa    ] o.a.s.c.CorePropertiesLocator Looking for core definitions underneath /export/home/jenkins/workspace/Lucene-Solr-master-Solaris/solr/build/solr-core/test/J1/../../../../../../../../../../export/home/jenkins/workspace/Lucene-Solr-master-Solaris/solr/build/solr-core/test/J1/temp/solr.handler.TestSolrConfigHandlerCloud_72331824A3FF58EE-001/shard-1-001/cores
   [junit4]   2> 83809 INFO  (TEST-TestSolrConfigHandlerCloud.test-seed#[72331824A3FF58EE]) [n:127.0.0.1:50509_iuujy%2Fwa    ] o.a.s.c.CoreDescriptor Created CoreDescriptor: {name=collection1, config=solrconfig.xml, transient=false, schema=schema.xml, loadOnStartup=true, configSetProperties=configsetprops.json, collection=collection1, coreNodeName=, dataDir=data/, shard=}
   [junit4]   2> 83809 INFO  (TEST-TestSolrConfigHandlerCloud.test-seed#[72331824A3FF58EE]) [n:127.0.0.1:50509_iuujy%2Fwa    ] o.a.s.c.CorePropertiesLocator Found core collection1 in /export/home/jenkins/workspace/Lucene-Solr-master-Solaris/solr/build/solr-core/test/J1/../../../../../../../../../../export/home/jenkins/workspace/Lucene-Solr-master-Solaris/solr/build/solr-core/test/J1/temp/solr.handler.TestSolrConfigHandlerCloud_72331824A3FF58EE-001/shard-1-001/cores/collection1
   [junit4]   2> 83809 INFO  (TEST-TestSolrConfigHandlerCloud.test-seed#[72331824A3FF58EE]) [n:127.0.0.1:50509_iuujy%2Fwa    ] o.a.s.c.CorePropertiesLocator Found 1 core definitions
   [junit4]   2> 83811 INFO  (TEST-TestSolrConfigHandlerCloud.test-seed#[72331824A3FF58EE]) [n:127.0.0.1:50509_iuujy%2Fwa    ] o.a.s.s.SolrDispatchFilter user.dir=/export/home/jenkins/workspace/Lucene-Solr-master-Solaris/solr/build/solr-core/test/J1
   [junit4]   2> 83811 INFO  (TEST-TestSolrConfigHandlerCloud.test-seed#[72331824A3FF58EE]) [n:127.0.0.1:50509_iuujy%2Fwa    ] o.a.s.s.SolrDispatchFilter SolrDispatchFilter.init() done
   [junit4]   2> 83812 INFO  (coreLoadExecutor-329-thread-1-processing-n:127.0.0.1:50509_iuujy%2Fwa) [n:127.0.0.1:50509_iuujy%2Fwa c:collection1   x:collection1] o.a.s.c.ZkController publishing state=down
   [junit4]   2> 83812 INFO  (coreLoadExecutor-329-thread-1-processing-n:127.0.0.1:50509_iuujy%2Fwa) [n:127.0.0.1:50509_iuujy%2Fwa c:collection1   x:collection1] o.a.s.c.ZkController numShards not found on descriptor - reading it from system property
   [junit4]   2> 83814 INFO  (coreLoadExecutor-329-thread-1-processing-n:127.0.0.1:50509_iuujy%2Fwa) [n:127.0.0.1:50509_iuujy%2Fwa c:collection1   x:collection1] o.a.s.c.ZkController Registering watch for collection collection1
   [junit4]   2> 83814 INFO  (coreLoadExecutor-329-thread-1-processing-n:127.0.0.1:50509_iuujy%2Fwa) [n:127.0.0.1:50509_iuujy%2Fwa c:collection1   x:collection1] o.a.s.c.c.ZkStateReader addZkWatch [collection1]
   [junit4]   2> 83815 INFO  (coreLoadExecutor-329-thread-1-processing-n:127.0.0.1:50509_iuujy%2Fwa) [n:127.0.0.1:50509_iuujy%2Fwa c:collection1   x:collection1] o.a.s.c.c.ZkStateReader Add data for [collection1] ver [1]
   [junit4]   2> 83815 INFO  (coreLoadExecutor-329-thread-1-processing-n:127.0.0.1:50509_iuujy%2Fwa) [n:127.0.0.1:50509_iuujy%2Fwa c:collection1   x:collection1] o.a.s.c.ZkController look for our core node name
   [junit4]   2> 83816 INFO  (OverseerStateUpdate-95802145318567940-127.0.0.1:44965_iuujy%2Fwa-n_0000000000) [n:127.0.0.1:44965_iuujy%2Fwa    ] o.a.s.c.Overseer processMessage: queueSize: 1, message = {
   [junit4]   2>   "core":"collection1",
   [junit4]   2>   "roles":null,
   [junit4]   2>   "base_url":"http://127.0.0.1:50509/iuujy/wa",
   [junit4]   2>   "node_name":"127.0.0.1:50509_iuujy%2Fwa",
   [junit4]   2>   "numShards":"2",
   [junit4]   2>   "state":"down",
   [junit4]   2>   "shard":null,
   [junit4]   2>   "collection":"collection1",
   [junit4]   2>   "op

[...truncated too long message...]

eckComponent Building spell index for spell checker: freq
   [junit4]   2> 1865470 INFO  (searcherExecutor-7413-thread-1) [    ] o.a.s.h.c.SpellCheckComponent Building spell index for spell checker: fqcn
   [junit4]   2> 1865495 INFO  (searcherExecutor-7413-thread-1) [    ] o.a.s.c.SolrCore [collection1] Registered new searcher Searcher@68ead640[collection1] main{ExitableDirectoryReader(UninvertingDirectoryReader())}
   [junit4]   2> 1865495 INFO  (TEST-SpellCheckComponentTest.testRebuildOnCommit-seed#[72331824A3FF58EE]) [    ] o.a.s.u.p.LogUpdateProcessorFactory [collection1]  webapp=null path=null params={}{commit=} 0 110
   [junit4]   2> 1865496 INFO  (SUITE-SpellCheckComponentTest-seed#[72331824A3FF58EE]-worker) [    ] o.a.s.SolrTestCaseJ4 ###deleteCore
   [junit4]   2> 1865496 INFO  (SUITE-SpellCheckComponentTest-seed#[72331824A3FF58EE]-worker) [    ] o.a.s.c.CoreContainer Shutting down CoreContainer instance=1595820183
   [junit4]   2> 1865496 INFO  (coreCloseExecutor-7417-thread-1) [    x:collection1] o.a.s.c.SolrCore [collection1]  CLOSING SolrCore org.apache.solr.core.SolrCore@bb7f28
   [junit4]   2> 1865496 INFO  (coreCloseExecutor-7417-thread-1) [    x:collection1] o.a.s.u.DirectUpdateHandler2 closing DirectUpdateHandler2{commits=24,autocommits=0,soft autocommits=0,optimizes=0,rollbacks=0,expungeDeletes=0,docsPending=0,adds=0,deletesById=0,deletesByQuery=0,errors=0,cumulative_adds=112,cumulative_deletesById=0,cumulative_deletesByQuery=11,cumulative_errors=0}
   [junit4]   2> 1865496 INFO  (coreCloseExecutor-7417-thread-1) [    x:collection1] o.a.s.u.SolrCoreState Closing SolrCoreState
   [junit4]   2> 1865496 INFO  (coreCloseExecutor-7417-thread-1) [    x:collection1] o.a.s.u.DefaultSolrCoreState SolrCoreState ref count has reached 0 - closing IndexWriter
   [junit4]   2> 1865496 INFO  (coreCloseExecutor-7417-thread-1) [    x:collection1] o.a.s.u.DefaultSolrCoreState closing IndexWriter with IndexWriterCloser
   [junit4]   2> 1865497 INFO  (coreCloseExecutor-7417-thread-1) [    x:collection1] o.a.s.c.SolrCore [collection1] Closing main searcher on request.
   [junit4]   2> 1865497 INFO  (coreCloseExecutor-7417-thread-1) [    x:collection1] o.a.s.c.CachingDirectoryFactory Closing MockDirectoryFactory - 2 directories currently being tracked
   [junit4]   2> 1865497 INFO  (coreCloseExecutor-7417-thread-1) [    x:collection1] o.a.s.c.CachingDirectoryFactory looking to close /export/home/jenkins/workspace/Lucene-Solr-master-Solaris/solr/build/solr-core/test/J0/temp/solr.handler.component.SpellCheckComponentTest_72331824A3FF58EE-001/init-core-data-001 [CachedDir<<refCount=0;path=/export/home/jenkins/workspace/Lucene-Solr-master-Solaris/solr/build/solr-core/test/J0/temp/solr.handler.component.SpellCheckComponentTest_72331824A3FF58EE-001/init-core-data-001;done=false>>]
   [junit4]   2> 1865497 INFO  (coreCloseExecutor-7417-thread-1) [    x:collection1] o.a.s.c.CachingDirectoryFactory Closing directory, CoreContainer#isShutdown=true
   [junit4]   2> 1865497 INFO  (coreCloseExecutor-7417-thread-1) [    x:collection1] o.a.s.c.CachingDirectoryFactory Closing directory: /export/home/jenkins/workspace/Lucene-Solr-master-Solaris/solr/build/solr-core/test/J0/temp/solr.handler.component.SpellCheckComponentTest_72331824A3FF58EE-001/init-core-data-001
   [junit4]   2> 1865497 INFO  (coreCloseExecutor-7417-thread-1) [    x:collection1] o.a.s.c.CachingDirectoryFactory looking to close /export/home/jenkins/workspace/Lucene-Solr-master-Solaris/solr/build/solr-core/test/J0/temp/solr.handler.component.SpellCheckComponentTest_72331824A3FF58EE-001/init-core-data-001/index [CachedDir<<refCount=0;path=/export/home/jenkins/workspace/Lucene-Solr-master-Solaris/solr/build/solr-core/test/J0/temp/solr.handler.component.SpellCheckComponentTest_72331824A3FF58EE-001/init-core-data-001/index;done=false>>]
   [junit4]   2> 1865497 INFO  (coreCloseExecutor-7417-thread-1) [    x:collection1] o.a.s.c.CachingDirectoryFactory Closing directory, CoreContainer#isShutdown=true
   [junit4]   2> 1865498 INFO  (coreCloseExecutor-7417-thread-1) [    x:collection1] o.a.s.c.CachingDirectoryFactory Closing directory: /export/home/jenkins/workspace/Lucene-Solr-master-Solaris/solr/build/solr-core/test/J0/temp/solr.handler.component.SpellCheckComponentTest_72331824A3FF58EE-001/init-core-data-001/index
   [junit4]   2> NOTE: leaving temporary files on disk at: /export/home/jenkins/workspace/Lucene-Solr-master-Solaris/solr/build/solr-core/test/J0/temp/solr.handler.component.SpellCheckComponentTest_72331824A3FF58EE-001
   [junit4]   2> NOTE: test params are: codec=CheapBastard, sim=RandomSimilarity(queryNorm=false,coord=no): {}, locale=el-CY, timezone=Asia/Gaza
   [junit4]   2> NOTE: SunOS 5.11 amd64/Oracle Corporation 1.8.0_92 (64-bit)/cpus=3,threads=1,free=166455040,total=518979584
   [junit4]   2> NOTE: All tests run in this JVM: [DocumentAnalysisRequestHandlerTest, DistribCursorPagingTest, DistribJoinFromCollectionTest, TestExpandComponent, BasicAuthIntegrationTest, TestGroupingSearch, SliceStateTest, TestExactStatsCache, TestObjectReleaseTracker, SyncSliceTest, TestDocumentBuilder, TestTolerantSearch, TestAnalyzedSuggestions, BasicDistributedZkTest, RollingRestartTest, TestDocSet, RequestLoggingTest, PreAnalyzedFieldTest, DocExpirationUpdateProcessorFactoryTest, CdcrRequestHandlerTest, ChaosMonkeyNothingIsSafeTest, TestWordDelimiterFilterFactory, ShardRoutingTest, TestFaceting, SaslZkACLProviderTest, TestStressLiveNodes, TestSQLHandler, UUIDFieldTest, TestHighFrequencyDictionaryFactory, DirectUpdateHandlerTest, IndexBasedSpellCheckerTest, DocumentBuilderTest, PrimitiveFieldTypeTest, TestFastLRUCache, SegmentsInfoRequestHandlerTest, TestExclusionRuleCollectionAccess, HighlighterTest, SharedFSAutoReplicaFailoverTest, UnloadDistributedZkTest, CdcrUpdateLogTest, TestSolr4Spatial2, HdfsChaosMonkeyNothingIsSafeTest, SpatialRPTFieldTypeTest, HighlighterMaxOffsetTest, AsyncMigrateRouteKeyTest, TestDynamicFieldResource, TestSolrQueryResponse, QueryElevationComponentTest, TestRandomCollapseQParserPlugin, JsonLoaderTest, JSONWriterTest, SuggestComponentTest, TestPostingsSolrHighlighter, TestSchemaVersionResource, BlockDirectoryTest, TestReplicaProperties, PolyFieldTest, OverseerStatusTest, GraphQueryTest, BigEndianAscendingWordDeserializerTest, TestConfigSetProperties, OutOfBoxZkACLAndCredentialsProvidersTest, TestStressLucene, CloudExitableDirectoryReaderTest, TestReloadDeadlock, ActionThrottleTest, TestOverriddenPrefixQueryForCustomFieldType, TestSchemaResource, ClusterStateUpdateTest, DOMUtilTest, ParsingFieldUpdateProcessorsTest, TestRequestStatusCollectionAPI, TestSimpleQParserPlugin, TestFileDictionaryLookup, HdfsDirectoryFactoryTest, SortSpecParsingTest, SOLR749Test, TestSizeLimitedDistributedMap, SolrIndexConfigTest, TriLevelCompositeIdRoutingTest, BitVectorTest, TestStressVersions, TestManagedSchema, SuggesterFSTTest, HdfsRestartWhileUpdatingTest, DistributedSpellCheckComponentTest, TestHashPartitioner, ChangedSchemaMergeTest, TestEmbeddedSolrServerConstructors, RequiredFieldsTest, QueryEqualityTest, TestNamedUpdateProcessors, FastVectorHighlighterTest, TestDistribIDF, OverseerTest, PeerSyncTest, TestLazyCores, TestElisionMultitermQuery, TestInitQParser, SmileWriterTest, TestSolrDeletionPolicy1, TestScoreJoinQPScore, DistributedSuggestComponentTest, TestMissingGroups, OverseerCollectionConfigSetProcessorTest, ResponseHeaderTest, TestSweetSpotSimilarityFactory, TestComponentsName, HdfsThreadLeakTest, TestOrdValues, TestLFUCache, TestAuthorizationFramework, AddSchemaFieldsUpdateProcessorFactoryTest, FullHLLTest, MBeansHandlerTest, CdcrReplicationDistributedZkTest, HdfsUnloadDistributedZkTest, HdfsCollectionsAPIDistributedZkTest, TestNRTOpen, SolrTestCaseJ4Test, DocValuesMissingTest, TestSolrCLIRunExample, DeleteShardTest, TestRandomRequestDistribution, TestReRankQParserPlugin, TestJmxIntegration, CurrencyFieldXmlFileTest, TestSchemaManager, TestShardHandlerFactory, CoreAdminRequestStatusTest, AlternateDirectoryTest, TestPseudoReturnFields, HLLUtilTest, TestTrackingShardHandlerFactory, SampleTest, TestCSVLoader, TestDocBasedVersionConstraints, DirectSolrSpellCheckerTest, IndexSchemaTest, BlockJoinFacetRandomTest, SystemInfoHandlerTest, AnalyticsQueryTest, CollectionsAPIDistributedZkTest, OpenCloseCoreStressTest, LeaderElectionIntegrationTest, RecoveryZkTest, TestReplicationHandler, TestRandomFaceting, TestZkChroot, TestRandomDVFaceting, ZkCLITest, TestDistributedSearch, TestStressReorder, HardAutoCommitTest, TestSolr4Spatial, SpellCheckComponentTest]
   [junit4] Completed [325/591 (2!)] on J0 in 8.35s, 11 tests, 1 error <<< FAILURES!

[...truncated 846 lines...]
BUILD FAILED
/export/home/jenkins/workspace/Lucene-Solr-master-Solaris/build.xml:740: The following error occurred while executing this line:
/export/home/jenkins/workspace/Lucene-Solr-master-Solaris/build.xml:684: The following error occurred while executing this line:
/export/home/jenkins/workspace/Lucene-Solr-master-Solaris/build.xml:59: The following error occurred while executing this line:
/export/home/jenkins/workspace/Lucene-Solr-master-Solaris/solr/build.xml:233: The following error occurred while executing this line:
/export/home/jenkins/workspace/Lucene-Solr-master-Solaris/solr/common-build.xml:529: The following error occurred while executing this line:
/export/home/jenkins/workspace/Lucene-Solr-master-Solaris/lucene/common-build.xml:1457: The following error occurred while executing this line:
/export/home/jenkins/workspace/Lucene-Solr-master-Solaris/lucene/common-build.xml:1014: There were test failures: 591 suites (10 ignored), 2388 tests, 1 suite-level error, 1 error, 86 ignored (71 assumptions) [seed: 72331824A3FF58EE]

Total time: 77 minutes 36 seconds
Build step 'Invoke Ant' marked build as failure
Archiving artifacts
[WARNINGS] Skipping publisher since build result is FAILURE
Recording test results
Email was triggered for: Failure - Any
Sending email for trigger: Failure - Any



Mime
View raw message