lucene-dev mailing list archives

Site index · List index
Message view « Date » · « Thread »
Top « Date » · « Thread »
From Policeman Jenkins Server <jenk...@thetaphi.de>
Subject [JENKINS] Lucene-Solr-master-Solaris (64bit/jdk1.8.0) - Build # 493 - Still Failing!
Date Fri, 01 Apr 2016 05:58:44 GMT
Build: http://jenkins.thetaphi.de/job/Lucene-Solr-master-Solaris/493/
Java: 64bit/jdk1.8.0 -XX:-UseCompressedOops -XX:+UseG1GC

1 tests failed.
FAILED:  org.apache.solr.core.TestArbitraryIndexDir.testLoadNewIndexDir

Error Message:
Exception during query

Stack Trace:
java.lang.RuntimeException: Exception during query
	at __randomizedtesting.SeedInfo.seed([F6EF260CDB14ECFB:1FB59D34458D7C53]:0)
	at org.apache.solr.SolrTestCaseJ4.assertQ(SolrTestCaseJ4.java:775)
	at org.apache.solr.core.TestArbitraryIndexDir.testLoadNewIndexDir(TestArbitraryIndexDir.java:107)
	at sun.reflect.NativeMethodAccessorImpl.invoke0(Native Method)
	at sun.reflect.NativeMethodAccessorImpl.invoke(NativeMethodAccessorImpl.java:62)
	at sun.reflect.DelegatingMethodAccessorImpl.invoke(DelegatingMethodAccessorImpl.java:43)
	at java.lang.reflect.Method.invoke(Method.java:498)
	at com.carrotsearch.randomizedtesting.RandomizedRunner.invoke(RandomizedRunner.java:1764)
	at com.carrotsearch.randomizedtesting.RandomizedRunner$8.evaluate(RandomizedRunner.java:871)
	at com.carrotsearch.randomizedtesting.RandomizedRunner$9.evaluate(RandomizedRunner.java:907)
	at com.carrotsearch.randomizedtesting.RandomizedRunner$10.evaluate(RandomizedRunner.java:921)
	at com.carrotsearch.randomizedtesting.rules.SystemPropertiesRestoreRule$1.evaluate(SystemPropertiesRestoreRule.java:57)
	at com.carrotsearch.randomizedtesting.rules.SystemPropertiesRestoreRule$1.evaluate(SystemPropertiesRestoreRule.java:57)
	at org.apache.lucene.util.TestRuleSetupTeardownChained$1.evaluate(TestRuleSetupTeardownChained.java:49)
	at org.apache.lucene.util.AbstractBeforeAfterRule$1.evaluate(AbstractBeforeAfterRule.java:45)
	at org.apache.lucene.util.TestRuleThreadAndTestName$1.evaluate(TestRuleThreadAndTestName.java:48)
	at org.apache.lucene.util.TestRuleIgnoreAfterMaxFailures$1.evaluate(TestRuleIgnoreAfterMaxFailures.java:64)
	at org.apache.lucene.util.TestRuleMarkFailure$1.evaluate(TestRuleMarkFailure.java:47)
	at com.carrotsearch.randomizedtesting.rules.StatementAdapter.evaluate(StatementAdapter.java:36)
	at com.carrotsearch.randomizedtesting.ThreadLeakControl$StatementRunner.run(ThreadLeakControl.java:367)
	at com.carrotsearch.randomizedtesting.ThreadLeakControl.forkTimeoutingTask(ThreadLeakControl.java:809)
	at com.carrotsearch.randomizedtesting.ThreadLeakControl$3.evaluate(ThreadLeakControl.java:460)
	at com.carrotsearch.randomizedtesting.RandomizedRunner.runSingleTest(RandomizedRunner.java:880)
	at com.carrotsearch.randomizedtesting.RandomizedRunner$5.evaluate(RandomizedRunner.java:781)
	at com.carrotsearch.randomizedtesting.RandomizedRunner$6.evaluate(RandomizedRunner.java:816)
	at com.carrotsearch.randomizedtesting.RandomizedRunner$7.evaluate(RandomizedRunner.java:827)
	at com.carrotsearch.randomizedtesting.rules.StatementAdapter.evaluate(StatementAdapter.java:36)
	at com.carrotsearch.randomizedtesting.rules.SystemPropertiesRestoreRule$1.evaluate(SystemPropertiesRestoreRule.java:57)
	at org.apache.lucene.util.AbstractBeforeAfterRule$1.evaluate(AbstractBeforeAfterRule.java:45)
	at com.carrotsearch.randomizedtesting.rules.StatementAdapter.evaluate(StatementAdapter.java:36)
	at org.apache.lucene.util.TestRuleStoreClassName$1.evaluate(TestRuleStoreClassName.java:41)
	at com.carrotsearch.randomizedtesting.rules.NoShadowingOrOverridesOnMethodsRule$1.evaluate(NoShadowingOrOverridesOnMethodsRule.java:40)
	at com.carrotsearch.randomizedtesting.rules.NoShadowingOrOverridesOnMethodsRule$1.evaluate(NoShadowingOrOverridesOnMethodsRule.java:40)
	at com.carrotsearch.randomizedtesting.rules.StatementAdapter.evaluate(StatementAdapter.java:36)
	at com.carrotsearch.randomizedtesting.rules.StatementAdapter.evaluate(StatementAdapter.java:36)
	at com.carrotsearch.randomizedtesting.rules.StatementAdapter.evaluate(StatementAdapter.java:36)
	at org.apache.lucene.util.TestRuleAssertionsRequired$1.evaluate(TestRuleAssertionsRequired.java:53)
	at org.apache.lucene.util.TestRuleMarkFailure$1.evaluate(TestRuleMarkFailure.java:47)
	at org.apache.lucene.util.TestRuleIgnoreAfterMaxFailures$1.evaluate(TestRuleIgnoreAfterMaxFailures.java:64)
	at org.apache.lucene.util.TestRuleIgnoreTestSuites$1.evaluate(TestRuleIgnoreTestSuites.java:54)
	at com.carrotsearch.randomizedtesting.rules.StatementAdapter.evaluate(StatementAdapter.java:36)
	at com.carrotsearch.randomizedtesting.ThreadLeakControl$StatementRunner.run(ThreadLeakControl.java:367)
	at java.lang.Thread.run(Thread.java:745)
Caused by: java.lang.RuntimeException: REQUEST FAILED: xpath=*[count(//doc)=1]
	xml response was: <?xml version="1.0" encoding="UTF-8"?>
<response>
<lst name="responseHeader"><int name="status">0</int><int name="QTime">6</int></lst><result name="response" numFound="0" start="0"></result>
</response>

	request was:q=id:2&qt=standard&start=0&rows=20&version=2.2
	at org.apache.solr.SolrTestCaseJ4.assertQ(SolrTestCaseJ4.java:768)
	... 41 more




Build Log:
[...truncated 10533 lines...]
   [junit4] Suite: org.apache.solr.core.TestArbitraryIndexDir
   [junit4]   2> Creating dataDir: /export/home/jenkins/workspace/Lucene-Solr-master-Solaris/solr/build/solr-core/test/J0/temp/solr.core.TestArbitraryIndexDir_F6EF260CDB14ECFB-001/init-core-data-001
   [junit4]   2> 12978 INFO  (SUITE-TestArbitraryIndexDir-seed#[F6EF260CDB14ECFB]-worker) [    ] o.a.s.SolrTestCaseJ4 Randomized ssl (false) and clientAuth (false)
   [junit4]   2> 12981 INFO  (TEST-TestArbitraryIndexDir.testLoadNewIndexDir-seed#[F6EF260CDB14ECFB]) [    ] o.a.s.SolrTestCaseJ4 ###Starting testLoadNewIndexDir
   [junit4]   2> 12981 INFO  (TEST-TestArbitraryIndexDir.testLoadNewIndexDir-seed#[F6EF260CDB14ECFB]) [    ] o.a.s.SolrTestCaseJ4 ####initCore
   [junit4]   2> 12981 INFO  (TEST-TestArbitraryIndexDir.testLoadNewIndexDir-seed#[F6EF260CDB14ECFB]) [    ] o.a.s.c.SolrResourceLoader new SolrResourceLoader for directory: '/export/home/jenkins/workspace/Lucene-Solr-master-Solaris/solr/core/src/test-files/solr/collection1'
   [junit4]   2> 12981 INFO  (TEST-TestArbitraryIndexDir.testLoadNewIndexDir-seed#[F6EF260CDB14ECFB]) [    ] o.a.s.c.SolrResourceLoader JNDI not configured for solr (NoInitialContextEx)
   [junit4]   2> 12981 INFO  (TEST-TestArbitraryIndexDir.testLoadNewIndexDir-seed#[F6EF260CDB14ECFB]) [    ] o.a.s.c.SolrResourceLoader using system property solr.solr.home: /export/home/jenkins/workspace/Lucene-Solr-master-Solaris/solr/core/src/test-files/solr
   [junit4]   2> 12982 INFO  (TEST-TestArbitraryIndexDir.testLoadNewIndexDir-seed#[F6EF260CDB14ECFB]) [    ] o.a.s.c.SolrResourceLoader Adding 'file:/export/home/jenkins/workspace/Lucene-Solr-master-Solaris/solr/core/src/test-files/solr/collection1/lib/classes/' to classloader
   [junit4]   2> 12982 INFO  (TEST-TestArbitraryIndexDir.testLoadNewIndexDir-seed#[F6EF260CDB14ECFB]) [    ] o.a.s.c.SolrResourceLoader Adding 'file:/export/home/jenkins/workspace/Lucene-Solr-master-Solaris/solr/core/src/test-files/solr/collection1/lib/README' to classloader
   [junit4]   2> 13058 INFO  (TEST-TestArbitraryIndexDir.testLoadNewIndexDir-seed#[F6EF260CDB14ECFB]) [    ] o.a.s.c.SolrConfig current version of requestparams : -1
   [junit4]   2> 13071 WARN  (TEST-TestArbitraryIndexDir.testLoadNewIndexDir-seed#[F6EF260CDB14ECFB]) [    ] o.a.s.c.Config Beginning with Solr 5.5, <mergePolicy> is deprecated, use <mergePolicyFactory> instead.
   [junit4]   2> 13076 INFO  (TEST-TestArbitraryIndexDir.testLoadNewIndexDir-seed#[F6EF260CDB14ECFB]) [    ] o.a.s.c.SolrConfig Using Lucene MatchVersion: 7.0.0
   [junit4]   2> 13094 INFO  (TEST-TestArbitraryIndexDir.testLoadNewIndexDir-seed#[F6EF260CDB14ECFB]) [    ] o.a.s.c.SolrConfig Loaded SolrConfig: solrconfig.xml
   [junit4]   2> 13102 INFO  (TEST-TestArbitraryIndexDir.testLoadNewIndexDir-seed#[F6EF260CDB14ECFB]) [    ] o.a.s.s.IndexSchema [null] Schema name=test
   [junit4]   2> 13206 INFO  (TEST-TestArbitraryIndexDir.testLoadNewIndexDir-seed#[F6EF260CDB14ECFB]) [    ] o.a.s.s.IndexSchema default search field in schema is text
   [junit4]   2> 13207 INFO  (TEST-TestArbitraryIndexDir.testLoadNewIndexDir-seed#[F6EF260CDB14ECFB]) [    ] o.a.s.s.IndexSchema unique key field: id
   [junit4]   2> 13210 WARN  (TEST-TestArbitraryIndexDir.testLoadNewIndexDir-seed#[F6EF260CDB14ECFB]) [    ] o.a.s.s.IndexSchema Field text is not multivalued and destination for multiple copyFields (2)
   [junit4]   2> 13231 INFO  (TEST-TestArbitraryIndexDir.testLoadNewIndexDir-seed#[F6EF260CDB14ECFB]) [    ] o.a.s.s.FileExchangeRateProvider Reloading exchange rates from file currency.xml
   [junit4]   2> 13234 INFO  (TEST-TestArbitraryIndexDir.testLoadNewIndexDir-seed#[F6EF260CDB14ECFB]) [    ] o.a.s.s.FileExchangeRateProvider Reloading exchange rates from file currency.xml
   [junit4]   2> 13236 INFO  (TEST-TestArbitraryIndexDir.testLoadNewIndexDir-seed#[F6EF260CDB14ECFB]) [    ] o.a.s.c.SolrResourceLoader JNDI not configured for solr (NoInitialContextEx)
   [junit4]   2> 13236 INFO  (TEST-TestArbitraryIndexDir.testLoadNewIndexDir-seed#[F6EF260CDB14ECFB]) [    ] o.a.s.c.SolrResourceLoader using system property solr.solr.home: /export/home/jenkins/workspace/Lucene-Solr-master-Solaris/solr/core/src/test-files/solr
   [junit4]   2> 13236 INFO  (TEST-TestArbitraryIndexDir.testLoadNewIndexDir-seed#[F6EF260CDB14ECFB]) [    ] o.a.s.c.SolrResourceLoader new SolrResourceLoader for directory: '/export/home/jenkins/workspace/Lucene-Solr-master-Solaris/solr/core/src/test-files/solr'
   [junit4]   2> 13236 INFO  (TEST-TestArbitraryIndexDir.testLoadNewIndexDir-seed#[F6EF260CDB14ECFB]) [    ] o.a.s.c.SolrResourceLoader JNDI not configured for solr (NoInitialContextEx)
   [junit4]   2> 13236 INFO  (TEST-TestArbitraryIndexDir.testLoadNewIndexDir-seed#[F6EF260CDB14ECFB]) [    ] o.a.s.c.SolrResourceLoader using system property solr.solr.home: /export/home/jenkins/workspace/Lucene-Solr-master-Solaris/solr/core/src/test-files/solr
   [junit4]   2> 13236 INFO  (TEST-TestArbitraryIndexDir.testLoadNewIndexDir-seed#[F6EF260CDB14ECFB]) [    ] o.a.s.c.CoreContainer New CoreContainer 1253906772
   [junit4]   2> 13236 INFO  (TEST-TestArbitraryIndexDir.testLoadNewIndexDir-seed#[F6EF260CDB14ECFB]) [    ] o.a.s.c.CoreContainer Loading cores into CoreContainer [instanceDir=/export/home/jenkins/workspace/Lucene-Solr-master-Solaris/solr/core/src/test-files/solr]
   [junit4]   2> 13237 WARN  (TEST-TestArbitraryIndexDir.testLoadNewIndexDir-seed#[F6EF260CDB14ECFB]) [    ] o.a.s.c.CoreContainer Couldn't add files from /export/home/jenkins/workspace/Lucene-Solr-master-Solaris/solr/core/src/test-files/solr/lib to classpath: /export/home/jenkins/workspace/Lucene-Solr-master-Solaris/solr/core/src/test-files/solr/lib
   [junit4]   2> 13237 INFO  (TEST-TestArbitraryIndexDir.testLoadNewIndexDir-seed#[F6EF260CDB14ECFB]) [    ] o.a.s.h.c.HttpShardHandlerFactory created with socketTimeout : 600000,connTimeout : 60000,maxConnectionsPerHost : 20,maxConnections : 10000,corePoolSize : 0,maximumPoolSize : 2147483647,maxThreadIdleTime : 5,sizeOfQueue : -1,fairnessPolicy : false,useRetries : false,
   [junit4]   2> 13258 INFO  (TEST-TestArbitraryIndexDir.testLoadNewIndexDir-seed#[F6EF260CDB14ECFB]) [    ] o.a.s.u.UpdateShardHandler Creating UpdateShardHandler HTTP client with params: socketTimeout=30000&connTimeout=30000&retry=true
   [junit4]   2> 13259 INFO  (TEST-TestArbitraryIndexDir.testLoadNewIndexDir-seed#[F6EF260CDB14ECFB]) [    ] o.a.s.l.LogWatcher SLF4J impl is org.slf4j.impl.Log4jLoggerFactory
   [junit4]   2> 13259 INFO  (TEST-TestArbitraryIndexDir.testLoadNewIndexDir-seed#[F6EF260CDB14ECFB]) [    ] o.a.s.l.LogWatcher Registering Log Listener [Log4j (org.slf4j.impl.Log4jLoggerFactory)]
   [junit4]   2> 13259 INFO  (TEST-TestArbitraryIndexDir.testLoadNewIndexDir-seed#[F6EF260CDB14ECFB]) [    ] o.a.s.c.CoreContainer Security conf doesn't exist. Skipping setup for authorization module.
   [junit4]   2> 13259 INFO  (TEST-TestArbitraryIndexDir.testLoadNewIndexDir-seed#[F6EF260CDB14ECFB]) [    ] o.a.s.c.CoreContainer No authentication plugin used.
   [junit4]   2> 13260 INFO  (TEST-TestArbitraryIndexDir.testLoadNewIndexDir-seed#[F6EF260CDB14ECFB]) [    ] o.a.s.c.CoreDescriptor Created CoreDescriptor: {name=collection1, config=solrconfig.xml, transient=false, schema=schema12.xml, loadOnStartup=true, configSetProperties=configsetprops.json, collection=collection1, dataDir=/export/home/jenkins/workspace/Lucene-Solr-master-Solaris/solr/build/solr-core/test/J0/temp/solr.core.TestArbitraryIndexDir_F6EF260CDB14ECFB-001/init-core-data-001, shard=shard1}
   [junit4]   2> 13262 INFO  (coreLoadExecutor-30-thread-1) [    ] o.a.s.c.SolrResourceLoader new SolrResourceLoader for directory: '/export/home/jenkins/workspace/Lucene-Solr-master-Solaris/solr/core/src/test-files/solr/collection1'
   [junit4]   2> 13263 INFO  (coreLoadExecutor-30-thread-1) [    ] o.a.s.c.SolrResourceLoader JNDI not configured for solr (NoInitialContextEx)
   [junit4]   2> 13263 INFO  (coreLoadExecutor-30-thread-1) [    ] o.a.s.c.SolrResourceLoader using system property solr.solr.home: /export/home/jenkins/workspace/Lucene-Solr-master-Solaris/solr/core/src/test-files/solr
   [junit4]   2> 13263 INFO  (coreLoadExecutor-30-thread-1) [    ] o.a.s.c.SolrResourceLoader Adding 'file:/export/home/jenkins/workspace/Lucene-Solr-master-Solaris/solr/core/src/test-files/solr/collection1/lib/classes/' to classloader
   [junit4]   2> 13263 INFO  (coreLoadExecutor-30-thread-1) [    ] o.a.s.c.SolrResourceLoader Adding 'file:/export/home/jenkins/workspace/Lucene-Solr-master-Solaris/solr/core/src/test-files/solr/collection1/lib/README' to classloader
   [junit4]   2> 13289 INFO  (coreLoadExecutor-30-thread-1) [    ] o.a.s.c.SolrConfig current version of requestparams : -1
   [junit4]   2> 13295 WARN  (coreLoadExecutor-30-thread-1) [    ] o.a.s.c.Config Beginning with Solr 5.5, <mergePolicy> is deprecated, use <mergePolicyFactory> instead.
   [junit4]   2> 13296 INFO  (coreLoadExecutor-30-thread-1) [    ] o.a.s.c.SolrConfig Using Lucene MatchVersion: 7.0.0
   [junit4]   2> 13315 INFO  (coreLoadExecutor-30-thread-1) [    ] o.a.s.c.SolrConfig Loaded SolrConfig: solrconfig.xml
   [junit4]   2> 13327 INFO  (coreLoadExecutor-30-thread-1) [    ] o.a.s.s.IndexSchema [collection1] Schema name=test
   [junit4]   2> 13403 INFO  (coreLoadExecutor-30-thread-1) [    ] o.a.s.s.IndexSchema default search field in schema is text
   [junit4]   2> 13403 INFO  (coreLoadExecutor-30-thread-1) [    ] o.a.s.s.IndexSchema unique key field: id
   [junit4]   2> 13404 WARN  (coreLoadExecutor-30-thread-1) [    ] o.a.s.s.IndexSchema Field text is not multivalued and destination for multiple copyFields (2)
   [junit4]   2> 13416 INFO  (coreLoadExecutor-30-thread-1) [    ] o.a.s.s.FileExchangeRateProvider Reloading exchange rates from file currency.xml
   [junit4]   2> 13420 INFO  (coreLoadExecutor-30-thread-1) [    ] o.a.s.s.FileExchangeRateProvider Reloading exchange rates from file currency.xml
   [junit4]   2> 13426 INFO  (coreLoadExecutor-30-thread-1) [    ] o.a.s.c.ConfigSetProperties Did not find ConfigSet properties, assuming default properties: Can't find resource 'configsetprops.json' in classpath or '/export/home/jenkins/workspace/Lucene-Solr-master-Solaris/solr/core/src/test-files/solr/collection1'
   [junit4]   2> 13426 INFO  (coreLoadExecutor-30-thread-1) [    ] o.a.s.c.CoreContainer Creating SolrCore 'collection1' using configuration from instancedir /export/home/jenkins/workspace/Lucene-Solr-master-Solaris/solr/core/src/test-files/solr/collection1
   [junit4]   2> 13426 INFO  (coreLoadExecutor-30-thread-1) [    x:collection1] o.a.s.c.SolrCore org.apache.solr.core.MockFSDirectoryFactory
   [junit4]   2> 13453 INFO  (coreLoadExecutor-30-thread-1) [    x:collection1] o.a.s.c.SolrCore [[collection1] ] Opening new SolrCore at [/export/home/jenkins/workspace/Lucene-Solr-master-Solaris/solr/core/src/test-files/solr/collection1], dataDir=[/export/home/jenkins/workspace/Lucene-Solr-master-Solaris/solr/build/solr-core/test/J0/temp/solr.core.TestArbitraryIndexDir_F6EF260CDB14ECFB-001/init-core-data-001/]
   [junit4]   2> 13453 INFO  (coreLoadExecutor-30-thread-1) [    x:collection1] o.a.s.c.JmxMonitoredMap No JMX servers found, not exposing Solr information with JMX.
   [junit4]   2> 13455 INFO  (coreLoadExecutor-30-thread-1) [    x:collection1] o.a.s.c.CachingDirectoryFactory return new directory for /export/home/jenkins/workspace/Lucene-Solr-master-Solaris/solr/build/solr-core/test/J0/temp/solr.core.TestArbitraryIndexDir_F6EF260CDB14ECFB-001/init-core-data-001
   [junit4]   2> 13455 INFO  (coreLoadExecutor-30-thread-1) [    x:collection1] o.a.s.c.SolrCore New index directory detected: old=null new=/export/home/jenkins/workspace/Lucene-Solr-master-Solaris/solr/build/solr-core/test/J0/temp/solr.core.TestArbitraryIndexDir_F6EF260CDB14ECFB-001/init-core-data-001/index/
   [junit4]   2> 13455 WARN  (coreLoadExecutor-30-thread-1) [    x:collection1] o.a.s.c.SolrCore [collection1] Solr index directory '/export/home/jenkins/workspace/Lucene-Solr-master-Solaris/solr/build/solr-core/test/J0/temp/solr.core.TestArbitraryIndexDir_F6EF260CDB14ECFB-001/init-core-data-001/index' doesn't exist. Creating new index...
   [junit4]   2> 13456 INFO  (coreLoadExecutor-30-thread-1) [    x:collection1] o.a.s.c.CachingDirectoryFactory return new directory for /export/home/jenkins/workspace/Lucene-Solr-master-Solaris/solr/build/solr-core/test/J0/temp/solr.core.TestArbitraryIndexDir_F6EF260CDB14ECFB-001/init-core-data-001/index
   [junit4]   2> 13456 INFO  (coreLoadExecutor-30-thread-1) [    x:collection1] o.a.s.u.RandomMergePolicy RandomMergePolicy wrapping class org.apache.lucene.index.TieredMergePolicy: [TieredMergePolicy: maxMergeAtOnce=22, maxMergeAtOnceExplicit=35, maxMergedSegmentMB=68.205078125, floorSegmentMB=1.439453125, forceMergeDeletesPctAllowed=21.17286756164239, segmentsPerTier=41.0, maxCFSSegmentSizeMB=8.796093022207999E12, noCFSRatio=1.0
   [junit4]   2> 13471 INFO  (coreLoadExecutor-30-thread-1) [    x:collection1] o.a.s.c.SolrDeletionPolicy SolrDeletionPolicy.onCommit: commits: num=1
   [junit4]   2> 	commit{dir=MockDirectoryWrapper(SimpleFSDirectory@/export/home/jenkins/workspace/Lucene-Solr-master-Solaris/solr/build/solr-core/test/J0/temp/solr.core.TestArbitraryIndexDir_F6EF260CDB14ECFB-001/init-core-data-001/index lockFactory=org.apache.lucene.store.SingleInstanceLockFactory@78b4cce4),segFN=segments_1,generation=1}
   [junit4]   2> 13472 INFO  (coreLoadExecutor-30-thread-1) [    x:collection1] o.a.s.c.SolrDeletionPolicy newest commit generation = 1
   [junit4]   2> 13472 INFO  (OldIndexDirectoryCleanupThreadForCore-collection1) [    x:collection1] o.a.s.c.SolrCore Looking for old index directories to cleanup for core collection1 in /export/home/jenkins/workspace/Lucene-Solr-master-Solaris/solr/build/solr-core/test/J0/temp/solr.core.TestArbitraryIndexDir_F6EF260CDB14ECFB-001/init-core-data-001/
   [junit4]   2> 13475 INFO  (coreLoadExecutor-30-thread-1) [    x:collection1] o.a.s.u.p.UpdateRequestProcessorChain creating updateRequestProcessorChain "dedupe"
   [junit4]   2> 13475 INFO  (coreLoadExecutor-30-thread-1) [    x:collection1] o.a.s.u.p.UpdateRequestProcessorChain inserting DistributedUpdateProcessorFactory into updateRequestProcessorChain "dedupe"
   [junit4]   2> 13475 INFO  (coreLoadExecutor-30-thread-1) [    x:collection1] o.a.s.u.p.UpdateRequestProcessorChain creating updateRequestProcessorChain "dedupe-allfields"
   [junit4]   2> 13475 INFO  (coreLoadExecutor-30-thread-1) [    x:collection1] o.a.s.u.p.UpdateRequestProcessorChain inserting DistributedUpdateProcessorFactory into updateRequestProcessorChain "dedupe-allfields"
   [junit4]   2> 13475 INFO  (coreLoadExecutor-30-thread-1) [    x:collection1] o.a.s.u.p.UpdateRequestProcessorChain creating updateRequestProcessorChain "stored_sig"
   [junit4]   2> 13475 INFO  (coreLoadExecutor-30-thread-1) [    x:collection1] o.a.s.u.p.UpdateRequestProcessorChain inserting DistributedUpdateProcessorFactory into updateRequestProcessorChain "stored_sig"
   [junit4]   2> 13475 INFO  (coreLoadExecutor-30-thread-1) [    x:collection1] o.a.s.u.p.UpdateRequestProcessorChain creating updateRequestProcessorChain "uniq-fields"
   [junit4]   2> 13475 INFO  (coreLoadExecutor-30-thread-1) [    x:collection1] o.a.s.u.p.UpdateRequestProcessorChain inserting DistributedUpdateProcessorFactory into updateRequestProcessorChain "uniq-fields"
   [junit4]   2> 13476 INFO  (coreLoadExecutor-30-thread-1) [    x:collection1] o.a.s.u.p.UpdateRequestProcessorChain creating updateRequestProcessorChain "distrib-dup-test-chain-explicit"
   [junit4]   2> 13476 INFO  (coreLoadExecutor-30-thread-1) [    x:collection1] o.a.s.u.p.UpdateRequestProcessorChain creating updateRequestProcessorChain "distrib-dup-test-chain-implicit"
   [junit4]   2> 13476 INFO  (coreLoadExecutor-30-thread-1) [    x:collection1] o.a.s.u.p.UpdateRequestProcessorChain inserting DistributedUpdateProcessorFactory into updateRequestProcessorChain "distrib-dup-test-chain-implicit"
   [junit4]   2> 13476 INFO  (coreLoadExecutor-30-thread-1) [    x:collection1] o.a.s.c.SolrCore no updateRequestProcessorChain defined as default, creating implicit default
   [junit4]   2> 13478 INFO  (coreLoadExecutor-30-thread-1) [    x:collection1] o.a.s.h.l.XMLLoader xsltCacheLifetimeSeconds=60
   [junit4]   2> 13479 INFO  (coreLoadExecutor-30-thread-1) [    x:collection1] o.a.s.h.l.XMLLoader xsltCacheLifetimeSeconds=60
   [junit4]   2> 13480 INFO  (coreLoadExecutor-30-thread-1) [    x:collection1] o.a.s.h.l.XMLLoader xsltCacheLifetimeSeconds=60
   [junit4]   2> 13481 INFO  (coreLoadExecutor-30-thread-1) [    x:collection1] o.a.s.h.l.XMLLoader xsltCacheLifetimeSeconds=60
   [junit4]   2> 13484 INFO  (coreLoadExecutor-30-thread-1) [    x:collection1] o.a.s.c.PluginBag requestHandler : 'lazy' created with startup=lazy 
   [junit4]   2> 13488 INFO  (coreLoadExecutor-30-thread-1) [    x:collection1] o.a.s.c.RequestHandlers Registered paths: /admin/mbeans,standard,spellCheckCompRH,lazy,/update/json/docs,/admin/luke,/export,spellCheckWithWordbreak_Direct,tvrh,/get,/admin/properties,/update/json,mltrh,/admin/threads,/search-facet-def,/update/csv,/sql,/search-facet-invariants,/admin/segments,spellCheckCompRH1,/mlt,/admin/system,/replication,dismax,defaults,/config,/stream,/schema,/admin/plugins,/admin/logging,spellCheckWithWordbreak,mock,/admin/ping,/update,/admin/file,/terms,spellCheckCompRH_Direct,/debug/dump
   [junit4]   2> 13488 INFO  (coreLoadExecutor-30-thread-1) [    x:collection1] o.a.s.c.SolrCore Using default statsCache cache: org.apache.solr.search.stats.LocalStatsCache
   [junit4]   2> 13488 INFO  (coreLoadExecutor-30-thread-1) [    x:collection1] o.a.s.u.CommitTracker Hard AutoCommit: disabled
   [junit4]   2> 13488 INFO  (coreLoadExecutor-30-thread-1) [    x:collection1] o.a.s.u.CommitTracker Soft AutoCommit: disabled
   [junit4]   2> 13490 INFO  (coreLoadExecutor-30-thread-1) [    x:collection1] o.a.s.u.RandomMergePolicy RandomMergePolicy wrapping class org.apache.lucene.index.AlcoholicMergePolicy: [AlcoholicMergePolicy: minMergeSize=0, mergeFactor=10, maxMergeSize=139848788, maxMergeSizeForForcedMerge=9223372036854775807, calibrateSizeByDeletes=true, maxMergeDocs=2147483647, maxCFSSegmentSizeMB=8.796093022207999E12, noCFSRatio=0.1]
   [junit4]   2> 13495 INFO  (coreLoadExecutor-30-thread-1) [    x:collection1] o.a.s.c.SolrDeletionPolicy SolrDeletionPolicy.onInit: commits: num=1
   [junit4]   2> 	commit{dir=MockDirectoryWrapper(SimpleFSDirectory@/export/home/jenkins/workspace/Lucene-Solr-master-Solaris/solr/build/solr-core/test/J0/temp/solr.core.TestArbitraryIndexDir_F6EF260CDB14ECFB-001/init-core-data-001/index lockFactory=org.apache.lucene.store.SingleInstanceLockFactory@78b4cce4),segFN=segments_1,generation=1}
   [junit4]   2> 13495 INFO  (coreLoadExecutor-30-thread-1) [    x:collection1] o.a.s.c.SolrDeletionPolicy newest commit generation = 1
   [junit4]   2> 13496 INFO  (coreLoadExecutor-30-thread-1) [    x:collection1] o.a.s.s.SolrIndexSearcher Opening [Searcher@76ced45[collection1] main]
   [junit4]   2> 13496 INFO  (coreLoadExecutor-30-thread-1) [    x:collection1] o.a.s.r.RestManager Initializing RestManager with initArgs: {storageIO=org.apache.solr.rest.ManagedResourceStorage$InMemoryStorageIO}
   [junit4]   2> 13497 INFO  (coreLoadExecutor-30-thread-1) [    x:collection1] o.a.s.r.ManagedResourceStorage Reading _rest_managed.json using InMemoryStorage
   [junit4]   2> 13497 INFO  (coreLoadExecutor-30-thread-1) [    x:collection1] o.a.s.r.RestManager Initializing 0 registered ManagedResources
   [junit4]   2> 13497 INFO  (coreLoadExecutor-30-thread-1) [    x:collection1] o.a.s.h.c.SpellCheckComponent Initializing spell checkers
   [junit4]   2> 13531 INFO  (coreLoadExecutor-30-thread-1) [    x:collection1] o.a.s.s.DirectSolrSpellChecker init: {name=direct,classname=DirectSolrSpellChecker,field=lowerfilt,minQueryLength=3}
   [junit4]   2> 13629 INFO  (coreLoadExecutor-30-thread-1) [    x:collection1] o.a.s.h.ReplicationHandler Commits will be reserved for  10000
   [junit4]   2> 13630 INFO  (searcherExecutor-31-thread-1-processing-x:collection1) [    x:collection1] o.a.s.h.c.SpellCheckComponent Loading spell index for spellchecker: default
   [junit4]   2> 13630 INFO  (coreLoadExecutor-30-thread-1) [    x:collection1] o.a.s.c.CoreContainer registering core: collection1
   [junit4]   2> 13630 INFO  (searcherExecutor-31-thread-1-processing-x:collection1) [    x:collection1] o.a.s.h.c.SpellCheckComponent Loading spell index for spellchecker: direct
   [junit4]   2> 13630 INFO  (searcherExecutor-31-thread-1-processing-x:collection1) [    x:collection1] o.a.s.h.c.SpellCheckComponent Loading spell index for spellchecker: wordbreak
   [junit4]   2> 13630 INFO  (searcherExecutor-31-thread-1-processing-x:collection1) [    x:collection1] o.a.s.h.c.SpellCheckComponent Loading spell index for spellchecker: multipleFields
   [junit4]   2> 13631 INFO  (searcherExecutor-31-thread-1-processing-x:collection1) [    x:collection1] o.a.s.h.c.SpellCheckComponent Loading spell index for spellchecker: jarowinkler
   [junit4]   2> 13631 INFO  (TEST-TestArbitraryIndexDir.testLoadNewIndexDir-seed#[F6EF260CDB14ECFB]) [    ] o.a.s.SolrTestCaseJ4 ####initCore end
   [junit4]   2> 13631 INFO  (searcherExecutor-31-thread-1-processing-x:collection1) [    x:collection1] o.a.s.h.c.SpellCheckComponent Loading spell index for spellchecker: external
   [junit4]   2> 13632 INFO  (searcherExecutor-31-thread-1-processing-x:collection1) [    x:collection1] o.a.s.h.c.SpellCheckComponent Loading spell index for spellchecker: freq
   [junit4]   2> 13633 INFO  (searcherExecutor-31-thread-1-processing-x:collection1) [    x:collection1] o.a.s.h.c.SpellCheckComponent Loading spell index for spellchecker: fqcn
   [junit4]   2> 13634 INFO  (searcherExecutor-31-thread-1-processing-x:collection1) [    x:collection1] o.a.s.h.c.SpellCheckComponent Loading spell index for spellchecker: perDict
   [junit4]   2> 13634 INFO  (searcherExecutor-31-thread-1-processing-x:collection1) [    x:collection1] o.a.s.c.SolrCore [collection1] Registered new searcher Searcher@76ced45[collection1] main{ExitableDirectoryReader(UninvertingDirectoryReader())}
   [junit4]   2> 13637 INFO  (TEST-TestArbitraryIndexDir.testLoadNewIndexDir-seed#[F6EF260CDB14ECFB]) [    ] o.a.s.u.p.LogUpdateProcessorFactory [collection1]  webapp=null path=null params={}{add=[1]} 0 5
   [junit4]   2> 13776 INFO  (TEST-TestArbitraryIndexDir.testLoadNewIndexDir-seed#[F6EF260CDB14ECFB]) [    ] o.a.s.u.DirectUpdateHandler2 start commit{,optimize=false,openSearcher=true,waitSearcher=true,expungeDeletes=false,softCommit=false,prepareCommit=false}
   [junit4]   2> 13856 INFO  (TEST-TestArbitraryIndexDir.testLoadNewIndexDir-seed#[F6EF260CDB14ECFB]) [    ] o.a.s.c.SolrDeletionPolicy SolrDeletionPolicy.onCommit: commits: num=2
   [junit4]   2> 	commit{dir=MockDirectoryWrapper(SimpleFSDirectory@/export/home/jenkins/workspace/Lucene-Solr-master-Solaris/solr/build/solr-core/test/J0/temp/solr.core.TestArbitraryIndexDir_F6EF260CDB14ECFB-001/init-core-data-001/index lockFactory=org.apache.lucene.store.SingleInstanceLockFactory@78b4cce4),segFN=segments_1,generation=1}
   [junit4]   2> 	commit{dir=MockDirectoryWrapper(SimpleFSDirectory@/export/home/jenkins/workspace/Lucene-Solr-master-Solaris/solr/build/solr-core/test/J0/temp/solr.core.TestArbitraryIndexDir_F6EF260CDB14ECFB-001/init-core-data-001/index lockFactory=org.apache.lucene.store.SingleInstanceLockFactory@78b4cce4),segFN=segments_2,generation=2}
   [junit4]   2> 13856 INFO  (TEST-TestArbitraryIndexDir.testLoadNewIndexDir-seed#[F6EF260CDB14ECFB]) [    ] o.a.s.c.SolrDeletionPolicy newest commit generation = 2
   [junit4]   2> 13858 INFO  (TEST-TestArbitraryIndexDir.testLoadNewIndexDir-seed#[F6EF260CDB14ECFB]) [    ] o.a.s.c.SolrCore New index directory detected: old=/export/home/jenkins/workspace/Lucene-Solr-master-Solaris/solr/build/solr-core/test/J0/temp/solr.core.TestArbitraryIndexDir_F6EF260CDB14ECFB-001/init-core-data-001/index/ new=/export/home/jenkins/workspace/Lucene-Solr-master-Solaris/solr/build/solr-core/test/J0/temp/solr.core.TestArbitraryIndexDir_F6EF260CDB14ECFB-001/init-core-data-001/index_temp
   [junit4]   2> 13863 INFO  (TEST-TestArbitraryIndexDir.testLoadNewIndexDir-seed#[F6EF260CDB14ECFB]) [    ] o.a.s.s.SolrIndexSearcher Opening [Searcher@30a6188e[collection1] main]
   [junit4]   2> 13864 INFO  (TEST-TestArbitraryIndexDir.testLoadNewIndexDir-seed#[F6EF260CDB14ECFB]) [    ] o.a.s.u.DirectUpdateHandler2 end_commit_flush
   [junit4]   2> 13864 INFO  (searcherExecutor-31-thread-1) [    ] o.a.s.c.SolrCore [collection1] Registered new searcher Searcher@30a6188e[collection1] main{ExitableDirectoryReader(UninvertingDirectoryReader(Uninverting(_0(7.0.0):c1)))}
   [junit4]   2> 13864 INFO  (TEST-TestArbitraryIndexDir.testLoadNewIndexDir-seed#[F6EF260CDB14ECFB]) [    ] o.a.s.u.p.LogUpdateProcessorFactory [collection1]  webapp=null path=null params={}{commit=} 0 88
   [junit4]   2> 13865 INFO  (TEST-TestArbitraryIndexDir.testLoadNewIndexDir-seed#[F6EF260CDB14ECFB]) [    ] o.a.s.c.SolrResourceLoader new SolrResourceLoader for directory: '/export/home/jenkins/workspace/Lucene-Solr-master-Solaris/solr/core/src/test-files/solr/collection1'
   [junit4]   2> 13865 INFO  (TEST-TestArbitraryIndexDir.testLoadNewIndexDir-seed#[F6EF260CDB14ECFB]) [    ] o.a.s.c.SolrResourceLoader JNDI not configured for solr (NoInitialContextEx)
   [junit4]   2> 13865 INFO  (TEST-TestArbitraryIndexDir.testLoadNewIndexDir-seed#[F6EF260CDB14ECFB]) [    ] o.a.s.c.SolrResourceLoader using system property solr.solr.home: /export/home/jenkins/workspace/Lucene-Solr-master-Solaris/solr/core/src/test-files/solr
   [junit4]   2> 13866 INFO  (TEST-TestArbitraryIndexDir.testLoadNewIndexDir-seed#[F6EF260CDB14ECFB]) [    ] o.a.s.c.SolrResourceLoader Adding 'file:/export/home/jenkins/workspace/Lucene-Solr-master-Solaris/solr/core/src/test-files/solr/collection1/lib/classes/' to classloader
   [junit4]   2> 13866 INFO  (TEST-TestArbitraryIndexDir.testLoadNewIndexDir-seed#[F6EF260CDB14ECFB]) [    ] o.a.s.c.SolrResourceLoader Adding 'file:/export/home/jenkins/workspace/Lucene-Solr-master-Solaris/solr/core/src/test-files/solr/collection1/lib/README' to classloader
   [junit4]   2> 13904 INFO  (TEST-TestArbitraryIndexDir.testLoadNewIndexDir-seed#[F6EF260CDB14ECFB]) [    ] o.a.s.c.SolrConfig current version of requestparams : -1
   [junit4]   2> 13910 WARN  (TEST-TestArbitraryIndexDir.testLoadNewIndexDir-seed#[F6EF260CDB14ECFB]) [    ] o.a.s.c.Config Beginning with Solr 5.5, <mergePolicy> is deprecated, use <mergePolicyFactory> instead.
   [junit4]   2> 13912 INFO  (TEST-TestArbitraryIndexDir.testLoadNewIndexDir-seed#[F6EF260CDB14ECFB]) [    ] o.a.s.c.SolrConfig Using Lucene MatchVersion: 7.0.0
   [junit4]   2> 13928 INFO  (TEST-TestArbitraryIndexDir.testLoadNewIndexDir-seed#[F6EF260CDB14ECFB]) [    ] o.a.s.c.SolrConfig Loaded SolrConfig: solrconfig.xml
   [junit4]   2> 13937 INFO  (TEST-TestArbitraryIndexDir.testLoadNewIndexDir-seed#[F6EF260CDB14ECFB]) [    ] o.a.s.s.IndexSchema [collection1] Schema name=test
   [junit4]   2> 14023 INFO  (TEST-TestArbitraryIndexDir.testLoadNewIndexDir-seed#[F6EF260CDB14ECFB]) [    ] o.a.s.s.IndexSchema default search field in schema is text
   [junit4]   2> 14024 INFO  (TEST-TestArbitraryIndexDir.testLoadNewIndexDir-seed#[F6EF260CDB14ECFB]) [    ] o.a.s.s.IndexSchema unique key field: id
   [junit4]   2> 14024 WARN  (TEST-TestArbitraryIndexDir.testLoadNewIndexDir-seed#[F6EF260CDB14ECFB]) [    ] o.a.s.s.IndexSchema Field text is not multivalued and destination for multiple copyFields (2)
   [junit4]   2> 14033 INFO  (TEST-TestArbitraryIndexDir.testLoadNewIndexDir-seed#[F6EF260CDB14ECFB]) [    ] o.a.s.s.FileExchangeRateProvider Reloading exchange rates from file currency.xml
   [junit4]   2> 14035 INFO  (TEST-TestArbitraryIndexDir.testLoadNewIndexDir-seed#[F6EF260CDB14ECFB]) [    ] o.a.s.s.FileExchangeRateProvider Reloading exchange rates from file currency.xml
   [junit4]   2> 14039 INFO  (TEST-TestArbitraryIndexDir.testLoadNewIndexDir-seed#[F6EF260CDB14ECFB]) [    ] o.a.s.c.ConfigSetProperties Did not find ConfigSet properties, assuming default properties: Can't find resource 'configsetprops.json' in classpath or '/export/home/jenkins/workspace/Lucene-Solr-master-Solaris/solr/core/src/test-files/solr/collection1'
   [junit4]   2> 14039 INFO  (TEST-TestArbitraryIndexDir.testLoadNewIndexDir-seed#[F6EF260CDB14ECFB]) [    ] o.a.s.c.CoreContainer Reloading SolrCore 'collection1' using configuration from instancedir /export/home/jenkins/workspace/Lucene-Solr-master-Solaris/solr/core/src/test-files/solr/collection1
   [junit4]   2> 14040 INFO  (TEST-TestArbitraryIndexDir.testLoadNewIndexDir-seed#[F6EF260CDB14ECFB]) [    x:collection1] o.a.s.c.SolrCore [[collection1] ] Opening new SolrCore at [/export/home/jenkins/workspace/Lucene-Solr-master-Solaris/solr/core/src/test-files/solr/collection1], dataDir=[/export/home/jenkins/workspace/Lucene-Solr-master-Solaris/solr/build/solr-core/test/J0/temp/solr.core.TestArbitraryIndexDir_F6EF260CDB14ECFB-001/init-core-data-001/]
   [junit4]   2> 14040 INFO  (TEST-TestArbitraryIndexDir.testLoadNewIndexDir-seed#[F6EF260CDB14ECFB]) [    x:collection1] o.a.s.c.JmxMonitoredMap No JMX servers found, not exposing Solr information with JMX.
   [junit4]   2> 14043 INFO  (TEST-TestArbitraryIndexDir.testLoadNewIndexDir-seed#[F6EF260CDB14ECFB]) [    x:collection1] o.a.s.c.SolrCore New index directory detected: old=null new=/export/home/jenkins/workspace/Lucene-Solr-master-Solaris/solr/build/solr-core/test/J0/temp/solr.core.TestArbitraryIndexDir_F6EF260CDB14ECFB-001/init-core-data-001/index_temp
   [junit4]   2> 14045 INFO  (OldIndexDirectoryCleanupThreadForCore-collection1) [    x:collection1] o.a.s.c.SolrCore Looking for old index directories to cleanup for core collection1 in /export/home/jenkins/workspace/Lucene-Solr-master-Solaris/solr/build/solr-core/test/J0/temp/solr.core.TestArbitraryIndexDir_F6EF260CDB14ECFB-001/init-core-data-001/
   [junit4]   2> 14046 INFO  (OldIndexDirectoryCleanupThreadForCore-collection1) [    x:collection1] o.a.s.c.DirectoryFactory Found 1 old index directories to clean-up under /export/home/jenkins/workspace/Lucene-Solr-master-Solaris/solr/build/solr-core/test/J0/temp/solr.core.TestArbitraryIndexDir_F6EF260CDB14ECFB-001/init-core-data-001/
   [junit4]   2> 14046 WARN  (OldIndexDirectoryCleanupThreadForCore-collection1) [    x:collection1] o.a.s.c.CachingDirectoryFactory Cannot delete directory /export/home/jenkins/workspace/Lucene-Solr-master-Solaris/solr/build/solr-core/test/J0/temp/solr.core.TestArbitraryIndexDir_F6EF260CDB14ECFB-001/init-core-data-001/index as it is still being referenced in the cache!
   [junit4]   2> 14046 WARN  (OldIndexDirectoryCleanupThreadForCore-collection1) [    x:collection1] o.a.s.c.DirectoryFactory Delete old index directory /export/home/jenkins/workspace/Lucene-Solr-master-Solaris/solr/build/solr-core/test/J0/temp/solr.core.TestArbitraryIndexDir_F6EF260CDB14ECFB-001/init-core-data-001/index failed.
   [junit4]   2> 14051 INFO  (TEST-TestArbitraryIndexDir.testLoadNewIndexDir-seed#[F6EF260CDB14ECFB]) [    x:collection1] o.a.s.u.p.UpdateRequestProcessorChain creating updateRequestProcessorChain "dedupe"
   [junit4]   2> 14052 INFO  (TEST-TestArbitraryIndexDir.testLoadNewIndexDir-seed#[F6EF260CDB14ECFB]) [    x:collection1] o.a.s.u.p.UpdateRequestProcessorChain inserting DistributedUpdateProcessorFactory into updateRequestProcessorChain "dedupe"
   [junit4]   2> 14052 INFO  (TEST-TestArbitraryIndexDir.testLoadNewIndexDir-seed#[F6EF260CDB14ECFB]) [    x:collection1] o.a.s.u.p.UpdateRequestProcessorChain creating updateRequestProcessorChain "dedupe-allfields"
   [junit4]   2> 14053 INFO  (TEST-TestArbitraryIndexDir.testLoadNewIndexDir-seed#[F6EF260CDB14ECFB]) [    x:collection1] o.a.s.u.p.UpdateRequestProcessorChain inserting DistributedUpdateProcessorFactory into updateRequestProcessorChain "dedupe-allfields"
   [junit4]   2> 14053 INFO  (TEST-TestArbitraryIndexDir.testLoadNewIndexDir-seed#[F6EF260CDB14ECFB]) [    x:collection1] o.a.s.u.p.UpdateRequestProcessorChain creating updateRequestProcessorChain "stored_sig"
   [junit4]   2> 14053 INFO  (TEST-TestArbitraryIndexDir.testLoadNewIndexDir-seed#[F6EF260CDB14ECFB]) [    x:collection1] o.a.s.u.p.UpdateRequestProcessorChain inserting DistributedUpdateProcessorFactory into updateRequestProcessorChain "stored_sig"
   [junit4]   2> 14053 INFO  (TEST-TestArbitraryIndexDir.testLoadNewIndexDir-seed#[F6EF260CDB14ECFB]) [    x:collection1] o.a.s.u.p.UpdateRequestProcessorChain creating updateRequestProcessorChain "uniq-fields"
   [junit4]   2> 14053 INFO  (TEST-TestArbitraryIndexDir.testLoadNewIndexDir-seed#[F6EF260CDB14ECFB]) [    x:collection1] o.a.s.u.p.UpdateRequestProcessorChain inserting DistributedUpdateProcessorFactory into updateRequestProcessorChain "uniq-fields"
   [junit4]   2> 14054 INFO  (TEST-TestArbitraryIndexDir.testLoadNewIndexDir-seed#[F6EF260CDB14ECFB]) [    x:collection1] o.a.s.u.p.UpdateRequestProcessorChain creating updateRequestProcessorChain "distrib-dup-test-chain-explicit"
   [junit4]   2> 14054 INFO  (TEST-TestArbitraryIndexDir.testLoadNewIndexDir-seed#[F6EF260CDB14ECFB]) [    x:collection1] o.a.s.u.p.UpdateRequestProcessorChain creating updateRequestProcessorChain "distrib-dup-test-chain-implicit"
   [junit4]   2> 14054 INFO  (TEST-TestArbitraryIndexDir.testLoadNewIndexDir-seed#[F6EF260CDB14ECFB]) [    x:collection1] o.a.s.u.p.UpdateRequestProcessorChain inserting DistributedUpdateProcessorFactory into updateRequestProcessorChain "distrib-dup-test-chain-implicit"
   [junit4]   2> 14054 INFO  (TEST-TestArbitraryIndexDir.testLoadNewIndexDir-seed#[F6EF260CDB14ECFB]) [    x:collection1] o.a.s.c.SolrCore no updateRequestProcessorChain defined as default, creating implicit default
   [junit4]   2> 14057 INFO  (TEST-TestArbitraryIndexDir.testLoadNewIndexDir-seed#[F6EF260CDB14ECFB]) [    x:collection1] o.a.s.h.l.XMLLoader xsltCacheLifetimeSeconds=60
   [junit4]   2> 14058 INFO  (TEST-TestArbitraryIndexDir.testLoadNewIndexDir-seed#[F6EF260CDB14ECFB]) [    x:collection1] o.a.s.h.l.XMLLoader xsltCacheLifetimeSeconds=60
   [junit4]   2> 14059 INFO  (TEST-TestArbitraryIndexDir.testLoadNewIndexDir-seed#[F6EF260CDB14ECFB]) [    x:collection1] o.a.s.h.l.XMLLoader xsltCacheLifetimeSeconds=60
   [junit4]   2> 14060 INFO  (TEST-TestArbitraryIndexDir.testLoadNewIndexDir-seed#[F6EF260CDB14ECFB]) [    x:collection1] o.a.s.h.l.XMLLoader xsltCacheLifetimeSeconds=60
   [junit4]   2> 14062 INFO  (TEST-TestArbitraryIndexDir.testLoadNewIndexDir-seed#[F6EF260CDB14ECFB]) [    x:collection1] o.a.s.c.PluginBag requestHandler : 'lazy' created with startup=lazy 
   [junit4]   2> 14063 INFO  (TEST-TestArbitraryIndexDir.testLoadNewIndexDir-seed#[F6EF260CDB14ECFB]) [    x:collection1] o.a.s.c.RequestHandlers Registered paths: /admin/mbeans,standard,spellCheckCompRH,lazy,/update/json/docs,/admin/luke,/export,spellCheckWithWordbreak_Direct,tvrh,/get,/admin/properties,/update/json,mltrh,/admin/threads,/search-facet-def,/update/csv,/sql,/search-facet-invariants,/admin/segments,spellCheckCompRH1,/mlt,/admin/system,/replication,dismax,defaults,/config,/stream,/schema,/admin/plugins,/admin/logging,spellCheckWithWordbreak,mock,/admin/ping,/update,/admin/file,/terms,spellCheckCompRH_Direct,/debug/dump
   [junit4]   2> 14063 INFO  (TEST-TestArbitraryIndexDir.testLoadNewIndexDir-seed#[F6EF260CDB14ECFB]) [    x:collection1] o.a.s.c.SolrCore Using default statsCache cache: org.apache.solr.search.stats.LocalStatsCache
   [junit4]   2> 14064 INFO  (TEST-TestArbitraryIndexDir.testLoadNewIndexDir-seed#[F6EF260CDB14ECFB]) [    x:collection1] o.a.s.u.CommitTracker Hard AutoCommit: disabled
   [junit4]   2> 14075 INFO  (TEST-TestArbitraryIndexDir.testLoadNewIndexDir-seed#[F6EF260CDB14ECFB]) [    x:collection1] o.a.s.u.CommitTracker Soft AutoCommit: disabled
   [junit4]   2> 14079 INFO  (TEST-TestArbitraryIndexDir.testLoadNewIndexDir-seed#[F6EF260CDB14ECFB]) [    x:collection1] o.a.s.s.SolrIndexSearcher Opening [Searcher@7921e88f[collection1] main]
   [junit4]   2> 14079 INFO  (TEST-TestArbitraryIndexDir.testLoadNewIndexDir-seed#[F6EF260CDB14ECFB]) [    x:collection1] o.a.s.r.RestManager Initializing RestManager with initArgs: {storageIO=org.apache.solr.rest.ManagedResourceStorage$InMemoryStorageIO}
   [junit4]   2> 14079 INFO  (TEST-TestArbitraryIndexDir.testLoadNewIndexDir-seed#[F6EF260CDB14ECFB]) [    x:collection1] o.a.s.r.ManagedResourceStorage Reading _rest_managed.json using InMemoryStorage
   [junit4]   2> 14079 INFO  (TEST-TestArbitraryIndexDir.testLoadNewIndexDir-seed#[F6EF260CDB14ECFB]) [    x:collection1] o.a.s.r.RestManager Initializing 0 registered ManagedResources
   [junit4]   2> 14080 INFO  (TEST-TestArbitraryIndexDir.testLoadNewIndexDir-seed#[F6EF260CDB14ECFB]) [    x:collection1] o.a.s.h.c.SpellCheckComponent Initializing spell checkers
   [junit4]   2> 14080 INFO  (TEST-TestArbitraryIndexDir.testLoadNewIndexDir-seed#[F6EF260CDB14ECFB]) [    x:collection1] o.a.s.s.DirectSolrSpellChecker init: {name=direct,classname=DirectSolrSpellChecker,field=lowerfilt,minQueryLength=3}
   [junit4]   2> 14088 INFO  (TEST-TestArbitraryIndexDir.testLoadNewIndexDir-seed#[F6EF260CDB14ECFB]) [    x:collection1] o.a.s.h.ReplicationHandler Commits will be reserved for  10000
   [junit4]   2> 14089 INFO  (TEST-TestArbitraryIndexDir.testLoadNewIndexDir-seed#[F6EF260CDB14ECFB]) [    x:collection1] o.a.s.u.DefaultSolrCoreState Closing old IndexWriter... core=collection1
   [junit4]   2> 14090 INFO  (searcherExecutor-35-thread-1-processing-x:collection1) [    x:collection1] o.a.s.h.c.SpellCheckComponent Loading spell index for spellchecker: default
   [junit4]   2> 14091 INFO  (searcherExecutor-35-thread-1-processing-x:collection1) [    x:collection1] o.a.s.h.c.SpellCheckComponent Loading spell index for spellchecker: direct
   [junit4]   2> 14091 INFO  (searcherExecutor-35-thread-1-processing-x:collection1) [    x:collection1] o.a.s.h.c.SpellCheckComponent Loading spell index for spellchecker: wordbreak
   [junit4]   2> 14091 INFO  (searcherExecutor-35-thread-1-processing-x:collection1) [    x:collection1] o.a.s.h.c.SpellCheckComponent Loading spell index for spellchecker: multipleFields
   [junit4]   2> 14091 INFO  (searcherExecutor-35-thread-1-processing-x:collection1) [    x:collection1] o.a.s.h.c.SpellCheckComponent Loading spell index for spellchecker: jarowinkler
   [junit4]   2> 14092 INFO  (searcherExecutor-35-thread-1-processing-x:collection1) [    x:collection1] o.a.s.h.c.SpellCheckComponent Loading spell index for spellchecker: external
   [junit4]   2> 14093 INFO  (searcherExecutor-35-thread-1-processing-x:collection1) [    x:collection1] o.a.s.h.c.SpellCheckComponent Loading spell index for spellchecker: freq
   [junit4]   2> 14093 INFO  (TEST-TestArbitraryIndexDir.testLoadNewIndexDir-seed#[F6EF260CDB14ECFB]) [    x:collection1] o.a.s.c.CachingDirectoryFactory return new directory for /export/home/jenkins/workspace/Lucene-Solr-master-Solaris/solr/build/solr-core/test/J0/temp/solr.core.TestArbitraryIndexDir_F6EF260CDB14ECFB-001/init-core-data-001/index_temp
   [junit4]   2> 14093 INFO  (searcherExecutor-35-thread-1-processing-x:collection1) [    x:collection1] o.a.s.h.c.SpellCheckComponent Loading spell index for spellchecker: fqcn
   [junit4]   2> 14093 INFO  (TEST-TestArbitraryIndexDir.testLoadNewIndexDir-seed#[F6EF260CDB14ECFB]) [    x:collection1] o.a.s.u.RandomMergePolicy RandomMergePolicy wrapping class org.apache.lucene.index.TieredMergePolicy: [TieredMergePolicy: maxMergeAtOnce=14, maxMergeAtOnceExplicit=11, maxMergedSegmentMB=92.029296875, floorSegmentMB=1.21875, forceMergeDeletesPctAllowed=26.615571080086518, segmentsPerTier=13.0, maxCFSSegmentSizeMB=8.796093022207999E12, noCFSRatio=0.0
   [junit4]   2> 14094 INFO  (searcherExecutor-35-thread-1-processing-x:collection1) [    x:collection1] o.a.s.h.c.SpellCheckComponent Loading spell index for spellchecker: perDict
   [junit4]   2> 14094 INFO  (searcherExecutor-35-thread-1-processing-x:collection1) [    x:collection1] o.a.s.c.SolrCore [collection1] Registered new searcher Searcher@7921e88f[collection1] main{ExitableDirectoryReader(UninvertingDirectoryReader(Uninverting(_0(7.0.0):c1)))}
   [junit4]   2> 14095 INFO  (TEST-TestArbitraryIndexDir.testLoadNewIndexDir-seed#[F6EF260CDB14ECFB]) [    x:collection1] o.a.s.c.SolrDeletionPolicy SolrDeletionPolicy.onInit: commits: num=1
   [junit4]   2> 	commit{dir=MockDirectoryWrapper(SimpleFSDirectory@/export/home/jenkins/workspace/Lucene-Solr-master-Solaris/solr/build/solr-core/test/J0/temp/solr.core.TestArbitraryIndexDir_F6EF260CDB14ECFB-001/init-core-data-001/index_temp lockFactory=org.apache.lucene.store.SingleInstanceLockFactory@77846948),segFN=segments_1,generation=1}
   [junit4]   2> 14095 INFO  (TEST-TestArbitraryIndexDir.testLoadNewIndexDir-seed#[F6EF260CDB14ECFB]) [    x:collection1] o.a.s.c.SolrDeletionPolicy newest commit generation = 1
   [junit4]   2> 14096 INFO  (TEST-TestArbitraryIndexDir.testLoadNewIndexDir-seed#[F6EF260CDB14ECFB]) [    x:collection1] o.a.s.u.DefaultSolrCoreState New IndexWriter is ready to be used.
   [junit4]   2> 14108 INFO  (TEST-TestArbitraryIndexDir.testLoadNewIndexDir-seed#[F6EF260CDB14ECFB]) [    x:collection1] o.a.s.s.SolrIndexSearcher Opening [Searcher@74a48708[collection1] main]
   [junit4]   2> 14108 INFO  (TEST-TestArbitraryIndexDir.testLoadNewIndexDir-seed#[F6EF260CDB14ECFB]) [    x:collection1] o.a.s.c.CoreContainer replacing core: collection1
   [junit4]   2> 14108 INFO  (TEST-TestArbitraryIndexDir.testLoadNewIndexDir-seed#[F6EF260CDB14ECFB]) [    x:collection1] o.a.s.c.SolrCore [collection1]  CLOSING SolrCore org.apache.solr.core.SolrCore@c158b29
   [junit4]   2> 14108 INFO  (TEST-TestArbitraryIndexDir.testLoadNewIndexDir-seed#[F6EF260CDB14ECFB]) [    x:collection1] o.a.s.u.DirectUpdateHandler2 closing DirectUpdateHandler2{commits=1,autocommits=0,soft autocommits=0,optimizes=0,rollbacks=0,expungeDeletes=0,docsPending=0,adds=0,deletesById=0,deletesByQuery=0,errors=0,cumulative_adds=1,cumulative_deletesById=0,cumulative_deletesByQuery=0,cumulative_errors=0}
   [junit4]   2> 14109 INFO  (TEST-TestArbitraryIndexDir.testLoadNewIndexDir-seed#[F6EF260CDB14ECFB]) [    x:collection1] o.a.s.c.SolrCore [collection1] Closing main searcher on request.
   [junit4]   2> 14112 INFO  (searcherExecutor-35-thread-1-processing-x:collection1) [    x:collection1] o.a.s.c.SolrCore [collection1] Registered new searcher Searcher@74a48708[collection1] main{ExitableDirectoryReader(UninvertingDirectoryReader(Uninverting(_0(7.0.0):c1)))}
   [junit4]   2> 14115 INFO  (TEST-TestArbitraryIndexDir.testLoadNewIndexDir-seed#[F6EF260CDB14ECFB]) [    x:collection1] o.a.s.c.S.Request [collection1]  webapp=null path=null params={q=id:2&qt=standard&start=0&rows=20&version=2.2} hits=0 status=0 QTime=6
   [junit4]   2> 14116 ERROR (TEST-TestArbitraryIndexDir.testLoadNewIndexDir-seed#[F6EF260CDB14ECFB]) [    x:collection1] o.a.s.SolrTestCaseJ4 REQUEST FAILED: xpath=*[count(//doc)=1]
   [junit4]   2> 	xml response was: <?xml version="1.0" encoding="UTF-8"?>
   [junit4]   2> <response>
   [junit4]   2> <lst name="responseHeader"><int name="status">0</int><int name="QTime">6</int></lst><result name="response" numFound="0" start="0"></result>
   [junit4]   2> </response>
   [junit4]   2> 
   [junit4]   2> 	request was:q=id:2&qt=standard&start=0&rows=20&version=2.2
   [junit4]   2> 14116 ERROR (TEST-TestArbitraryIndexDir.testLoadNewIndexDir-seed#[F6EF260CDB14ECFB]) [    x:collection1] o.a.s.SolrTestCaseJ4 REQUEST FAILED: q=id:2&qt=standard&start=0&rows=20&version=2.2:java.lang.RuntimeException: REQUEST FAILED: xpath=*[count(//doc)=1]
   [junit4]   2> 	xml response was: <?xml version="1.0" encoding="UTF-8"?>
   [junit4]   2> <response>
   [junit4]   2> <lst name="responseHeader"><int name="status">0</int><int name="QTime">6</int></lst><result name="response" numFound="0" start="0"></result>
   [junit4]   2> </response>
   [junit4]   2> 
   [junit4]   2> 	request was:q=id:2&qt=standard&start=0&rows=20&version=2.2
   [junit4]   2> 	at org.apache.solr.SolrTestCaseJ4.assertQ(SolrTestCaseJ4.java:768)
   [junit4]   2> 	at org.apache.solr.core.TestArbitraryIndexDir.testLoadNewIndexDir(TestArbitraryIndexDir.java:107)
   [junit4]   2> 	at sun.reflect.NativeMethodAccessorImpl.invoke0(Native Method)
   [junit4]   2> 	at sun.reflect.NativeMethodAccessorImpl.invoke(NativeMethodAccessorImpl.java:62)
   [junit4]   2> 	at sun.reflect.DelegatingMethodAccessorImpl.invoke(DelegatingMethodAccessorImpl.java:43)
   [junit4]   2> 	at java.lang.reflect.Method.invoke(Method.java:498)
   [junit4]   2> 	at com.carrotsearch.randomizedtesting.RandomizedRunner.invoke(RandomizedRunner.java:1764)
   [junit4]   2> 	at com.carrotsearch.randomizedtesting.RandomizedRunner$8.evaluate(RandomizedRunner.java:871)
   [junit4]   2> 	at com.carrotsearch.randomizedtesting.RandomizedRunner$9.evaluate(RandomizedRunner.java:907)
   [junit4]   2> 	at com.carrotsearch.randomizedtesting.RandomizedRunner$10.evaluate(RandomizedRunner.java:921)
   [junit4]   2> 	at com.carrotsearch.randomizedtesting.rules.SystemPropertiesRestoreRule$1.evaluate(SystemPropertiesRestoreRule.java:57)
   [junit4]   2> 	at com.carrotsearch.randomizedtesting.rules.SystemPropertiesRestoreRule$1.evaluate(SystemPropertiesRestoreRule.java:57)
   [junit4]   2> 	at org.apache.lucene.util.TestRuleSetupTeardownChained$1.evaluate(TestRuleSetupTeardownChained.java:49)
   [junit4]   2> 	at org.apache.lucene.util.AbstractBeforeAfterRule$1.evaluate(AbstractBeforeAfterRule.java:45)
   [junit4]   2> 	at org.apache.lucene.util.TestRuleThreadAndTestName$1.evaluate(TestRuleThreadAndTestName.java:48)
   [junit4]   2> 	at org.apache.lucene.util.TestRuleIgnoreAfterMaxFailures$1.evaluate(TestRuleIgnoreAfterMaxFailures.java:64)
   [junit4]   2> 	at org.apache.lucene.util.TestRuleMarkFailure$1.evaluate(TestRuleMarkFailure.java:47)
   [junit4]   2> 	at com.carrotsearch.randomizedtesting.rules.StatementAdapter.evaluate(StatementAdapter.java:36)
   [junit4]   2> 	at com.carrotsearch.randomizedtesting.ThreadLeakControl$StatementRunner.run(ThreadLeakControl.java:367)
   [junit4]   2> 	at com.carrotsearch.randomizedtesting.ThreadLeakControl.forkTimeoutingTask(ThreadLeakControl.java:809)
   [junit4]   2> 	at com.carrotsearch.randomizedtesting.ThreadLeakControl$3.evaluate(ThreadLeakControl.java:460)
   [junit4]   2> 	at com.carrotsearch.randomizedtesting.RandomizedRunner.runSingleTest(RandomizedRunner.java:880)
   [junit4]   2> 	at com.carrotsearch.randomizedtesting.RandomizedRunner$5.evaluate(RandomizedRunner.java:781)
   [junit4]   2> 	at com.carrotsearch.randomizedtesting.RandomizedRunner$6.evaluate(RandomizedRunner.java:816)
   [junit4]   2> 	at com.carrotsearch.randomizedtesting.RandomizedRunner$7.evaluate(RandomizedRunner.java:827)
   [junit4]   2> 	at com.carrotsearch.randomizedtesting.rules.StatementAdapter.evaluate(StatementAdapter.java:36)
   [junit4]   2> 	at com.carrotsearch.randomizedtesting.rules.SystemPropertiesRestoreRule$1.evaluate(SystemPropertiesRestoreRule.java:57)
   [junit4]   2> 	at org.apache.lucene.util.AbstractBeforeAfterRule$1.evaluate(AbstractBeforeAfterRule.java:45)
   [junit4]   2> 	at com.carrotsearch.randomizedtesting.rules.StatementAdapter.evaluate(StatementAdapter.java:36)
   [junit4]   2> 	at org.apache.lucene.util.TestRuleStoreClassName$1.evaluate(TestRuleStoreClassName.java:41)
   [junit4]   2> 	at com.carrotsearch.randomizedtesting.rules.NoShadowingOrOverridesOnMethodsRule$1.evaluate(NoShadowingOrOverridesOnMethodsRule.java:40)
   [junit4]   2> 	at com.carrotsearch.randomizedtesting.rules.NoShadowingOrOverridesOnMethodsRule$1.evaluate(NoShadowingOrOverridesOnMethodsRule.java:40)
   [junit4]   2> 	at com.carrotsearch.randomizedtesting.rules.StatementAdapter.evaluate(StatementAdapter.java:36)
   [junit4]   2> 	at com.carrotsearch.randomizedtesting.rules.StatementAdapter.evaluate(StatementAdapter.java:36)
   [junit4]   2> 	at com.carrotsearch.randomizedtesting.rules.StatementAdapter.evaluate(StatementAdapter.java:36)
   [junit4]   2> 	at org.apache.lucene.util.TestRuleAssertionsRequired$1.evaluate(TestRuleAssertionsRequired.java:53)
   [junit4]   2> 	at org.apache.lucene.util.TestRuleMarkFailure$1.evaluate(TestRuleMarkFailure.java:47)
   [junit4]   2> 	at org.apache.lucene.util.TestRuleIgnoreAfterMaxFailures$1.evaluate(TestRuleIgnoreAfterMaxFailures.java:64)
   [junit4]   2> 	at org.apache.lucene.util.TestRuleIgnoreTestSuites$1.evaluate(TestRuleIgnoreTestSuites.java:54)
   [junit4]   2> 	at com.carrotsearch.randomizedtesting.rules.StatementAdapter.evaluate(StatementAdapter.java:36)
   [junit4]   2> 	at com.carrotsearch.randomizedtesting.ThreadLeakControl$StatementRunner.run(ThreadLeakControl.java:367)
   [junit4]   2> 	at java.lang.Thread.run(Thread.java:745)
   [junit4]   2> 
   [junit4]   2> 14117 INFO  (TEST-TestArbitraryIndexDir.testLoadNewIndexDir-seed#[F6EF260CDB14ECFB]) [    x:collection1] o.a.s.SolrTestCaseJ4 ###Ending testLoadNewIndexDir
   [junit4]   2> NOTE: reproduce with: ant test  -Dtestcase=TestArbitraryIndexDir -Dtests.method=testLoadNewIndexDir -Dtests.seed=F6EF260CDB14ECFB -Dtests.slow=true -Dtests.locale=sr-RS -Dtests.timezone=Africa/Freetown -Dtests.asserts=true -Dtests.file.encoding=ISO-8859-1
   [junit4] ERROR   1.14s J0 | TestArbitraryIndexDir.testLoadNewIndexDir <<<
   [junit4]    > Throwable #1: java.lang.RuntimeException: Exception during query
   [junit4]    > 	at __randomizedtesting.SeedInfo.seed([F6EF260CDB14ECFB:1FB59D34458D7C53]:0)
   [junit4]    > 	at org.apache.solr.SolrTestCaseJ4.assertQ(SolrTestCaseJ4.java:775)
   [junit4]    > 	at org.apache.solr.core.TestArbitraryIndexDir.testLoadNewIndexDir(TestArbitraryIndexDir.java:107)
   [junit4]    > 	at java.lang.Thread.run(Thread.java:745)
   [junit4]    > Caused by: java.lang.RuntimeException: REQUEST FAILED: xpath=*[count(//doc)=1]
   [junit4]    > 	xml response was: <?xml version="1.0" encoding="UTF-8"?>
   [junit4]    > <response>
   [junit4]    > <lst name="responseHeader"><int name="status">0</int><int name="QTime">6</int></lst><result name="response" numFound="0" start="0"></result>
   [junit4]    > </response>
   [junit4]    > 	request was:q=id:2&qt=standard&start=0&rows=20&version=2.2
   [junit4]    > 	at org.apache.solr.SolrTestCaseJ4.assertQ(SolrTestCaseJ4.java:768)
   [junit4]    > 	... 41 more
   [junit4]   2> 14122 INFO  (SUITE-TestArbitraryIndexDir-seed#[F6EF260CDB14ECFB]-worker) [    x:collection1] o.a.s.SolrTestCaseJ4 ###deleteCore
   [junit4]   2> 14122 INFO  (SUITE-TestArbitraryIndexDir-seed#[F6EF260CDB14ECFB]-worker) [    x:collection1] o.a.s.c.CoreContainer Shutting down CoreContainer instance=1253906772
   [junit4]   2> 14138 INFO  (coreCloseExecutor-39-thread-1-processing-x:collection1) [    x:collection1] o.a.s.c.SolrCore [collection1]  CLOSING SolrCore org.apache.solr.core.SolrCore@30c38d84
   [junit4]   2> 14138 INFO  (coreCloseExecutor-39-thread-1-processing-x:collection1) [    x:collection1] o.a.s.u.DirectUpdateHandler2 closing DirectUpdateHandler2{commits=0,autocommits=0,soft autocommits=0,optimizes=0,rollbacks=0,expungeDeletes=0,docsPending=0,adds=0,deletesById=0,deletesByQuery=0,errors=0,cumulative_adds=0,cumulative_deletesById=0,cumulative_deletesByQuery=0,cumulative_errors=0}
   [junit4]   2> 14138 INFO  (coreCloseExecutor-39-thread-1-processing-x:collection1) [    x:collection1] o.a.s.u.SolrCoreState Closing SolrCoreState
   [junit4]   2> 14138 INFO  (coreCloseExecutor-39-thread-1-processing-x:collection1) [    x:collection1] o.a.s.u.DefaultSolrCoreState SolrCoreState ref count has reached 0 - closing IndexWriter
   [junit4]   2> 14138 INFO  (coreCloseExecutor-39-thread-1-processing-x:collection1) [    x:collection1] o.a.s.u.DefaultSolrCoreState closing IndexWriter with IndexWriterCloser
   [junit4]   2> 14203 INFO  (coreCloseExecutor-39-thread-1-processing-x:collection1) [    x:collection1] o.a.s.c.SolrCore [collection1] Closing main searcher on request.
   [junit4]   2> 14221 INFO  (coreCloseExecutor-39-thread-1-processing-x:collection1) [    x:collection1] o.a.s.c.CachingDirectoryFactory Closing MockFSDirectoryFactory - 3 directories currently being tracked
   [junit4]   2> 14221 INFO  (coreCloseExecutor-39-thread-1-processing-x:collection1) [    x:collection1] o.a.s.c.CachingDirectoryFactory looking to close /export/home/jenkins/workspace/Lucene-Solr-master-Solaris/solr/build/solr-core/test/J0/temp/solr.core.TestArbitraryIndexDir_F6EF260CDB14ECFB-001/init-core-data-001 [CachedDir<<refCount=0;path=/export/home/jenkins/workspace/Lucene-Solr-master-Solaris/solr/build/solr-core/test/J0/temp/solr.core.TestArbitraryIndexDir_F6EF260CDB14ECFB-001/init-core-data-001;done=false>>]
   [junit4]   2> 14221 INFO  (coreCloseExecutor-39-thread-1-processing-x:collection1) [    x:collection1] o.a.s.c.CachingDirectoryFactory Closing directory, CoreContainer#isShutdown=true
   [junit4]   2> 14221 INFO  (coreCloseExecutor-39-thread-1-processing-x:collection1) [    x:collection1] o.a.s.c.CachingDirectoryFactory Closing directory: /export/home/jenkins/workspace/Lucene-Solr-master-Solaris/solr/build/solr-core/test/J0/temp/solr.core.TestArbitraryIndexDir_F6EF260CDB14ECFB-001/init-core-data-001
   [junit4]   2> 14223 INFO  (coreCloseExecutor-39-thread-1-processing-x:collection1) [    x:collection1] o.a.s.c.CachingDirectoryFactory looking to close /export/home/jenkins/workspace/Lucene-Solr-master-Solaris/solr/build/solr-core/test/J0/temp/solr.core.TestArbitraryIndexDir_F6EF260CDB14ECFB-001/init-core-data-001/index_temp [CachedDir<<refCount=0;path=/export/home/jenkins/workspace/Lucene-Solr-master-Solaris/solr/build/solr-core/test/J0/temp/solr.core.TestArbitraryIndexDir_F6EF260CDB14ECFB-001/init-core-data-001/index_temp;done=false>>]
   [junit4]   2> 14223 INFO  (coreCloseExecutor-39-thread-1-processing-x:collection1) [    x:collection1] o.a.s.c.CachingDirectoryFactory Closing directory, CoreContainer#isShutdown=true
   [junit4]   2> 14223 INFO  (coreCloseExecutor-39-thread-1-processing-x:collection1) [    x:collection1] o.a.s.c.CachingDirectoryFactory Closing directory: /export/home/jenkins/workspace/Lucene-Solr-master-Solaris/solr/build/solr-core/test/J0/temp/solr.core.TestArbitraryIndexDir_F6EF260CDB14ECFB-001/init-core-data-001/index_temp
   [junit4]   2> 14256 INFO  (coreCloseExecutor-39-thread-1-processing-x:collection1) [    x:collection1] o.a.s.c.CachingDirectoryFactory looking to close /export/home/jenkins/workspace/Lucene-Solr-master-Solaris/solr/build/solr-core/test/J0/temp/solr.core.TestArbitraryIndexDir_F6EF260CDB14ECFB-001/init-core-data-001/index [CachedDir<<refCount=0;path=/export/home/jenkins/workspace/Lucene-Solr-master-Solaris/solr/build/solr-core/test/J0/temp/solr.core.TestArbitraryIndexDir_F6EF260CDB14ECFB-001/init-core-data-001/index;done=false>>]
   [junit4]   2> 14257 INFO  (coreCloseExecutor-39-thread-1-processing-x:collection1) [    x:collection1] o.a.s.c.CachingDirectoryFactory Closing directory, CoreContainer#isShutdown=true
   [junit4]   2> 14257 INFO  (coreCloseExecutor-39-thread-1-processing-x:collection1) [    x:collection1] o.a.s.c.CachingDirectoryFactory Closing directory: /export/home/jenkins/workspace/Lucene-Solr-master-Solaris/solr/build/solr-core/test/J0/temp/solr.core.TestArbitraryIndexDir_F6EF260CDB14ECFB-001/init-core-data-001/index
   [junit4]   2> NOTE: leaving temporary files on disk at: /export/home/jenkins/workspace/Lucene-Solr-master-Solaris/solr/build/solr-core/test/J0/temp/solr.core.TestArbitraryIndexDir_F6EF260CDB14ECFB-001
   [junit4]   2> NOTE: test params are: codec=Asserting(Lucene60): {name=TestBloomFilteredLucenePostings(BloomFilteringPostingsFormat(Lucene50(blocksize=128))), id=TestBloomFilteredLucenePostings(BloomFilteringPostingsFormat(Lucene50(blocksize=128)))}, docValues:{}, maxPointsInLeafNode=930, maxMBSortInHeap=5.966578245850885, sim=RandomSimilarity(queryNorm=true,coord=no): {}, locale=sr-RS, timezone=Africa/Freetown
   [junit4]   2> NOTE: SunOS 5.11 amd64/Oracle Corporation 1.8.0_72 (64-bit)/cpus=3,threads=1,free=160675168,total=279969792
   [junit4]   2> NOTE: All tests run in this JVM: [TestExtendedDismaxParser, DirectSolrSpellCheckerTest, TestArbitraryIndexDir]
   [junit4] Completed [3/584 (1!)] on J0 in 1.34s, 1 test, 1 error <<< FAILURES!

[...truncated 1887 lines...]
BUILD FAILED
/export/home/jenkins/workspace/Lucene-Solr-master-Solaris/build.xml:740: The following error occurred while executing this line:
/export/home/jenkins/workspace/Lucene-Solr-master-Solaris/build.xml:684: The following error occurred while executing this line:
/export/home/jenkins/workspace/Lucene-Solr-master-Solaris/build.xml:59: The following error occurred while executing this line:
/export/home/jenkins/workspace/Lucene-Solr-master-Solaris/solr/build.xml:233: The following error occurred while executing this line:
/export/home/jenkins/workspace/Lucene-Solr-master-Solaris/solr/common-build.xml:529: The following error occurred while executing this line:
/export/home/jenkins/workspace/Lucene-Solr-master-Solaris/lucene/common-build.xml:1457: The following error occurred while executing this line:
/export/home/jenkins/workspace/Lucene-Solr-master-Solaris/lucene/common-build.xml:1014: There were test failures: 584 suites (10 ignored), 2353 tests, 1 error, 85 ignored (70 assumptions) [seed: F6EF260CDB14ECFB]

Total time: 83 minutes 35 seconds
Build step 'Invoke Ant' marked build as failure
Archiving artifacts
[WARNINGS] Skipping publisher since build result is FAILURE
Recording test results
Email was triggered for: Failure - Any
Sending email for trigger: Failure - Any



Mime
View raw message