lucene-dev mailing list archives

Site index · List index
Message view « Date » · « Thread »
Top « Date » · « Thread »
From Apache Jenkins Server <jenk...@builds.apache.org>
Subject [JENKINS] Lucene-Solr-NightlyTests-master - Build # 978 - Still Failing
Date Tue, 05 Apr 2016 20:06:47 GMT
Build: https://builds.apache.org/job/Lucene-Solr-NightlyTests-master/978/

13 tests failed.
FAILED:  org.apache.solr.client.solrj.ConnectionReuseTest.test

Error Message:
We expected all communication via streaming client to use one connection! expected=239 got=235

Stack Trace:
java.lang.AssertionError: We expected all communication via streaming client to use one connection! expected=239 got=235
	at __randomizedtesting.SeedInfo.seed([BE696F04332BFFEC:363D50DE9DD79214]:0)
	at org.junit.Assert.fail(Assert.java:93)
	at org.junit.Assert.assertTrue(Assert.java:43)
	at org.apache.solr.client.solrj.ConnectionReuseTest.test(ConnectionReuseTest.java:153)
	at sun.reflect.NativeMethodAccessorImpl.invoke0(Native Method)
	at sun.reflect.NativeMethodAccessorImpl.invoke(NativeMethodAccessorImpl.java:62)
	at sun.reflect.DelegatingMethodAccessorImpl.invoke(DelegatingMethodAccessorImpl.java:43)
	at java.lang.reflect.Method.invoke(Method.java:498)
	at com.carrotsearch.randomizedtesting.RandomizedRunner.invoke(RandomizedRunner.java:1764)
	at com.carrotsearch.randomizedtesting.RandomizedRunner$8.evaluate(RandomizedRunner.java:871)
	at com.carrotsearch.randomizedtesting.RandomizedRunner$9.evaluate(RandomizedRunner.java:907)
	at com.carrotsearch.randomizedtesting.RandomizedRunner$10.evaluate(RandomizedRunner.java:921)
	at org.apache.solr.BaseDistributedSearchTestCase$ShardsRepeatRule$ShardsFixedStatement.callStatement(BaseDistributedSearchTestCase.java:985)
	at org.apache.solr.BaseDistributedSearchTestCase$ShardsRepeatRule$ShardsStatement.evaluate(BaseDistributedSearchTestCase.java:960)
	at com.carrotsearch.randomizedtesting.rules.SystemPropertiesRestoreRule$1.evaluate(SystemPropertiesRestoreRule.java:57)
	at org.apache.lucene.util.TestRuleSetupTeardownChained$1.evaluate(TestRuleSetupTeardownChained.java:49)
	at org.apache.lucene.util.AbstractBeforeAfterRule$1.evaluate(AbstractBeforeAfterRule.java:45)
	at org.apache.lucene.util.TestRuleThreadAndTestName$1.evaluate(TestRuleThreadAndTestName.java:48)
	at org.apache.lucene.util.TestRuleIgnoreAfterMaxFailures$1.evaluate(TestRuleIgnoreAfterMaxFailures.java:64)
	at org.apache.lucene.util.TestRuleMarkFailure$1.evaluate(TestRuleMarkFailure.java:47)
	at com.carrotsearch.randomizedtesting.rules.StatementAdapter.evaluate(StatementAdapter.java:36)
	at com.carrotsearch.randomizedtesting.ThreadLeakControl$StatementRunner.run(ThreadLeakControl.java:367)
	at com.carrotsearch.randomizedtesting.ThreadLeakControl.forkTimeoutingTask(ThreadLeakControl.java:809)
	at com.carrotsearch.randomizedtesting.ThreadLeakControl$3.evaluate(ThreadLeakControl.java:460)
	at com.carrotsearch.randomizedtesting.RandomizedRunner.runSingleTest(RandomizedRunner.java:880)
	at com.carrotsearch.randomizedtesting.RandomizedRunner$5.evaluate(RandomizedRunner.java:781)
	at com.carrotsearch.randomizedtesting.RandomizedRunner$6.evaluate(RandomizedRunner.java:816)
	at com.carrotsearch.randomizedtesting.RandomizedRunner$7.evaluate(RandomizedRunner.java:827)
	at com.carrotsearch.randomizedtesting.rules.StatementAdapter.evaluate(StatementAdapter.java:36)
	at com.carrotsearch.randomizedtesting.rules.SystemPropertiesRestoreRule$1.evaluate(SystemPropertiesRestoreRule.java:57)
	at org.apache.lucene.util.AbstractBeforeAfterRule$1.evaluate(AbstractBeforeAfterRule.java:45)
	at com.carrotsearch.randomizedtesting.rules.StatementAdapter.evaluate(StatementAdapter.java:36)
	at org.apache.lucene.util.TestRuleStoreClassName$1.evaluate(TestRuleStoreClassName.java:41)
	at com.carrotsearch.randomizedtesting.rules.NoShadowingOrOverridesOnMethodsRule$1.evaluate(NoShadowingOrOverridesOnMethodsRule.java:40)
	at com.carrotsearch.randomizedtesting.rules.NoShadowingOrOverridesOnMethodsRule$1.evaluate(NoShadowingOrOverridesOnMethodsRule.java:40)
	at com.carrotsearch.randomizedtesting.rules.StatementAdapter.evaluate(StatementAdapter.java:36)
	at com.carrotsearch.randomizedtesting.rules.StatementAdapter.evaluate(StatementAdapter.java:36)
	at com.carrotsearch.randomizedtesting.rules.StatementAdapter.evaluate(StatementAdapter.java:36)
	at org.apache.lucene.util.TestRuleAssertionsRequired$1.evaluate(TestRuleAssertionsRequired.java:53)
	at org.apache.lucene.util.TestRuleMarkFailure$1.evaluate(TestRuleMarkFailure.java:47)
	at org.apache.lucene.util.TestRuleIgnoreAfterMaxFailures$1.evaluate(TestRuleIgnoreAfterMaxFailures.java:64)
	at org.apache.lucene.util.TestRuleIgnoreTestSuites$1.evaluate(TestRuleIgnoreTestSuites.java:54)
	at com.carrotsearch.randomizedtesting.rules.StatementAdapter.evaluate(StatementAdapter.java:36)
	at com.carrotsearch.randomizedtesting.ThreadLeakControl$StatementRunner.run(ThreadLeakControl.java:367)
	at java.lang.Thread.run(Thread.java:745)


FAILED:  org.apache.solr.cloud.CdcrReplicationDistributedZkTest.testReplicationAfterLeaderChange

Error Message:
Timeout while trying to assert number of documents @ target_collection

Stack Trace:
java.lang.AssertionError: Timeout while trying to assert number of documents @ target_collection
	at __randomizedtesting.SeedInfo.seed([BE696F04332BFFEC:6C9923E76D8459DE]:0)
	at org.apache.solr.cloud.BaseCdcrDistributedZkTest.assertNumDocs(BaseCdcrDistributedZkTest.java:270)
	at org.apache.solr.cloud.CdcrReplicationDistributedZkTest.testReplicationAfterLeaderChange(CdcrReplicationDistributedZkTest.java:291)
	at sun.reflect.NativeMethodAccessorImpl.invoke0(Native Method)
	at sun.reflect.NativeMethodAccessorImpl.invoke(NativeMethodAccessorImpl.java:62)
	at sun.reflect.DelegatingMethodAccessorImpl.invoke(DelegatingMethodAccessorImpl.java:43)
	at java.lang.reflect.Method.invoke(Method.java:498)
	at com.carrotsearch.randomizedtesting.RandomizedRunner.invoke(RandomizedRunner.java:1764)
	at com.carrotsearch.randomizedtesting.RandomizedRunner$8.evaluate(RandomizedRunner.java:871)
	at com.carrotsearch.randomizedtesting.RandomizedRunner$9.evaluate(RandomizedRunner.java:907)
	at com.carrotsearch.randomizedtesting.RandomizedRunner$10.evaluate(RandomizedRunner.java:921)
	at org.apache.solr.BaseDistributedSearchTestCase$ShardsRepeatRule$ShardsFixedStatement.callStatement(BaseDistributedSearchTestCase.java:985)
	at org.apache.solr.BaseDistributedSearchTestCase$ShardsRepeatRule$ShardsStatement.evaluate(BaseDistributedSearchTestCase.java:960)
	at com.carrotsearch.randomizedtesting.rules.SystemPropertiesRestoreRule$1.evaluate(SystemPropertiesRestoreRule.java:57)
	at org.apache.lucene.util.TestRuleSetupTeardownChained$1.evaluate(TestRuleSetupTeardownChained.java:49)
	at org.apache.lucene.util.AbstractBeforeAfterRule$1.evaluate(AbstractBeforeAfterRule.java:45)
	at org.apache.lucene.util.TestRuleThreadAndTestName$1.evaluate(TestRuleThreadAndTestName.java:48)
	at org.apache.lucene.util.TestRuleIgnoreAfterMaxFailures$1.evaluate(TestRuleIgnoreAfterMaxFailures.java:64)
	at org.apache.lucene.util.TestRuleMarkFailure$1.evaluate(TestRuleMarkFailure.java:47)
	at com.carrotsearch.randomizedtesting.rules.StatementAdapter.evaluate(StatementAdapter.java:36)
	at com.carrotsearch.randomizedtesting.ThreadLeakControl$StatementRunner.run(ThreadLeakControl.java:367)
	at com.carrotsearch.randomizedtesting.ThreadLeakControl.forkTimeoutingTask(ThreadLeakControl.java:809)
	at com.carrotsearch.randomizedtesting.ThreadLeakControl$3.evaluate(ThreadLeakControl.java:460)
	at com.carrotsearch.randomizedtesting.RandomizedRunner.runSingleTest(RandomizedRunner.java:880)
	at com.carrotsearch.randomizedtesting.RandomizedRunner$5.evaluate(RandomizedRunner.java:781)
	at com.carrotsearch.randomizedtesting.RandomizedRunner$6.evaluate(RandomizedRunner.java:816)
	at com.carrotsearch.randomizedtesting.RandomizedRunner$7.evaluate(RandomizedRunner.java:827)
	at com.carrotsearch.randomizedtesting.rules.StatementAdapter.evaluate(StatementAdapter.java:36)
	at com.carrotsearch.randomizedtesting.rules.SystemPropertiesRestoreRule$1.evaluate(SystemPropertiesRestoreRule.java:57)
	at org.apache.lucene.util.AbstractBeforeAfterRule$1.evaluate(AbstractBeforeAfterRule.java:45)
	at com.carrotsearch.randomizedtesting.rules.StatementAdapter.evaluate(StatementAdapter.java:36)
	at org.apache.lucene.util.TestRuleStoreClassName$1.evaluate(TestRuleStoreClassName.java:41)
	at com.carrotsearch.randomizedtesting.rules.NoShadowingOrOverridesOnMethodsRule$1.evaluate(NoShadowingOrOverridesOnMethodsRule.java:40)
	at com.carrotsearch.randomizedtesting.rules.NoShadowingOrOverridesOnMethodsRule$1.evaluate(NoShadowingOrOverridesOnMethodsRule.java:40)
	at com.carrotsearch.randomizedtesting.rules.StatementAdapter.evaluate(StatementAdapter.java:36)
	at com.carrotsearch.randomizedtesting.rules.StatementAdapter.evaluate(StatementAdapter.java:36)
	at com.carrotsearch.randomizedtesting.rules.StatementAdapter.evaluate(StatementAdapter.java:36)
	at org.apache.lucene.util.TestRuleAssertionsRequired$1.evaluate(TestRuleAssertionsRequired.java:53)
	at org.apache.lucene.util.TestRuleMarkFailure$1.evaluate(TestRuleMarkFailure.java:47)
	at org.apache.lucene.util.TestRuleIgnoreAfterMaxFailures$1.evaluate(TestRuleIgnoreAfterMaxFailures.java:64)
	at org.apache.lucene.util.TestRuleIgnoreTestSuites$1.evaluate(TestRuleIgnoreTestSuites.java:54)
	at com.carrotsearch.randomizedtesting.rules.StatementAdapter.evaluate(StatementAdapter.java:36)
	at com.carrotsearch.randomizedtesting.ThreadLeakControl$StatementRunner.run(ThreadLeakControl.java:367)
	at java.lang.Thread.run(Thread.java:745)
Caused by: java.lang.AssertionError: expected:<10> but was:<4>
	at org.junit.Assert.fail(Assert.java:93)
	at org.junit.Assert.failNotEquals(Assert.java:647)
	at org.junit.Assert.assertEquals(Assert.java:128)
	at org.junit.Assert.assertEquals(Assert.java:472)
	at org.junit.Assert.assertEquals(Assert.java:456)
	at org.apache.solr.cloud.BaseCdcrDistributedZkTest.assertNumDocs(BaseCdcrDistributedZkTest.java:261)
	... 42 more


FAILED:  junit.framework.TestSuite.org.apache.solr.cloud.CollectionsAPIDistributedZkTest

Error Message:
1 thread leaked from SUITE scope at org.apache.solr.cloud.CollectionsAPIDistributedZkTest:     1) Thread[id=35882, name=searcherExecutor-6258-thread-1, state=WAITING, group=TGRP-CollectionsAPIDistributedZkTest]         at sun.misc.Unsafe.park(Native Method)         at java.util.concurrent.locks.LockSupport.park(LockSupport.java:175)         at java.util.concurrent.locks.AbstractQueuedSynchronizer$ConditionObject.await(AbstractQueuedSynchronizer.java:2039)         at java.util.concurrent.LinkedBlockingQueue.take(LinkedBlockingQueue.java:442)         at java.util.concurrent.ThreadPoolExecutor.getTask(ThreadPoolExecutor.java:1067)         at java.util.concurrent.ThreadPoolExecutor.runWorker(ThreadPoolExecutor.java:1127)         at java.util.concurrent.ThreadPoolExecutor$Worker.run(ThreadPoolExecutor.java:617)         at java.lang.Thread.run(Thread.java:745)

Stack Trace:
com.carrotsearch.randomizedtesting.ThreadLeakError: 1 thread leaked from SUITE scope at org.apache.solr.cloud.CollectionsAPIDistributedZkTest: 
   1) Thread[id=35882, name=searcherExecutor-6258-thread-1, state=WAITING, group=TGRP-CollectionsAPIDistributedZkTest]
        at sun.misc.Unsafe.park(Native Method)
        at java.util.concurrent.locks.LockSupport.park(LockSupport.java:175)
        at java.util.concurrent.locks.AbstractQueuedSynchronizer$ConditionObject.await(AbstractQueuedSynchronizer.java:2039)
        at java.util.concurrent.LinkedBlockingQueue.take(LinkedBlockingQueue.java:442)
        at java.util.concurrent.ThreadPoolExecutor.getTask(ThreadPoolExecutor.java:1067)
        at java.util.concurrent.ThreadPoolExecutor.runWorker(ThreadPoolExecutor.java:1127)
        at java.util.concurrent.ThreadPoolExecutor$Worker.run(ThreadPoolExecutor.java:617)
        at java.lang.Thread.run(Thread.java:745)
	at __randomizedtesting.SeedInfo.seed([BE696F04332BFFEC]:0)


FAILED:  junit.framework.TestSuite.org.apache.solr.cloud.CollectionsAPIDistributedZkTest

Error Message:
There are still zombie threads that couldn't be terminated:    1) Thread[id=35882, name=searcherExecutor-6258-thread-1, state=WAITING, group=TGRP-CollectionsAPIDistributedZkTest]         at sun.misc.Unsafe.park(Native Method)         at java.util.concurrent.locks.LockSupport.park(LockSupport.java:175)         at java.util.concurrent.locks.AbstractQueuedSynchronizer$ConditionObject.await(AbstractQueuedSynchronizer.java:2039)         at java.util.concurrent.LinkedBlockingQueue.take(LinkedBlockingQueue.java:442)         at java.util.concurrent.ThreadPoolExecutor.getTask(ThreadPoolExecutor.java:1067)         at java.util.concurrent.ThreadPoolExecutor.runWorker(ThreadPoolExecutor.java:1127)         at java.util.concurrent.ThreadPoolExecutor$Worker.run(ThreadPoolExecutor.java:617)         at java.lang.Thread.run(Thread.java:745)

Stack Trace:
com.carrotsearch.randomizedtesting.ThreadLeakError: There are still zombie threads that couldn't be terminated:
   1) Thread[id=35882, name=searcherExecutor-6258-thread-1, state=WAITING, group=TGRP-CollectionsAPIDistributedZkTest]
        at sun.misc.Unsafe.park(Native Method)
        at java.util.concurrent.locks.LockSupport.park(LockSupport.java:175)
        at java.util.concurrent.locks.AbstractQueuedSynchronizer$ConditionObject.await(AbstractQueuedSynchronizer.java:2039)
        at java.util.concurrent.LinkedBlockingQueue.take(LinkedBlockingQueue.java:442)
        at java.util.concurrent.ThreadPoolExecutor.getTask(ThreadPoolExecutor.java:1067)
        at java.util.concurrent.ThreadPoolExecutor.runWorker(ThreadPoolExecutor.java:1127)
        at java.util.concurrent.ThreadPoolExecutor$Worker.run(ThreadPoolExecutor.java:617)
        at java.lang.Thread.run(Thread.java:745)
	at __randomizedtesting.SeedInfo.seed([BE696F04332BFFEC]:0)


FAILED:  junit.framework.TestSuite.org.apache.solr.core.TestLazyCores

Error Message:
ObjectTracker found 4 object(s) that were not released!!! [SolrCore, MDCAwareThreadPoolExecutor, RawDirectoryWrapper, MockDirectoryWrapper]

Stack Trace:
java.lang.AssertionError: ObjectTracker found 4 object(s) that were not released!!! [SolrCore, MDCAwareThreadPoolExecutor, RawDirectoryWrapper, MockDirectoryWrapper]
	at __randomizedtesting.SeedInfo.seed([BE696F04332BFFEC]:0)
	at org.junit.Assert.fail(Assert.java:93)
	at org.junit.Assert.assertTrue(Assert.java:43)
	at org.junit.Assert.assertNull(Assert.java:551)
	at org.apache.solr.SolrTestCaseJ4.afterClass(SolrTestCaseJ4.java:247)
	at sun.reflect.GeneratedMethodAccessor20.invoke(Unknown Source)
	at sun.reflect.DelegatingMethodAccessorImpl.invoke(DelegatingMethodAccessorImpl.java:43)
	at java.lang.reflect.Method.invoke(Method.java:498)
	at com.carrotsearch.randomizedtesting.RandomizedRunner.invoke(RandomizedRunner.java:1764)
	at com.carrotsearch.randomizedtesting.RandomizedRunner$7.evaluate(RandomizedRunner.java:834)
	at com.carrotsearch.randomizedtesting.rules.StatementAdapter.evaluate(StatementAdapter.java:36)
	at com.carrotsearch.randomizedtesting.rules.SystemPropertiesRestoreRule$1.evaluate(SystemPropertiesRestoreRule.java:57)
	at org.apache.lucene.util.AbstractBeforeAfterRule$1.evaluate(AbstractBeforeAfterRule.java:45)
	at com.carrotsearch.randomizedtesting.rules.StatementAdapter.evaluate(StatementAdapter.java:36)
	at org.apache.lucene.util.TestRuleStoreClassName$1.evaluate(TestRuleStoreClassName.java:41)
	at com.carrotsearch.randomizedtesting.rules.NoShadowingOrOverridesOnMethodsRule$1.evaluate(NoShadowingOrOverridesOnMethodsRule.java:40)
	at com.carrotsearch.randomizedtesting.rules.NoShadowingOrOverridesOnMethodsRule$1.evaluate(NoShadowingOrOverridesOnMethodsRule.java:40)
	at com.carrotsearch.randomizedtesting.rules.StatementAdapter.evaluate(StatementAdapter.java:36)
	at com.carrotsearch.randomizedtesting.rules.StatementAdapter.evaluate(StatementAdapter.java:36)
	at com.carrotsearch.randomizedtesting.rules.StatementAdapter.evaluate(StatementAdapter.java:36)
	at org.apache.lucene.util.TestRuleAssertionsRequired$1.evaluate(TestRuleAssertionsRequired.java:53)
	at org.apache.lucene.util.TestRuleMarkFailure$1.evaluate(TestRuleMarkFailure.java:47)
	at org.apache.lucene.util.TestRuleIgnoreAfterMaxFailures$1.evaluate(TestRuleIgnoreAfterMaxFailures.java:64)
	at org.apache.lucene.util.TestRuleIgnoreTestSuites$1.evaluate(TestRuleIgnoreTestSuites.java:54)
	at com.carrotsearch.randomizedtesting.rules.StatementAdapter.evaluate(StatementAdapter.java:36)
	at com.carrotsearch.randomizedtesting.ThreadLeakControl$StatementRunner.run(ThreadLeakControl.java:367)
	at java.lang.Thread.run(Thread.java:745)


FAILED:  junit.framework.TestSuite.org.apache.solr.core.TestLazyCores

Error Message:
1 thread leaked from SUITE scope at org.apache.solr.core.TestLazyCores:     1) Thread[id=22724, name=searcherExecutor-7313-thread-1, state=WAITING, group=TGRP-TestLazyCores]         at sun.misc.Unsafe.park(Native Method)         at java.util.concurrent.locks.LockSupport.park(LockSupport.java:175)         at java.util.concurrent.locks.AbstractQueuedSynchronizer$ConditionObject.await(AbstractQueuedSynchronizer.java:2039)         at java.util.concurrent.LinkedBlockingQueue.take(LinkedBlockingQueue.java:442)         at java.util.concurrent.ThreadPoolExecutor.getTask(ThreadPoolExecutor.java:1067)         at java.util.concurrent.ThreadPoolExecutor.runWorker(ThreadPoolExecutor.java:1127)         at java.util.concurrent.ThreadPoolExecutor$Worker.run(ThreadPoolExecutor.java:617)         at java.lang.Thread.run(Thread.java:745)

Stack Trace:
com.carrotsearch.randomizedtesting.ThreadLeakError: 1 thread leaked from SUITE scope at org.apache.solr.core.TestLazyCores: 
   1) Thread[id=22724, name=searcherExecutor-7313-thread-1, state=WAITING, group=TGRP-TestLazyCores]
        at sun.misc.Unsafe.park(Native Method)
        at java.util.concurrent.locks.LockSupport.park(LockSupport.java:175)
        at java.util.concurrent.locks.AbstractQueuedSynchronizer$ConditionObject.await(AbstractQueuedSynchronizer.java:2039)
        at java.util.concurrent.LinkedBlockingQueue.take(LinkedBlockingQueue.java:442)
        at java.util.concurrent.ThreadPoolExecutor.getTask(ThreadPoolExecutor.java:1067)
        at java.util.concurrent.ThreadPoolExecutor.runWorker(ThreadPoolExecutor.java:1127)
        at java.util.concurrent.ThreadPoolExecutor$Worker.run(ThreadPoolExecutor.java:617)
        at java.lang.Thread.run(Thread.java:745)
	at __randomizedtesting.SeedInfo.seed([BE696F04332BFFEC]:0)


FAILED:  junit.framework.TestSuite.org.apache.solr.core.TestLazyCores

Error Message:
There are still zombie threads that couldn't be terminated:    1) Thread[id=22724, name=searcherExecutor-7313-thread-1, state=WAITING, group=TGRP-TestLazyCores]         at sun.misc.Unsafe.park(Native Method)         at java.util.concurrent.locks.LockSupport.park(LockSupport.java:175)         at java.util.concurrent.locks.AbstractQueuedSynchronizer$ConditionObject.await(AbstractQueuedSynchronizer.java:2039)         at java.util.concurrent.LinkedBlockingQueue.take(LinkedBlockingQueue.java:442)         at java.util.concurrent.ThreadPoolExecutor.getTask(ThreadPoolExecutor.java:1067)         at java.util.concurrent.ThreadPoolExecutor.runWorker(ThreadPoolExecutor.java:1127)         at java.util.concurrent.ThreadPoolExecutor$Worker.run(ThreadPoolExecutor.java:617)         at java.lang.Thread.run(Thread.java:745)

Stack Trace:
com.carrotsearch.randomizedtesting.ThreadLeakError: There are still zombie threads that couldn't be terminated:
   1) Thread[id=22724, name=searcherExecutor-7313-thread-1, state=WAITING, group=TGRP-TestLazyCores]
        at sun.misc.Unsafe.park(Native Method)
        at java.util.concurrent.locks.LockSupport.park(LockSupport.java:175)
        at java.util.concurrent.locks.AbstractQueuedSynchronizer$ConditionObject.await(AbstractQueuedSynchronizer.java:2039)
        at java.util.concurrent.LinkedBlockingQueue.take(LinkedBlockingQueue.java:442)
        at java.util.concurrent.ThreadPoolExecutor.getTask(ThreadPoolExecutor.java:1067)
        at java.util.concurrent.ThreadPoolExecutor.runWorker(ThreadPoolExecutor.java:1127)
        at java.util.concurrent.ThreadPoolExecutor$Worker.run(ThreadPoolExecutor.java:617)
        at java.lang.Thread.run(Thread.java:745)
	at __randomizedtesting.SeedInfo.seed([BE696F04332BFFEC]:0)


FAILED:  junit.framework.TestSuite.org.apache.solr.cloud.CdcrReplicationDistributedZkTest

Error Message:
32 threads leaked from SUITE scope at org.apache.solr.cloud.CdcrReplicationDistributedZkTest:     1) Thread[id=2007, name=Connection evictor, state=TIMED_WAITING, group=TGRP-CdcrReplicationDistributedZkTest]         at java.lang.Thread.sleep(Native Method)         at org.apache.http.impl.client.IdleConnectionEvictor$1.run(IdleConnectionEvictor.java:66)         at java.lang.Thread.run(Thread.java:745)    2) Thread[id=3914, name=Connection evictor, state=TIMED_WAITING, group=TGRP-CdcrReplicationDistributedZkTest]         at java.lang.Thread.sleep(Native Method)         at org.apache.http.impl.client.IdleConnectionEvictor$1.run(IdleConnectionEvictor.java:66)         at java.lang.Thread.run(Thread.java:745)    3) Thread[id=9025, name=Connection evictor, state=TIMED_WAITING, group=TGRP-CdcrReplicationDistributedZkTest]         at java.lang.Thread.sleep(Native Method)         at org.apache.http.impl.client.IdleConnectionEvictor$1.run(IdleConnectionEvictor.java:66)         at java.lang.Thread.run(Thread.java:745)    4) Thread[id=3667, name=Connection evictor, state=TIMED_WAITING, group=TGRP-CdcrReplicationDistributedZkTest]         at java.lang.Thread.sleep(Native Method)         at org.apache.http.impl.client.IdleConnectionEvictor$1.run(IdleConnectionEvictor.java:66)         at java.lang.Thread.run(Thread.java:745)    5) Thread[id=3669, name=Connection evictor, state=TIMED_WAITING, group=TGRP-CdcrReplicationDistributedZkTest]         at java.lang.Thread.sleep(Native Method)         at org.apache.http.impl.client.IdleConnectionEvictor$1.run(IdleConnectionEvictor.java:66)         at java.lang.Thread.run(Thread.java:745)    6) Thread[id=3227, name=Connection evictor, state=TIMED_WAITING, group=TGRP-CdcrReplicationDistributedZkTest]         at java.lang.Thread.sleep(Native Method)         at org.apache.http.impl.client.IdleConnectionEvictor$1.run(IdleConnectionEvictor.java:66)         at java.lang.Thread.run(Thread.java:745)    7) Thread[id=1535, name=Connection evictor, state=TIMED_WAITING, group=TGRP-CdcrReplicationDistributedZkTest]         at java.lang.Thread.sleep(Native Method)         at org.apache.http.impl.client.IdleConnectionEvictor$1.run(IdleConnectionEvictor.java:66)         at java.lang.Thread.run(Thread.java:745)    8) Thread[id=3511, name=Connection evictor, state=TIMED_WAITING, group=TGRP-CdcrReplicationDistributedZkTest]         at java.lang.Thread.sleep(Native Method)         at org.apache.http.impl.client.IdleConnectionEvictor$1.run(IdleConnectionEvictor.java:66)         at java.lang.Thread.run(Thread.java:745)    9) Thread[id=2006, name=Connection evictor, state=TIMED_WAITING, group=TGRP-CdcrReplicationDistributedZkTest]         at java.lang.Thread.sleep(Native Method)         at org.apache.http.impl.client.IdleConnectionEvictor$1.run(IdleConnectionEvictor.java:66)         at java.lang.Thread.run(Thread.java:745)   10) Thread[id=3508, name=Connection evictor, state=TIMED_WAITING, group=TGRP-CdcrReplicationDistributedZkTest]         at java.lang.Thread.sleep(Native Method)         at org.apache.http.impl.client.IdleConnectionEvictor$1.run(IdleConnectionEvictor.java:66)         at java.lang.Thread.run(Thread.java:745)   11) Thread[id=3912, name=Connection evictor, state=TIMED_WAITING, group=TGRP-CdcrReplicationDistributedZkTest]         at java.lang.Thread.sleep(Native Method)         at org.apache.http.impl.client.IdleConnectionEvictor$1.run(IdleConnectionEvictor.java:66)         at java.lang.Thread.run(Thread.java:745)   12) Thread[id=7552, name=Connection evictor, state=TIMED_WAITING, group=TGRP-CdcrReplicationDistributedZkTest]         at java.lang.Thread.sleep(Native Method)         at org.apache.http.impl.client.IdleConnectionEvictor$1.run(IdleConnectionEvictor.java:66)         at java.lang.Thread.run(Thread.java:745)   13) Thread[id=3911, name=Connection evictor, state=TIMED_WAITING, group=TGRP-CdcrReplicationDistributedZkTest]         at java.lang.Thread.sleep(Native Method)         at org.apache.http.impl.client.IdleConnectionEvictor$1.run(IdleConnectionEvictor.java:66)         at java.lang.Thread.run(Thread.java:745)   14) Thread[id=9024, name=Connection evictor, state=TIMED_WAITING, group=TGRP-CdcrReplicationDistributedZkTest]         at java.lang.Thread.sleep(Native Method)         at org.apache.http.impl.client.IdleConnectionEvictor$1.run(IdleConnectionEvictor.java:66)         at java.lang.Thread.run(Thread.java:745)   15) Thread[id=7550, name=Connection evictor, state=TIMED_WAITING, group=TGRP-CdcrReplicationDistributedZkTest]         at java.lang.Thread.sleep(Native Method)         at org.apache.http.impl.client.IdleConnectionEvictor$1.run(IdleConnectionEvictor.java:66)         at java.lang.Thread.run(Thread.java:745)   16) Thread[id=9023, name=Connection evictor, state=TIMED_WAITING, group=TGRP-CdcrReplicationDistributedZkTest]         at java.lang.Thread.sleep(Native Method)         at org.apache.http.impl.client.IdleConnectionEvictor$1.run(IdleConnectionEvictor.java:66)         at java.lang.Thread.run(Thread.java:745)   17) Thread[id=2008, name=Connection evictor, state=TIMED_WAITING, group=TGRP-CdcrReplicationDistributedZkTest]         at java.lang.Thread.sleep(Native Method)         at org.apache.http.impl.client.IdleConnectionEvictor$1.run(IdleConnectionEvictor.java:66)         at java.lang.Thread.run(Thread.java:745)   18) Thread[id=3509, name=Connection evictor, state=TIMED_WAITING, group=TGRP-CdcrReplicationDistributedZkTest]         at java.lang.Thread.sleep(Native Method)         at org.apache.http.impl.client.IdleConnectionEvictor$1.run(IdleConnectionEvictor.java:66)         at java.lang.Thread.run(Thread.java:745)   19) Thread[id=3225, name=Connection evictor, state=TIMED_WAITING, group=TGRP-CdcrReplicationDistributedZkTest]         at java.lang.Thread.sleep(Native Method)         at org.apache.http.impl.client.IdleConnectionEvictor$1.run(IdleConnectionEvictor.java:66)         at java.lang.Thread.run(Thread.java:745)   20) Thread[id=7551, name=Connection evictor, state=TIMED_WAITING, group=TGRP-CdcrReplicationDistributedZkTest]         at java.lang.Thread.sleep(Native Method)         at org.apache.http.impl.client.IdleConnectionEvictor$1.run(IdleConnectionEvictor.java:66)         at java.lang.Thread.run(Thread.java:745)   21) Thread[id=3226, name=Connection evictor, state=TIMED_WAITING, group=TGRP-CdcrReplicationDistributedZkTest]         at java.lang.Thread.sleep(Native Method)         at org.apache.http.impl.client.IdleConnectionEvictor$1.run(IdleConnectionEvictor.java:66)         at java.lang.Thread.run(Thread.java:745)   22) Thread[id=1536, name=Connection evictor, state=TIMED_WAITING, group=TGRP-CdcrReplicationDistributedZkTest]         at java.lang.Thread.sleep(Native Method)         at org.apache.http.impl.client.IdleConnectionEvictor$1.run(IdleConnectionEvictor.java:66)         at java.lang.Thread.run(Thread.java:745)   23) Thread[id=3913, name=Connection evictor, state=TIMED_WAITING, group=TGRP-CdcrReplicationDistributedZkTest]         at java.lang.Thread.sleep(Native Method)         at org.apache.http.impl.client.IdleConnectionEvictor$1.run(IdleConnectionEvictor.java:66)         at java.lang.Thread.run(Thread.java:745)   24) Thread[id=2009, name=Connection evictor, state=TIMED_WAITING, group=TGRP-CdcrReplicationDistributedZkTest]         at java.lang.Thread.sleep(Native Method)         at org.apache.http.impl.client.IdleConnectionEvictor$1.run(IdleConnectionEvictor.java:66)         at java.lang.Thread.run(Thread.java:745)   25) Thread[id=3510, name=Connection evictor, state=TIMED_WAITING, group=TGRP-CdcrReplicationDistributedZkTest]         at java.lang.Thread.sleep(Native Method)         at org.apache.http.impl.client.IdleConnectionEvictor$1.run(IdleConnectionEvictor.java:66)         at java.lang.Thread.run(Thread.java:745)   26) Thread[id=3670, name=Connection evictor, state=TIMED_WAITING, group=TGRP-CdcrReplicationDistributedZkTest]         at java.lang.Thread.sleep(Native Method)         at org.apache.http.impl.client.IdleConnectionEvictor$1.run(IdleConnectionEvictor.java:66)         at java.lang.Thread.run(Thread.java:745)   27) Thread[id=1534, name=Connection evictor, state=TIMED_WAITING, group=TGRP-CdcrReplicationDistributedZkTest]         at java.lang.Thread.sleep(Native Method)         at org.apache.http.impl.client.IdleConnectionEvictor$1.run(IdleConnectionEvictor.java:66)         at java.lang.Thread.run(Thread.java:745)   28) Thread[id=3668, name=Connection evictor, state=TIMED_WAITING, group=TGRP-CdcrReplicationDistributedZkTest]         at java.lang.Thread.sleep(Native Method)         at org.apache.http.impl.client.IdleConnectionEvictor$1.run(IdleConnectionEvictor.java:66)         at java.lang.Thread.run(Thread.java:745)   29) Thread[id=9026, name=Connection evictor, state=TIMED_WAITING, group=TGRP-CdcrReplicationDistributedZkTest]         at java.lang.Thread.sleep(Native Method)         at org.apache.http.impl.client.IdleConnectionEvictor$1.run(IdleConnectionEvictor.java:66)         at java.lang.Thread.run(Thread.java:745)   30) Thread[id=1537, name=Connection evictor, state=TIMED_WAITING, group=TGRP-CdcrReplicationDistributedZkTest]         at java.lang.Thread.sleep(Native Method)         at org.apache.http.impl.client.IdleConnectionEvictor$1.run(IdleConnectionEvictor.java:66)         at java.lang.Thread.run(Thread.java:745)   31) Thread[id=3228, name=Connection evictor, state=TIMED_WAITING, group=TGRP-CdcrReplicationDistributedZkTest]         at java.lang.Thread.sleep(Native Method)         at org.apache.http.impl.client.IdleConnectionEvictor$1.run(IdleConnectionEvictor.java:66)         at java.lang.Thread.run(Thread.java:745)   32) Thread[id=7553, name=Connection evictor, state=TIMED_WAITING, group=TGRP-CdcrReplicationDistributedZkTest]         at java.lang.Thread.sleep(Native Method)         at org.apache.http.impl.client.IdleConnectionEvictor$1.run(IdleConnectionEvictor.java:66)         at java.lang.Thread.run(Thread.java:745)

Stack Trace:
com.carrotsearch.randomizedtesting.ThreadLeakError: 32 threads leaked from SUITE scope at org.apache.solr.cloud.CdcrReplicationDistributedZkTest: 
   1) Thread[id=2007, name=Connection evictor, state=TIMED_WAITING, group=TGRP-CdcrReplicationDistributedZkTest]
        at java.lang.Thread.sleep(Native Method)
        at org.apache.http.impl.client.IdleConnectionEvictor$1.run(IdleConnectionEvictor.java:66)
        at java.lang.Thread.run(Thread.java:745)
   2) Thread[id=3914, name=Connection evictor, state=TIMED_WAITING, group=TGRP-CdcrReplicationDistributedZkTest]
        at java.lang.Thread.sleep(Native Method)
        at org.apache.http.impl.client.IdleConnectionEvictor$1.run(IdleConnectionEvictor.java:66)
        at java.lang.Thread.run(Thread.java:745)
   3) Thread[id=9025, name=Connection evictor, state=TIMED_WAITING, group=TGRP-CdcrReplicationDistributedZkTest]
        at java.lang.Thread.sleep(Native Method)
        at org.apache.http.impl.client.IdleConnectionEvictor$1.run(IdleConnectionEvictor.java:66)
        at java.lang.Thread.run(Thread.java:745)
   4) Thread[id=3667, name=Connection evictor, state=TIMED_WAITING, group=TGRP-CdcrReplicationDistributedZkTest]
        at java.lang.Thread.sleep(Native Method)
        at org.apache.http.impl.client.IdleConnectionEvictor$1.run(IdleConnectionEvictor.java:66)
        at java.lang.Thread.run(Thread.java:745)
   5) Thread[id=3669, name=Connection evictor, state=TIMED_WAITING, group=TGRP-CdcrReplicationDistributedZkTest]
        at java.lang.Thread.sleep(Native Method)
        at org.apache.http.impl.client.IdleConnectionEvictor$1.run(IdleConnectionEvictor.java:66)
        at java.lang.Thread.run(Thread.java:745)
   6) Thread[id=3227, name=Connection evictor, state=TIMED_WAITING, group=TGRP-CdcrReplicationDistributedZkTest]
        at java.lang.Thread.sleep(Native Method)
        at org.apache.http.impl.client.IdleConnectionEvictor$1.run(IdleConnectionEvictor.java:66)
        at java.lang.Thread.run(Thread.java:745)
   7) Thread[id=1535, name=Connection evictor, state=TIMED_WAITING, group=TGRP-CdcrReplicationDistributedZkTest]
        at java.lang.Thread.sleep(Native Method)
        at org.apache.http.impl.client.IdleConnectionEvictor$1.run(IdleConnectionEvictor.java:66)
        at java.lang.Thread.run(Thread.java:745)
   8) Thread[id=3511, name=Connection evictor, state=TIMED_WAITING, group=TGRP-CdcrReplicationDistributedZkTest]
        at java.lang.Thread.sleep(Native Method)
        at org.apache.http.impl.client.IdleConnectionEvictor$1.run(IdleConnectionEvictor.java:66)
        at java.lang.Thread.run(Thread.java:745)
   9) Thread[id=2006, name=Connection evictor, state=TIMED_WAITING, group=TGRP-CdcrReplicationDistributedZkTest]
        at java.lang.Thread.sleep(Native Method)
        at org.apache.http.impl.client.IdleConnectionEvictor$1.run(IdleConnectionEvictor.java:66)
        at java.lang.Thread.run(Thread.java:745)
  10) Thread[id=3508, name=Connection evictor, state=TIMED_WAITING, group=TGRP-CdcrReplicationDistributedZkTest]
        at java.lang.Thread.sleep(Native Method)
        at org.apache.http.impl.client.IdleConnectionEvictor$1.run(IdleConnectionEvictor.java:66)
        at java.lang.Thread.run(Thread.java:745)
  11) Thread[id=3912, name=Connection evictor, state=TIMED_WAITING, group=TGRP-CdcrReplicationDistributedZkTest]
        at java.lang.Thread.sleep(Native Method)
        at org.apache.http.impl.client.IdleConnectionEvictor$1.run(IdleConnectionEvictor.java:66)
        at java.lang.Thread.run(Thread.java:745)
  12) Thread[id=7552, name=Connection evictor, state=TIMED_WAITING, group=TGRP-CdcrReplicationDistributedZkTest]
        at java.lang.Thread.sleep(Native Method)
        at org.apache.http.impl.client.IdleConnectionEvictor$1.run(IdleConnectionEvictor.java:66)
        at java.lang.Thread.run(Thread.java:745)
  13) Thread[id=3911, name=Connection evictor, state=TIMED_WAITING, group=TGRP-CdcrReplicationDistributedZkTest]
        at java.lang.Thread.sleep(Native Method)
        at org.apache.http.impl.client.IdleConnectionEvictor$1.run(IdleConnectionEvictor.java:66)
        at java.lang.Thread.run(Thread.java:745)
  14) Thread[id=9024, name=Connection evictor, state=TIMED_WAITING, group=TGRP-CdcrReplicationDistributedZkTest]
        at java.lang.Thread.sleep(Native Method)
        at org.apache.http.impl.client.IdleConnectionEvictor$1.run(IdleConnectionEvictor.java:66)
        at java.lang.Thread.run(Thread.java:745)
  15) Thread[id=7550, name=Connection evictor, state=TIMED_WAITING, group=TGRP-CdcrReplicationDistributedZkTest]
        at java.lang.Thread.sleep(Native Method)
        at org.apache.http.impl.client.IdleConnectionEvictor$1.run(IdleConnectionEvictor.java:66)
        at java.lang.Thread.run(Thread.java:745)
  16) Thread[id=9023, name=Connection evictor, state=TIMED_WAITING, group=TGRP-CdcrReplicationDistributedZkTest]
        at java.lang.Thread.sleep(Native Method)
        at org.apache.http.impl.client.IdleConnectionEvictor$1.run(IdleConnectionEvictor.java:66)
        at java.lang.Thread.run(Thread.java:745)
  17) Thread[id=2008, name=Connection evictor, state=TIMED_WAITING, group=TGRP-CdcrReplicationDistributedZkTest]
        at java.lang.Thread.sleep(Native Method)
        at org.apache.http.impl.client.IdleConnectionEvictor$1.run(IdleConnectionEvictor.java:66)
        at java.lang.Thread.run(Thread.java:745)
  18) Thread[id=3509, name=Connection evictor, state=TIMED_WAITING, group=TGRP-CdcrReplicationDistributedZkTest]
        at java.lang.Thread.sleep(Native Method)
        at org.apache.http.impl.client.IdleConnectionEvictor$1.run(IdleConnectionEvictor.java:66)
        at java.lang.Thread.run(Thread.java:745)
  19) Thread[id=3225, name=Connection evictor, state=TIMED_WAITING, group=TGRP-CdcrReplicationDistributedZkTest]
        at java.lang.Thread.sleep(Native Method)
        at org.apache.http.impl.client.IdleConnectionEvictor$1.run(IdleConnectionEvictor.java:66)
        at java.lang.Thread.run(Thread.java:745)
  20) Thread[id=7551, name=Connection evictor, state=TIMED_WAITING, group=TGRP-CdcrReplicationDistributedZkTest]
        at java.lang.Thread.sleep(Native Method)
        at org.apache.http.impl.client.IdleConnectionEvictor$1.run(IdleConnectionEvictor.java:66)
        at java.lang.Thread.run(Thread.java:745)
  21) Thread[id=3226, name=Connection evictor, state=TIMED_WAITING, group=TGRP-CdcrReplicationDistributedZkTest]
        at java.lang.Thread.sleep(Native Method)
        at org.apache.http.impl.client.IdleConnectionEvictor$1.run(IdleConnectionEvictor.java:66)
        at java.lang.Thread.run(Thread.java:745)
  22) Thread[id=1536, name=Connection evictor, state=TIMED_WAITING, group=TGRP-CdcrReplicationDistributedZkTest]
        at java.lang.Thread.sleep(Native Method)
        at org.apache.http.impl.client.IdleConnectionEvictor$1.run(IdleConnectionEvictor.java:66)
        at java.lang.Thread.run(Thread.java:745)
  23) Thread[id=3913, name=Connection evictor, state=TIMED_WAITING, group=TGRP-CdcrReplicationDistributedZkTest]
        at java.lang.Thread.sleep(Native Method)
        at org.apache.http.impl.client.IdleConnectionEvictor$1.run(IdleConnectionEvictor.java:66)
        at java.lang.Thread.run(Thread.java:745)
  24) Thread[id=2009, name=Connection evictor, state=TIMED_WAITING, group=TGRP-CdcrReplicationDistributedZkTest]
        at java.lang.Thread.sleep(Native Method)
        at org.apache.http.impl.client.IdleConnectionEvictor$1.run(IdleConnectionEvictor.java:66)
        at java.lang.Thread.run(Thread.java:745)
  25) Thread[id=3510, name=Connection evictor, state=TIMED_WAITING, group=TGRP-CdcrReplicationDistributedZkTest]
        at java.lang.Thread.sleep(Native Method)
        at org.apache.http.impl.client.IdleConnectionEvictor$1.run(IdleConnectionEvictor.java:66)
        at java.lang.Thread.run(Thread.java:745)
  26) Thread[id=3670, name=Connection evictor, state=TIMED_WAITING, group=TGRP-CdcrReplicationDistributedZkTest]
        at java.lang.Thread.sleep(Native Method)
        at org.apache.http.impl.client.IdleConnectionEvictor$1.run(IdleConnectionEvictor.java:66)
        at java.lang.Thread.run(Thread.java:745)
  27) Thread[id=1534, name=Connection evictor, state=TIMED_WAITING, group=TGRP-CdcrReplicationDistributedZkTest]
        at java.lang.Thread.sleep(Native Method)
        at org.apache.http.impl.client.IdleConnectionEvictor$1.run(IdleConnectionEvictor.java:66)
        at java.lang.Thread.run(Thread.java:745)
  28) Thread[id=3668, name=Connection evictor, state=TIMED_WAITING, group=TGRP-CdcrReplicationDistributedZkTest]
        at java.lang.Thread.sleep(Native Method)
        at org.apache.http.impl.client.IdleConnectionEvictor$1.run(IdleConnectionEvictor.java:66)
        at java.lang.Thread.run(Thread.java:745)
  29) Thread[id=9026, name=Connection evictor, state=TIMED_WAITING, group=TGRP-CdcrReplicationDistributedZkTest]
        at java.lang.Thread.sleep(Native Method)
        at org.apache.http.impl.client.IdleConnectionEvictor$1.run(IdleConnectionEvictor.java:66)
        at java.lang.Thread.run(Thread.java:745)
  30) Thread[id=1537, name=Connection evictor, state=TIMED_WAITING, group=TGRP-CdcrReplicationDistributedZkTest]
        at java.lang.Thread.sleep(Native Method)
        at org.apache.http.impl.client.IdleConnectionEvictor$1.run(IdleConnectionEvictor.java:66)
        at java.lang.Thread.run(Thread.java:745)
  31) Thread[id=3228, name=Connection evictor, state=TIMED_WAITING, group=TGRP-CdcrReplicationDistributedZkTest]
        at java.lang.Thread.sleep(Native Method)
        at org.apache.http.impl.client.IdleConnectionEvictor$1.run(IdleConnectionEvictor.java:66)
        at java.lang.Thread.run(Thread.java:745)
  32) Thread[id=7553, name=Connection evictor, state=TIMED_WAITING, group=TGRP-CdcrReplicationDistributedZkTest]
        at java.lang.Thread.sleep(Native Method)
        at org.apache.http.impl.client.IdleConnectionEvictor$1.run(IdleConnectionEvictor.java:66)
        at java.lang.Thread.run(Thread.java:745)
	at __randomizedtesting.SeedInfo.seed([BE696F04332BFFEC]:0)


FAILED:  junit.framework.TestSuite.org.apache.solr.cloud.CdcrReplicationHandlerTest

Error Message:
ObjectTracker found 12 object(s) that were not released!!! [InternalHttpClient, InternalHttpClient, InternalHttpClient, InternalHttpClient, InternalHttpClient, InternalHttpClient, InternalHttpClient, InternalHttpClient, InternalHttpClient, InternalHttpClient, InternalHttpClient, InternalHttpClient]

Stack Trace:
java.lang.AssertionError: ObjectTracker found 12 object(s) that were not released!!! [InternalHttpClient, InternalHttpClient, InternalHttpClient, InternalHttpClient, InternalHttpClient, InternalHttpClient, InternalHttpClient, InternalHttpClient, InternalHttpClient, InternalHttpClient, InternalHttpClient, InternalHttpClient]
	at __randomizedtesting.SeedInfo.seed([BE696F04332BFFEC]:0)
	at org.junit.Assert.fail(Assert.java:93)
	at org.junit.Assert.assertTrue(Assert.java:43)
	at org.junit.Assert.assertNull(Assert.java:551)
	at org.apache.solr.SolrTestCaseJ4.afterClass(SolrTestCaseJ4.java:247)
	at sun.reflect.NativeMethodAccessorImpl.invoke0(Native Method)
	at sun.reflect.NativeMethodAccessorImpl.invoke(NativeMethodAccessorImpl.java:62)
	at sun.reflect.DelegatingMethodAccessorImpl.invoke(DelegatingMethodAccessorImpl.java:43)
	at java.lang.reflect.Method.invoke(Method.java:498)
	at com.carrotsearch.randomizedtesting.RandomizedRunner.invoke(RandomizedRunner.java:1764)
	at com.carrotsearch.randomizedtesting.RandomizedRunner$7.evaluate(RandomizedRunner.java:834)
	at com.carrotsearch.randomizedtesting.rules.StatementAdapter.evaluate(StatementAdapter.java:36)
	at com.carrotsearch.randomizedtesting.rules.SystemPropertiesRestoreRule$1.evaluate(SystemPropertiesRestoreRule.java:57)
	at org.apache.lucene.util.AbstractBeforeAfterRule$1.evaluate(AbstractBeforeAfterRule.java:45)
	at com.carrotsearch.randomizedtesting.rules.StatementAdapter.evaluate(StatementAdapter.java:36)
	at org.apache.lucene.util.TestRuleStoreClassName$1.evaluate(TestRuleStoreClassName.java:41)
	at com.carrotsearch.randomizedtesting.rules.NoShadowingOrOverridesOnMethodsRule$1.evaluate(NoShadowingOrOverridesOnMethodsRule.java:40)
	at com.carrotsearch.randomizedtesting.rules.NoShadowingOrOverridesOnMethodsRule$1.evaluate(NoShadowingOrOverridesOnMethodsRule.java:40)
	at com.carrotsearch.randomizedtesting.rules.StatementAdapter.evaluate(StatementAdapter.java:36)
	at com.carrotsearch.randomizedtesting.rules.StatementAdapter.evaluate(StatementAdapter.java:36)
	at com.carrotsearch.randomizedtesting.rules.StatementAdapter.evaluate(StatementAdapter.java:36)
	at org.apache.lucene.util.TestRuleAssertionsRequired$1.evaluate(TestRuleAssertionsRequired.java:53)
	at org.apache.lucene.util.TestRuleMarkFailure$1.evaluate(TestRuleMarkFailure.java:47)
	at org.apache.lucene.util.TestRuleIgnoreAfterMaxFailures$1.evaluate(TestRuleIgnoreAfterMaxFailures.java:64)
	at org.apache.lucene.util.TestRuleIgnoreTestSuites$1.evaluate(TestRuleIgnoreTestSuites.java:54)
	at com.carrotsearch.randomizedtesting.rules.StatementAdapter.evaluate(StatementAdapter.java:36)
	at com.carrotsearch.randomizedtesting.ThreadLeakControl$StatementRunner.run(ThreadLeakControl.java:367)
	at java.lang.Thread.run(Thread.java:745)


FAILED:  junit.framework.TestSuite.org.apache.solr.cloud.CdcrReplicationHandlerTest

Error Message:
12 threads leaked from SUITE scope at org.apache.solr.cloud.CdcrReplicationHandlerTest:     1) Thread[id=16495, name=Connection evictor, state=TIMED_WAITING, group=TGRP-CdcrReplicationHandlerTest]         at java.lang.Thread.sleep(Native Method)         at org.apache.http.impl.client.IdleConnectionEvictor$1.run(IdleConnectionEvictor.java:66)         at java.lang.Thread.run(Thread.java:745)    2) Thread[id=16227, name=Connection evictor, state=TIMED_WAITING, group=TGRP-CdcrReplicationHandlerTest]         at java.lang.Thread.sleep(Native Method)         at org.apache.http.impl.client.IdleConnectionEvictor$1.run(IdleConnectionEvictor.java:66)         at java.lang.Thread.run(Thread.java:745)    3) Thread[id=15616, name=Connection evictor, state=TIMED_WAITING, group=TGRP-CdcrReplicationHandlerTest]         at java.lang.Thread.sleep(Native Method)         at org.apache.http.impl.client.IdleConnectionEvictor$1.run(IdleConnectionEvictor.java:66)         at java.lang.Thread.run(Thread.java:745)    4) Thread[id=15096, name=Connection evictor, state=TIMED_WAITING, group=TGRP-CdcrReplicationHandlerTest]         at java.lang.Thread.sleep(Native Method)         at org.apache.http.impl.client.IdleConnectionEvictor$1.run(IdleConnectionEvictor.java:66)         at java.lang.Thread.run(Thread.java:745)    5) Thread[id=15739, name=Connection evictor, state=TIMED_WAITING, group=TGRP-CdcrReplicationHandlerTest]         at java.lang.Thread.sleep(Native Method)         at org.apache.http.impl.client.IdleConnectionEvictor$1.run(IdleConnectionEvictor.java:66)         at java.lang.Thread.run(Thread.java:745)    6) Thread[id=15965, name=Connection evictor, state=TIMED_WAITING, group=TGRP-CdcrReplicationHandlerTest]         at java.lang.Thread.sleep(Native Method)         at org.apache.http.impl.client.IdleConnectionEvictor$1.run(IdleConnectionEvictor.java:66)         at java.lang.Thread.run(Thread.java:745)    7) Thread[id=16494, name=Connection evictor, state=TIMED_WAITING, group=TGRP-CdcrReplicationHandlerTest]         at java.lang.Thread.sleep(Native Method)         at org.apache.http.impl.client.IdleConnectionEvictor$1.run(IdleConnectionEvictor.java:66)         at java.lang.Thread.run(Thread.java:745)    8) Thread[id=15095, name=Connection evictor, state=TIMED_WAITING, group=TGRP-CdcrReplicationHandlerTest]         at java.lang.Thread.sleep(Native Method)         at org.apache.http.impl.client.IdleConnectionEvictor$1.run(IdleConnectionEvictor.java:66)         at java.lang.Thread.run(Thread.java:745)    9) Thread[id=15966, name=Connection evictor, state=TIMED_WAITING, group=TGRP-CdcrReplicationHandlerTest]         at java.lang.Thread.sleep(Native Method)         at org.apache.http.impl.client.IdleConnectionEvictor$1.run(IdleConnectionEvictor.java:66)         at java.lang.Thread.run(Thread.java:745)   10) Thread[id=15738, name=Connection evictor, state=TIMED_WAITING, group=TGRP-CdcrReplicationHandlerTest]         at java.lang.Thread.sleep(Native Method)         at org.apache.http.impl.client.IdleConnectionEvictor$1.run(IdleConnectionEvictor.java:66)         at java.lang.Thread.run(Thread.java:745)   11) Thread[id=16226, name=Connection evictor, state=TIMED_WAITING, group=TGRP-CdcrReplicationHandlerTest]         at java.lang.Thread.sleep(Native Method)         at org.apache.http.impl.client.IdleConnectionEvictor$1.run(IdleConnectionEvictor.java:66)         at java.lang.Thread.run(Thread.java:745)   12) Thread[id=15615, name=Connection evictor, state=TIMED_WAITING, group=TGRP-CdcrReplicationHandlerTest]         at java.lang.Thread.sleep(Native Method)         at org.apache.http.impl.client.IdleConnectionEvictor$1.run(IdleConnectionEvictor.java:66)         at java.lang.Thread.run(Thread.java:745)

Stack Trace:
com.carrotsearch.randomizedtesting.ThreadLeakError: 12 threads leaked from SUITE scope at org.apache.solr.cloud.CdcrReplicationHandlerTest: 
   1) Thread[id=16495, name=Connection evictor, state=TIMED_WAITING, group=TGRP-CdcrReplicationHandlerTest]
        at java.lang.Thread.sleep(Native Method)
        at org.apache.http.impl.client.IdleConnectionEvictor$1.run(IdleConnectionEvictor.java:66)
        at java.lang.Thread.run(Thread.java:745)
   2) Thread[id=16227, name=Connection evictor, state=TIMED_WAITING, group=TGRP-CdcrReplicationHandlerTest]
        at java.lang.Thread.sleep(Native Method)
        at org.apache.http.impl.client.IdleConnectionEvictor$1.run(IdleConnectionEvictor.java:66)
        at java.lang.Thread.run(Thread.java:745)
   3) Thread[id=15616, name=Connection evictor, state=TIMED_WAITING, group=TGRP-CdcrReplicationHandlerTest]
        at java.lang.Thread.sleep(Native Method)
        at org.apache.http.impl.client.IdleConnectionEvictor$1.run(IdleConnectionEvictor.java:66)
        at java.lang.Thread.run(Thread.java:745)
   4) Thread[id=15096, name=Connection evictor, state=TIMED_WAITING, group=TGRP-CdcrReplicationHandlerTest]
        at java.lang.Thread.sleep(Native Method)
        at org.apache.http.impl.client.IdleConnectionEvictor$1.run(IdleConnectionEvictor.java:66)
        at java.lang.Thread.run(Thread.java:745)
   5) Thread[id=15739, name=Connection evictor, state=TIMED_WAITING, group=TGRP-CdcrReplicationHandlerTest]
        at java.lang.Thread.sleep(Native Method)
        at org.apache.http.impl.client.IdleConnectionEvictor$1.run(IdleConnectionEvictor.java:66)
        at java.lang.Thread.run(Thread.java:745)
   6) Thread[id=15965, name=Connection evictor, state=TIMED_WAITING, group=TGRP-CdcrReplicationHandlerTest]
        at java.lang.Thread.sleep(Native Method)
        at org.apache.http.impl.client.IdleConnectionEvictor$1.run(IdleConnectionEvictor.java:66)
        at java.lang.Thread.run(Thread.java:745)
   7) Thread[id=16494, name=Connection evictor, state=TIMED_WAITING, group=TGRP-CdcrReplicationHandlerTest]
        at java.lang.Thread.sleep(Native Method)
        at org.apache.http.impl.client.IdleConnectionEvictor$1.run(IdleConnectionEvictor.java:66)
        at java.lang.Thread.run(Thread.java:745)
   8) Thread[id=15095, name=Connection evictor, state=TIMED_WAITING, group=TGRP-CdcrReplicationHandlerTest]
        at java.lang.Thread.sleep(Native Method)
        at org.apache.http.impl.client.IdleConnectionEvictor$1.run(IdleConnectionEvictor.java:66)
        at java.lang.Thread.run(Thread.java:745)
   9) Thread[id=15966, name=Connection evictor, state=TIMED_WAITING, group=TGRP-CdcrReplicationHandlerTest]
        at java.lang.Thread.sleep(Native Method)
        at org.apache.http.impl.client.IdleConnectionEvictor$1.run(IdleConnectionEvictor.java:66)
        at java.lang.Thread.run(Thread.java:745)
  10) Thread[id=15738, name=Connection evictor, state=TIMED_WAITING, group=TGRP-CdcrReplicationHandlerTest]
        at java.lang.Thread.sleep(Native Method)
        at org.apache.http.impl.client.IdleConnectionEvictor$1.run(IdleConnectionEvictor.java:66)
        at java.lang.Thread.run(Thread.java:745)
  11) Thread[id=16226, name=Connection evictor, state=TIMED_WAITING, group=TGRP-CdcrReplicationHandlerTest]
        at java.lang.Thread.sleep(Native Method)
        at org.apache.http.impl.client.IdleConnectionEvictor$1.run(IdleConnectionEvictor.java:66)
        at java.lang.Thread.run(Thread.java:745)
  12) Thread[id=15615, name=Connection evictor, state=TIMED_WAITING, group=TGRP-CdcrReplicationHandlerTest]
        at java.lang.Thread.sleep(Native Method)
        at org.apache.http.impl.client.IdleConnectionEvictor$1.run(IdleConnectionEvictor.java:66)
        at java.lang.Thread.run(Thread.java:745)
	at __randomizedtesting.SeedInfo.seed([BE696F04332BFFEC]:0)


FAILED:  junit.framework.TestSuite.org.apache.solr.cloud.ConcurrentDeleteAndCreateCollectionTest

Error Message:
ObjectTracker found 10 object(s) that were not released!!! [InternalHttpClient, InternalHttpClient, InternalHttpClient, InternalHttpClient, InternalHttpClient, InternalHttpClient, InternalHttpClient, InternalHttpClient, InternalHttpClient, InternalHttpClient]

Stack Trace:
java.lang.AssertionError: ObjectTracker found 10 object(s) that were not released!!! [InternalHttpClient, InternalHttpClient, InternalHttpClient, InternalHttpClient, InternalHttpClient, InternalHttpClient, InternalHttpClient, InternalHttpClient, InternalHttpClient, InternalHttpClient]
	at __randomizedtesting.SeedInfo.seed([BE696F04332BFFEC]:0)
	at org.junit.Assert.fail(Assert.java:93)
	at org.junit.Assert.assertTrue(Assert.java:43)
	at org.junit.Assert.assertNull(Assert.java:551)
	at org.apache.solr.SolrTestCaseJ4.afterClass(SolrTestCaseJ4.java:247)
	at sun.reflect.GeneratedMethodAccessor67.invoke(Unknown Source)
	at sun.reflect.DelegatingMethodAccessorImpl.invoke(DelegatingMethodAccessorImpl.java:43)
	at java.lang.reflect.Method.invoke(Method.java:498)
	at com.carrotsearch.randomizedtesting.RandomizedRunner.invoke(RandomizedRunner.java:1764)
	at com.carrotsearch.randomizedtesting.RandomizedRunner$7.evaluate(RandomizedRunner.java:834)
	at com.carrotsearch.randomizedtesting.rules.StatementAdapter.evaluate(StatementAdapter.java:36)
	at com.carrotsearch.randomizedtesting.rules.SystemPropertiesRestoreRule$1.evaluate(SystemPropertiesRestoreRule.java:57)
	at org.apache.lucene.util.AbstractBeforeAfterRule$1.evaluate(AbstractBeforeAfterRule.java:45)
	at com.carrotsearch.randomizedtesting.rules.StatementAdapter.evaluate(StatementAdapter.java:36)
	at org.apache.lucene.util.TestRuleStoreClassName$1.evaluate(TestRuleStoreClassName.java:41)
	at com.carrotsearch.randomizedtesting.rules.NoShadowingOrOverridesOnMethodsRule$1.evaluate(NoShadowingOrOverridesOnMethodsRule.java:40)
	at com.carrotsearch.randomizedtesting.rules.NoShadowingOrOverridesOnMethodsRule$1.evaluate(NoShadowingOrOverridesOnMethodsRule.java:40)
	at com.carrotsearch.randomizedtesting.rules.StatementAdapter.evaluate(StatementAdapter.java:36)
	at com.carrotsearch.randomizedtesting.rules.StatementAdapter.evaluate(StatementAdapter.java:36)
	at com.carrotsearch.randomizedtesting.rules.StatementAdapter.evaluate(StatementAdapter.java:36)
	at org.apache.lucene.util.TestRuleAssertionsRequired$1.evaluate(TestRuleAssertionsRequired.java:53)
	at org.apache.lucene.util.TestRuleMarkFailure$1.evaluate(TestRuleMarkFailure.java:47)
	at org.apache.lucene.util.TestRuleIgnoreAfterMaxFailures$1.evaluate(TestRuleIgnoreAfterMaxFailures.java:64)
	at org.apache.lucene.util.TestRuleIgnoreTestSuites$1.evaluate(TestRuleIgnoreTestSuites.java:54)
	at com.carrotsearch.randomizedtesting.rules.StatementAdapter.evaluate(StatementAdapter.java:36)
	at com.carrotsearch.randomizedtesting.ThreadLeakControl$StatementRunner.run(ThreadLeakControl.java:367)
	at java.lang.Thread.run(Thread.java:745)


FAILED:  junit.framework.TestSuite.org.apache.solr.cloud.ConcurrentDeleteAndCreateCollectionTest

Error Message:
10 threads leaked from SUITE scope at org.apache.solr.cloud.ConcurrentDeleteAndCreateCollectionTest:     1) Thread[id=119129, name=Connection evictor, state=TIMED_WAITING, group=TGRP-ConcurrentDeleteAndCreateCollectionTest]         at java.lang.Thread.sleep(Native Method)         at org.apache.http.impl.client.IdleConnectionEvictor$1.run(IdleConnectionEvictor.java:66)         at java.lang.Thread.run(Thread.java:745)    2) Thread[id=119109, name=Connection evictor, state=TIMED_WAITING, group=TGRP-ConcurrentDeleteAndCreateCollectionTest]         at java.lang.Thread.sleep(Native Method)         at org.apache.http.impl.client.IdleConnectionEvictor$1.run(IdleConnectionEvictor.java:66)         at java.lang.Thread.run(Thread.java:745)    3) Thread[id=119139, name=Connection evictor, state=TIMED_WAITING, group=TGRP-ConcurrentDeleteAndCreateCollectionTest]         at java.lang.Thread.sleep(Native Method)         at org.apache.http.impl.client.IdleConnectionEvictor$1.run(IdleConnectionEvictor.java:66)         at java.lang.Thread.run(Thread.java:745)    4) Thread[id=119104, name=Connection evictor, state=TIMED_WAITING, group=TGRP-ConcurrentDeleteAndCreateCollectionTest]         at java.lang.Thread.sleep(Native Method)         at org.apache.http.impl.client.IdleConnectionEvictor$1.run(IdleConnectionEvictor.java:66)         at java.lang.Thread.run(Thread.java:745)    5) Thread[id=119099, name=Connection evictor, state=TIMED_WAITING, group=TGRP-ConcurrentDeleteAndCreateCollectionTest]         at java.lang.Thread.sleep(Native Method)         at org.apache.http.impl.client.IdleConnectionEvictor$1.run(IdleConnectionEvictor.java:66)         at java.lang.Thread.run(Thread.java:745)    6) Thread[id=119119, name=Connection evictor, state=TIMED_WAITING, group=TGRP-ConcurrentDeleteAndCreateCollectionTest]         at java.lang.Thread.sleep(Native Method)         at org.apache.http.impl.client.IdleConnectionEvictor$1.run(IdleConnectionEvictor.java:66)         at java.lang.Thread.run(Thread.java:745)    7) Thread[id=119124, name=Connection evictor, state=TIMED_WAITING, group=TGRP-ConcurrentDeleteAndCreateCollectionTest]         at java.lang.Thread.sleep(Native Method)         at org.apache.http.impl.client.IdleConnectionEvictor$1.run(IdleConnectionEvictor.java:66)         at java.lang.Thread.run(Thread.java:745)    8) Thread[id=119134, name=Connection evictor, state=TIMED_WAITING, group=TGRP-ConcurrentDeleteAndCreateCollectionTest]         at java.lang.Thread.sleep(Native Method)         at org.apache.http.impl.client.IdleConnectionEvictor$1.run(IdleConnectionEvictor.java:66)         at java.lang.Thread.run(Thread.java:745)    9) Thread[id=119094, name=Connection evictor, state=TIMED_WAITING, group=TGRP-ConcurrentDeleteAndCreateCollectionTest]         at java.lang.Thread.sleep(Native Method)         at org.apache.http.impl.client.IdleConnectionEvictor$1.run(IdleConnectionEvictor.java:66)         at java.lang.Thread.run(Thread.java:745)   10) Thread[id=119114, name=Connection evictor, state=TIMED_WAITING, group=TGRP-ConcurrentDeleteAndCreateCollectionTest]         at java.lang.Thread.sleep(Native Method)         at org.apache.http.impl.client.IdleConnectionEvictor$1.run(IdleConnectionEvictor.java:66)         at java.lang.Thread.run(Thread.java:745)

Stack Trace:
com.carrotsearch.randomizedtesting.ThreadLeakError: 10 threads leaked from SUITE scope at org.apache.solr.cloud.ConcurrentDeleteAndCreateCollectionTest: 
   1) Thread[id=119129, name=Connection evictor, state=TIMED_WAITING, group=TGRP-ConcurrentDeleteAndCreateCollectionTest]
        at java.lang.Thread.sleep(Native Method)
        at org.apache.http.impl.client.IdleConnectionEvictor$1.run(IdleConnectionEvictor.java:66)
        at java.lang.Thread.run(Thread.java:745)
   2) Thread[id=119109, name=Connection evictor, state=TIMED_WAITING, group=TGRP-ConcurrentDeleteAndCreateCollectionTest]
        at java.lang.Thread.sleep(Native Method)
        at org.apache.http.impl.client.IdleConnectionEvictor$1.run(IdleConnectionEvictor.java:66)
        at java.lang.Thread.run(Thread.java:745)
   3) Thread[id=119139, name=Connection evictor, state=TIMED_WAITING, group=TGRP-ConcurrentDeleteAndCreateCollectionTest]
        at java.lang.Thread.sleep(Native Method)
        at org.apache.http.impl.client.IdleConnectionEvictor$1.run(IdleConnectionEvictor.java:66)
        at java.lang.Thread.run(Thread.java:745)
   4) Thread[id=119104, name=Connection evictor, state=TIMED_WAITING, group=TGRP-ConcurrentDeleteAndCreateCollectionTest]
        at java.lang.Thread.sleep(Native Method)
        at org.apache.http.impl.client.IdleConnectionEvictor$1.run(IdleConnectionEvictor.java:66)
        at java.lang.Thread.run(Thread.java:745)
   5) Thread[id=119099, name=Connection evictor, state=TIMED_WAITING, group=TGRP-ConcurrentDeleteAndCreateCollectionTest]
        at java.lang.Thread.sleep(Native Method)
        at org.apache.http.impl.client.IdleConnectionEvictor$1.run(IdleConnectionEvictor.java:66)
        at java.lang.Thread.run(Thread.java:745)
   6) Thread[id=119119, name=Connection evictor, state=TIMED_WAITING, group=TGRP-ConcurrentDeleteAndCreateCollectionTest]
        at java.lang.Thread.sleep(Native Method)
        at org.apache.http.impl.client.IdleConnectionEvictor$1.run(IdleConnectionEvictor.java:66)
        at java.lang.Thread.run(Thread.java:745)
   7) Thread[id=119124, name=Connection evictor, state=TIMED_WAITING, group=TGRP-ConcurrentDeleteAndCreateCollectionTest]
        at java.lang.Thread.sleep(Native Method)
        at org.apache.http.impl.client.IdleConnectionEvictor$1.run(IdleConnectionEvictor.java:66)
        at java.lang.Thread.run(Thread.java:745)
   8) Thread[id=119134, name=Connection evictor, state=TIMED_WAITING, group=TGRP-ConcurrentDeleteAndCreateCollectionTest]
        at java.lang.Thread.sleep(Native Method)
        at org.apache.http.impl.client.IdleConnectionEvictor$1.run(IdleConnectionEvictor.java:66)
        at java.lang.Thread.run(Thread.java:745)
   9) Thread[id=119094, name=Connection evictor, state=TIMED_WAITING, group=TGRP-ConcurrentDeleteAndCreateCollectionTest]
        at java.lang.Thread.sleep(Native Method)
        at org.apache.http.impl.client.IdleConnectionEvictor$1.run(IdleConnectionEvictor.java:66)
        at java.lang.Thread.run(Thread.java:745)
  10) Thread[id=119114, name=Connection evictor, state=TIMED_WAITING, group=TGRP-ConcurrentDeleteAndCreateCollectionTest]
        at java.lang.Thread.sleep(Native Method)
        at org.apache.http.impl.client.IdleConnectionEvictor$1.run(IdleConnectionEvictor.java:66)
        at java.lang.Thread.run(Thread.java:745)
	at __randomizedtesting.SeedInfo.seed([BE696F04332BFFEC]:0)


FAILED:  org.apache.solr.cloud.CollectionsAPIDistributedZkTest.test

Error Message:
Timeout occured while waiting response from server at: http://127.0.0.1:51419

Stack Trace:
org.apache.solr.client.solrj.SolrServerException: Timeout occured while waiting response from server at: http://127.0.0.1:51419
	at org.apache.solr.client.solrj.impl.HttpSolrClient.executeMethod(HttpSolrClient.java:611)
	at org.apache.solr.client.solrj.impl.HttpSolrClient.request(HttpSolrClient.java:248)
	at org.apache.solr.client.solrj.impl.HttpSolrClient.request(HttpSolrClient.java:237)
	at org.apache.solr.client.solrj.SolrClient.request(SolrClient.java:1219)
	at org.apache.solr.cloud.CollectionsAPIDistributedZkTest.makeRequest(CollectionsAPIDistributedZkTest.java:382)
	at org.apache.solr.cloud.CollectionsAPIDistributedZkTest.testErrorHandling(CollectionsAPIDistributedZkTest.java:399)
	at org.apache.solr.cloud.CollectionsAPIDistributedZkTest.test(CollectionsAPIDistributedZkTest.java:170)
	at sun.reflect.NativeMethodAccessorImpl.invoke0(Native Method)
	at sun.reflect.NativeMethodAccessorImpl.invoke(NativeMethodAccessorImpl.java:62)
	at sun.reflect.DelegatingMethodAccessorImpl.invoke(DelegatingMethodAccessorImpl.java:43)
	at java.lang.reflect.Method.invoke(Method.java:498)
	at com.carrotsearch.randomizedtesting.RandomizedRunner.invoke(RandomizedRunner.java:1764)
	at com.carrotsearch.randomizedtesting.RandomizedRunner$8.evaluate(RandomizedRunner.java:871)
	at com.carrotsearch.randomizedtesting.RandomizedRunner$9.evaluate(RandomizedRunner.java:907)
	at com.carrotsearch.randomizedtesting.RandomizedRunner$10.evaluate(RandomizedRunner.java:921)
	at org.apache.solr.BaseDistributedSearchTestCase$ShardsRepeatRule$ShardsFixedStatement.callStatement(BaseDistributedSearchTestCase.java:985)
	at org.apache.solr.BaseDistributedSearchTestCase$ShardsRepeatRule$ShardsStatement.evaluate(BaseDistributedSearchTestCase.java:960)
	at com.carrotsearch.randomizedtesting.rules.SystemPropertiesRestoreRule$1.evaluate(SystemPropertiesRestoreRule.java:57)
	at org.apache.lucene.util.TestRuleSetupTeardownChained$1.evaluate(TestRuleSetupTeardownChained.java:49)
	at org.apache.lucene.util.AbstractBeforeAfterRule$1.evaluate(AbstractBeforeAfterRule.java:45)
	at org.apache.lucene.util.TestRuleThreadAndTestName$1.evaluate(TestRuleThreadAndTestName.java:48)
	at org.apache.lucene.util.TestRuleIgnoreAfterMaxFailures$1.evaluate(TestRuleIgnoreAfterMaxFailures.java:64)
	at org.apache.lucene.util.TestRuleMarkFailure$1.evaluate(TestRuleMarkFailure.java:47)
	at com.carrotsearch.randomizedtesting.rules.StatementAdapter.evaluate(StatementAdapter.java:36)
	at com.carrotsearch.randomizedtesting.ThreadLeakControl$StatementRunner.run(ThreadLeakControl.java:367)
	at com.carrotsearch.randomizedtesting.ThreadLeakControl.forkTimeoutingTask(ThreadLeakControl.java:809)
	at com.carrotsearch.randomizedtesting.ThreadLeakControl$3.evaluate(ThreadLeakControl.java:460)
	at com.carrotsearch.randomizedtesting.RandomizedRunner.runSingleTest(RandomizedRunner.java:880)
	at com.carrotsearch.randomizedtesting.RandomizedRunner$5.evaluate(RandomizedRunner.java:781)
	at com.carrotsearch.randomizedtesting.RandomizedRunner$6.evaluate(RandomizedRunner.java:816)
	at com.carrotsearch.randomizedtesting.RandomizedRunner$7.evaluate(RandomizedRunner.java:827)
	at com.carrotsearch.randomizedtesting.rules.StatementAdapter.evaluate(StatementAdapter.java:36)
	at com.carrotsearch.randomizedtesting.rules.SystemPropertiesRestoreRule$1.evaluate(SystemPropertiesRestoreRule.java:57)
	at org.apache.lucene.util.AbstractBeforeAfterRule$1.evaluate(AbstractBeforeAfterRule.java:45)
	at com.carrotsearch.randomizedtesting.rules.StatementAdapter.evaluate(StatementAdapter.java:36)
	at org.apache.lucene.util.TestRuleStoreClassName$1.evaluate(TestRuleStoreClassName.java:41)
	at com.carrotsearch.randomizedtesting.rules.NoShadowingOrOverridesOnMethodsRule$1.evaluate(NoShadowingOrOverridesOnMethodsRule.java:40)
	at com.carrotsearch.randomizedtesting.rules.NoShadowingOrOverridesOnMethodsRule$1.evaluate(NoShadowingOrOverridesOnMethodsRule.java:40)
	at com.carrotsearch.randomizedtesting.rules.StatementAdapter.evaluate(StatementAdapter.java:36)
	at com.carrotsearch.randomizedtesting.rules.StatementAdapter.evaluate(StatementAdapter.java:36)
	at com.carrotsearch.randomizedtesting.rules.StatementAdapter.evaluate(StatementAdapter.java:36)
	at org.apache.lucene.util.TestRuleAssertionsRequired$1.evaluate(TestRuleAssertionsRequired.java:53)
	at org.apache.lucene.util.TestRuleMarkFailure$1.evaluate(TestRuleMarkFailure.java:47)
	at org.apache.lucene.util.TestRuleIgnoreAfterMaxFailures$1.evaluate(TestRuleIgnoreAfterMaxFailures.java:64)
	at org.apache.lucene.util.TestRuleIgnoreTestSuites$1.evaluate(TestRuleIgnoreTestSuites.java:54)
	at com.carrotsearch.randomizedtesting.rules.StatementAdapter.evaluate(StatementAdapter.java:36)
	at com.carrotsearch.randomizedtesting.ThreadLeakControl$StatementRunner.run(ThreadLeakControl.java:367)
	at java.lang.Thread.run(Thread.java:745)
Caused by: java.net.SocketTimeoutException: Read timed out
	at java.net.SocketInputStream.socketRead0(Native Method)
	at java.net.SocketInputStream.socketRead(SocketInputStream.java:116)
	at java.net.SocketInputStream.read(SocketInputStream.java:170)
	at java.net.SocketInputStream.read(SocketInputStream.java:141)
	at org.apache.http.impl.io.SessionInputBufferImpl.streamRead(SessionInputBufferImpl.java:139)
	at org.apache.http.impl.io.SessionInputBufferImpl.fillBuffer(SessionInputBufferImpl.java:155)
	at org.apache.http.impl.io.SessionInputBufferImpl.readLine(SessionInputBufferImpl.java:284)
	at org.apache.http.impl.conn.DefaultHttpResponseParser.parseHead(DefaultHttpResponseParser.java:140)
	at org.apache.http.impl.conn.DefaultHttpResponseParser.parseHead(DefaultHttpResponseParser.java:57)
	at org.apache.http.impl.io.AbstractMessageParser.parse(AbstractMessageParser.java:261)
	at org.apache.http.impl.DefaultBHttpClientConnection.receiveResponseHeader(DefaultBHttpClientConnection.java:165)
	at org.apache.http.impl.conn.CPoolProxy.receiveResponseHeader(CPoolProxy.java:167)
	at org.apache.http.protocol.HttpRequestExecutor.doReceiveResponse(HttpRequestExecutor.java:272)
	at org.apache.http.protocol.HttpRequestExecutor.execute(HttpRequestExecutor.java:124)
	at org.apache.http.impl.execchain.MainClientExec.execute(MainClientExec.java:271)
	at org.apache.http.impl.execchain.ProtocolExec.execute(ProtocolExec.java:184)
	at org.apache.http.impl.execchain.RetryExec.execute(RetryExec.java:88)
	at org.apache.http.impl.execchain.RedirectExec.execute(RedirectExec.java:110)
	at org.apache.http.impl.client.InternalHttpClient.doExecute(InternalHttpClient.java:184)
	at org.apache.http.impl.client.CloseableHttpClient.execute(CloseableHttpClient.java:82)
	at org.apache.http.impl.client.CloseableHttpClient.execute(CloseableHttpClient.java:55)
	at org.apache.solr.client.solrj.impl.HttpSolrClient.executeMethod(HttpSolrClient.java:505)
	... 47 more




Build Log:
[...truncated 11272 lines...]
   [junit4] Suite: org.apache.solr.cloud.CdcrReplicationHandlerTest
   [junit4]   2> Creating dataDir: /x1/jenkins/jenkins-slave/workspace/Lucene-Solr-NightlyTests-master/solr/build/solr-core/test/J1/temp/solr.cloud.CdcrReplicationHandlerTest_BE696F04332BFFEC-001/init-core-data-001
   [junit4]   2> 672276 INFO  (SUITE-CdcrReplicationHandlerTest-seed#[BE696F04332BFFEC]-worker) [    ] o.a.s.SolrTestCaseJ4 Randomized ssl (false) and clientAuth (false)
   [junit4]   2> 672276 INFO  (SUITE-CdcrReplicationHandlerTest-seed#[BE696F04332BFFEC]-worker) [    ] o.a.s.BaseDistributedSearchTestCase Setting hostContext system property: /at/cp
   [junit4]   2> 672290 INFO  (TEST-CdcrReplicationHandlerTest.testReplicationWithBufferedUpdates-seed#[BE696F04332BFFEC]) [    ] o.a.s.c.ZkTestServer STARTING ZK TEST SERVER
   [junit4]   2> 672291 INFO  (Thread-14514) [    ] o.a.s.c.ZkTestServer client port:0.0.0.0/0.0.0.0:0
   [junit4]   2> 672291 INFO  (Thread-14514) [    ] o.a.s.c.ZkTestServer Starting server
   [junit4]   2> 672402 INFO  (TEST-CdcrReplicationHandlerTest.testReplicationWithBufferedUpdates-seed#[BE696F04332BFFEC]) [    ] o.a.s.c.ZkTestServer start zk server on port:40596
   [junit4]   2> 672402 INFO  (TEST-CdcrReplicationHandlerTest.testReplicationWithBufferedUpdates-seed#[BE696F04332BFFEC]) [    ] o.a.s.c.c.SolrZkClient Using default ZkCredentialsProvider
   [junit4]   2> 672411 INFO  (TEST-CdcrReplicationHandlerTest.testReplicationWithBufferedUpdates-seed#[BE696F04332BFFEC]) [    ] o.a.s.c.c.ConnectionManager Waiting for client to connect to ZooKeeper
   [junit4]   2> 672557 INFO  (zkCallback-74-thread-1) [    ] o.a.s.c.c.ConnectionManager Watcher org.apache.solr.common.cloud.ConnectionManager@269d10d1 name:ZooKeeperConnection Watcher:127.0.0.1:40596 got event WatchedEvent state:SyncConnected type:None path:null path:null type:None
   [junit4]   2> 672557 INFO  (TEST-CdcrReplicationHandlerTest.testReplicationWithBufferedUpdates-seed#[BE696F04332BFFEC]) [    ] o.a.s.c.c.ConnectionManager Client is connected to ZooKeeper
   [junit4]   2> 672558 INFO  (TEST-CdcrReplicationHandlerTest.testReplicationWithBufferedUpdates-seed#[BE696F04332BFFEC]) [    ] o.a.s.c.c.SolrZkClient Using default ZkACLProvider
   [junit4]   2> 672558 INFO  (TEST-CdcrReplicationHandlerTest.testReplicationWithBufferedUpdates-seed#[BE696F04332BFFEC]) [    ] o.a.s.c.c.SolrZkClient makePath: /solr
   [junit4]   2> 672560 INFO  (TEST-CdcrReplicationHandlerTest.testReplicationWithBufferedUpdates-seed#[BE696F04332BFFEC]) [    ] o.a.s.c.c.SolrZkClient Using default ZkCredentialsProvider
   [junit4]   2> 672629 INFO  (TEST-CdcrReplicationHandlerTest.testReplicationWithBufferedUpdates-seed#[BE696F04332BFFEC]) [    ] o.a.s.c.c.ConnectionManager Waiting for client to connect to ZooKeeper
   [junit4]   2> 672660 INFO  (zkCallback-75-thread-1) [    ] o.a.s.c.c.ConnectionManager Watcher org.apache.solr.common.cloud.ConnectionManager@483b3331 name:ZooKeeperConnection Watcher:127.0.0.1:40596/solr got event WatchedEvent state:SyncConnected type:None path:null path:null type:None
   [junit4]   2> 672660 INFO  (TEST-CdcrReplicationHandlerTest.testReplicationWithBufferedUpdates-seed#[BE696F04332BFFEC]) [    ] o.a.s.c.c.ConnectionManager Client is connected to ZooKeeper
   [junit4]   2> 672661 INFO  (TEST-CdcrReplicationHandlerTest.testReplicationWithBufferedUpdates-seed#[BE696F04332BFFEC]) [    ] o.a.s.c.c.SolrZkClient Using default ZkACLProvider
   [junit4]   2> 672661 INFO  (TEST-CdcrReplicationHandlerTest.testReplicationWithBufferedUpdates-seed#[BE696F04332BFFEC]) [    ] o.a.s.c.c.SolrZkClient makePath: /collections/collection1
   [junit4]   2> 672662 INFO  (TEST-CdcrReplicationHandlerTest.testReplicationWithBufferedUpdates-seed#[BE696F04332BFFEC]) [    ] o.a.s.c.c.SolrZkClient makePath: /collections/collection1/shards
   [junit4]   2> 672662 INFO  (TEST-CdcrReplicationHandlerTest.testReplicationWithBufferedUpdates-seed#[BE696F04332BFFEC]) [    ] o.a.s.c.c.SolrZkClient makePath: /collections/control_collection
   [junit4]   2> 672663 INFO  (TEST-CdcrReplicationHandlerTest.testReplicationWithBufferedUpdates-seed#[BE696F04332BFFEC]) [    ] o.a.s.c.c.SolrZkClient makePath: /collections/control_collection/shards
   [junit4]   2> 672664 INFO  (TEST-CdcrReplicationHandlerTest.testReplicationWithBufferedUpdates-seed#[BE696F04332BFFEC]) [    ] o.a.s.c.AbstractZkTestCase put /x1/jenkins/jenkins-slave/workspace/Lucene-Solr-NightlyTests-master/solr/core/src/test-files/solr/collection1/conf/solrconfig-cdcr.xml to /configs/conf1/solrconfig.xml
   [junit4]   2> 672664 INFO  (TEST-CdcrReplicationHandlerTest.testReplicationWithBufferedUpdates-seed#[BE696F04332BFFEC]) [    ] o.a.s.c.c.SolrZkClient makePath: /configs/conf1/solrconfig.xml
   [junit4]   2> 672670 INFO  (TEST-CdcrReplicationHandlerTest.testReplicationWithBufferedUpdates-seed#[BE696F04332BFFEC]) [    ] o.a.s.c.AbstractZkTestCase put /x1/jenkins/jenkins-slave/workspace/Lucene-Solr-NightlyTests-master/solr/core/src/test-files/solr/collection1/conf/schema15.xml to /configs/conf1/schema.xml
   [junit4]   2> 672670 INFO  (TEST-CdcrReplicationHandlerTest.testReplicationWithBufferedUpdates-seed#[BE696F04332BFFEC]) [    ] o.a.s.c.c.SolrZkClient makePath: /configs/conf1/schema.xml
   [junit4]   2> 672671 INFO  (TEST-CdcrReplicationHandlerTest.testReplicationWithBufferedUpdates-seed#[BE696F04332BFFEC]) [    ] o.a.s.c.AbstractZkTestCase put /x1/jenkins/jenkins-slave/workspace/Lucene-Solr-NightlyTests-master/solr/core/src/test-files/solr/collection1/conf/solrconfig.snippet.randomindexconfig.xml to /configs/conf1/solrconfig.snippet.randomindexconfig.xml
   [junit4]   2> 672671 INFO  (TEST-CdcrReplicationHandlerTest.testReplicationWithBufferedUpdates-seed#[BE696F04332BFFEC]) [    ] o.a.s.c.c.SolrZkClient makePath: /configs/conf1/solrconfig.snippet.randomindexconfig.xml
   [junit4]   2> 672672 INFO  (TEST-CdcrReplicationHandlerTest.testReplicationWithBufferedUpdates-seed#[BE696F04332BFFEC]) [    ] o.a.s.c.AbstractZkTestCase put /x1/jenkins/jenkins-slave/workspace/Lucene-Solr-NightlyTests-master/solr/core/src/test-files/solr/collection1/conf/stopwords.txt to /configs/conf1/stopwords.txt
   [junit4]   2> 672672 INFO  (TEST-CdcrReplicationHandlerTest.testReplicationWithBufferedUpdates-seed#[BE696F04332BFFEC]) [    ] o.a.s.c.c.SolrZkClient makePath: /configs/conf1/stopwords.txt
   [junit4]   2> 672673 INFO  (TEST-CdcrReplicationHandlerTest.testReplicationWithBufferedUpdates-seed#[BE696F04332BFFEC]) [    ] o.a.s.c.AbstractZkTestCase put /x1/jenkins/jenkins-slave/workspace/Lucene-Solr-NightlyTests-master/solr/core/src/test-files/solr/collection1/conf/protwords.txt to /configs/conf1/protwords.txt
   [junit4]   2> 672673 INFO  (TEST-CdcrReplicationHandlerTest.testReplicationWithBufferedUpdates-seed#[BE696F04332BFFEC]) [    ] o.a.s.c.c.SolrZkClient makePath: /configs/conf1/protwords.txt
   [junit4]   2> 672679 INFO  (TEST-CdcrReplicationHandlerTest.testReplicationWithBufferedUpdates-seed#[BE696F04332BFFEC]) [    ] o.a.s.c.AbstractZkTestCase put /x1/jenkins/jenkins-slave/workspace/Lucene-Solr-NightlyTests-master/solr/core/src/test-files/solr/collection1/conf/currency.xml to /configs/conf1/currency.xml
   [junit4]   2> 672679 INFO  (TEST-CdcrReplicationHandlerTest.testReplicationWithBufferedUpdates-seed#[BE696F04332BFFEC]) [    ] o.a.s.c.c.SolrZkClient makePath: /configs/conf1/currency.xml
   [junit4]   2> 672680 INFO  (TEST-CdcrReplicationHandlerTest.testReplicationWithBufferedUpdates-seed#[BE696F04332BFFEC]) [    ] o.a.s.c.AbstractZkTestCase put /x1/jenkins/jenkins-slave/workspace/Lucene-Solr-NightlyTests-master/solr/core/src/test-files/solr/collection1/conf/enumsConfig.xml to /configs/conf1/enumsConfig.xml
   [junit4]   2> 672680 INFO  (TEST-CdcrReplicationHandlerTest.testReplicationWithBufferedUpdates-seed#[BE696F04332BFFEC]) [    ] o.a.s.c.c.SolrZkClient makePath: /configs/conf1/enumsConfig.xml
   [junit4]   2> 672680 INFO  (TEST-CdcrReplicationHandlerTest.testReplicationWithBufferedUpdates-seed#[BE696F04332BFFEC]) [    ] o.a.s.c.AbstractZkTestCase put /x1/jenkins/jenkins-slave/workspace/Lucene-Solr-NightlyTests-master/solr/core/src/test-files/solr/collection1/conf/open-exchange-rates.json to /configs/conf1/open-exchange-rates.json
   [junit4]   2> 672681 INFO  (TEST-CdcrReplicationHandlerTest.testReplicationWithBufferedUpdates-seed#[BE696F04332BFFEC]) [    ] o.a.s.c.c.SolrZkClient makePath: /configs/conf1/open-exchange-rates.json
   [junit4]   2> 672690 INFO  (TEST-CdcrReplicationHandlerTest.testReplicationWithBufferedUpdates-seed#[BE696F04332BFFEC]) [    ] o.a.s.c.AbstractZkTestCase put /x1/jenkins/jenkins-slave/workspace/Lucene-Solr-NightlyTests-master/solr/core/src/test-files/solr/collection1/conf/mapping-ISOLatin1Accent.txt to /configs/conf1/mapping-ISOLatin1Accent.txt
   [junit4]   2> 672690 INFO  (TEST-CdcrReplicationHandlerTest.testReplicationWithBufferedUpdates-seed#[BE696F04332BFFEC]) [    ] o.a.s.c.c.SolrZkClient makePath: /configs/conf1/mapping-ISOLatin1Accent.txt
   [junit4]   2> 672691 INFO  (TEST-CdcrReplicationHandlerTest.testReplicationWithBufferedUpdates-seed#[BE696F04332BFFEC]) [    ] o.a.s.c.AbstractZkTestCase put /x1/jenkins/jenkins-slave/workspace/Lucene-Solr-NightlyTests-master/solr/core/src/test-files/solr/collection1/conf/old_synonyms.txt to /configs/conf1/old_synonyms.txt
   [junit4]   2> 672691 INFO  (TEST-CdcrReplicationHandlerTest.testReplicationWithBufferedUpdates-seed#[BE696F04332BFFEC]) [    ] o.a.s.c.c.SolrZkClient makePath: /configs/conf1/old_synonyms.txt
   [junit4]   2> 672697 INFO  (TEST-CdcrReplicationHandlerTest.testReplicationWithBufferedUpdates-seed#[BE696F04332BFFEC]) [    ] o.a.s.c.AbstractZkTestCase put /x1/jenkins/jenkins-slave/workspace/Lucene-Solr-NightlyTests-master/solr/core/src/test-files/solr/collection1/conf/synonyms.txt to /configs/conf1/synonyms.txt
   [junit4]   2> 672697 INFO  (TEST-CdcrReplicationHandlerTest.testReplicationWithBufferedUpdates-seed#[BE696F04332BFFEC]) [    ] o.a.s.c.c.SolrZkClient makePath: /configs/conf1/synonyms.txt
   [junit4]   2> 672702 INFO  (TEST-CdcrReplicationHandlerTest.testReplicationWithBufferedUpdates-seed#[BE696F04332BFFEC]) [    ] o.a.s.SolrTestCaseJ4 ###Starting testReplicationWithBufferedUpdates
   [junit4]   2> 673207 INFO  (TEST-CdcrReplicationHandlerTest.testReplicationWithBufferedUpdates-seed#[BE696F04332BFFEC]) [    ] o.a.s.SolrTestCaseJ4 Writing core.properties file to /x1/jenkins/jenkins-slave/workspace/Lucene-Solr-NightlyTests-master/solr/build/solr-core/test/J1/temp/solr.cloud.CdcrReplicationHandlerTest_BE696F04332BFFEC-001/jetty-001/cores/collection1
   [junit4]   2> 673210 INFO  (TEST-CdcrReplicationHandlerTest.testReplicationWithBufferedUpdates-seed#[BE696F04332BFFEC]) [    ] o.e.j.s.Server jetty-9.3.8.v20160314
   [junit4]   2> 673211 INFO  (TEST-CdcrReplicationHandlerTest.testReplicationWithBufferedUpdates-seed#[BE696F04332BFFEC]) [    ] o.e.j.s.h.ContextHandler Started o.e.j.s.ServletContextHandler@143c9a13{/at/cp,null,AVAILABLE}
   [junit4]   2> 673212 INFO  (TEST-CdcrReplicationHandlerTest.testReplicationWithBufferedUpdates-seed#[BE696F04332BFFEC]) [    ] o.e.j.s.ServerConnector Started ServerConnector@52fce1{HTTP/1.1,[http/1.1]}{127.0.0.1:54460}
   [junit4]   2> 673212 INFO  (TEST-CdcrReplicationHandlerTest.testReplicationWithBufferedUpdates-seed#[BE696F04332BFFEC]) [    ] o.e.j.s.Server Started @680251ms
   [junit4]   2> 673212 INFO  (TEST-CdcrReplicationHandlerTest.testReplicationWithBufferedUpdates-seed#[BE696F04332BFFEC]) [    ] o.a.s.c.s.e.JettySolrRunner Jetty properties: {shards=shard1, hostContext=/at/cp, hostPort=54460, coreRootDirectory=/x1/jenkins/jenkins-slave/workspace/Lucene-Solr-NightlyTests-master/solr/build/solr-core/test/J1/temp/solr.cloud.CdcrReplicationHandlerTest_BE696F04332BFFEC-001/jetty-001/cores}
   [junit4]   2> 673212 INFO  (TEST-CdcrReplicationHandlerTest.testReplicationWithBufferedUpdates-seed#[BE696F04332BFFEC]) [    ] o.a.s.s.SolrDispatchFilter SolrDispatchFilter.init(): sun.misc.Launcher$AppClassLoader@73d16e93
   [junit4]   2> 673212 INFO  (TEST-CdcrReplicationHandlerTest.testReplicationWithBufferedUpdates-seed#[BE696F04332BFFEC]) [    ] o.a.s.c.SolrResourceLoader new SolrResourceLoader for directory: '/x1/jenkins/jenkins-slave/workspace/Lucene-Solr-NightlyTests-master/solr/build/solr-core/test/J1/temp/solr.cloud.CdcrReplicationHandlerTest_BE696F04332BFFEC-001/jetty-001'
   [junit4]   2> 673213 INFO  (TEST-CdcrReplicationHandlerTest.testReplicationWithBufferedUpdates-seed#[BE696F04332BFFEC]) [    ] o.a.s.c.SolrResourceLoader JNDI not configured for solr (NoInitialContextEx)
   [junit4]   2> 673213 INFO  (TEST-CdcrReplicationHandlerTest.testReplicationWithBufferedUpdates-seed#[BE696F04332BFFEC]) [    ] o.a.s.c.SolrResourceLoader solr home defaulted to 'solr/' (could not find system property or JNDI)
   [junit4]   2> 673213 INFO  (TEST-CdcrReplicationHandlerTest.testReplicationWithBufferedUpdates-seed#[BE696F04332BFFEC]) [    ] o.a.s.c.c.SolrZkClient Using default ZkCredentialsProvider
   [junit4]   2> 673227 INFO  (TEST-CdcrReplicationHandlerTest.testReplicationWithBufferedUpdates-seed#[BE696F04332BFFEC]) [    ] o.a.s.c.c.ConnectionManager Waiting for client to connect to ZooKeeper
   [junit4]   2> 673253 INFO  (zkCallback-76-thread-1) [    ] o.a.s.c.c.ConnectionManager Watcher org.apache.solr.common.cloud.ConnectionManager@5b2797b7 name:ZooKeeperConnection Watcher:127.0.0.1:40596/solr got event WatchedEvent state:SyncConnected type:None path:null path:null type:None
   [junit4]   2> 673253 INFO  (TEST-CdcrReplicationHandlerTest.testReplicationWithBufferedUpdates-seed#[BE696F04332BFFEC]) [    ] o.a.s.c.c.ConnectionManager Client is connected to ZooKeeper
   [junit4]   2> 673253 INFO  (TEST-CdcrReplicationHandlerTest.testReplicationWithBufferedUpdates-seed#[BE696F04332BFFEC]) [    ] o.a.s.c.c.SolrZkClient Using default ZkACLProvider
   [junit4]   2> 673255 INFO  (TEST-CdcrReplicationHandlerTest.testReplicationWithBufferedUpdates-seed#[BE696F04332BFFEC]) [    ] o.a.s.s.SolrDispatchFilter Loading solr.xml from SolrHome (not found in ZooKeeper)
   [junit4]   2> 673255 INFO  (TEST-CdcrReplicationHandlerTest.testReplicationWithBufferedUpdates-seed#[BE696F04332BFFEC]) [    ] o.a.s.c.SolrXmlConfig Loading container configuration from /x1/jenkins/jenkins-slave/workspace/Lucene-Solr-NightlyTests-master/solr/build/solr-core/test/J1/temp/solr.cloud.CdcrReplicationHandlerTest_BE696F04332BFFEC-001/jetty-001/solr.xml
   [junit4]   2> 673259 INFO  (TEST-CdcrReplicationHandlerTest.testReplicationWithBufferedUpdates-seed#[BE696F04332BFFEC]) [    ] o.a.s.c.CorePropertiesLocator Config-defined core root directory: /x1/jenkins/jenkins-slave/workspace/Lucene-Solr-NightlyTests-master/solr/build/solr-core/test/J1/temp/solr.cloud.CdcrReplicationHandlerTest_BE696F04332BFFEC-001/jetty-001/cores
   [junit4]   2> 673259 INFO  (TEST-CdcrReplicationHandlerTest.testReplicationWithBufferedUpdates-seed#[BE696F04332BFFEC]) [    ] o.a.s.c.CoreContainer New CoreContainer 1366571811
   [junit4]   2> 673259 INFO  (TEST-CdcrReplicationHandlerTest.testReplicationWithBufferedUpdates-seed#[BE696F04332BFFEC]) [    ] o.a.s.c.CoreContainer Loading cores into CoreContainer [instanceDir=/x1/jenkins/jenkins-slave/workspace/Lucene-Solr-NightlyTests-master/solr/build/solr-core/test/J1/temp/solr.cloud.CdcrReplicationHandlerTest_BE696F04332BFFEC-001/jetty-001]
   [junit4]   2> 673259 WARN  (TEST-CdcrReplicationHandlerTest.testReplicationWithBufferedUpdates-seed#[BE696F04332BFFEC]) [    ] o.a.s.c.CoreContainer Couldn't add files from /x1/jenkins/jenkins-slave/workspace/Lucene-Solr-NightlyTests-master/solr/build/solr-core/test/J1/temp/solr.cloud.CdcrReplicationHandlerTest_BE696F04332BFFEC-001/jetty-001/lib to classpath: /x1/jenkins/jenkins-slave/workspace/Lucene-Solr-NightlyTests-master/solr/build/solr-core/test/J1/temp/solr.cloud.CdcrReplicationHandlerTest_BE696F04332BFFEC-001/jetty-001/lib
   [junit4]   2> 673260 INFO  (TEST-CdcrReplicationHandlerTest.testReplicationWithBufferedUpdates-seed#[BE696F04332BFFEC]) [    ] o.a.s.h.c.HttpShardHandlerFactory created with socketTimeout : 90000,urlScheme : ,connTimeout : 15000,maxConnectionsPerHost : 20,maxConnections : 10000,corePoolSize : 0,maximumPoolSize : 2147483647,maxThreadIdleTime : 5,sizeOfQueue : -1,fairnessPolicy : false,
   [junit4]   2> 673261 INFO  (TEST-CdcrReplicationHandlerTest.testReplicationWithBufferedUpdates-seed#[BE696F04332BFFEC]) [    ] o.a.s.u.UpdateShardHandler Creating UpdateShardHandler HTTP client with params: 
   [junit4]   2> 673273 INFO  (TEST-CdcrReplicationHandlerTest.testReplicationWithBufferedUpdates-seed#[BE696F04332BFFEC]) [    ] o.a.s.l.LogWatcher SLF4J impl is org.slf4j.impl.Log4jLoggerFactory
   [junit4]   2> 673273 INFO  (TEST-CdcrReplicationHandlerTest.testReplicationWithBufferedUpdates-seed#[BE696F04332BFFEC]) [    ] o.a.s.l.LogWatcher Registering Log Listener [Log4j (org.slf4j.impl.Log4jLoggerFactory)]
   [junit4]   2> 673273 INFO  (TEST-CdcrReplicationHandlerTest.testReplicationWithBufferedUpdates-seed#[BE696F04332BFFEC]) [    ] o.a.s.c.ZkContainer Zookeeper client=127.0.0.1:40596/solr
   [junit4]   2> 673273 INFO  (TEST-CdcrReplicationHandlerTest.testReplicationWithBufferedUpdates-seed#[BE696F04332BFFEC]) [    ] o.a.s.c.ZkController zkHost includes chroot
   [junit4]   2> 673273 INFO  (TEST-CdcrReplicationHandlerTest.testReplicationWithBufferedUpdates-seed#[BE696F04332BFFEC]) [    ] o.a.s.c.c.SolrZkClient Using default ZkCredentialsProvider
   [junit4]   2> 673274 INFO  (TEST-CdcrReplicationHandlerTest.testReplicationWithBufferedUpdates-seed#[BE696F04332BFFEC]) [    ] o.a.s.c.c.ConnectionManager Waiting for client to connect to ZooKeeper
   [junit4]   2> 673293 INFO  (zkCallback-79-thread-1) [    ] o.a.s.c.c.ConnectionManager Watcher org.apache.solr.common.cloud.ConnectionManager@cc67658 name:ZooKeeperConnection Watcher:127.0.0.1:40596 got event WatchedEvent state:SyncConnected type:None path:null path:null type:None
   [junit4]   2> 673293 INFO  (TEST-CdcrReplicationHandlerTest.testReplicationWithBufferedUpdates-seed#[BE696F04332BFFEC]) [    ] o.a.s.c.c.ConnectionManager Client is connected to ZooKeeper
   [junit4]   2> 673294 INFO  (TEST-CdcrReplicationHandlerTest.testReplicationWithBufferedUpdates-seed#[BE696F04332BFFEC]) [    ] o.a.s.c.c.SolrZkClient Using default ZkACLProvider
   [junit4]   2> 673295 INFO  (TEST-CdcrReplicationHandlerTest.testReplicationWithBufferedUpdates-seed#[BE696F04332BFFEC]) [n:127.0.0.1:54460_at%2Fcp    ] o.a.s.c.c.ConnectionManager Waiting for client to connect to ZooKeeper
   [junit4]   2> 673330 INFO  (zkCallback-80-thread-1-processing-n:127.0.0.1:54460_at%2Fcp) [n:127.0.0.1:54460_at%2Fcp    ] o.a.s.c.c.ConnectionManager Watcher org.apache.solr.common.cloud.ConnectionManager@6809d375 name:ZooKeeperConnection Watcher:127.0.0.1:40596/solr got event WatchedEvent state:SyncConnected type:None path:null path:null type:None
   [junit4]   2> 673330 INFO  (TEST-CdcrReplicationHandlerTest.testReplicationWithBufferedUpdates-seed#[BE696F04332BFFEC]) [n:127.0.0.1:54460_at%2Fcp    ] o.a.s.c.c.ConnectionManager Client is connected to ZooKeeper
   [junit4]   2> 673343 INFO  (TEST-CdcrReplicationHandlerTest.testReplicationWithBufferedUpdates-seed#[BE696F04332BFFEC]) [n:127.0.0.1:54460_at%2Fcp    ] o.a.s.c.c.SolrZkClient makePath: /overseer/queue
   [junit4]   2> 673344 INFO  (TEST-CdcrReplicationHandlerTest.testReplicationWithBufferedUpdates-seed#[BE696F04332BFFEC]) [n:127.0.0.1:54460_at%2Fcp    ] o.a.s.c.c.SolrZkClient makePath: /overseer/collection-queue-work
   [junit4]   2> 673346 INFO  (TEST-CdcrReplicationHandlerTest.testReplicationWithBufferedUpdates-seed#[BE696F04332BFFEC]) [n:127.0.0.1:54460_at%2Fcp    ] o.a.s.c.c.SolrZkClient makePath: /overseer/collection-map-running
   [junit4]   2> 673346 INFO  (TEST-CdcrReplicationHandlerTest.testReplicationWithBufferedUpdates-seed#[BE696F04332BFFEC]) [n:127.0.0.1:54460_at%2Fcp    ] o.a.s.c.c.SolrZkClient makePath: /overseer/collection-map-completed
   [junit4]   2> 673358 INFO  (TEST-CdcrReplicationHandlerTest.testReplicationWithBufferedUpdates-seed#[BE696F04332BFFEC]) [n:127.0.0.1:54460_at%2Fcp    ] o.a.s.c.c.SolrZkClient makePath: /overseer/collection-map-failure
   [junit4]   2> 673359 INFO  (TEST-CdcrReplicationHandlerTest.testReplicationWithBufferedUpdates-seed#[BE696F04332BFFEC]) [n:127.0.0.1:54460_at%2Fcp    ] o.a.s.c.c.SolrZkClient makePath: /live_nodes
   [junit4]   2> 673359 INFO  (TEST-CdcrReplicationHandlerTest.testReplicationWithBufferedUpdates-seed#[BE696F04332BFFEC]) [n:127.0.0.1:54460_at%2Fcp    ] o.a.s.c.c.SolrZkClient makePath: /aliases.json
   [junit4]   2> 673360 INFO  (TEST-CdcrReplicationHandlerTest.testReplicationWithBufferedUpdates-seed#[BE696F04332BFFEC]) [n:127.0.0.1:54460_at%2Fcp    ] o.a.s.c.c.SolrZkClient makePath: /clusterstate.json
   [junit4]   2> 673360 INFO  (TEST-CdcrReplicationHandlerTest.testReplicationWithBufferedUpdates-seed#[BE696F04332BFFEC]) [n:127.0.0.1:54460_at%2Fcp    ] o.a.s.c.c.SolrZkClient makePath: /security.json
   [junit4]   2> 673361 INFO  (TEST-CdcrReplicationHandlerTest.testReplicationWithBufferedUpdates-seed#[BE696F04332BFFEC]) [n:127.0.0.1:54460_at%2Fcp    ] o.a.s.c.c.ZkStateReader Updating cluster state from ZooKeeper... 
   [junit4]   2> 673361 INFO  (TEST-CdcrReplicationHandlerTest.testReplicationWithBufferedUpdates-seed#[BE696F04332BFFEC]) [n:127.0.0.1:54460_at%2Fcp    ] o.a.s.c.c.ZkStateReader Updated live nodes from ZooKeeper... (0) -> (0)
   [junit4]   2> 673362 INFO  (TEST-CdcrReplicationHandlerTest.testReplicationWithBufferedUpdates-seed#[BE696F04332BFFEC]) [n:127.0.0.1:54460_at%2Fcp    ] o.a.s.c.c.SolrZkClient makePath: /overseer_elect
   [junit4]   2> 673363 INFO  (TEST-CdcrReplicationHandlerTest.testReplicationWithBufferedUpdates-seed#[BE696F04332BFFEC]) [n:127.0.0.1:54460_at%2Fcp    ] o.a.s.c.c.

[...truncated too long message...]

]
   [junit4]   2>    3) Thread[id=119139, name=Connection evictor, state=TIMED_WAITING, group=TGRP-ConcurrentDeleteAndCreateCollectionTest]
   [junit4]   2>    4) Thread[id=119104, name=Connection evictor, state=TIMED_WAITING, group=TGRP-ConcurrentDeleteAndCreateCollectionTest]
   [junit4]   2>    5) Thread[id=119099, name=Connection evictor, state=TIMED_WAITING, group=TGRP-ConcurrentDeleteAndCreateCollectionTest]
   [junit4]   2>    6) Thread[id=119119, name=Connection evictor, state=TIMED_WAITING, group=TGRP-ConcurrentDeleteAndCreateCollectionTest]
   [junit4]   2>    7) Thread[id=119124, name=Connection evictor, state=TIMED_WAITING, group=TGRP-ConcurrentDeleteAndCreateCollectionTest]
   [junit4]   2>    8) Thread[id=119134, name=Connection evictor, state=TIMED_WAITING, group=TGRP-ConcurrentDeleteAndCreateCollectionTest]
   [junit4]   2>    9) Thread[id=119094, name=Connection evictor, state=TIMED_WAITING, group=TGRP-ConcurrentDeleteAndCreateCollectionTest]
   [junit4]   2>   10) Thread[id=119114, name=Connection evictor, state=TIMED_WAITING, group=TGRP-ConcurrentDeleteAndCreateCollectionTest]
   [junit4]   2> Apr 05, 2016 7:56:59 PM com.carrotsearch.randomizedtesting.ThreadLeakControl tryToInterruptAll
   [junit4]   2> INFO: All leaked threads terminated.
   [junit4]   2> NOTE: test params are: codec=Asserting(Lucene60): {}, docValues:{}, maxPointsInLeafNode=1526, maxMBSortInHeap=6.720798688666894, sim=RandomSimilarity(queryNorm=false,coord=no): {}, locale=es-BO, timezone=America/Kentucky/Louisville
   [junit4]   2> NOTE: Linux 3.13.0-52-generic amd64/Oracle Corporation 1.8.0_74 (64-bit)/cpus=4,threads=1,free=176661864,total=500170752
   [junit4]   2> NOTE: All tests run in this JVM: [AlternateDirectoryTest, DistributedQueueTest, DistributedSuggestComponentTest, TestReplicationHandlerBackup, SolrRequestParserTest, DistributedFacetPivotWhiteBoxTest, TestSolr4Spatial2, TestMiniSolrCloudClusterSSL, AsyncCallRequestStatusResponseTest, RestartWhileUpdatingTest, TestRealTimeGet, TestLuceneMatchVersion, CdcrReplicationDistributedZkTest, TestNRTOpen, SuggestComponentContextFilterQueryTest, UUIDUpdateProcessorFallbackTest, CacheHeaderTest, TestMissingGroups, TestLRUCache, TestPseudoReturnFields, TestSearcherReuse, CustomCollectionTest, TriLevelCompositeIdRoutingTest, ZkStateReaderTest, TestExactSharedStatsCache, BigEndianAscendingWordDeserializerTest, TestJsonFacets, TestHighlightDedupGrouping, CurrencyFieldOpenExchangeTest, TestCloudManagedSchema, HdfsBasicDistributedZkTest, BufferStoreTest, DistribCursorPagingTest, TestJoin, TestRTimerTree, DistributedDebugComponentTest, ConnectionReuseTest, TestRandomFaceting, TestCryptoKeys, TestShortCircuitedRequests, SystemInfoHandlerTest, HttpPartitionTest, TestSolr4Spatial, DistributedQueryElevationComponentTest, CheckHdfsIndexTest, TestIntervalFaceting, SignatureUpdateProcessorFactoryTest, TestSQLHandler, ZkNodePropsTest, TestExpandComponent, PingRequestHandlerTest, TestRandomDVFaceting, DisMaxRequestHandlerTest, TestStressUserVersions, AnalyticsQueryTest, TestDistributedSearch, DefaultValueUpdateProcessorTest, RankQueryTest, TestBulkSchemaAPI, TestPhraseSuggestions, CopyFieldTest, ConcurrentDeleteAndCreateCollectionTest]
   [junit4]   2> NOTE: download the large Jenkins line-docs file by running 'ant get-jenkins-line-docs' in the lucene directory.
   [junit4]   2> NOTE: reproduce with: ant test  -Dtestcase=ConcurrentDeleteAndCreateCollectionTest -Dtests.seed=BE696F04332BFFEC -Dtests.multiplier=2 -Dtests.nightly=true -Dtests.slow=true -Dtests.linedocsfile=/x1/jenkins/lucene-data/enwiki.random.lines.txt -Dtests.locale=es-BO -Dtests.timezone=America/Kentucky/Louisville -Dtests.asserts=true -Dtests.file.encoding=ISO-8859-1
   [junit4] ERROR   0.00s J0 | ConcurrentDeleteAndCreateCollectionTest (suite) <<<
   [junit4]    > Throwable #1: java.lang.AssertionError: ObjectTracker found 10 object(s) that were not released!!! [InternalHttpClient, InternalHttpClient, InternalHttpClient, InternalHttpClient, InternalHttpClient, InternalHttpClient, InternalHttpClient, InternalHttpClient, InternalHttpClient, InternalHttpClient]
   [junit4]    > 	at __randomizedtesting.SeedInfo.seed([BE696F04332BFFEC]:0)
   [junit4]    > 	at org.apache.solr.SolrTestCaseJ4.afterClass(SolrTestCaseJ4.java:247)
   [junit4]    > 	at java.lang.Thread.run(Thread.java:745)Throwable #2: com.carrotsearch.randomizedtesting.ThreadLeakError: 10 threads leaked from SUITE scope at org.apache.solr.cloud.ConcurrentDeleteAndCreateCollectionTest: 
   [junit4]    >    1) Thread[id=119129, name=Connection evictor, state=TIMED_WAITING, group=TGRP-ConcurrentDeleteAndCreateCollectionTest]
   [junit4]    >         at java.lang.Thread.sleep(Native Method)
   [junit4]    >         at org.apache.http.impl.client.IdleConnectionEvictor$1.run(IdleConnectionEvictor.java:66)
   [junit4]    >         at java.lang.Thread.run(Thread.java:745)
   [junit4]    >    2) Thread[id=119109, name=Connection evictor, state=TIMED_WAITING, group=TGRP-ConcurrentDeleteAndCreateCollectionTest]
   [junit4]    >         at java.lang.Thread.sleep(Native Method)
   [junit4]    >         at org.apache.http.impl.client.IdleConnectionEvictor$1.run(IdleConnectionEvictor.java:66)
   [junit4]    >         at java.lang.Thread.run(Thread.java:745)
   [junit4]    >    3) Thread[id=119139, name=Connection evictor, state=TIMED_WAITING, group=TGRP-ConcurrentDeleteAndCreateCollectionTest]
   [junit4]    >         at java.lang.Thread.sleep(Native Method)
   [junit4]    >         at org.apache.http.impl.client.IdleConnectionEvictor$1.run(IdleConnectionEvictor.java:66)
   [junit4]    >         at java.lang.Thread.run(Thread.java:745)
   [junit4]    >    4) Thread[id=119104, name=Connection evictor, state=TIMED_WAITING, group=TGRP-ConcurrentDeleteAndCreateCollectionTest]
   [junit4]    >         at java.lang.Thread.sleep(Native Method)
   [junit4]    >         at org.apache.http.impl.client.IdleConnectionEvictor$1.run(IdleConnectionEvictor.java:66)
   [junit4]    >         at java.lang.Thread.run(Thread.java:745)
   [junit4]    >    5) Thread[id=119099, name=Connection evictor, state=TIMED_WAITING, group=TGRP-ConcurrentDeleteAndCreateCollectionTest]
   [junit4]    >         at java.lang.Thread.sleep(Native Method)
   [junit4]    >         at org.apache.http.impl.client.IdleConnectionEvictor$1.run(IdleConnectionEvictor.java:66)
   [junit4]    >         at java.lang.Thread.run(Thread.java:745)
   [junit4]    >    6) Thread[id=119119, name=Connection evictor, state=TIMED_WAITING, group=TGRP-ConcurrentDeleteAndCreateCollectionTest]
   [junit4]    >         at java.lang.Thread.sleep(Native Method)
   [junit4]    >         at org.apache.http.impl.client.IdleConnectionEvictor$1.run(IdleConnectionEvictor.java:66)
   [junit4]    >         at java.lang.Thread.run(Thread.java:745)
   [junit4]    >    7) Thread[id=119124, name=Connection evictor, state=TIMED_WAITING, group=TGRP-ConcurrentDeleteAndCreateCollectionTest]
   [junit4]    >         at java.lang.Thread.sleep(Native Method)
   [junit4]    >         at org.apache.http.impl.client.IdleConnectionEvictor$1.run(IdleConnectionEvictor.java:66)
   [junit4]    >         at java.lang.Thread.run(Thread.java:745)
   [junit4]    >    8) Thread[id=119134, name=Connection evictor, state=TIMED_WAITING, group=TGRP-ConcurrentDeleteAndCreateCollectionTest]
   [junit4]    >         at java.lang.Thread.sleep(Native Method)
   [junit4]    >         at org.apache.http.impl.client.IdleConnectionEvictor$1.run(IdleConnectionEvictor.java:66)
   [junit4]    >         at java.lang.Thread.run(Thread.java:745)
   [junit4]    >    9) Thread[id=119094, name=Connection evictor, state=TIMED_WAITING, group=TGRP-ConcurrentDeleteAndCreateCollectionTest]
   [junit4]    >         at java.lang.Thread.sleep(Native Method)
   [junit4]    >         at org.apache.http.impl.client.IdleConnectionEvictor$1.run(IdleConnectionEvictor.java:66)
   [junit4]    >         at java.lang.Thread.run(Thread.java:745)
   [junit4]    >   10) Thread[id=119114, name=Connection evictor, state=TIMED_WAITING, group=TGRP-ConcurrentDeleteAndCreateCollectionTest]
   [junit4]    >         at java.lang.Thread.sleep(Native Method)
   [junit4]    >         at org.apache.http.impl.client.IdleConnectionEvictor$1.run(IdleConnectionEvictor.java:66)
   [junit4]    >         at java.lang.Thread.run(Thread.java:745)
   [junit4]    > 	at __randomizedtesting.SeedInfo.seed([BE696F04332BFFEC]:0)
   [junit4] Completed [549/584 (6!)] on J0 in 86.28s, 2 tests, 1 failure, 1 error <<< FAILURES!

[...truncated 125 lines...]
BUILD FAILED
/x1/jenkins/jenkins-slave/workspace/Lucene-Solr-NightlyTests-master/build.xml:747: The following error occurred while executing this line:
/x1/jenkins/jenkins-slave/workspace/Lucene-Solr-NightlyTests-master/build.xml:684: The following error occurred while executing this line:
/x1/jenkins/jenkins-slave/workspace/Lucene-Solr-NightlyTests-master/build.xml:59: The following error occurred while executing this line:
/x1/jenkins/jenkins-slave/workspace/Lucene-Solr-NightlyTests-master/solr/build.xml:233: The following error occurred while executing this line:
/x1/jenkins/jenkins-slave/workspace/Lucene-Solr-NightlyTests-master/solr/common-build.xml:529: The following error occurred while executing this line:
/x1/jenkins/jenkins-slave/workspace/Lucene-Solr-NightlyTests-master/lucene/common-build.xml:1457: The following error occurred while executing this line:
/x1/jenkins/jenkins-slave/workspace/Lucene-Solr-NightlyTests-master/lucene/common-build.xml:1014: There were test failures: 584 suites (10 ignored), 2353 tests, 10 suite-level errors, 1 error, 2 failures, 1149 ignored (8 assumptions) [seed: BE696F04332BFFEC]

Total time: 259 minutes 37 seconds
Build step 'Invoke Ant' marked build as failure
Archiving artifacts
No prior successful build to compare, so performing full copy of artifacts
Recording test results
Email was triggered for: Failure - Any
Sending email for trigger: Failure - Any




Mime
View raw message