lucene-dev mailing list archives

Site index · List index
Message view « Date » · « Thread »
Top « Date » · « Thread »
From Apache Jenkins Server <jenk...@builds.apache.org>
Subject [JENKINS] Lucene-Solr-Tests-5.5-Java8 - Build # 17 - Failure
Date Thu, 28 Apr 2016 05:37:12 GMT
Build: https://builds.apache.org/job/Lucene-Solr-Tests-5.5-Java8/17/

2 tests failed.
FAILED:  org.apache.solr.security.BasicAuthIntegrationTest.testBasics

Error Message:
Test abandoned because suite timeout was reached.

Stack Trace:
java.lang.Exception: Test abandoned because suite timeout was reached.
	at __randomizedtesting.SeedInfo.seed([DEAF2CE2912C3338]:0)


FAILED:  junit.framework.TestSuite.org.apache.solr.security.BasicAuthIntegrationTest

Error Message:
Suite timeout exceeded (>= 7200000 msec).

Stack Trace:
java.lang.Exception: Suite timeout exceeded (>= 7200000 msec).
	at __randomizedtesting.SeedInfo.seed([DEAF2CE2912C3338]:0)




Build Log:
[...truncated 12460 lines...]
   [junit4] Suite: org.apache.solr.security.BasicAuthIntegrationTest
   [junit4]   2> 892966 INFO  (TEST-BasicAuthIntegrationTest.testBasics-seed#[DEAF2CE2912C3338]) [    ] o.a.s.c.ZkTestServer STARTING ZK TEST SERVER
   [junit4]   2> 892966 INFO  (Thread-2152) [    ] o.a.s.c.ZkTestServer client port:0.0.0.0/0.0.0.0:0
   [junit4]   2> 892966 INFO  (Thread-2152) [    ] o.a.s.c.ZkTestServer Starting server
   [junit4]   2> 893066 INFO  (TEST-BasicAuthIntegrationTest.testBasics-seed#[DEAF2CE2912C3338]) [    ] o.a.s.c.ZkTestServer start zk server on port:40701
   [junit4]   2> 893067 INFO  (TEST-BasicAuthIntegrationTest.testBasics-seed#[DEAF2CE2912C3338]) [    ] o.a.s.c.c.SolrZkClient Using default ZkCredentialsProvider
   [junit4]   2> 893069 INFO  (TEST-BasicAuthIntegrationTest.testBasics-seed#[DEAF2CE2912C3338]) [    ] o.a.s.c.c.ConnectionManager Waiting for client to connect to ZooKeeper
   [junit4]   2> 893073 INFO  (zkCallback-743-thread-1) [    ] o.a.s.c.c.ConnectionManager Watcher org.apache.solr.common.cloud.ConnectionManager@7f85b78b name:ZooKeeperConnection Watcher:127.0.0.1:40701 got event WatchedEvent state:SyncConnected type:None path:null path:null type:None
   [junit4]   2> 893073 INFO  (TEST-BasicAuthIntegrationTest.testBasics-seed#[DEAF2CE2912C3338]) [    ] o.a.s.c.c.ConnectionManager Client is connected to ZooKeeper
   [junit4]   2> 893073 INFO  (TEST-BasicAuthIntegrationTest.testBasics-seed#[DEAF2CE2912C3338]) [    ] o.a.s.c.c.SolrZkClient Using default ZkACLProvider
   [junit4]   2> 893073 INFO  (TEST-BasicAuthIntegrationTest.testBasics-seed#[DEAF2CE2912C3338]) [    ] o.a.s.c.c.SolrZkClient makePath: /solr/solr.xml
   [junit4]   2> 893081 INFO  (jetty-launcher-742-thread-2) [    ] o.e.j.s.Server jetty-9.2.13.v20150730
   [junit4]   2> 893081 INFO  (jetty-launcher-742-thread-4) [    ] o.e.j.s.Server jetty-9.2.13.v20150730
   [junit4]   2> 893081 INFO  (jetty-launcher-742-thread-1) [    ] o.e.j.s.Server jetty-9.2.13.v20150730
   [junit4]   2> 893082 INFO  (jetty-launcher-742-thread-1) [    ] o.e.j.s.h.ContextHandler Started o.e.j.s.ServletContextHandler@58182408{/solr,null,AVAILABLE}
   [junit4]   2> 893090 INFO  (jetty-launcher-742-thread-4) [    ] o.e.j.s.h.ContextHandler Started o.e.j.s.ServletContextHandler@f39c11d{/solr,null,AVAILABLE}
   [junit4]   2> 893091 INFO  (jetty-launcher-742-thread-2) [    ] o.e.j.s.h.ContextHandler Started o.e.j.s.ServletContextHandler@36eec050{/solr,null,AVAILABLE}
   [junit4]   2> 893091 INFO  (jetty-launcher-742-thread-2) [    ] o.e.j.s.ServerConnector Started ServerConnector@459aaa0{HTTP/1.1}{127.0.0.1:34824}
   [junit4]   2> 893091 INFO  (jetty-launcher-742-thread-2) [    ] o.e.j.s.Server Started @895052ms
   [junit4]   2> 893091 INFO  (jetty-launcher-742-thread-2) [    ] o.a.s.c.s.e.JettySolrRunner Jetty properties: {hostContext=/solr, hostPort=34824}
   [junit4]   2> 893091 INFO  (jetty-launcher-742-thread-2) [    ] o.a.s.s.SolrDispatchFilter SolrDispatchFilter.init(): sun.misc.Launcher$AppClassLoader@73d16e93
   [junit4]   2> 893091 INFO  (jetty-launcher-742-thread-2) [    ] o.a.s.c.SolrResourceLoader new SolrResourceLoader for directory: '/x1/jenkins/jenkins-slave/workspace/Lucene-Solr-Tests-5.5-Java8/solr/build/solr-core/test/J0/temp/solr.security.BasicAuthIntegrationTest_DEAF2CE2912C3338-001/tempDir-001/node1'
   [junit4]   2> 893091 INFO  (jetty-launcher-742-thread-2) [    ] o.a.s.c.SolrResourceLoader JNDI not configured for solr (NoInitialContextEx)
   [junit4]   2> 893091 INFO  (jetty-launcher-742-thread-2) [    ] o.a.s.c.SolrResourceLoader solr home defaulted to 'solr/' (could not find system property or JNDI)
   [junit4]   2> 893091 INFO  (jetty-launcher-742-thread-2) [    ] o.a.s.c.c.SolrZkClient Using default ZkCredentialsProvider
   [junit4]   2> 893092 INFO  (jetty-launcher-742-thread-2) [    ] o.a.s.c.c.ConnectionManager Waiting for client to connect to ZooKeeper
   [junit4]   2> 893092 INFO  (jetty-launcher-742-thread-1) [    ] o.e.j.s.ServerConnector Started ServerConnector@2c75f4db{HTTP/1.1}{127.0.0.1:49051}
   [junit4]   2> 893092 INFO  (jetty-launcher-742-thread-1) [    ] o.e.j.s.Server Started @895053ms
   [junit4]   2> 893092 INFO  (jetty-launcher-742-thread-1) [    ] o.a.s.c.s.e.JettySolrRunner Jetty properties: {hostContext=/solr, hostPort=49051}
   [junit4]   2> 893092 INFO  (jetty-launcher-742-thread-1) [    ] o.a.s.s.SolrDispatchFilter SolrDispatchFilter.init(): sun.misc.Launcher$AppClassLoader@73d16e93
   [junit4]   2> 893092 INFO  (jetty-launcher-742-thread-1) [    ] o.a.s.c.SolrResourceLoader new SolrResourceLoader for directory: '/x1/jenkins/jenkins-slave/workspace/Lucene-Solr-Tests-5.5-Java8/solr/build/solr-core/test/J0/temp/solr.security.BasicAuthIntegrationTest_DEAF2CE2912C3338-001/tempDir-001/node5'
   [junit4]   2> 893092 INFO  (jetty-launcher-742-thread-1) [    ] o.a.s.c.SolrResourceLoader JNDI not configured for solr (NoInitialContextEx)
   [junit4]   2> 893092 INFO  (jetty-launcher-742-thread-1) [    ] o.a.s.c.SolrResourceLoader solr home defaulted to 'solr/' (could not find system property or JNDI)
   [junit4]   2> 893092 INFO  (jetty-launcher-742-thread-1) [    ] o.a.s.c.c.SolrZkClient Using default ZkCredentialsProvider
   [junit4]   2> 893093 INFO  (jetty-launcher-742-thread-1) [    ] o.a.s.c.c.ConnectionManager Waiting for client to connect to ZooKeeper
   [junit4]   2> 893093 INFO  (jetty-launcher-742-thread-5) [    ] o.e.j.s.Server jetty-9.2.13.v20150730
   [junit4]   2> 893097 INFO  (jetty-launcher-742-thread-3) [    ] o.e.j.s.Server jetty-9.2.13.v20150730
   [junit4]   2> 893097 INFO  (zkCallback-745-thread-1) [    ] o.a.s.c.c.ConnectionManager Watcher org.apache.solr.common.cloud.ConnectionManager@59e0fef4 name:ZooKeeperConnection Watcher:127.0.0.1:40701/solr got event WatchedEvent state:SyncConnected type:None path:null path:null type:None
   [junit4]   2> 893097 INFO  (jetty-launcher-742-thread-1) [    ] o.a.s.c.c.ConnectionManager Client is connected to ZooKeeper
   [junit4]   2> 893097 INFO  (jetty-launcher-742-thread-1) [    ] o.a.s.c.c.SolrZkClient Using default ZkACLProvider
   [junit4]   2> 893097 INFO  (jetty-launcher-742-thread-1) [    ] o.a.s.s.SolrDispatchFilter solr.xml found in ZooKeeper. Loading...
   [junit4]   2> 893106 INFO  (jetty-launcher-742-thread-5) [    ] o.e.j.s.h.ContextHandler Started o.e.j.s.ServletContextHandler@6a68fa0{/solr,null,AVAILABLE}
   [junit4]   2> 893106 INFO  (jetty-launcher-742-thread-4) [    ] o.e.j.s.ServerConnector Started ServerConnector@6548eacc{HTTP/1.1}{127.0.0.1:49107}
   [junit4]   2> 893106 INFO  (jetty-launcher-742-thread-4) [    ] o.e.j.s.Server Started @895067ms
   [junit4]   2> 893106 INFO  (jetty-launcher-742-thread-4) [    ] o.a.s.c.s.e.JettySolrRunner Jetty properties: {hostContext=/solr, hostPort=49107}
   [junit4]   2> 893106 INFO  (jetty-launcher-742-thread-4) [    ] o.a.s.s.SolrDispatchFilter SolrDispatchFilter.init(): sun.misc.Launcher$AppClassLoader@73d16e93
   [junit4]   2> 893106 INFO  (jetty-launcher-742-thread-4) [    ] o.a.s.c.SolrResourceLoader new SolrResourceLoader for directory: '/x1/jenkins/jenkins-slave/workspace/Lucene-Solr-Tests-5.5-Java8/solr/build/solr-core/test/J0/temp/solr.security.BasicAuthIntegrationTest_DEAF2CE2912C3338-001/tempDir-001/node2'
   [junit4]   2> 893106 INFO  (jetty-launcher-742-thread-4) [    ] o.a.s.c.SolrResourceLoader JNDI not configured for solr (NoInitialContextEx)
   [junit4]   2> 893106 INFO  (jetty-launcher-742-thread-4) [    ] o.a.s.c.SolrResourceLoader solr home defaulted to 'solr/' (could not find system property or JNDI)
   [junit4]   2> 893107 INFO  (jetty-launcher-742-thread-1) [    ] o.a.s.c.CorePropertiesLocator Config-defined core root directory: /x1/jenkins/jenkins-slave/workspace/Lucene-Solr-Tests-5.5-Java8/solr/build/solr-core/test/J0/temp/solr.security.BasicAuthIntegrationTest_DEAF2CE2912C3338-001/tempDir-001/node5/.
   [junit4]   2> 893107 INFO  (jetty-launcher-742-thread-1) [    ] o.a.s.c.CoreContainer New CoreContainer 1029050296
   [junit4]   2> 893107 INFO  (jetty-launcher-742-thread-1) [    ] o.a.s.c.CoreContainer Loading cores into CoreContainer [instanceDir=/x1/jenkins/jenkins-slave/workspace/Lucene-Solr-Tests-5.5-Java8/solr/build/solr-core/test/J0/temp/solr.security.BasicAuthIntegrationTest_DEAF2CE2912C3338-001/tempDir-001/node5]
   [junit4]   2> 893107 WARN  (jetty-launcher-742-thread-1) [    ] o.a.s.c.CoreContainer Couldn't add files from /x1/jenkins/jenkins-slave/workspace/Lucene-Solr-Tests-5.5-Java8/solr/build/solr-core/test/J0/temp/solr.security.BasicAuthIntegrationTest_DEAF2CE2912C3338-001/tempDir-001/node5/lib to classpath: /x1/jenkins/jenkins-slave/workspace/Lucene-Solr-Tests-5.5-Java8/solr/build/solr-core/test/J0/temp/solr.security.BasicAuthIntegrationTest_DEAF2CE2912C3338-001/tempDir-001/node5/lib
   [junit4]   2> 893107 INFO  (jetty-launcher-742-thread-1) [    ] o.a.s.h.c.HttpShardHandlerFactory created with socketTimeout : 90000,urlScheme : ,connTimeout : 15000,maxConnectionsPerHost : 20,maxConnections : 10000,corePoolSize : 0,maximumPoolSize : 2147483647,maxThreadIdleTime : 5,sizeOfQueue : -1,fairnessPolicy : false,useRetries : false,
   [junit4]   2> 893108 INFO  (jetty-launcher-742-thread-1) [    ] o.a.s.u.UpdateShardHandler Creating UpdateShardHandler HTTP client with params: socketTimeout=340000&connTimeout=45000&retry=true
   [junit4]   2> 893108 INFO  (jetty-launcher-742-thread-1) [    ] o.a.s.l.LogWatcher SLF4J impl is org.slf4j.impl.Log4jLoggerFactory
   [junit4]   2> 893108 INFO  (jetty-launcher-742-thread-1) [    ] o.a.s.l.LogWatcher Registering Log Listener [Log4j (org.slf4j.impl.Log4jLoggerFactory)]
   [junit4]   2> 893108 INFO  (jetty-launcher-742-thread-1) [    ] o.a.s.c.ZkContainer Zookeeper client=127.0.0.1:40701/solr
   [junit4]   2> 893108 INFO  (jetty-launcher-742-thread-1) [    ] o.a.s.c.ZkController zkHost includes chroot
   [junit4]   2> 893108 INFO  (jetty-launcher-742-thread-1) [    ] o.a.s.c.c.SolrZkClient Using default ZkCredentialsProvider
   [junit4]   2> 893110 INFO  (jetty-launcher-742-thread-3) [    ] o.e.j.s.h.ContextHandler Started o.e.j.s.ServletContextHandler@3612739f{/solr,null,AVAILABLE}
   [junit4]   2> 893111 INFO  (zkCallback-744-thread-1) [    ] o.a.s.c.c.ConnectionManager Watcher org.apache.solr.common.cloud.ConnectionManager@7bbc4fad name:ZooKeeperConnection Watcher:127.0.0.1:40701/solr got event WatchedEvent state:SyncConnected type:None path:null path:null type:None
   [junit4]   2> 893111 INFO  (jetty-launcher-742-thread-1) [    ] o.a.s.c.c.ConnectionManager Waiting for client to connect to ZooKeeper
   [junit4]   2> 893111 INFO  (jetty-launcher-742-thread-5) [    ] o.e.j.s.ServerConnector Started ServerConnector@5a860a7{HTTP/1.1}{127.0.0.1:40135}
   [junit4]   2> 893111 INFO  (jetty-launcher-742-thread-5) [    ] o.e.j.s.Server Started @895072ms
   [junit4]   2> 893111 INFO  (jetty-launcher-742-thread-5) [    ] o.a.s.c.s.e.JettySolrRunner Jetty properties: {hostContext=/solr, hostPort=40135}
   [junit4]   2> 893111 INFO  (jetty-launcher-742-thread-5) [    ] o.a.s.s.SolrDispatchFilter SolrDispatchFilter.init(): sun.misc.Launcher$AppClassLoader@73d16e93
   [junit4]   2> 893112 INFO  (jetty-launcher-742-thread-5) [    ] o.a.s.c.SolrResourceLoader new SolrResourceLoader for directory: '/x1/jenkins/jenkins-slave/workspace/Lucene-Solr-Tests-5.5-Java8/solr/build/solr-core/test/J0/temp/solr.security.BasicAuthIntegrationTest_DEAF2CE2912C3338-001/tempDir-001/node3'
   [junit4]   2> 893112 INFO  (jetty-launcher-742-thread-5) [    ] o.a.s.c.SolrResourceLoader JNDI not configured for solr (NoInitialContextEx)
   [junit4]   2> 893112 INFO  (jetty-launcher-742-thread-5) [    ] o.a.s.c.SolrResourceLoader solr home defaulted to 'solr/' (could not find system property or JNDI)
   [junit4]   2> 893112 INFO  (jetty-launcher-742-thread-3) [    ] o.e.j.s.ServerConnector Started ServerConnector@787ba6ba{HTTP/1.1}{127.0.0.1:60215}
   [junit4]   2> 893112 INFO  (jetty-launcher-742-thread-3) [    ] o.e.j.s.Server Started @895073ms
   [junit4]   2> 893112 INFO  (jetty-launcher-742-thread-3) [    ] o.a.s.c.s.e.JettySolrRunner Jetty properties: {hostContext=/solr, hostPort=60215}
   [junit4]   2> 893112 INFO  (jetty-launcher-742-thread-3) [    ] o.a.s.s.SolrDispatchFilter SolrDispatchFilter.init(): sun.misc.Launcher$AppClassLoader@73d16e93
   [junit4]   2> 893112 INFO  (jetty-launcher-742-thread-3) [    ] o.a.s.c.SolrResourceLoader new SolrResourceLoader for directory: '/x1/jenkins/jenkins-slave/workspace/Lucene-Solr-Tests-5.5-Java8/solr/build/solr-core/test/J0/temp/solr.security.BasicAuthIntegrationTest_DEAF2CE2912C3338-001/tempDir-001/node4'
   [junit4]   2> 893112 INFO  (jetty-launcher-742-thread-3) [    ] o.a.s.c.SolrResourceLoader JNDI not configured for solr (NoInitialContextEx)
   [junit4]   2> 893112 INFO  (jetty-launcher-742-thread-3) [    ] o.a.s.c.SolrResourceLoader solr home defaulted to 'solr/' (could not find system property or JNDI)
   [junit4]   2> 893112 INFO  (jetty-launcher-742-thread-3) [    ] o.a.s.c.c.SolrZkClient Using default ZkCredentialsProvider
   [junit4]   2> 893111 INFO  (jetty-launcher-742-thread-2) [    ] o.a.s.c.c.ConnectionManager Client is connected to ZooKeeper
   [junit4]   2> 893113 INFO  (jetty-launcher-742-thread-2) [    ] o.a.s.c.c.SolrZkClient Using default ZkACLProvider
   [junit4]   2> 893111 INFO  (jetty-launcher-742-thread-4) [    ] o.a.s.c.c.SolrZkClient Using default ZkCredentialsProvider
   [junit4]   2> 893113 INFO  (jetty-launcher-742-thread-2) [    ] o.a.s.s.SolrDispatchFilter solr.xml found in ZooKeeper. Loading...
   [junit4]   2> 893113 INFO  (jetty-launcher-742-thread-5) [    ] o.a.s.c.c.SolrZkClient Using default ZkCredentialsProvider
   [junit4]   2> 893117 INFO  (jetty-launcher-742-thread-3) [    ] o.a.s.c.c.ConnectionManager Waiting for client to connect to ZooKeeper
   [junit4]   2> 893121 INFO  (jetty-launcher-742-thread-5) [    ] o.a.s.c.c.ConnectionManager Waiting for client to connect to ZooKeeper
   [junit4]   2> 893122 INFO  (zkCallback-750-thread-1) [    ] o.a.s.c.c.ConnectionManager Watcher org.apache.solr.common.cloud.ConnectionManager@385a976f name:ZooKeeperConnection Watcher:127.0.0.1:40701/solr got event WatchedEvent state:SyncConnected type:None path:null path:null type:None
   [junit4]   2> 893122 INFO  (jetty-launcher-742-thread-3) [    ] o.a.s.c.c.ConnectionManager Client is connected to ZooKeeper
   [junit4]   2> 893122 INFO  (jetty-launcher-742-thread-3) [    ] o.a.s.c.c.SolrZkClient Using default ZkACLProvider
   [junit4]   2> 893122 INFO  (zkCallback-751-thread-1) [    ] o.a.s.c.c.ConnectionManager Watcher org.apache.solr.common.cloud.ConnectionManager@2dea68e4 name:ZooKeeperConnection Watcher:127.0.0.1:40701/solr got event WatchedEvent state:SyncConnected type:None path:null path:null type:None
   [junit4]   2> 893122 INFO  (jetty-launcher-742-thread-3) [    ] o.a.s.s.SolrDispatchFilter solr.xml found in ZooKeeper. Loading...
   [junit4]   2> 893122 INFO  (jetty-launcher-742-thread-5) [    ] o.a.s.c.c.ConnectionManager Client is connected to ZooKeeper
   [junit4]   2> 893122 INFO  (jetty-launcher-742-thread-5) [    ] o.a.s.c.c.SolrZkClient Using default ZkACLProvider
   [junit4]   2> 893125 INFO  (jetty-launcher-742-thread-5) [    ] o.a.s.s.SolrDispatchFilter solr.xml found in ZooKeeper. Loading...
   [junit4]   2> 893129 INFO  (jetty-launcher-742-thread-4) [    ] o.a.s.c.c.ConnectionManager Waiting for client to connect to ZooKeeper
   [junit4]   2> 893130 INFO  (jetty-launcher-742-thread-2) [    ] o.a.s.c.CorePropertiesLocator Config-defined core root directory: /x1/jenkins/jenkins-slave/workspace/Lucene-Solr-Tests-5.5-Java8/solr/build/solr-core/test/J0/temp/solr.security.BasicAuthIntegrationTest_DEAF2CE2912C3338-001/tempDir-001/node1/.
   [junit4]   2> 893130 INFO  (jetty-launcher-742-thread-2) [    ] o.a.s.c.CoreContainer New CoreContainer 479682014
   [junit4]   2> 893130 INFO  (jetty-launcher-742-thread-2) [    ] o.a.s.c.CoreContainer Loading cores into CoreContainer [instanceDir=/x1/jenkins/jenkins-slave/workspace/Lucene-Solr-Tests-5.5-Java8/solr/build/solr-core/test/J0/temp/solr.security.BasicAuthIntegrationTest_DEAF2CE2912C3338-001/tempDir-001/node1]
   [junit4]   2> 893130 WARN  (jetty-launcher-742-thread-2) [    ] o.a.s.c.CoreContainer Couldn't add files from /x1/jenkins/jenkins-slave/workspace/Lucene-Solr-Tests-5.5-Java8/solr/build/solr-core/test/J0/temp/solr.security.BasicAuthIntegrationTest_DEAF2CE2912C3338-001/tempDir-001/node1/lib to classpath: /x1/jenkins/jenkins-slave/workspace/Lucene-Solr-Tests-5.5-Java8/solr/build/solr-core/test/J0/temp/solr.security.BasicAuthIntegrationTest_DEAF2CE2912C3338-001/tempDir-001/node1/lib
   [junit4]   2> 893131 INFO  (jetty-launcher-742-thread-2) [    ] o.a.s.h.c.HttpShardHandlerFactory created with socketTimeout : 90000,urlScheme : ,connTimeout : 15000,maxConnectionsPerHost : 20,maxConnections : 10000,corePoolSize : 0,maximumPoolSize : 2147483647,maxThreadIdleTime : 5,sizeOfQueue : -1,fairnessPolicy : false,useRetries : false,
   [junit4]   2> 893131 INFO  (jetty-launcher-742-thread-2) [    ] o.a.s.u.UpdateShardHandler Creating UpdateShardHandler HTTP client with params: socketTimeout=340000&connTimeout=45000&retry=true
   [junit4]   2> 893131 INFO  (jetty-launcher-742-thread-2) [    ] o.a.s.l.LogWatcher SLF4J impl is org.slf4j.impl.Log4jLoggerFactory
   [junit4]   2> 893131 INFO  (jetty-launcher-742-thread-2) [    ] o.a.s.l.LogWatcher Registering Log Listener [Log4j (org.slf4j.impl.Log4jLoggerFactory)]
   [junit4]   2> 893131 INFO  (jetty-launcher-742-thread-2) [    ] o.a.s.c.ZkContainer Zookeeper client=127.0.0.1:40701/solr
   [junit4]   2> 893131 INFO  (jetty-launcher-742-thread-2) [    ] o.a.s.c.ZkController zkHost includes chroot
   [junit4]   2> 893132 INFO  (jetty-launcher-742-thread-2) [    ] o.a.s.c.c.SolrZkClient Using default ZkCredentialsProvider
   [junit4]   2> 893134 INFO  (jetty-launcher-742-thread-3) [    ] o.a.s.c.CorePropertiesLocator Config-defined core root directory: /x1/jenkins/jenkins-slave/workspace/Lucene-Solr-Tests-5.5-Java8/solr/build/solr-core/test/J0/temp/solr.security.BasicAuthIntegrationTest_DEAF2CE2912C3338-001/tempDir-001/node4/.
   [junit4]   2> 893134 INFO  (jetty-launcher-742-thread-3) [    ] o.a.s.c.CoreContainer New CoreContainer 887400633
   [junit4]   2> 893134 INFO  (jetty-launcher-742-thread-3) [    ] o.a.s.c.CoreContainer Loading cores into CoreContainer [instanceDir=/x1/jenkins/jenkins-slave/workspace/Lucene-Solr-Tests-5.5-Java8/solr/build/solr-core/test/J0/temp/solr.security.BasicAuthIntegrationTest_DEAF2CE2912C3338-001/tempDir-001/node4]
   [junit4]   2> 893134 WARN  (jetty-launcher-742-thread-3) [    ] o.a.s.c.CoreContainer Couldn't add files from /x1/jenkins/jenkins-slave/workspace/Lucene-Solr-Tests-5.5-Java8/solr/build/solr-core/test/J0/temp/solr.security.BasicAuthIntegrationTest_DEAF2CE2912C3338-001/tempDir-001/node4/lib to classpath: /x1/jenkins/jenkins-slave/workspace/Lucene-Solr-Tests-5.5-Java8/solr/build/solr-core/test/J0/temp/solr.security.BasicAuthIntegrationTest_DEAF2CE2912C3338-001/tempDir-001/node4/lib
   [junit4]   2> 893134 INFO  (jetty-launcher-742-thread-3) [    ] o.a.s.h.c.HttpShardHandlerFactory created with socketTimeout : 90000,urlScheme : ,connTimeout : 15000,maxConnectionsPerHost : 20,maxConnections : 10000,corePoolSize : 0,maximumPoolSize : 2147483647,maxThreadIdleTime : 5,sizeOfQueue : -1,fairnessPolicy : false,useRetries : false,
   [junit4]   2> 893135 INFO  (jetty-launcher-742-thread-3) [    ] o.a.s.u.UpdateShardHandler Creating UpdateShardHandler HTTP client with params: socketTimeout=340000&connTimeout=45000&retry=true
   [junit4]   2> 893135 INFO  (zkCallback-748-thread-1) [    ] o.a.s.c.c.ConnectionManager Watcher org.apache.solr.common.cloud.ConnectionManager@4e1bf898 name:ZooKeeperConnection Watcher:127.0.0.1:40701 got event WatchedEvent state:SyncConnected type:None path:null path:null type:None
   [junit4]   2> 893135 INFO  (jetty-launcher-742-thread-3) [    ] o.a.s.l.LogWatcher SLF4J impl is org.slf4j.impl.Log4jLoggerFactory
   [junit4]   2> 893135 INFO  (jetty-launcher-742-thread-3) [    ] o.a.s.l.LogWatcher Registering Log Listener [Log4j (org.slf4j.impl.Log4jLoggerFactory)]
   [junit4]   2> 893135 INFO  (jetty-launcher-742-thread-3) [    ] o.a.s.c.ZkContainer Zookeeper client=127.0.0.1:40701/solr
   [junit4]   2> 893135 INFO  (jetty-launcher-742-thread-3) [    ] o.a.s.c.ZkController zkHost includes chroot
   [junit4]   2> 893135 INFO  (jetty-launcher-742-thread-3) [    ] o.a.s.c.c.SolrZkClient Using default ZkCredentialsProvider
   [junit4]   2> 893135 INFO  (jetty-launcher-742-thread-1) [    ] o.a.s.c.c.ConnectionManager Client is connected to ZooKeeper
   [junit4]   2> 893137 INFO  (jetty-launcher-742-thread-2) [    ] o.a.s.c.c.ConnectionManager Waiting for client to connect to ZooKeeper
   [junit4]   2> 893135 INFO  (jetty-launcher-742-thread-5) [    ] o.a.s.c.CorePropertiesLocator Config-defined core root directory: /x1/jenkins/jenkins-slave/workspace/Lucene-Solr-Tests-5.5-Java8/solr/build/solr-core/test/J0/temp/solr.security.BasicAuthIntegrationTest_DEAF2CE2912C3338-001/tempDir-001/node3/.
   [junit4]   2> 893138 INFO  (jetty-launcher-742-thread-5) [    ] o.a.s.c.CoreContainer New CoreContainer 1119426844
   [junit4]   2> 893138 INFO  (jetty-launcher-742-thread-5) [    ] o.a.s.c.CoreContainer Loading cores into CoreContainer [instanceDir=/x1/jenkins/jenkins-slave/workspace/Lucene-Solr-Tests-5.5-Java8/solr/build/solr-core/test/J0/temp/solr.security.BasicAuthIntegrationTest_DEAF2CE2912C3338-001/tempDir-001/node3]
   [junit4]   2> 893138 INFO  (jetty-launcher-742-thread-1) [    ] o.a.s.c.c.SolrZkClient Using default ZkACLProvider
   [junit4]   2> 893138 WARN  (jetty-launcher-742-thread-5) [    ] o.a.s.c.CoreContainer Couldn't add files from /x1/jenkins/jenkins-slave/workspace/Lucene-Solr-Tests-5.5-Java8/solr/build/solr-core/test/J0/temp/solr.security.BasicAuthIntegrationTest_DEAF2CE2912C3338-001/tempDir-001/node3/lib to classpath: /x1/jenkins/jenkins-slave/workspace/Lucene-Solr-Tests-5.5-Java8/solr/build/solr-core/test/J0/temp/solr.security.BasicAuthIntegrationTest_DEAF2CE2912C3338-001/tempDir-001/node3/lib
   [junit4]   2> 893144 INFO  (jetty-launcher-742-thread-5) [    ] o.a.s.h.c.HttpShardHandlerFactory created with socketTimeout : 90000,urlScheme : ,connTimeout : 15000,maxConnectionsPerHost : 20,maxConnections : 10000,corePoolSize : 0,maximumPoolSize : 2147483647,maxThreadIdleTime : 5,sizeOfQueue : -1,fairnessPolicy : false,useRetries : false,
   [junit4]   2> 893144 INFO  (zkCallback-749-thread-1) [    ] o.a.s.c.c.ConnectionManager Watcher org.apache.solr.common.cloud.ConnectionManager@7f0b31ce name:ZooKeeperConnection Watcher:127.0.0.1:40701/solr got event WatchedEvent state:SyncConnected type:None path:null path:null type:None
   [junit4]   2> 893144 INFO  (jetty-launcher-742-thread-4) [    ] o.a.s.c.c.ConnectionManager Client is connected to ZooKeeper
   [junit4]   2> 893144 INFO  (jetty-launcher-742-thread-5) [    ] o.a.s.u.UpdateShardHandler Creating UpdateShardHandler HTTP client with params: socketTimeout=340000&connTimeout=45000&retry=true
   [junit4]   2> 893144 INFO  (jetty-launcher-742-thread-4) [    ] o.a.s.c.c.SolrZkClient Using default ZkACLProvider
   [junit4]   2> 893144 INFO  (jetty-launcher-742-thread-5) [    ] o.a.s.l.LogWatcher SLF4J impl is org.slf4j.impl.Log4jLoggerFactory
   [junit4]   2> 893144 INFO  (jetty-launcher-742-thread-5) [    ] o.a.s.l.LogWatcher Registering Log Listener [Log4j (org.slf4j.impl.Log4jLoggerFactory)]
   [junit4]   2> 893144 INFO  (jetty-launcher-742-thread-5) [    ] o.a.s.c.ZkContainer Zookeeper client=127.0.0.1:40701/solr
   [junit4]   2> 893144 INFO  (jetty-launcher-742-thread-5) [    ] o.a.s.c.ZkController zkHost includes chroot
   [junit4]   2> 893145 INFO  (jetty-launcher-742-thread-5) [    ] o.a.s.c.c.SolrZkClient Using default ZkCredentialsProvider
   [junit4]   2> 893141 INFO  (jetty-launcher-742-thread-3) [    ] o.a.s.c.c.ConnectionManager Waiting for client to connect to ZooKeeper
   [junit4]   2> 893145 INFO  (jetty-launcher-742-thread-1) [n:127.0.0.1:49051_solr    ] o.a.s.c.ZkController Added new OnReconnect listener org.apache.solr.cloud.ZkController$6@7ea2f880
   [junit4]   2> 893145 INFO  (jetty-launcher-742-thread-5) [    ] o.a.s.c.c.ConnectionManager Waiting for client to connect to ZooKeeper
   [junit4]   2> 893145 INFO  (jetty-launcher-742-thread-4) [    ] o.a.s.s.SolrDispatchFilter solr.xml found in ZooKeeper. Loading...
   [junit4]   2> 893146 INFO  (jetty-launcher-742-thread-1) [n:127.0.0.1:49051_solr    ] o.a.s.c.c.ConnectionManager Waiting for client to connect to ZooKeeper
   [junit4]   2> 893146 INFO  (zkCallback-754-thread-1) [    ] o.a.s.c.c.ConnectionManager Watcher org.apache.solr.common.cloud.ConnectionManager@1a634128 name:ZooKeeperConnection Watcher:127.0.0.1:40701 got event WatchedEvent state:SyncConnected type:None path:null path:null type:None
   [junit4]   2> 893146 INFO  (jetty-launcher-742-thread-2) [    ] o.a.s.c.c.ConnectionManager Client is connected to ZooKeeper
   [junit4]   2> 893146 INFO  (jetty-launcher-742-thread-2) [    ] o.a.s.c.c.SolrZkClient Using default ZkACLProvider
   [junit4]   2> 893149 INFO  (zkCallback-760-thread-1) [    ] o.a.s.c.c.ConnectionManager Watcher org.apache.solr.common.cloud.ConnectionManager@5bdae532 name:ZooKeeperConnection Watcher:127.0.0.1:40701 got event WatchedEvent state:SyncConnected type:None path:null path:null type:None
   [junit4]   2> 893149 INFO  (jetty-launcher-742-thread-5) [    ] o.a.s.c.c.ConnectionManager Client is connected to ZooKeeper
   [junit4]   2> 893149 INFO  (jetty-launcher-742-thread-5) [    ] o.a.s.c.c.SolrZkClient Using default ZkACLProvider
   [junit4]   2> 893157 INFO  (zkCallback-761-thread-1-processing-n:127.0.0.1:49051_solr) [n:127.0.0.1:49051_solr    ] o.a.s.c.c.ConnectionManager Watcher org.apache.solr.common.cloud.ConnectionManager@6ad0d961 name:ZooKeeperConnection Watcher:127.0.0.1:40701/solr got event WatchedEvent state:SyncConnected type:None path:null path:null type:None
   [junit4]   2> 893157 INFO  (jetty-launcher-742-thread-1) [n:127.0.0.1:49051_solr    ] o.a.s.c.c.ConnectionManager Client is connected to ZooKeeper
   [junit4]   2> 893158 INFO  (jetty-launcher-742-thread-2) [n:127.0.0.1:34824_solr    ] o.a.s.c.ZkController Added new OnReconnect listener org.apache.solr.cloud.ZkController$6@73bfdaa8
   [junit4]   2> 893158 INFO  (jetty-launcher-742-thread-5) [n:127.0.0.1:40135_solr    ] o.a.s.c.ZkController Added new OnReconnect listener org.apache.solr.cloud.ZkController$6@2c59c736
   [junit4]   2> 893158 INFO  (jetty-launcher-742-thread-4) [    ] o.a.s.c.CorePropertiesLocator Config-defined core root directory: /x1/jenkins/jenkins-slave/workspace/Lucene-Solr-Tests-5.5-Java8/solr/build/solr-core/test/J0/temp/solr.security.BasicAuthIntegrationTest_DEAF2CE2912C3338-001/tempDir-001/node2/.
   [junit4]   2> 893159 INFO  (jetty-launcher-742-thread-4) [    ] o.a.s.c.CoreContainer New CoreContainer 309609863
   [junit4]   2> 893159 INFO  (jetty-launcher-742-thread-4) [    ] o.a.s.c.CoreContainer Loading cores into CoreContainer [instanceDir=/x1/jenkins/jenkins-slave/workspace/Lucene-Solr-Tests-5.5-Java8/solr/build/solr-core/test/J0/temp/solr.security.BasicAuthIntegrationTest_DEAF2CE2912C3338-001/tempDir-001/node2]
   [junit4]   2> 893159 WARN  (jetty-launcher-742-thread-4) [    ] o.a.s.c.CoreContainer Couldn't add files from /x1/jenkins/jenkins-slave/workspace/Lucene-Solr-Tests-5.5-Java8/solr/build/solr-core/test/J0/temp/solr.security.BasicAuthIntegrationTest_DEAF2CE2912C3338-001/tempDir-001/node2/lib to classpath: /x1/jenkins/jenkins-slave/workspace/Lucene-Solr-Tests-5.5-Java8/solr/build/solr-core/test/J0/temp/solr.security.BasicAuthIntegrationTest_DEAF2CE2912C3338-001/tempDir-001/node2/lib
   [junit4]   2> 893159 INFO  (jetty-launcher-742-thread-4) [    ] o.a.s.h.c.HttpShardHandlerFactory created with socketTimeout : 90000,urlScheme : ,connTimeout : 15000,maxConnectionsPerHost : 20,maxConnections : 10000,corePoolSize : 0,maximumPoolSize : 2147483647,maxThreadIdleTime : 5,sizeOfQueue : -1,fairnessPolicy : false,useRetries : false,
   [junit4]   2> 893160 INFO  (jetty-launcher-742-thread-4) [    ] o.a.s.u.UpdateShardHandler Creating UpdateShardHandler HTTP client with params: socketTimeout=340000&connTimeout=45000&retry=true
   [junit4]   2> 893160 INFO  (jetty-launcher-742-thread-4) [    ] o.a.s.l.LogWatcher SLF4J impl is org.slf4j.impl.Log4jLoggerFactory
   [junit4]   2> 893160 INFO  (jetty-launcher-742-thread-4) [    ] o.a.s.l.LogWatcher Registering Log Listener [Log4j (org.slf4j.impl.Log4jLoggerFactory)]
   [junit4]   2> 893160 INFO  (jetty-launcher-742-thread-4) [    ] o.a.s.c.ZkContainer Zookeeper client=127.0.0.1:40701/solr
   [junit4]   2> 893160 INFO  (jetty-launcher-742-thread-4) [    ] o.a.s.c.ZkController zkHost includes chroot
   [junit4]   2> 893160 INFO  (jetty-launcher-742-thread-4) [    ] o.a.s.c.c.SolrZkClient Using default ZkCredentialsProvider
   [junit4]   2> 893160 INFO  (jetty-launcher-742-thread-4) [    ] o.a.s.c.c.ConnectionManager Waiting for client to connect to ZooKeeper
   [junit4]   2> 893160 INFO  (zkCallback-757-thread-1) [    ] o.a.s.c.c.ConnectionManager Watcher org.apache.solr.common.cloud.ConnectionManager@6e2ddcf6 name:ZooKeeperConnection Watcher:127.0.0.1:40701 got event WatchedEvent state:SyncConnected type:None path:null path:null type:None
   [junit4]   2> 893162 INFO  (jetty-launcher-742-thread-3) [    ] o.a.s.c.c.ConnectionManager Client is connected to ZooKeeper
   [junit4]   2> 893162 INFO  (jetty-launcher-742-thread-3) [    ] o.a.s.c.c.SolrZkClient Using default ZkACLProvider
   [junit4]   2> 893165 INFO  (jetty-launcher-742-thread-2) [n:127.0.0.1:34824_solr    ] o.a.s.c.c.ConnectionManager Waiting for client to connect to ZooKeeper
   [junit4]   2> 893166 INFO  (jetty-launcher-742-thread-3) [n:127.0.0.1:60215_solr    ] o.a.s.c.ZkController Added new OnReconnect listener org.apache.solr.cloud.ZkController$6@aab7b2a
   [junit4]   2> 893169 INFO  (jetty-launcher-742-thread-3) [n:127.0.0.1:60215_solr    ] o.a.s.c.c.ConnectionManager Waiting for client to connect to ZooKeeper
   [junit4]   2> 893169 INFO  (jetty-launcher-742-thread-5) [n:127.0.0.1:40135_solr    ] o.a.s.c.c.ConnectionManager Waiting for client to connect to ZooKeeper
   [junit4]   2> 893170 INFO  (jetty-launcher-742-thread-1) [n:127.0.0.1:49051_solr    ] o.a.s.c.c.SolrZkClient makePath: /overseer/queue
   [junit4]   2> 893170 INFO  (zkCallback-766-thread-1) [    ] o.a.s.c.c.ConnectionManager Watcher org.apache.solr.common.cloud.ConnectionManager@eac4de4 name:ZooKeeperConnection Watcher:127.0.0.1:40701 got event WatchedEvent state:SyncConnected type:None path:null path:null type:None
   [junit4]   2> 893170 INFO  (zkCallback-762-thread-1-processing-n:127.0.0.1:34824_solr) [n:127.0.0.1:34824_solr    ] o.a.s.c.c.ConnectionManager Watcher org.apache.solr.common.cloud.ConnectionManager@6c58ceb name:ZooKeeperConnection Watcher:127.0.0.1:40701/solr got event WatchedEvent state:SyncConnected type:None path:null path:null type:None
   [junit4]   2> 893170 INFO  (jetty-launcher-742-thread-2) [n:127.0.0.1:34824_solr    ] o.a.s.c.c.ConnectionManager Client is connected to ZooKeeper
   [junit4]   2> 893170 INFO  (jetty-launcher-742-thread-4) [    ] o.a.s.c.c.ConnectionManager Client is connected to ZooKeeper
   [junit4]   2> 893170 INFO  (jetty-launcher-742-thread-4) [    ] o.a.s.c.c.SolrZkClient Using default ZkACLProvider
   [junit4]   2> 893171 INFO  (zkCallback-767-thread-1-processing-n:127.0.0.1:60215_solr) [n:127.0.0.1:60215_solr    ] o.a.s.c.c.ConnectionManager Watcher org.apache.solr.common.cloud.ConnectionManager@3bb81338 name:ZooKeeperConnection Watcher:127.0.0.1:40701/solr got event WatchedEvent state:SyncConnected type:None path:null path:null type:None
   [junit4]   2> 893171 INFO  (zkCallback-763-thread-1-processing-n:127.0.0.1:40135_solr) [n:127.0.0.1:40135_solr    ] o.a.s.c.c.ConnectionManager Watcher org.apache.solr.common.cloud.ConnectionManager@6b5b8450 name:ZooKeeperConnection Watcher:127.0.0.1:40701/solr got event WatchedEvent state:SyncConnected type:None path:null path:null type:None
   [junit4]   2> 893171 INFO  (jetty-launcher-742-thread-3) [n:127.0.0.1:60215_solr    ] o.a.s.c.c.ConnectionManager Client is connected to ZooKeeper
   [junit4]   2> 893171 INFO  (jetty-launcher-742-thread-5) [n:127.0.0.1:40135_solr    ] o.a.s.c.c.ConnectionManager Client is connected to ZooKeeper
   [junit4]   2> 893175 INFO  (jetty-launcher-742-thread-4) [n:127.0.0.1:49107_solr    ] o.a.s.c.ZkController Added new OnReconnect listener org.apache.solr.cloud.ZkController$6@71a79c04
   [junit4]   2> 893175 WARN  (NIOServerCxn.Factory:0.0.0.0/0.0.0.0:0) [    ] o.a.z.s.NIOServerCnxn caught end of stream exception
   [junit4]   2> EndOfStreamException: Unable to read additional data from client sessionid 0x1545aeb0788000c, likely client has closed socket
   [junit4]   2> 	at org.apache.zookeeper.server.NIOServerCnxn.doIO(NIOServerCnxn.java:228)
   [junit4]   2> 	at org.apache.zookeeper.server.NIOServerCnxnFactory.run(NIOServerCnxnFactory.java:208)
   [junit4]   2> 	at java.lang.Thread.run(Thread.java:745)
   [junit4]   2> 893177 INFO  (jetty-launcher-742-thread-4) [n:127.0.0.1:49107_solr    ] o.a.s.c.c.ConnectionManager Waiting for client to connect to ZooKeeper
   [junit4]   2> 893183 INFO  (jetty-launcher-742-thread-3) [n:127.0.0.1:60215_solr    ] o.a.s.c.c.SolrZkClient makePath: /overseer/collection-queue-work
   [junit4]   2> 893183 INFO  (jetty-launcher-742-thread-5) [n:127.0.0.1:40135_solr    ] o.a.s.c.c.SolrZkClient makePath: /overseer/collection-queue-work
   [junit4]   2> 893183 INFO  (jetty-launcher-742-thread-1) [n:127.0.0.1:49051_solr    ] o.a.s.c.c.SolrZkClient makePath: /overseer/collection-queue-work
   [junit4]   2> 893183 INFO  (jetty-launcher-742-thread-2) [n:127.0.0.1:34824_solr    ] o.a.s.c.c.SolrZkClient makePath: /overseer/collection-queue-work
   [junit4]   2> 893187 INFO  (jetty-launcher-742-thread-2) [n:127.0.0.1:34824_solr    ] o.a.s.c.c.SolrZkClient makePath: /overseer/collection-map-running
   [junit4]   2> 893187 INFO  (jetty-launcher-742-thread-5) [n:127.0.0.1:40135_solr    ] o.a.s.c.c.SolrZkClient makePath: /overseer/collection-map-running
   [junit4]   2> 893187 INFO  (jetty-launcher-742-thread-1) [n:127.0.0.1:49051_solr    ] o.a.s.c.c.SolrZkClient makePath: /overseer/collection-map-running
   [junit4]   2> 893187 INFO  (jetty-launcher-742-thread-3) [n:127.0.0.1:60215_solr    ] o.a.s.c.c.SolrZkClient makePath: /overseer/collection-map-running
   [junit4]   2> 893189 INFO  (zkCallback-768-thread-1-processing-n:127.0.0.1:49107_solr) [n:127.0.0.1:49107_solr    ] o.a.s.c.c.ConnectionManager Watcher org.apache.solr.common.cloud.ConnectionManager@7798b1ef name:ZooKeeperConnection Watcher:127.0.0.1:40701/solr got event WatchedEvent state:SyncConnected type:None path:null path:null type:None
   [junit4]   2> 893189 INFO  (jetty-launcher-742-thread-4) [n:127.0.0.1:49107_solr    ] o.a.s.c.c.ConnectionManager Client is connected to ZooKeeper
   [junit4]   2> 893190 INFO  (jetty-launcher-742-thread-2) [n:127.0.0.1:34824_solr    ] o.a.s.c.c.SolrZkClient makePath: /overseer/collection-map-completed
   [junit4]   2> 893190 INFO  (jetty-launcher-742-thread-5) [n:127.0.0.1:40135_solr    ] o.a.s.c.c.SolrZkClient makePath: /overseer/collection-map-completed
   [junit4]   2> 893191 INFO  (jetty-launcher-742-thread-3) [n:127.0.0.1:60215_solr    ] o.a.s.c.c.SolrZkClient makePath: /overseer/collection-map-completed
   [junit4]   2> 893191 INFO  (jetty-launcher-742-thread-1) [n:127.0.0.1:49051_solr    ] o.a.s.c.c.SolrZkClient makePath: /overseer/collection-map-completed
   [junit4]   2> 893194 INFO  (jetty-launcher-742-thread-2) [n:127.0.0.1:34824_solr    ] o.a.s.c.c.SolrZkClient makePath: /overseer/collection-map-failure
   [junit4]   2> 893194 INFO  (jetty-launcher-742-thread-3) [n:127.0.0.1:60215_solr    ] o.a.s.c.c.SolrZkClient makePath: /overseer/collection-map-failure
   [junit4]   2> 893194 INFO  (jetty-launcher-742-thread-5) [n:127.0.0.1:40135_solr    ] o.a.s.c.c.SolrZkClient makePath: /overseer/collection-map-failure
   [junit4]   2> 893194 INFO  (jetty-launcher-742-thread-1) [n:127.0.0.1:49051_solr    ] o.a.s.c.c.SolrZkClient makePath: /overseer/collection-map-failure
   [junit4]   2> 893197 INFO  (jetty-launcher-742-thread-2) [n:127.0.0.1:34824_solr    ] o.a.s.c.c.SolrZkClient makePath: /live_nodes
   [junit4]   2> 893197 INFO  (jetty-launcher-742-thread-3) [n:127.0.0.1:60215_solr    ] o.a.s.c.c.SolrZkClient makePath: /live_nodes
   [junit4]   2> 893197 INFO  (jetty-launcher-742-thread-1) [n:127.0.0.1:49051_solr    ] o.a.s.c.c.SolrZkClient makePath: /live_nodes
   [junit4]   2> 893197 INFO  (jetty-launcher-742-thread-5) [n:127.0.0.1:40135_solr    ] o.a.s.c.c.SolrZkClient makePath: /live_nodes
   [junit4]   2> 893198 INFO  (jetty-launcher-742-thread-3) [n:127.0.0.1:60215_solr    ] o.a.s.c.c.SolrZkClient makePath: /collections
   [junit4]   2> 893198 INFO  (jetty-launcher-742-thread-4) [n:127.0.0.1:49107_solr    ] o.a.s.c.c.SolrZkClient makePath: /collections
   [junit4]   2> 893198 INFO  (jetty-launcher-742-thread-5) [n:127.0.0.1:40135_solr    ] o.a.s.c.c.SolrZkClient makePath: /collections
   [junit4]   2> 893199 INFO  (jetty-launcher-742-thread-1) [n:127.0.0.1:49051_solr    ] o.a.s.c.c.SolrZkClient makePath: /collections
   [junit4]   2> 893199 INFO  (jetty-launcher-742-thread-2) [n:127.0.0.1:34824_solr    ] o.a.s.c.c.SolrZkClient makePath: /collections
   [junit4]   2> 893200 INFO  (jetty-launcher-742-thread-3) [n:127.0.0.1:60215_solr    ] o.a.s.c.c.SolrZkClient makePath: /aliases.json
   [junit4]   2> 893200 INFO  (jetty-launcher-742-thread-1) [n:127.0.0.1:49051_solr    ] o.a.s.c.c.SolrZkClient makePath: /aliases.json
   [junit4]   2> 893200 INFO  (jetty-launcher-742-thread-5) [n:127.0.0.1:40135_solr    ] o.a.s.c.c.SolrZkClient makePath: /aliases.json
   [junit4]   2> 893200 INFO  (jetty-launcher-742-thread-2) [n:127.0.0.1:34824_solr    ] o.a.s.c.c.SolrZkClient makePath: /aliases.json
   [junit4]   2> 893200 INFO  (jetty-launcher-742-thread-4) [n:127.0.0.1:49107_solr    ] o.a.s.c.c.SolrZkClient makePath: /aliases.json
   [junit4]   2> 893202 INFO  (jetty-launcher-742-thread-5) [n:127.0.0.1:40135_solr    ] o.a.s.c.c.SolrZkClient makePath: /clusterstate.json
   [junit4]   2> 893202 INFO  (jetty-launcher-742-thread-2) [n:127.0.0.1:34824_solr    ] o.a.s.c.c.SolrZkClient makePath: /clusterstate.json
   [junit4]   2> 893202 INFO  (jetty-launcher-742-thread-1) [n:127.0.0.1:49051_solr    ] o.a.s.c.c.SolrZkClient makePath: /clusterstate.json
   [junit4]   2> 893202 INFO  (jetty-launcher-742-thread-3) [n:127.0.0.1:60215_solr    ] o.a.s.c.c.SolrZkClient makePath: /clusterstate.json
   [junit4]   2> 893202 INFO  (jetty-launcher-742-thread-4) [n:127.0.0.1:49107_solr    ] o.a.s.c.c.SolrZkClient makePath: /clusterstate.json
   [junit4]   2> 893203 INFO  (jetty-launcher-742-thread-5) [n:127.0.0.1:40135_solr    ] o.a.s.c.c.SolrZkClient makePath: /security.json
   [junit4]   2> 893203 INFO  (jetty-launcher-742-thread-1) [n:127.0.0.1:49051_solr    ] o.a.s.c.c.SolrZkClient makePath: /security.json
   [junit4]   2> 893204 INFO  (jetty-launcher-742-thread-4) [n:127.0.0.1:49107_solr    ] o.a.s.c.c.SolrZkClient makePath: /security.json
   [junit4]   2> 893204 INFO  (jetty-launcher-742-thread-3) [n:127.0.0.1:60215_solr    ] o.a.s.c.c.SolrZkClient makePath: /security.json
   [junit4]   2> 893204 INFO  (jetty-launcher-742-thread-2) [n:127.0.0.1:34824_solr    ] o.a.s.c.c.SolrZkClient makePath: /security.json
   [junit4]   2> 893204 INFO  (jetty-launcher-742-thread-5) [n:127.0.0.1:40135_solr    ] o.a.s.c.ZkController Register node as live in ZooKeeper:/live_nodes/127.0.0.1:40135_solr
   [junit4]   2> 893205 INFO  (jetty-launcher-742-thread-3) [n:127.0.0.1:60215_solr    ] o.a.s.c.ZkController Register node as live in ZooKeeper:/live_nodes/127.0.0.1:60215_solr
   [junit4]   2> 893205 INFO  (jetty-launcher-742-thread-4) [n:127.0.0.1:49107_solr    ] o.a.s.c.ZkController Register node as live in ZooKeeper:/live_nodes/127.0.0.1:49107_solr
   [junit4]   2> 893205 INFO  (jetty-launcher-742-thread-2) [n:127.0.0.1:34824_solr    ] o.a.s.c.ZkController Register node as live in ZooKeeper:/live_nodes/127.0.0.1:34824_solr
   [junit4]   2> 893205 INFO  (jetty-launcher-742-thread-1) [n:127.0.0.1:49051_solr    ] o.a.s.c.ZkController Register node as live in ZooKeeper:/live_nodes/127.0.0.1:49051_solr
   [junit4]   2> 893205 INFO  (jetty-launcher-742-thread-5) [n:127.0.0.1:40135_solr    ] o.a.s.c.c.SolrZkClient makePath: /live_nodes/127.0.0.1:40135_solr
   [junit4]   2> 893206 INFO  (jetty-launcher-742-thread-3) [n:127.0.0.1:60215_solr    ] o.a.s.c.c.SolrZkClient makePath: /live_nodes/127.0.0.1:60215_solr
   [junit4]   2> 893206 INFO  (jetty-launcher-742-thread-4) [n:127.0.0.1:49107_solr    ] o.a.s.c.c.SolrZkClient makePath: /live_nodes/127.0.0.1:49107_solr
   [junit4]   2> 893206 INFO  (jetty-launcher-742-thread-2) [n:127.0.0.1:34824_solr    ] o.a.s.c.c.SolrZkClient makePath: /live_nodes/127.0.0.1:34824_solr
   [junit4]   2> 893206 INFO  (jetty-launcher-742-thread-1) [n:127.0.0.1:49051_solr    ] o.a.s.c.c.SolrZkClient makePath: /live_nodes/127.0.0.1:49051_solr
   [junit4]   2> 893208 INFO  (jetty-launcher-742-thread-3) [n:127.0.0.1:60215_solr    ] o.a.s.c.c.SolrZkClient makePath: /overseer_elect
   [junit4]   2> 893208 INFO  (jetty-launcher-742-thread-4) [n:127.0.0.1:49107_solr    ] o.a.s.c.c.SolrZkClient makePath: /overseer_elect
   [junit4]   2> 893208 INFO  (jetty-launcher-742-thread-5) [n:127.0.0.1:40135_solr    ] o.a.s.c.c.SolrZkClient makePath: /overseer_elect
   [junit4]   2> 893208 INFO  (jetty-launcher-742-thread-2) [n:127.0.0.1:34824_solr    ] o.a.s.c.c.SolrZkClient makePath: /overseer_elect
   [junit4]   2> 893209 INFO  (jetty-launcher-742-thread-1) [n:127.0.0.1:49051_solr    ] o.a.s.c.c.SolrZkClient makePath: /overseer_elect
   [junit4]   2> 893210 INFO  (jetty-launcher-742-thread-4) [n:127.0.0.1:49107_solr    ] o.a.s.c.c.SolrZkClient makePath: /overseer_elect/election
   [junit4]   2> 893210 INFO  (jetty-launcher-742-thread-2) [n:127.0.0.1:34824_solr    ] o.a.s.c.c.SolrZkClient makePath: /overseer_elect/election
   [junit4]   2> 893210 INFO  (jetty-launcher-742-thread-1) [n:127.0.0.1:49051_solr    ] o.a.s.c.c.SolrZkClient makePath: /overseer_elect/election
   [junit4]   2> 893210 INFO  (jetty-launcher-742-thread-5) [n:127.0.0.1:40135_solr    ] o.a.s.c.c.SolrZkClient makePath: /overseer_elect/election
   [junit4]   2> 893210 INFO  (jetty-launcher-742-thread-3) [n:127.0.0.1:60215_solr    ] o.a.s.c.c.SolrZkClient makePath: /overseer_elect/election
   [junit4]   2> 893213 INFO  (jetty-launcher-742-thread-1) [n:127.0.0.1:49051_solr    ] o.a.s.c.Overseer Overseer (id=null) closing
   [junit4]   2> 893213 INFO  (jetty-launcher-742-thread-4) [n:127.0.0.1:49107_solr    ] o.a.s.c.Overseer Overseer (id=null) closing
   [junit4]   2> 893213 INFO  (jetty-launcher-742-thread-5) [n:127.0.0.1:40135_solr    ] o.a.s.c.Overseer Overseer (id=null) closing
   [junit4]   2> 893214 INFO  (jetty-launcher-742-thread-2) [n:127.0.0.1:34824_solr    ] o.a.s.c.Overseer Overseer (id=null) closing
   [junit4]   2> 893214 INFO  (jetty-launcher-742-thread-1) [n:127.0.0.1:49051_solr    ] o.a.s.c.LeaderElector Joined leadership election with path: /overseer_elect/election/95801457571790857-127.0.0.1:49051_solr-n_0000000000
   [junit4]   2> 893214 INFO  (jetty-launcher-742-thread-5) [n:127.0.0.1:40135_solr    ] o.a.s.c.LeaderElector Joined leadership election with path: /overseer_elect/election/95801457571790862-127.0.0.1:40135_solr-n_0000000001
   [junit4]   2> 893214 INFO  (jetty-launcher-742-thread-3) [n:127.0.0.1:60215_solr    ] o.a.s.c.Overseer Overseer (id=null) closing
   [junit4]   2> 893214 INFO  (jetty-launcher-742-thread-4) [n:127.0.0.1:49107_solr    ] o.a.s.c.LeaderElector Joined leadership election with path: /overseer_elect/election/95801457571790863-127.0.0.1:49107_solr-n_0000000002
   [junit4]   2> 893215 INFO  (jetty-launcher-742-thread-2) [n:127.0.0.1:34824_solr    ] o.a.s.c.LeaderElector Joined leadership election with path: /overseer_elect/election/95801457571790859-127.0.0.1:34824_solr-n_0000000003
   [junit4]   2> 893215 INFO  (jetty-launcher-742-thread-1) [n:127.0.0.1:49051_solr    ] o.a.s.c.OverseerElectionContext I am going to be the leader 127.0.0.1:49051_solr
   [junit4]   2> 893215 INFO  (jetty-launcher-742-thread-1) [n:127.0.0.1:49051_solr    ] o.a.s.c.c.SolrZkClient makePath: /overseer_elect/leader
   [junit4]   2> 893215 INFO  (jetty-launcher-742-thread-3) [n:127.0.0.1:60215_solr    ] o.a.s.c.LeaderElector Joined leadership election with path: /overseer_elect/election/95801457571790861-127.0.0.1:60215_solr-n_0000000004
   [junit4]   2> 893216 INFO  (jetty-launcher-742-thread-5) [n:127.0.0.1:40135_solr    ] o.a.s.c.LeaderElector Watching path /overseer_elect/election/95801457571790857-127.0.0.1:49051_solr-n_0000000000 to know if I could be the leader
   [junit4]   2> 893216 INFO  (jetty-launcher-742-thread-5) [n:127.0.0.1:40135_solr    ] o.a.s.c.c.ZkStateReader Updating cluster state from ZooKeeper... 
   [junit4]   2> 893216 INFO  (jetty-launcher-742-thread-2) [n:127.0.0.1:34824_solr    ] o.a.s.c.LeaderElector Watching path /overseer_elect/election/95801457571790863-127.0.0.1:49107_solr-n_0000000002 to know if I could be the leader
   [junit4]   2> 893216 INFO  (jetty-launcher-742-thread-2) [n:127.0.0.1:34824_solr    ] o.a.s.c.c.ZkStateReader Updating cluster state from ZooKeeper... 
   [junit4]   2> 893216 INFO  (jetty-launcher-742-thread-4) [n:127.0.0.1:49107_solr    ] o.a.s.c.LeaderElector Watching path /overseer_elect/election/95801457571790862-127.0.0.1:40135_solr-n_0000000001 to know if I could be the leader
   [junit4]   2> 893216 INFO  (jetty-launcher-742-thread-4) [n:127.0.0.1:49107_solr    ] o.a.s.c.c.ZkStateReader Updating cluster state from ZooKeeper... 
   [junit4]   2> 893217 INFO  (jetty-launcher-742-thread-3) [n:127.0.0.1:60215_solr    ] o.a.s.c.LeaderElector Watching path /overseer_elect/election/95801457571790859-127.0.0.1:34824_solr-n_0000000003 to know if I could be the leader
   [junit4]   2> 893217 INFO  (jetty-launcher-742-thread-3) [n:127.0.0.1:60215_solr    ] o.a.s.c.c.ZkStateReader Updating cluster state from ZooKeeper... 
   [junit4]   2> 893217 INFO  (jetty-launcher-742-thread-1) [n:127.0.0.1:49051_solr    ] o.a.s.c.Overseer Overseer (id=95801457571790857-127.0.0.1:49051_solr-n_0000000000) starting
   [junit4]   2> 893221 INFO  (jetty-launcher-742-thread-1) [n:127.0.0.1:49051_solr    ] o.a.s.c.c.SolrZkClient makePath: /overseer/queue-work
   [junit4]   2> 893229 INFO  (jetty-launcher-742-thread-2) [n:127.0.0.1:34824_solr    ] o.a.s.c.CoreContainer Security conf doesn't exist. Skipping setup for authorization module.
   [junit4]   2> 893229 INFO  (jetty-launcher-742-thread-2) [n:127.0.0.1:34824_solr    ] o.a.s.c.CoreContainer No authentication plugin used.
   [junit4]   2> 893230 INFO  (jetty-launcher-742-thread-2) [n:127.0.0.1:34824_solr    ] o.a.s.c.CorePropertiesLocator Looking for core definitions underneath /x1/jenkins/jenkins-slave/workspace/Lucene-Solr-Tests-5.5-Java8/solr/build/solr-core/test/J0/temp/solr.security.BasicAuthIntegrationTest_DEAF2CE2912C3338-001/tempDir-001/node1/.
   [junit4]   2> 893230 INFO  (jetty-launcher-742-thread-2) [n:127.0.0.1:34824_solr    ] o.a.s.c.CorePropertiesLocator Found 0 core definitions
   [junit4]   2> 893236 INFO  (jetty-launcher-742-thread-5) [n:127.0.0.1:40135_solr    ] o.a.s.c.CoreContainer Security conf doesn't exist. Skipping setup for authorization module.
   [junit4]   2> 893236 INFO  (jetty-launcher-742-thread-5) [n:127.0.0.1:40135_solr    ] o.a.s.c.CoreContainer No authentication plugin used.
   [junit4]   2> 893236 INFO  (jetty-launcher-742-thread-5) [n:127.0.0.1:40135_solr    ] o.a.s.c.CorePropertiesLocator Looking for core definitions underneath /x1/jenkins/jenkins-slave/workspace/Lucene-Solr-Tests-5.5-Java8/solr/build/solr-core/test/J0/temp/solr.security.BasicAuthIntegrationTest_DEAF2CE2912C3338-001/tempDir-001/node3/.
   [junit4]   2> 893236 INFO  (jetty-launcher-742-thread-5) [n:127.0.0.1:40135_solr    ] o.a.s.c.CorePropertiesLocator Found 0 core definitions
   [junit4]   2> 893236 INFO  (jetty-launcher-742-thread-3) [n:127.0.0.1:60215_solr    ] o.a.s.c.CoreContainer Security conf doesn't exist. Skipping setup for authorization module.
   [junit4]   2> 893236 INFO  (jetty-launcher-742-thread-3) [n:127.0.0.1:60215_solr    ] o.a.s.c.CoreContainer No authentication plugin used.
   [junit4]   2> 893237 INFO  (jetty-launcher-742-thread-3) [n:127.0.0.1:60215_solr    ] o.a.s.c.CorePropertiesLocator Looking for core definitions underneath /x1/jenkins/jenkins-slave/workspace/Lucene-Solr-Tests-5.5-Java8/solr/build/solr-core/test/J0/temp/solr.security.BasicAuthIntegrationTest_DEAF2CE2912C3338-001/tempDir-001/node4/.
   [junit4]   2> 893237 INFO  (jetty-launcher-742-thread-3) [n:127.0.0.1:60215_solr    ] o.a.s.c.CorePropertiesLocator Found 0 core definitions
   [junit4]   2> 893237 INFO  (jetty-launcher-742-thread-2) [n:127.0.0.1:34824_solr    ] o.a.s.s.SolrDispatchFilter user.dir=/x1/jenkins/jenkins-slave/workspace/Lucene-Solr-Tests-5.5-Java8/solr/build/solr-core/test/J0
   [junit4]   2> 893237 INFO  (jetty-launcher-742-thread-2) [n:127.0.0.1:34824_solr    ] o.a.s.s.SolrDispatchFilter SolrDispatchFilter.init() done
   [junit4]   2> 893242 INFO  (jetty-launcher-742-thread-3) [n:127.0.0.1:60215_solr    ] o.a.s.s.SolrDispatchFilter user.dir=/x1/jenkins/jenkins-slave/workspace/Lucene-Solr-Tests-5.5-Java8/solr/build/solr-core/test/J0
   [junit4]   2> 893242 INFO  (jetty-launcher-742-thread-3) [n:127.0.0.1:60215_solr    ] o.a.s.s.SolrDispatchFilter SolrDispatchFilter.init() done
   [junit4]   2> 893243 INFO  (jetty-launcher-742-thread-5) [n:127.0.0.1:40135_solr    ] o.a.s.s.SolrDispatchFilter user.dir=/x1/jenkins/jenkins-slave/workspace/Lucene-Solr-Tests-5.5-Java8/solr/build/solr-core/test/J0
   [junit4]   2> 893243 INFO  (jetty-launcher-742-thread-5) [n:127.0.0.1:40135_solr    ] o.a.s.s.SolrDispatchFilter SolrDispatchFilter.init() done
   [junit4]   2> 893244 INFO  (jetty-launcher-742-thread-1) [n:127.0.0.1:49051_solr    ] o.a.s.c.OverseerAutoReplicaFailoverThread Starting OverseerAutoReplicaFailoverThread autoReplicaFailoverWorkLoopDelay=10000 autoReplicaFailoverWaitAfterExpiration=30000 autoReplicaFailoverBadNodeExpiration=60000
   [junit4]   2> 893245 INFO  (OverseerStateUpdate-95801457571790857-127.0.0.1:49051_solr-n_0000000000) [n:127.0.0.1:49051_solr    ] o.a.s.c.Overseer Starting to work on the main queue
   [junit4]   2> 893246 INFO  (OverseerStateUpdate-95801457571790857-127.0.0.1:49051_solr-n_0000000000) [n:127.0.0.1:49051_solr    ] o.a.s.c.c.ZkStateReader Updating cluster state from ZooKeeper... 
   [junit4]   2> 893249 INFO  (OverseerCollectionConfigSetProcessor-95801457571790857-127.0.0.1:49051_solr-n_0000000000) [n:127.0.0.1:49051_solr    ] o.a.s.c.OverseerTaskProcessor Process current queue of overseer operations
   [junit4]   2> 893260 INFO  (jetty-launcher-742-thread-1) [n:127.0.0.1:49051_solr    ] o.a.s.c.c.ZkStateReader Updating cluster state from ZooKeeper... 
   [junit4]   2> 893261 INFO  (jetty-launcher-742-thread-4) [n:127.0.0.1:49107_solr    ] o.a.s.c.CoreContainer Security conf doesn't exist. Skipping setup for authorization module.
   [junit4]   2> 893261 INFO  (jetty-launcher-742-thread-4) [n:127.0.0.1:49107_solr    ] o.a.s.c.CoreContainer No authentication plugin used.
   [junit4]   2> 893262 INFO  (jetty-launcher-742-thread-4) [n:127.0.0.1:49107_solr    ] o.a.s.c.CorePropertiesLocator Looking for core definitions underneath /x1/jenkins/jenkins-slave/workspace/Lucene-Solr-Tests-5.5-Java8/solr/build/solr-core/test/J0/temp/solr.security.BasicAuthIntegrationTest_DEAF2CE2912C3338-001/tempDir-001/node2/.
   [junit4]   2> 893262 INFO  (jetty-launcher-742-thread-4) [n:127.0.0.1:49107_solr    ] o.a.s.c.CorePropertiesLocator Found 0 core definitions
   [junit4]   2> 893262 INFO  (jetty-launcher-742-thread-4) [n:127.0.0.1:49107_solr    ] o.a.s.s.SolrDispatchFilter user.dir=/x1/jenkins/jenkins-slave/workspace/Lucene-Solr-Tests-5.5-Java8/solr/build/solr-core/test/J0
   [junit4]   2> 893262 INFO  (jetty-launcher-742-thread-4) [n:127.0.0.1:49107_solr    ] o.a.s.s.SolrDispatchFilter SolrDispatchFilter.init() done
   [junit4]   2> 893269 INFO  (jetty-launcher-742-thread-1) [n:127.0.0.1:49051_solr    ] o.a.s.c.CoreContainer Security conf doesn't exist. Skipping setup for authorization module.
   [junit4]   2> 893269 INFO  (jetty-launcher-742-thread-1) [n:127.0.0.1:49051_solr    ] o.a.s.c.CoreContainer No authentication plugin used.
   [junit4]   2> 893269 INFO  (jetty-launcher-742-thread-1) [n:127.0.0.1:49051_solr    ] o.a.s.c.CorePropertiesLocator Looking for core definitions underneath /x1/jenkins/jenkins-slave/workspace/Lucene-Solr-Tests-5.5-Java8/solr/build/solr-core/test/J0/temp/solr.security.BasicAuthIntegrationTest_DEAF2CE2912C3338-001/tempDir-001/node5/.
   [junit4]   2> 893269 INFO  (jetty-launcher-742-thread-1) [n:127.0.0.1:49051_solr    ] o.a.s.c.CorePropertiesLocator Found 0 core definitions
   [junit4]   2> 893270 INFO  (jetty-launcher-742-thread-1) [n:127.0.0.1:49051_solr    ] o.a.s.s.SolrDispatchFilter user.dir=/x1/jenkins/jenkins-slave/workspace/Lucene-Solr-Tests-5.5-Java8/solr/build/solr-core/test/J0
   [junit4]   2> 893270 INFO  (jetty-launcher-742-thread-1) [n:127.0.0.1:49051_solr    ] o.a.s.s.SolrDispatchFilter SolrDispatchFilter.init() done
   [junit4]   2> 893270 INFO  (TEST-BasicAuthIntegrationTest.testBasics-seed#[DEAF2CE2912C3338]) [    ] o.a.s.c.c.SolrZkClient Using default ZkCredentialsProvider
   [junit4]   2> 893270 INFO  (TEST-BasicAuthIntegrationTest.testBasics-seed#[DEAF2CE2912C3338]) [    ] o.a.s.c.c.ConnectionManager Waiting for client to connect to ZooKeeper
   [junit4]   2> 893271 INFO  (zkCallback-769-thread-1) [    ] o.a.s.c.c.ConnectionManager Watcher org.apache.solr.common.cloud.ConnectionManager@49ec8062 name:ZooKeeperConnection Watcher:127.0.0.1:40701 got event WatchedEvent state:SyncConnected type:None path:null path:null type:None
   [junit4]   2> 893271 INFO  (TEST-BasicAuthIntegrationTest.testBasics-seed#[DEAF2CE2912C3338]) [    ] o.a.s.c.c.ConnectionManager Client is connected to ZooKeeper
   [junit4]   2> 893272 INFO  (TEST-BasicAuthIntegrationTest.testBasics-seed#[DEAF2CE2912C3338]) [    ] o.a.s.c.c.SolrZkClient Using default ZkACLProvider
   [junit4]   2> 893284 INFO  (TEST-BasicAuthIntegrationTest.testBasics-seed#[DEAF2CE2912C3338]) [    ] o.e.j.s.ServerConnector Stopped ServerConnector@459aaa0{HTTP/1.1}{127.0.0.1:0}
   [junit4]   2> 893284 INFO  (TEST-BasicAuthIntegrationTest.testBasics-seed#[DEAF2CE2912C3338]) [    ] o.a.s.c.CoreContainer Shutting down CoreContainer instance=479682014
   [junit4]   2> 893285 INFO  (TEST-BasicAuthIntegrationTest.testBasics-seed#[DEAF2CE2912C3338]) [    ] o.a.s.c.ZkController Publish node=127.0.0.1:34824_solr as DOWN
   [junit4]   2> 893287 INFO  (OverseerStateUpdate-95801457571790857-127.0.0.1:49051_solr-n_0000000000) [n:127.0.0.1:49051_solr    ] o.a.s.c.Overseer processMessage: queueSize: 1, message = {
   [junit4]   2>   "operation":"downnode",
   [junit4]   2>   "node_name":"127.0.0.1:34824_solr"} current state version: 0
   [junit4]   2> 893287 INFO  (OverseerStateUpdate-95801457571790857-127.0.0.1:49051_solr-n_0000000000) [n:127.0.0.1:49051_solr    ] o.a.s.c.o.NodeMutator DownNode state invoked for node: 127.0.0.1:34824_solr
   [junit4]   2> 893290 INFO  (zkCallback-768-thread-1-processing-n:127.0.0.1:49107_solr) [n:127.0.0.1:49107_solr    ] o.a.s.c.c.ZkStateReader A live node change: [WatchedEvent state:SyncConnected type:NodeChildrenChanged path:/live_nodes], has occurred - updating... (live nodes size: [5])
   [junit4]   2> 893291 INFO  (zkCallback-763-thread-1-processing-n:127.0.0.1:40135_solr) [n:127.0.0.1:40135_solr    ] o.a.s.c.c.ZkStateReader A live node change: [WatchedEvent state:SyncConnected type:NodeChildrenChanged path:/live_nodes], has occurred - updating... (live nodes size: [5])
   [junit4]   2> 893291 INFO  (zkCallback-761-thread-2-processing-n:127.0.0.1:49051_solr) [n:127.0.0.1:49051_solr    ] o.a.s.c.c.ZkStateReader A live node change: [WatchedEvent state:SyncConnected type:NodeChildrenChanged path:/live_nodes], has occurred - updating... (live nodes size: [5])
   [junit4]   2> 893291 INFO  (zkCallback-761-thread-1-processing-n:127.0.0.1:49051_solr) [n:127.0.0.1:49051_solr    ] o.a.s.c.c.ZkStateReader A live node change: [WatchedEvent state:SyncConnected type:NodeChildrenChanged path:/live_nodes], has occurred - updating... (live nodes size: [5])
   [junit4]   2> 893292 INFO  (zkCallback-767-thread-2-processing-n:127.0.0.1:60215_solr) [n:127.0.0.1:60215_solr    ] o.a.s.c.LeaderElector Watching path /overseer_elect/election/95801457571790863-127.0.0.1:49107_solr-n_0000000002 to know if I could be the leader
   [junit4]   2> 893291 INFO  (zkCallback-762-thread-1-processing-n:127.0.0.1:34824_solr) [n:127.0.0.1:34824_solr    ] o.a.s.c.c.ZkStateReader A live node change: [WatchedEvent state:SyncConnected type:NodeChildrenChanged path:/live_nodes], has occurred - updating... (live nodes size: [5])
   [junit4]   2> 893290 INFO  (zkCallback-767-thread-1-processing-n:127.0.0.1:60215_solr) [n:127.0.0.1:60215_solr    ] o.a.s.c.c.ZkStateReader A live node change: [WatchedEvent state:SyncConnected type:NodeChildrenChanged path:/live_nodes], has occurred - updating... (live nodes size: [5])
   [junit4]   2> 893292 WARN  (zkCallback-762-thread-1-processing-n:127.0.0.1:34824_solr) [n:127.0.0.1:34824_solr    ] o.a.s.c.c.ZkStateReader ZooKeeper watch triggered, but Solr cannot talk to ZK: [KeeperErrorCode = Session expired for /live_nodes]
   [junit4]   2> 893293 INFO  (TEST-BasicAuthIntegrationTest.testBasics-seed#[DEAF2CE2912C3338]) [    ] o.e.j.s.h.ContextHandler Stopped o.e.j.s.ServletContextHandler@36eec050{/solr,null,UNAVAILABLE}
   [junit4]   2> 893294 INFO  (TEST-BasicAuthIntegrationTest.testBasics-seed#[DEAF2CE2912C3338]) [    ] o.e.j.s.Server jetty-9.2.13.v20150730
   [junit4]   2> 893298 INFO  (TEST-BasicAuthIntegrationTest.testBasics-seed#[DEAF2CE2912C3338]) [    ] o.e.j.s.h.ContextHandler Started o.e.j.s.ServletContextHandler@7e36f54d{/solr,null,AVAILABLE}
   [junit4]   2> 893298 INFO  (TEST-BasicAuthIntegrationTest.testBasics-seed#[DEAF2CE2912C3338]) [    ] o.e.j.s.ServerConnector Started ServerConnector@7c18b34a{HTTP/1.1}{127.0.0.1:59197}
   [junit4]   2> 893298 INFO  (TEST-BasicAuthIntegrationTest.testBasics-seed#[DEAF2CE2912C3338]) [    ] o.e.j.s.Server Started @895259ms
   [junit4]   2> 893298 INFO  (TEST-BasicAuthIntegrationTest.testBasics-seed#[DEAF2CE2912C3338]) [    ] o.a.s.c.s.e.JettySolrRunner Jetty properties: {hostContext=/solr, hostPort=59197}
   [junit4]   2> 893299 INFO  (TEST-BasicAuthIntegrationTest.testBasics-seed#[DEAF2CE2912C3338]) [    ] o.a.s.s.SolrDispatchFilter SolrDispatchFilter.init(): sun.misc.Launcher$AppClassLoader@73d16e93
   [junit4]   2> 893299 INFO  (TEST-BasicAuthIntegrationTest.testBasics-seed#[DEAF2CE2912C3338]) [    ] o.a.s.c.SolrResourceLoader new SolrResourceLoader for directory: '/x1/jenkins/jenkins-slave/workspace/Lucene-Solr-Tests-5.5-Java8/solr/build/solr-core/test/J0/temp/solr.security.BasicAuthIntegrationTest_DEAF2CE2912C3338-001/tempDir-001/node6'
   [junit4]   2> 893299 INFO  (TEST-BasicAuthIntegrationTest.testBasics-seed#[DEAF2CE2912C3338]) [    ] o.a.s.c.SolrResourceLoader JNDI not configured for solr (NoInitialContextEx)
   [junit4]   2> 893299 INFO  (TEST-BasicAuthIntegrationTest.testBasics-seed#[DEAF2CE2912C3338]) [    ] o.a.s.c.SolrResourceLoader solr home defaulted to 'solr/' (could not find system property or JNDI)
   [junit4]   2> 893299 INFO  (TEST-BasicAuthIntegrationTest.testBasics-seed#[DEAF2CE2912C3338]) [    ] o.a.s.c.c.SolrZkClient Using default ZkCredentialsProvider
   [junit4]   2> 893301 INFO  (TEST-BasicAuthIntegrationTest.testBasics-seed#[DEAF2CE2912C3338]) [    ] o.a.s.c.c.ConnectionManager Waiting for client to connect to ZooKeeper
   [junit4]   2> 893301 INFO  (zkCallback-771-thread-1) [    ] o.a.s.c.c.ConnectionManager Watcher org.apache.solr.common.cloud.ConnectionManager@6e102bea name:ZooKeeperConnection Watcher:127.0.0.1:40701/solr got event WatchedEvent state:SyncConnected type:None path:null path:null type:None
   [junit4]   2> 893302 INFO  (TEST-BasicAuthIntegrationTest.testBasics-seed#[DEAF2CE2912C3338]) [    ] o.a.s.c.c.ConnectionManager Client is connected to ZooKeeper
   [junit4]   2> 893302 INFO  (TEST-BasicAuthIntegrationTest.testBasics-seed#[DEAF2CE2912C3338]) [    ] o.a.s.c.c.SolrZkClient Using default ZkACLProvider
   [junit4]   2> 893302 INFO  (TEST-BasicAuthIntegrationTest.testBasics-seed#[DEAF2CE2912C3338]) [    ] o.a.s.s.SolrDispatchFilter solr.xml found in ZooKeeper. Loading...
   [junit4]   2> 893306 INFO  (TEST-BasicAuthIntegrationTest.testBasics-seed#[DEAF2CE2912C3338]) [    ] o.a.s.c.CorePropertiesLocator Config-defined core root directory: /x1/jenkins/jenkins-slave/workspace/Lucene-Solr-Tests-5.5-Java8/solr/build/solr-core/test/J0/temp/solr.security.BasicAuthIntegrationTest_DEAF2CE2912C3338-001/tempDir-001/node6/.
   [junit4]   2> 893306 INFO  (TEST-BasicAuthIntegrationTest.testBasics-seed#[DEAF2CE2912C3338]) [    ] o.a.s.c.CoreContainer New CoreContainer 747231779
   [junit4]   2> 893306 INFO  (TEST-BasicAuthIntegrationTest.testBasics-seed#[DEAF2CE2912C3338]) [    ] o.a.s.c.CoreContainer Loading cores into CoreContainer [instanceDir=/x1/jenkins/jenkins-slave/workspace/Lucene-Solr-Tests-5.5-Java8/solr/build/solr-core/test/J0/temp/solr.security.BasicAuthIntegrationTest_DEAF2CE2912C3338-001/tempDir-001/node6]
   [junit4]   2> 893306 WARN  (TEST-BasicAuthIntegrationTest.testBasics-seed#[DEAF2CE2912C3338]) [    ] o.a.s.c.CoreContainer Couldn't add files from /x1/jenkins/jenkins-slave/workspace/Lucene-Solr-Tests-5.5-Java8/solr/build/solr-core/test/J0/temp/solr.security.BasicAuthIntegrationTest_DEAF2CE2912C3338-001/tempDir-001/node6/lib to classpath: /x1/jenkins/jenkins-slave/workspace/Lucene-Solr-Tests-5.5-Java8/solr/build/solr-core/test/J0/temp/solr.security.BasicAuthIntegrationTest_DEAF2CE2912C3338-001/tempDir-001/node6/lib
   [junit4]   2> 893306 INFO  (TEST-BasicAuthIntegrationTest.testBasics-seed#[DEAF2CE2912C3338]) [    ] o.a.s.h.c.HttpShardHandlerFactory created with socketTimeout : 90000,urlScheme : ,connTimeout : 15000,maxConnectionsPerHost : 20,maxConnections : 10000,corePoolSize : 0,maximumPoolSize : 2147483647,maxThreadIdleTime : 5,sizeOfQueue : -1,fairnessPolicy : false,useRetries : false,
   [junit4]   2> 893306 INFO  (TEST-BasicAuthIntegrationTest.testBasics-seed#[DEAF2CE2912C3338]) [    ] o.a.s.u.UpdateShardHandler Creating UpdateShardHandler HTTP client with params: socketTimeout=340000&connTimeout=45000&retry=true
   [junit4]   2> 893307 INFO  (TEST-BasicAuthIntegrationTest.testBasics-seed#[DEAF2CE2912C3338]) [    ] o.a.s.l.LogWatcher SLF4J impl is org.slf4j.impl.Log4jLoggerFactory
   [junit4]   2> 893307 INFO  (TEST-BasicAuthIntegrationTest.testBasics-seed#[DEAF2CE2912C3338]) [    ] o.a.s.l.LogWatcher Registering Log Listener [Log4j (org.slf4j.impl.Log4jLoggerFactory)]
   [junit4]   2> 893307 INFO  (TEST-BasicAuthIntegrationTest.testBasics-seed#[DEAF2CE2912C3338]) [    ] o.a.s.c.ZkContainer Zookeeper client=127.0.0.1:40701/solr
   [junit4]   2> 893307 INFO  (TEST-BasicAuthIntegrationTest.testBasics-seed#[DEAF2CE2912C3338]) [    ] o.a.s.c.ZkController zkHost includes chroot
   [junit4]   2> 893307 INFO  (TEST-BasicAuthIntegrationTest.testBasics-seed#[DEAF2CE2912C3338]) [    ] o.a.s.c.c.SolrZkClient Using default ZkCredentialsProvider
   [junit4]   2> 893310 INFO  (TEST-BasicAuthIntegrationTest.testBasics-seed#[DEAF2CE2912C3338]) [    ] o.a.s.c.c.ConnectionManager Waiting for client to connect to ZooKeeper
   [junit4]   2> 893314 INFO  (zkCallback-774-thread-1) [    ] o.a.s.c.c.ConnectionManager Watcher org.apache.solr.common.cloud.ConnectionManager@73bd2558 name:ZooKeeperConnection Watcher:127.0.0.1:40701 got event WatchedEvent state:SyncConnected type:None path:null path:null type:None
   [junit4]   2> 893315 INFO  (TEST-BasicAuthIntegrationTest.testBasics-seed#[DEAF2CE2912C3338]) [    ] o.a.s.c.c.ConnectionManager Client is connected to ZooKeeper
   [junit4]   2> 893315 INFO  (TEST-BasicAuthIntegrationTest.testBasics-seed#[DEAF2CE2912C3338]) [    ] o.a.s.c.c.SolrZkClient Using default ZkACLProvider
   [junit4]   2> 893317 INFO  (TEST-BasicAuthIntegrationTest.testBasics-seed#[DEAF2CE2912C3338]) [n:127.0.0.1:59197_solr    ] o.a.s.c.ZkController Added new OnReconnect listener org.apache.solr.cloud.ZkController$6@37579cc
   [junit4]   2> 893317 INFO  (TEST-BasicAuthIntegrationTest.testBasics-seed#[DEAF2CE2912C3338]) [n:127.0.0.1:59197_solr    ] o.a.s.c.c.ConnectionManager Waiting for client to connect to ZooKeeper
   [junit4]   2> 893318 INFO  (zkCallback-775-thread-1-processing-n:127.0.0.1:59197_solr) [n:127.0.0.1:59197_solr    ] o.a.s.c.c.ConnectionManager Watcher org.apache.solr.common.cloud.ConnectionManager@13a50cb name:ZooKeeperConnection Watcher:127.0.0.1:40701/solr got event WatchedEvent state:SyncConnected type:None path:null path:null type:None
   [junit4]   2> 893318 INFO  (TEST-BasicAuthIntegrationTest.testBasics-seed#[DEAF2CE2912C3338]) [n:127.0.0.1:59197_solr    ] o.a.s.c.c.ConnectionManager Client is connected to ZooKeeper
   [junit4]   2> 893323 INFO  (TEST-BasicAuthIntegrationTest.testBasics-seed#[DEAF2CE2912C3338]) [n:127.0.0.1:59197_solr    ] o.a.s.c.c.ZkStateReader Updating cluster state from ZooKeeper... 
   [junit4]   2> 894325 INFO  (TEST-BasicAuthIntegrationTest.testBasics-seed#[DEAF2CE2912C3338]) [n:127.0.0.1:59197_solr    ] o.a.s.c.ZkController Register node as live in ZooKeeper:/live_nodes/127.0.0.1:59197_solr
   [junit4]   2> 894326 INFO  (TEST-BasicAuthIntegrationTest.testBasics-seed#[DEAF2CE2912C3338]) [n:127.0.0.1:59197_solr    ] o.a.s.c.c.SolrZkClient makePath: /live_nodes/127.0.0.1:59197_solr
   [junit4]   2> 894327 INFO  (zkCallback-767-thread-1-processing-n:127.0.0.1:60215_solr) [n:127.0.0.1:60215_solr    ] o.a.s.c.c.ZkStateReader A live node change: [WatchedEvent state:SyncConnected type:NodeChildrenChanged path:/live_nodes], has occurred - updating... (live nodes size: [4])
   [junit4]   2> 894327 INFO  (zkCallback-761-thread-1-processing-n:127.0.0.1:49051_solr) [n:127.0.0.1:49051_solr    ] o.a.s.c.c.ZkStateReader A live node change: [WatchedEvent state:SyncConnected type:NodeChildrenChanged path:/live_nodes], has occurred - updating... (live nodes size: [4])
   [junit4]   2> 894327 INFO  (zkCallback-768-thread-1-processing-n:127.0.0.1:49107_solr) [n:127.0.0.1:49107_solr    ] o.a.s.c.c.ZkStateReader A live node change: [WatchedEvent state:SyncConnected type:NodeChildrenChanged path:/live_nodes], has occurred - updating... (live nodes size: [4])
   [junit4]   2> 894327 INFO  (zkCallback-761-thread-2-processing-n:127.0.0.1:49051_solr) [n:127.0.0.1:49051_solr    ] o.a.s.c.c.ZkStateReader A live node change: [WatchedEvent state:SyncConnected type:NodeChildrenChanged path:/live_nodes], has occurred - updating... (live nodes size: [4])
   [junit4]   2> 894327 INFO  (zkCallback-763-thread-1-processing-n:127.0.0.1:40135_solr) [n:127.0.0.1:40135_solr    ] o.a.s.c.c.ZkStateReader A live node change: [WatchedEvent state:SyncConnected type:NodeChildrenChanged path:/live_nodes], has occurred - updating... (live nodes size: [4])
   [junit4]   2> 894327 INFO  (zkCallback-775-thread-1-processing-n:127.0.0.1:59197_solr) [n:127.0.0.1:59197_solr    ] o.a.s.c.c.ZkStateReader A live node change: [WatchedEvent state:SyncConnected type:NodeChildrenChanged path:/live_nodes], has occurred - updating... (live nodes size: [4])
   [junit4]   2> 894328 INFO  (TEST-BasicAuthIntegrationTest.testBasics-seed#[DEAF2CE2912C3338]) [n:127.0.0.1:59197_solr    ] o.a.s.c.Overseer Overseer (id=null) closing
   [junit4]   2> 894329 INFO  (TEST-BasicAuthIntegrationTest.testBasics-seed#[DEAF2CE2912C3338]) [n:127.0.0.1:59197_solr    ] o.a.s.c.LeaderElector Joined leadership election with path: /overseer_elect/election/95801457571790867-127.0.0.1:59197_solr-n_0000000005
   [junit4]   2> 894330 INFO  (TEST-BasicAuthIntegrationTest.testBasics-seed#[DEAF2CE2912C3338]) [n:127.0.0.1:59197_solr    ] o.a.s.c.LeaderElector Watching path /overseer_elect/election/95801457571790861-127.0.0.1:60215_solr-n_0000000004 to know if I could be the leader
   [junit4]   2> 894345 INFO  (TEST-BasicAuthIntegrationTest.testBasics-seed#[DEAF2CE2912C3338]) [n:127.0.0.1:59197_solr    ] o.a.s.c.CoreContainer Security conf doesn't exist. Skipping setup for authorization module.
   [junit4]   2> 894345 INFO  (TEST-BasicAuthIntegrationTest.testBasics-seed#[DEAF2CE2912C3338]) [n:127.0.0.1:59197_solr    ] o.a.s.c.CoreContainer No authentication plugin used.
   [junit4]   2> 894346 INFO  (TEST-BasicAuthIntegrationTest.testBasics-seed#[DEAF2CE2912C3338]) [n:127.0.0.1:59197_solr    ] o.a.s.c.CorePropertiesLocator Looking for core definitions underneath /x1/jenkins/jenkins-slave/workspace/Lucene-Solr-Tests-5.5-Java8/solr/build/solr-core/test/J0/temp/solr.security.BasicAuthIntegrationTest_DEAF2CE2912C3338-001/tempDir-001/node6/.
   [junit4]   2> 894346 INFO  (TEST-BasicAuthIntegrationTest.testBasics-seed#[DEAF2CE2912C3338]) [n:127.0.0.1:59197_solr    ] o.a.s.c.CorePropertiesLocator Found 0 core definitions
   [junit4]   2> 894354 INFO  (TEST-BasicAuthIntegrationTest.testBasics-seed#[DEAF2CE2912C3338]) [n:127.0.0.1:59197_solr    ] o.a.s.s.SolrDispatchFilter user.dir=/x1/jenkins/jenkins-slave/workspace/Lucene-Solr-Tests-5.5-Java8/solr/build/solr-core/test/J0
   [junit4]   2> 894354 INFO  (TEST-BasicAuthIntegrationTest.testBasics-seed#[DEAF2CE2912C3338]) [n:127.0.0.1:59197_solr    ] o.a.s.s.SolrDispatchFilter SolrDispatchFilter.init() done
   [junit4]   2> 894355 INFO  (TEST-BasicAuthIntegrationTest.testBasics-seed#[DEAF2CE2912C3338]) [    ] o.a.s.c.c.SolrZkClient Using default ZkCredentialsProvider
   [junit4]   2> 894357 INFO  (TEST-BasicAuthIntegrationTest.testBasics-seed#[DEAF2CE2912C3338]) [    ] o.a.s.c.c.ConnectionManager Waiting for client to connect to ZooKeeper
   [junit4]   2> 894360 INFO  (zkCallback-776-thread-1) [    ] o.a.s.c.c.ConnectionManager Watcher org.apache.solr.common.cloud.ConnectionManager@1cbd42c name:ZooKeeperConnection Watcher:127.0.0.1:40701/solr got event WatchedEvent state:SyncConnected type:None path:null path:null type:None
   [junit4]   2> 894360 INFO  (TEST-BasicAuthIntegrationTest.testBasics-seed#[DEAF2CE2912C3338]) [    ] o.a.s.c.c.ConnectionManager Client is connected to ZooKeeper
   [junit4]   2> 894361 INFO  (TEST-BasicAuthIntegrationTest.testBasics-seed#[DEAF2CE2912C3338]) [    ] o.a.s.c.c.SolrZkClient Using default ZkACLProvider
   [junit4]   2> 894361 INFO  (TEST-BasicAuthIntegrationTest.testBasics-seed#[DEAF2CE2912C3338]) [    ] o.a.s.c.c.SolrZkClient makePath: /configs/solrCloudCollectionConfig/solrconfig-spellcheckcomponent.xml
   [junit4]   2> 894368 INFO  (TEST-BasicAuthIntegrationTest.testBasics-seed#[DEAF2CE2912C3338]) [    ] o.a.s.c.c.SolrZkClient makePath: /configs/solrCloudCollectionConfig/schema-null-charfilters-analyzer.xml
   [junit4]   2> 894371 INFO  (TEST-BasicAuthIntegrationTest.testBasics-seed#[DEAF2CE2912C3338]) [    ] o.a.s.c.c.SolrZkClient makePath: /configs/solrCloudCollectionConfig/regex-boost-processor-test.txt
   [junit4]   2> 894372 INFO  (TEST-BasicAuthIntegrationTest.testBasics-seed#[DEAF2CE2912C3338]) [    ] o.a.s.c.c.SolrZkClient makePath: /configs/solrCloudCollectionConfig/solrconfig-spellchecker.xml
   [junit4]   2> 894375 INFO  (TEST-BasicAuthIntegrationTest.testBasics-seed#[DEAF2CE2912C3338]) [    ] o.a.s.c.c.SolrZkClient makePath: /configs/solrCloudCollectionConfig/bad-schema-multiple-asterisk-copyfield-dest-should-fail-test.xml
   [junit4]   2> 894376 INFO  (TEST-BasicAuthIntegrationTest.testBasics-seed#[DEAF2CE2912C3338]) [    ] o.a.s.c.c.SolrZkClient makePath: /configs/solrCloudCollectionConfig/schema-docValuesFaceting.xml
   [junit4]   2> 894378 INFO  (TEST-BasicAuthIntegrationTest.testBasics-seed#[DEAF2CE2912C3338]) [    ] o.a.s.c.c.SolrZkClient makePath: /configs/solrCloudCollectionConfig/solrconfig-tlog-with-delayingcomponent.xml
   [junit4]   2> 894381 INFO  (TEST-BasicAuthIntegrationTest.testBasics-seed#[DEAF2CE2912C3338]) [    ] o.a.s.c.c.SolrZkClient makePath: /configs/solrCloudCollectionConfig/bad-schema-currency-ft-bogus-default-code.xml
   [junit4]   2> 894382 INFO  (TEST-BasicAuthIntegrationTest.testBasics-seed#[DEAF2CE2912C3338]) [    ] o.a.s.c.c.SolrZkClient makePath: /configs/solrCloudCollectionConfig/schema-numeric.xml
   [junit4]   2> 894384 INFO  (TEST-BasicAuthIntegrationTest.testBasics-seed#[DEAF2CE2912C3338]) [    ] o.a.s.c.c.SolrZkClient makePath: /configs/solrCloudCollectionConfig/solrconfig_codec.xml
   [junit4]   2> 894385 INFO  (TEST-BasicAuthIntegrationTest.testBasics-seed#[DEAF2CE2912C3338]) [    ] o.a.s.c.c.SolrZkClient makePath: /configs/solrCloudCollectionConfig/bad-schema-multiple-asterisk-copyfield-source-should-fail-test.xml
   [junit4]   2> 894387 INFO  (TEST-BasicAuthIntegrationTest.testBasics-seed#[DEAF2CE2912C3338]) [    ] o.a.s.c.c.SolrZkClient makePath: /configs/solrCloudCollectionConfig/schema_latest.xml
   [junit4]   2> 894389 INFO  (TEST-BasicAuthIntegrationTest.testBasics-seed#[DEAF2CE2912C3338]) [    ] o.a.s.c.c.SolrZkClient makePath: /configs/solrCloudCollectionConfig/schema-sorts.xml
   [junit4]   2> 894391 INFO  (TEST-BasicAuthIntegrationTest.testBasics-seed#[DEAF2CE2912C3338]) [    ] o.a.s.c.c.SolrZkClient makePath: /configs/solrCloudCollectionConfig/solrconfig-headers.xml
   [junit4]   2> 894394 INFO  (TEST-BasicAuthIntegrationTest.testBasics-seed#[DEAF2CE2912C3338]) [    ] o.a.s.c.c.SolrZkClient makePath: /configs/solrCloudCollectionConfig/solrconfig-implicitproperties.xml
   [junit4]   2> 894395 INFO  (TEST-BasicAuthIntegrationTest.testBasics-seed#[DEAF2CE2912C3338]) [    ] o.a.s.c.c.SolrZkClient makePath: /configs/solrCloudCollectionConfig/bad-solrconfig-bogus-scriptengine-name.xml
   [junit4]   2> 894397 INFO  (TEST-BasicAuthIntegrationTest.testBasics-seed#[DEAF2CE2912C3338]) [    ] o.a.s.c.c.SolrZkClient makePath: /configs/solrCloudCollectionConfig/schema-snippet-types.incl
   [junit4]   2> 894398 INFO  (TEST-BasicAuthIntegrationTest.testBasics-seed#[DEAF2CE2912C3338]) [    ] o.a.s.c.c.SolrZkClient makePath: /configs/solrCloudCollectionConfig/solrconfig-parsing-update-processor-chains.xml
   [junit4]   2> 894400 INFO  (TEST-BasicAuthIntegrationTest.testBasics-seed#[DEAF2CE2912C3338]) [    ] o.a.s.c.c.SolrZkClient makePath: /configs/solrCloudCollectionConfig/schema-docValuesMissing.xml
   [junit4]   2> 894402 INFO  (TEST-BasicAuthIntegrationTest.testBasics-seed#[DEAF2CE2912C3338]) [    ] o.a.s.c.c.SolrZkClient makePath: /configs/solrCloudCollectionConfig/solrconfig-noopregen.xml
   [junit4]   2> 894403 INFO  (TEST-BasicAuthIntegrationTest.testBasics-seed#[DEAF2CE2912C3338]) [    ] o.a.s.c.c.SolrZkClient makePath: /configs/solrCloudCollectionConfig/schema-one-field-no-dynamic-field-unique-key.xml
   [junit4]   2> 894404 INFO  (TEST-BasicAuthIntegrationTest.testBasics-seed#[DEAF2CE2912C3338]) [    ] o.a.s.c.c.SolrZkClient makePath: /configs/solrCloudCollectionConfig/solrconfig-script-updateprocessor.xml
   [junit4]   2> 894406 INFO  (TEST-BasicAuthIntegrationTest.testBasics-seed#[DEAF2CE2912C3338]) [    ] o.a.s.c.c.SolrZkClient makePath: /configs/solrCloudCollectionConfig/bad-error-solrconfig.xml
   [junit4]   2> 894408 INFO  (TEST-BasicAuthIntegrationTest.testBasics-seed#[DEAF2CE2912C3338]) [    ] o.a.s.c.c.SolrZkClient makePath: /configs/solrCloudCollectionConfig/solrconfig-suggestercomponent.xml
   [junit4]   2> 894412 INFO  (TEST-BasicAuthIntegrationTest.testBasics-seed#[DEAF2CE2912C3338]) [    ] o.a.s.c.c.SolrZkClient makePath: /configs/solrCloudCollectionConfig/bad-currency.xml
   [junit4]   2> 894413 INFO  (TEST-BasicAuthIntegrationTest.testBasics-seed#[DEAF2CE2912C3338]) [    ] o.a.s.c.c.SolrZkClient makePath: /configs/solrCloudCollectionConfig/solrconfig-query-parser-init.xml
   [junit4]   2> 894415 INFO  (TEST-BasicAuthIntegrationTest.testBasics-seed#[DEAF2CE2912C3338]) [    ] o.a.s.c.c.SolrZkClient makePath: /configs/solrCloudCollectionConfig/solrconfig-caching.xml
   [junit4]   2> 894418 INFO  (TEST-BasicAuthIntegrationTest.testBasics-seed#[DEAF2CE2912C3338]) [    ] o.a.s.c.c.SolrZkClient makePath: /configs/solrCloudCollectionConfig/conditional.updateprocessor.js
   [junit4]   2> 894419 INFO  (TEST-BasicAuthIntegrationTest.testBasics-seed#[DEAF2CE2912C3338]) [    ] o.a.s.c.c.SolrZkClient makePath: /configs/solrCloudCollectionConfig/solrconfig-indexconfig-mergepolicyfactory.xml
   [junit4]   2> 894420 INFO  (TEST-BasicAuthIntegrationTest.testBasics-seed#[DEAF2CE2912C3338]) [    ] o.a.s.c.c.SolrZkClient makePath: /configs/solrCloudCollectionConfig/compoundDictionary.txt
   [junit4]   2> 894425 INFO  (TEST-BasicAuthIntegrationTest.testBasics-seed#[DEAF2CE2912C3338]) [    ] o.a.s.c.c.SolrZkClient makePath: /configs/solrCloudCollectionConfig/solrconfig-tieredmergepolicyfactory.xml
   [junit4]   2> 894429 INFO  (TEST-BasicAuthIntegrationTest.testBasics-seed#[DEAF2CE2912C3338]) [    ] o.a.s.c.c.SolrZkClient makePath: /configs/solrCloudCollectionConfig/phrasesuggest.txt
   [junit4]   2> 894431 INFO  (TEST-BasicAuthIntegrationTest.testBasics-seed#[DEAF2CE2912C3338]) [    ] o.a.s.c.c.SolrZkClient makePath: /configs/solrCloudCollectionConfig/solrconfig-transformers.xml
   [junit4]   2> 894433 INFO  (TEST-BasicAuthIntegrationTest.testBasics-seed#[DEAF2CE2912C3338]) [    ] o.a.s.c.c.SolrZkClient makePath: /configs/solrCloudCollectionConfig/bad-schema-not-indexed-but-norms.xml
   [junit4]   2> 894434 INFO  (TEST-BasicAuthIntegrationTest.testBasics-seed#[DEAF2CE2912C3338]) [    ] o.a.s.c.c.SolrZkClient makePath: /configs/solrCloudCollectionConfig/blendedInfixSuggest.txt
   [junit4]   2> 894435 INFO  (TEST-BasicAuthIntegrationTest.testBasics-seed#[DEAF2CE2912C3338]) [    ] o.a.s.c.c.SolrZkClient makePath: /configs/solrCloudCollectionConfig/schema-phrasesuggest.xml
   [junit4]   2> 894438 INFO  (TEST-BasicAuthIntegrationTest.testBasics-seed#[DEAF2CE2912C3338]) [    ] o.a.s.c.c.SolrZkClient makePath: /configs/solrCloudCollectionConfig/hunspell-test.dic
   [junit4]   2> 894439 INFO  (TEST-BasicAuthIntegrationTest.testBasics-seed#[DEAF2CE2912C3338]) [    ] o.a.s.c.c.SolrZkClient makePath: /configs/solrCloudCollectionConfig/schema-HighlighterMaxOffsetTest.xml
   [junit4]   2> 894441 INFO  (TEST-BasicAuthIntegrationTest.testBasics-seed#[DEAF2CE2912C3338]) [    ] o.a.s.c.c.SolrZkClient makePath: /configs/solrCloudCollectionConfig/schema-rest-lucene-match-version.xml
   [junit4]   2> 894443 INFO  (TEST-BasicAuthIntegrationTest.testBasics-seed#[DEAF2CE2912C3338]) [    ] o.a.s.c.c.SolrZkClient makePath: /configs/solrCloudCollectionConfig/solrconfig-functionquery.xml
   [junit4]   2> 894444 INFO  (TEST-BasicAuthIntegrationTest.testBasics-seed#[DEAF2CE2912C3338]) [    ] o.a.s.c.c.SolrZkClient makePath: /configs/solrCloudCollectionConfig/solrconfig-externalversionconstraint.xml
   [junit4]   2> 894447 INFO  (TEST-BasicAuthIntegrationTest.testBasics-seed#[DEAF2CE2912C3338]) [    ] o.a.s.c.c.SolrZkClient makePath: /configs/solrCloudCollectionConfig/bad-schema-codec-global-vs-ft-mismatch.xml
   [junit4]   2> 894451 INFO  (TEST-BasicAuthIntegrationTest.testBasics-seed#[DEAF2CE2912C3338]) [    ] o.a.s.c.c.SolrZkClient makePath: /configs/solrCloudCollectionConfig/schema-sim.xml
   [junit4]   2> 894452 INFO  (TEST-BasicAuthIntegrationTest.testBasics-seed#[DEAF2CE2912C3338]) [    ] o.a.s.c.c.SolrZkClient makePath: /configs/solrCloudCollectionConfig/schema-docValuesMulti.xml
   [junit4]   2> 894454 INFO  (TEST-BasicAuthIntegrationTest.testBasics-seed#[DEAF2CE2912C3338]) [    ] o.a.s.c.c.SolrZkClient makePath: /configs/solrCloudCollectionConfig/solrconfig-logmergepolicyfactory.xml
   [junit4]   2> 894455 INFO  (TEST-BasicAuthIntegrationTest.testBasics-seed#[DEAF2CE2912C3338]) [    ] o.a.s.c.c.SolrZkClient makePath: /configs/solrCloudCollectionConfig/solrconfig-collapseqparser.xml
   [junit4]   2> 894460 INFO  (TEST-BasicAuthIntegrationTest.testBasics-seed#[DEAF2CE2912C3338]) [    ] o.a.s.c.c.SolrZkClient makePath: /configs/solrCloudCollectionConfig/solrconfig-analytics-query.xml
   [junit4]   2> 894462 INFO  (TEST-BasicAuthIntegrationTest.testBasics-seed#[DEAF2CE2912C3338]) [    ] o.a.s.c.c.SolrZkClient makePath: /configs/solrCloudCollectionConfig/schema-sweetspot.xml
   [junit4]   2> 894464 INFO  (TEST-BasicAuthIntegrationTest.testBasics-seed#[DEAF2CE2912C3338]) [    ] o.a.s.c.c.SolrZkClient makePath: /configs/solrCloudCollectionConfig/solrconfig-searcher-listeners1.xml
   [junit4]   2> 894465 INFO  (TEST-BasicAuthIntegrationTest.testBasics-seed#[DEAF2CE2912C3338]) [    ] o.a.s.c.c.SolrZkClient makePath: /configs/solrCloudCollectionConfig/schema-id-and-version-fields-only.xml
   [junit4]   2> 894466 INFO  (TEST-BasicAuthIntegrationTest.testBasics-seed#[DEAF2CE2912C3338]) [    ] o.a.s.c.c.SolrZkClient makePath: /configs/solrCloudCollectionConfig/bad-solrconfig-schema-mutable-but-not-managed.xml
   [junit4]   2> 894471 INFO  (TEST-BasicAuthIntegrationTest.testBasics-seed#[DEAF2CE2912C3338]) [    ] o.a.s.c.c.SolrZkClient makePath: /configs/solrCloudCollectionConfig/hunspell-test.aff
   [junit4]   2> 894473 INFO  (TEST-BasicAuthIntegrationTest.testBasics-seed#[DEAF2CE2912C3338]) [    ] o.a.s.c.c.SolrZkClient makePath: /configs/solrCloudCollectionConfig/solrconfig-response-log-component.xml
   [junit4]   2> 894475 INFO  (TEST-BasicAuthIntegrationTest.testBasics-seed#[DEAF2CE2912C3338]) [    ] o.a.s.c.c.SolrZkClient makePath: /configs/solrCloudCollectionConfig/bad-schema-sim-default-does-not-exist.xml
   [junit4]   2> 894476 INFO  (TEST-BasicAuthIntegrationTest.testBasics-seed#[DEAF2CE2912C3338]) [    ] o.a.s.c.c.SolrZkClient makePath: /configs/solrCloudCollectionConfig/bad-schema-dynamicfield-required.xml
   [junit4]   2> 894477 INFO  (TEST-BasicAuthIntegrationTest.testBasics-seed#[DEAF2CE2912C3338]) [    ] o.a.s.c.c.SolrZkClient makePath: /configs/solrCloudCollectionConfig/bad-schema-not-indexed-but-pos.xml
   [junit4]   2> 894479 INFO  (TEST-BasicAuthIntegrationTest.testBasics-seed#[DEAF2CE2912C3338]) [    ] o.a.s.c.c.SolrZkClient makePath: /configs/solrCloudCollectionConfig/solrconfig-hash.xml
   [junit4]   2> 894480 INFO  (TEST-BasicAuthIntegrationTest.testBasics-seed#[DEAF2CE2912C3338]) [    ] o.a.s.c.c.SolrZkClient makePath: /configs/solrCloudCollectionConfig/solrconfig-components-name.xml
   [junit4]   2> 894483 INFO  (TEST-BasicAuthIntegrationTest.testBasics-seed#[DEAF2CE2912C3338]) [    ] o.a.s.c.c.SolrZkClient makePath: /configs/solrCloudCollectionConfig/bad-mp-solrconfig.xml
   [junit4]   2> 894484 INFO  (TEST-BasicAuthIntegrationTest.testBasics-seed#[DEAF2CE2912C3338]) [    ] o.a.s.c.c.SolrZkClient makePath: /configs/solrCloudCollectionConfig/solrconfig.snippet.randomindexconfig.xml
   [junit4]   2> 894487 INFO  (TEST-BasicAuthIntegrationTest.testBasics-seed#[DEAF2CE2912C3338]) [    ] o.a.s.c.c.SolrZkClient makePath: /configs/solrCloudCollectionConfig/solrconfig-xinclude.xml
   [junit4]   2> 894488 INFO  (TEST-BasicAuthIntegrationTest.testBasics-seed#[DEAF2CE2912C3338]) [    ] o.a.s.c.c.SolrZkClient makePath: /configs/solrCloudCollectionConfig/cross-compatible.js
   [junit4]   2> 894490 INFO  (TEST-BasicAuthIntegrationTest.testBasics-seed#[DEAF2CE2912C3338]) [    ] o.a.s.c.c.SolrZkClient makePath: /configs/solrCloudCollectionConfig/solrconfig_perf.xml
   [junit4]   2> 894491 INFO  (TEST-BasicAuthIntegrationTest.testBasics-seed#[DEAF2CE2912C3338]) [    ] o.a.s.c.c.SolrZkClient makePath: /configs/solrCloudCollectionConfig/bad-solrconfig-invalid-scriptfile.xml
   [junit4]   2> 894493 INFO  (TEST-BasicAuthIntegrationTest.testBasics-seed#[DEAF2CE2912C3338]) [    ] o.a.s.c.c.SolrZkClient makePath: /configs/solrCloudCollectionConfig/solrconfig-basic.xml
   [junit4]   2> 894495 INFO  (TEST-BasicAuthIntegrationTest.testBasics-seed#[DEAF2CE2912C3338]) [    ] o.a.s.c.c.SolrZkClient makePath: /configs/solrCloudCollectionConfig/schema-replication1.xml
   [junit4]   2> 894496 INFO  (TEST-BasicAuthIntegrationTest.testBasics-seed#[DEAF2CE2912C3338]) [    ] o.a.s.c.c.SolrZkClient makePath: /configs/solrCloudCollectionConfig/bad-solrconfig-missing-scriptfile.xml
   [junit4]   2> 894498 INFO  (TEST-BasicAuthIntegrationTest.testBasics-seed#[DEAF2CE2912C3338]) [    ] o.a.s.c.c.SolrZkClient makePath: /configs/solrCloudCollectionConfig/solrconfig-altdirectory.xml
   [junit4]   2> 894500 INFO  (TEST-BasicAuthIntegrationTest.testBasics-seed#[DEAF2CE2912C3338]) [    ] o.a.s.c.c.SolrZkClient makePath: /configs/solrCloudCollectionConfig/schema-distributed-missing-sort.xml
   [junit4]   2> 894502 INFO  (TEST-BasicAuthIntegrationTest.testBasics-seed#[DEAF2CE2912C3338]) [    ] o.a.s.c.c.SolrZkClient makePath: /configs/solrCloudCollectionConfig/enumsConfig.xml
   [junit4]   2> 894503 INFO  (TEST-BasicAuthIntegrationTest.testBasics-seed#[DEAF2CE2912C3338]) [    ] o.a.s.c.c.SolrZkClient makePath: /configs/solrCloudCollectionConfig/schema-tfidf.xml
   [junit4]   2> 894525 INFO  (TEST-BasicAuthIntegrationTest.testBasics-seed#[DEAF2CE2912C3338]) [    ] o.a.s.c.c.SolrZkClient makePath: /configs/solrCloudCollectionConfig/jasuggest.txt
   [junit4]   2> 894526 INFO  (TEST-BasicAuthIntegrationTest.testBasics-seed#[DEAF2CE2912C3338]) [    ] o.a.s.c.c.SolrZkClient makePath: /configs/solrCloudCollectionConfig/bad-schema-dup-field.xml
   [junit4]   2> 894527 INFO  (TEST-BasicAuthIntegrationTest.testBasics-seed#[DEAF2CE2912C3338]) [    ] o.a.s.c.c.SolrZkClient makePath: /configs/solrCloudCollectionConfig/fuzzysuggest.txt
   [junit4]   2> 894528 INFO  (TEST-BasicAuthIntegrationTest.testBasics-seed#[DEAF2CE2912C3338]) [    ] o.a.s.c.c.SolrZkClient makePath: /configs/solrCloudCollectionConfig/schema-minimal.xml
   [junit4]   2> 894529 INFO  (TEST-BasicAuthIntegrationTest.testBasics-seed#[DEAF2CE2912C3338]) [    ] o.a.s.c.c.SolrZkClient makePath: /configs/solrCloudCollectionConfig/solrconfig-highlight.xml
   [junit4]   2> 894532 INFO  (TEST-BasicAuthIntegrationTest.testBasics-seed#[DEAF2CE2912C3338]) [    ] o.a.s.c.c.SolrZkClient makePath: /configs/solrCloudCollectionConfig/solrconfig-tieredmergepolicy.xml
   [junit4]   2> 894533 INFO  (TEST-BasicAuthIntegrationTest.testBasics-seed#[DEAF2CE2912C3338]) [    ] o.a.s.c.c.SolrZkClient makePath: /configs/solrCloudCollectionConfig/schema-blockjoinfacetcomponent.xml
   [junit4]   2> 894535 INFO  (TEST-BasicAuthIntegrationTest.testBasics-seed#[DEAF2CE2912C3338]) [    ] o.a.s.c.c.SolrZkClient makePath: /configs/solrCloudCollectionConfig/schema-version-indexed.xml
   [junit4]   2> 894536 INFO  (TEST-BasicAuthIntegrationTest.testBasics-seed#[DEAF2CE2912C3338]) [    ] o.a.s.c.c.SolrZkClient makePath: /configs/solrCloudCollectionConfig/bad-schema-unsupported-docValues.xml
   [junit4]   2> 894538 INFO  (TEST-BasicAuthIntegrationTest.testBasics-seed#[DEAF2CE2912C3338]) [    ] o.a.s.c.c.SolrZkClient makePath: /configs/solrCloudCollectionConfig/mapping-ISOLatin1Accent.txt
   [junit4]   2> 894539 INFO  (TEST-BasicAuthIntegrationTest.testBasics-seed#[DEAF2CE2912C3338]) [    ] o.a.s.c.c.SolrZkClient makePath: /configs/solrCloudCollectionConfig/schema-lmdirichlet.xml
   [junit4]   2> 894540 INFO  (TEST-BasicAuthIntegrationTest.testBasics-seed#[DEAF2CE2912C3338]) [    ] o.a.s.c.c.SolrZkClient makePath: /configs/solrCloudCollectionConfig/schema-synonym-tokenizer.xml
   [junit4]   2> 894542 INFO  (TEST-BasicAuthIntegrationTest.testBasics-seed#[DEAF2CE2912C3338]) [    ] o.a.s.c.c.SolrZkClient makePath: /configs/solrCloudCollectionConfig/stop-2.txt
   [junit4]   2> 894544 INFO  (TEST-BasicAuthIntegrationTest.testBasics-seed#[DEAF2CE2912C3338]) [    ] o.a.s.c.c.SolrZkClient makePath: /configs/solrCloudCollectionConfig/schema-non-stored-docvalues.xml
   [junit4]   2> 894545 INFO  (TEST-BasicAuthIntegrationTest.testBasics-seed#[DEAF2CE2912C3338]) [    ] o.a.s.c.c.SolrZkClient makePath: /configs/solrCloudCollectionConfig/schema-sim-default-override.xml
   [junit4]   2> 894547 INFO  (TEST-BasicAuthIntegrationTest.testBasics-seed#[DEAF2CE2912C3338]) [    ] o.a.s.c.c.SolrZkClient makePath: /configs/solrCloudCollectionConfig/solrconfig-plugcollector.xml
   [junit4]   2> 894554 INFO  (TEST-BasicAuthIntegrationTest.testBasics-seed#[DEAF2CE2912C3338]) [    ] o.a.s.c.c.SolrZkClient makePath: /configs/solrCloudCollectionConfig/bad-schema-uniquekey-uses-default.xml
   [junit4]   2> 894559 INFO  (TEST-BasicAuthIntegrationTest.testBasics-seed#[DEAF2CE2912C3338]) [    ] o.a.s.c.c.SolrZkClient makePath: /configs/solrCloudCollectionConfig/bad-schema-sim-global-vs-ft-mismatch.xml
   [junit4]   2> 894560 INFO  (TEST-BasicAuthIntegrationTest.testBasics-seed#[DEAF2CE2912C3338]) [    ] o.a.s.c.c.SolrZkClient makePath: /configs/solrCloudCollectionConfig/solrconfig-warmer.xml
   [junit4]   2> 894562 INFO  (TEST-BasicAuthIntegrationTest.testBasics-se

[...truncated too long message...]

  [junit4]   2> 8114037 INFO  (coreCloseExecutor-2620-thread-1) [n:127.0.0.1:49107_solr c:testSolrCloudCollection s:shard1 r:core_node4 x:testSolrCloudCollection_shard1_replica1] o.a.s.c.CachingDirectoryFactory Closing directory: data/index
   [junit4]   2> 8114037 INFO  (coreCloseExecutor-2620-thread-1) [n:127.0.0.1:49107_solr c:testSolrCloudCollection s:shard1 r:core_node4 x:testSolrCloudCollection_shard1_replica1] o.a.s.c.CachingDirectoryFactory looking to close data [CachedDir<<refCount=0;path=data;done=false>>]
   [junit4]   2> 8114037 INFO  (coreCloseExecutor-2620-thread-1) [n:127.0.0.1:49107_solr c:testSolrCloudCollection s:shard1 r:core_node4 x:testSolrCloudCollection_shard1_replica1] o.a.s.c.CachingDirectoryFactory Closing directory: data
   [junit4]   2> 8114039 INFO  (coreCloseExecutor-2622-thread-1) [n:127.0.0.1:59197_solr c:testSolrCloudCollection s:shard2 r:core_node3 x:testSolrCloudCollection_shard2_replica2] o.a.s.c.CachingDirectoryFactory Closing RAMDirectoryFactory - 2 directories currently being tracked
   [junit4]   2> 8114039 INFO  (coreCloseExecutor-2622-thread-1) [n:127.0.0.1:59197_solr c:testSolrCloudCollection s:shard2 r:core_node3 x:testSolrCloudCollection_shard2_replica2] o.a.s.c.CachingDirectoryFactory looking to close data/index [CachedDir<<refCount=0;path=data/index;done=false>>]
   [junit4]   2> 8114039 INFO  (coreCloseExecutor-2622-thread-1) [n:127.0.0.1:59197_solr c:testSolrCloudCollection s:shard2 r:core_node3 x:testSolrCloudCollection_shard2_replica2] o.a.s.c.CachingDirectoryFactory Closing directory: data/index
   [junit4]   2> 8114039 INFO  (coreCloseExecutor-2622-thread-1) [n:127.0.0.1:59197_solr c:testSolrCloudCollection s:shard2 r:core_node3 x:testSolrCloudCollection_shard2_replica2] o.a.s.c.CachingDirectoryFactory looking to close data [CachedDir<<refCount=0;path=data;done=false>>]
   [junit4]   2> 8114039 INFO  (coreCloseExecutor-2622-thread-1) [n:127.0.0.1:59197_solr c:testSolrCloudCollection s:shard2 r:core_node3 x:testSolrCloudCollection_shard2_replica2] o.a.s.c.CachingDirectoryFactory Closing directory: data
   [junit4]   2> 8114040 INFO  (jetty-launcher-742-thread-9) [    ] o.e.j.s.h.ContextHandler Stopped o.e.j.s.ServletContextHandler@7e36f54d{/solr,null,UNAVAILABLE}
   [junit4]   2> 8114041 INFO  (jetty-launcher-742-thread-8) [    ] o.e.j.s.h.ContextHandler Stopped o.e.j.s.ServletContextHandler@f39c11d{/solr,null,UNAVAILABLE}
   [junit4]   2> 8114046 INFO  (TEST-BasicAuthIntegrationTest.testBasics-seed#[DEAF2CE2912C3338]) [    ] o.a.s.c.ZkTestServer connecting to 127.0.0.1:40701 40701
   [junit4]   2> 8114416 WARN  (jetty-launcher-742-thread-4-SendThread(127.0.0.1:40701)) [n:127.0.0.1:49107_solr    ] o.a.z.c.StaticHostProvider Unexpected exception
   [junit4]   2> java.lang.InterruptedException: sleep interrupted
   [junit4]   2> 	at java.lang.Thread.sleep(Native Method)
   [junit4]   2> 	at org.apache.zookeeper.client.StaticHostProvider.next(StaticHostProvider.java:101)
   [junit4]   2> 	at org.apache.zookeeper.ClientCnxn$SendThread.startConnect(ClientCnxn.java:940)
   [junit4]   2> 	at org.apache.zookeeper.ClientCnxn$SendThread.run(ClientCnxn.java:1003)
   [junit4]   2> 8114416 WARN  (TEST-BasicAuthIntegrationTest.testBasics-seed#[DEAF2CE2912C3338]-SendThread(127.0.0.1:40701)) [n:127.0.0.1:59197_solr    ] o.a.z.c.StaticHostProvider Unexpected exception
   [junit4]   2> java.lang.InterruptedException: sleep interrupted
   [junit4]   2> 	at java.lang.Thread.sleep(Native Method)
   [junit4]   2> 	at org.apache.zookeeper.client.StaticHostProvider.next(StaticHostProvider.java:101)
   [junit4]   2> 	at org.apache.zookeeper.ClientCnxn$SendThread.startConnect(ClientCnxn.java:940)
   [junit4]   2> 	at org.apache.zookeeper.ClientCnxn$SendThread.run(ClientCnxn.java:1003)
   [junit4]   2> 8114416 WARN  (TEST-BasicAuthIntegrationTest.testBasics-seed#[DEAF2CE2912C3338]-SendThread(127.0.0.1:40701)) [n:127.0.0.1:60215_solr    ] o.a.z.c.StaticHostProvider Unexpected exception
   [junit4]   2> java.lang.InterruptedException: sleep interrupted
   [junit4]   2> 	at java.lang.Thread.sleep(Native Method)
   [junit4]   2> 	at org.apache.zookeeper.client.StaticHostProvider.next(StaticHostProvider.java:101)
   [junit4]   2> 	at org.apache.zookeeper.ClientCnxn$SendThread.startConnect(ClientCnxn.java:940)
   [junit4]   2> 	at org.apache.zookeeper.ClientCnxn$SendThread.run(ClientCnxn.java:1003)
   [junit4]   2> 8114416 WARN  (jetty-launcher-742-thread-5-SendThread(127.0.0.1:40701)) [n:127.0.0.1:40135_solr    ] o.a.z.c.StaticHostProvider Unexpected exception
   [junit4]   2> java.lang.InterruptedException: sleep interrupted
   [junit4]   2> 	at java.lang.Thread.sleep(Native Method)
   [junit4]   2> 	at org.apache.zookeeper.client.StaticHostProvider.next(StaticHostProvider.java:101)
   [junit4]   2> 	at org.apache.zookeeper.ClientCnxn$SendThread.startConnect(ClientCnxn.java:940)
   [junit4]   2> 	at org.apache.zookeeper.ClientCnxn$SendThread.run(ClientCnxn.java:1003)
   [junit4]   2> 8114416 WARN  (TEST-BasicAuthIntegrationTest.testBasics-seed#[DEAF2CE2912C3338]-SendThread(127.0.0.1:40701)) [n:127.0.0.1:33013_solr    ] o.a.z.c.StaticHostProvider Unexpected exception
   [junit4]   2> java.lang.InterruptedException: sleep interrupted
   [junit4]   2> 	at java.lang.Thread.sleep(Native Method)
   [junit4]   2> 	at org.apache.zookeeper.client.StaticHostProvider.next(StaticHostProvider.java:101)
   [junit4]   2> 	at org.apache.zookeeper.ClientCnxn$SendThread.startConnect(ClientCnxn.java:940)
   [junit4]   2> 	at org.apache.zookeeper.ClientCnxn$SendThread.run(ClientCnxn.java:1003)
   [junit4]   2> NOTE: leaving temporary files on disk at: /x1/jenkins/jenkins-slave/workspace/Lucene-Solr-Tests-5.5-Java8/solr/build/solr-core/test/J0/temp/solr.security.BasicAuthIntegrationTest_DEAF2CE2912C3338-001
   [junit4]   2> Apr 28, 2016 5:30:54 AM com.carrotsearch.randomizedtesting.ThreadLeakControl tryToInterruptAll
   [junit4]   2> INFO: All leaked threads terminated.
   [junit4]   2> NOTE: test params are: codec=Lucene54, sim=RandomSimilarity(queryNorm=false,coord=no): {}, locale=ca-ES, timezone=Asia/Karachi
   [junit4]   2> NOTE: Linux 3.13.0-85-generic amd64/Oracle Corporation 1.8.0_74 (64-bit)/cpus=4,threads=2,free=242258128,total=529530880
   [junit4]   2> NOTE: All tests run in this JVM: [PathHierarchyTokenizerFactoryTest, XsltUpdateRequestHandlerTest, TestOnReconnectListenerSupport, TestComponentsName, LeaderFailoverAfterPartitionTest, CopyFieldTest, TestAnalyzedSuggestions, QueryElevationComponentTest, PrimUtilsTest, TestInitParams, TestManagedStopFilterFactory, DisMaxRequestHandlerTest, UUIDUpdateProcessorFallbackTest, TestShardHandlerFactory, MigrateRouteKeyTest, TestBlendedInfixSuggestions, AnalyticsMergeStrategyTest, TestXmlQParser, TestRestoreCore, VersionInfoTest, TestRangeQuery, TestLMDirichletSimilarityFactory, SolrCoreTest, CleanupOldIndexTest, ResponseHeaderTest, ZkNodePropsTest, BasicDistributedZkTest, TestBinaryField, ShardSplitTest, ExternalFileFieldSortTest, PingRequestHandlerTest, TestExactSharedStatsCache, RequiredFieldsTest, AsyncCallRequestStatusResponseTest, TriLevelCompositeIdRoutingTest, CoreAdminCreateDiscoverTest, IndexSchemaRuntimeFieldTest, TestIBSimilarityFactory, CloudMLTQParserTest, TestConfigSetImmutable, ConnectionManagerTest, ResponseLogComponentTest, OverseerStatusTest, TestDistributedSearch, BigEndianAscendingWordDeserializerTest, JavabinLoaderTest, RAMDirectoryFactoryTest, ZkStateWriterTest, TestDFISimilarityFactory, PreAnalyzedFieldTest, TestDynamicFieldCollectionResource, TestManagedResourceStorage, PolyFieldTest, TestCloudManagedSchema, HdfsBasicDistributedZkTest, TestRandomFaceting, TestOrdValues, AddBlockUpdateTest, OverriddenZkACLAndCredentialsProvidersTest, HdfsDirectoryFactoryTest, EchoParamsTest, CurrencyFieldOpenExchangeTest, EnumFieldTest, TestStressLucene, TestRealTimeGet, DistributedQueryElevationComponentTest, TestLeaderElectionZkExpiry, TestSchemaSimilarityResource, RollingRestartTest, BlockJoinFacetDistribTest, ExplicitHLLTest, TestExpandComponent, BasicAuthIntegrationTest]
   [junit4]   2> NOTE: reproduce with: ant test  -Dtestcase=BasicAuthIntegrationTest -Dtests.seed=DEAF2CE2912C3338 -Dtests.multiplier=2 -Dtests.slow=true -Dtests.locale=ca-ES -Dtests.timezone=Asia/Karachi -Dtests.asserts=true -Dtests.file.encoding=US-ASCII
   [junit4] ERROR   0.00s J0 | BasicAuthIntegrationTest (suite) <<<
   [junit4]    > Throwable #1: java.lang.Exception: Suite timeout exceeded (>= 7200000 msec).
   [junit4]    > 	at __randomizedtesting.SeedInfo.seed([DEAF2CE2912C3338]:0)
   [junit4] Completed [550/572 (1!)] on J0 in 7221.59s, 1 test, 2 errors <<< FAILURES!

[...truncated 81 lines...]
BUILD FAILED
/x1/jenkins/jenkins-slave/workspace/Lucene-Solr-Tests-5.5-Java8/build.xml:750: The following error occurred while executing this line:
/x1/jenkins/jenkins-slave/workspace/Lucene-Solr-Tests-5.5-Java8/build.xml:694: The following error occurred while executing this line:
/x1/jenkins/jenkins-slave/workspace/Lucene-Solr-Tests-5.5-Java8/build.xml:59: The following error occurred while executing this line:
/x1/jenkins/jenkins-slave/workspace/Lucene-Solr-Tests-5.5-Java8/solr/build.xml:233: The following error occurred while executing this line:
/x1/jenkins/jenkins-slave/workspace/Lucene-Solr-Tests-5.5-Java8/solr/common-build.xml:534: The following error occurred while executing this line:
/x1/jenkins/jenkins-slave/workspace/Lucene-Solr-Tests-5.5-Java8/lucene/common-build.xml:1477: The following error occurred while executing this line:
/x1/jenkins/jenkins-slave/workspace/Lucene-Solr-Tests-5.5-Java8/lucene/common-build.xml:1033: There were test failures: 572 suites (7 ignored), 2293 tests, 1 suite-level error, 1 error, 55 ignored (39 assumptions) [seed: DEAF2CE2912C3338]

Total time: 159 minutes 40 seconds
Build step 'Invoke Ant' marked build as failure
Archiving artifacts
Recording test results
Email was triggered for: Failure - Any
Sending email for trigger: Failure - Any




Mime
View raw message