lucene-dev mailing list archives

Site index · List index
Message view « Date » · « Thread »
Top « Date » · « Thread »
From Policeman Jenkins Server <jenk...@thetaphi.de>
Subject [JENKINS] Lucene-Solr-master-Windows (64bit/jdk1.8.0_92) - Build # 5804 - Failure!
Date Wed, 27 Apr 2016 22:21:59 GMT
Build: http://jenkins.thetaphi.de/job/Lucene-Solr-master-Windows/5804/
Java: 64bit/jdk1.8.0_92 -XX:+UseCompressedOops -XX:+UseParallelGC

1 tests failed.
FAILED:  org.apache.solr.handler.TestReplicationHandler.doTestIndexAndConfigAliasReplication

Error Message:
Index: 0, Size: 0

Stack Trace:
java.lang.IndexOutOfBoundsException: Index: 0, Size: 0
	at __randomizedtesting.SeedInfo.seed([B2CDAAABBE2C88D6:45BE44F378C42730]:0)
	at java.util.ArrayList.rangeCheck(ArrayList.java:653)
	at java.util.ArrayList.get(ArrayList.java:429)
	at org.apache.solr.handler.TestReplicationHandler.doTestIndexAndConfigAliasReplication(TestReplicationHandler.java:1248)
	at sun.reflect.NativeMethodAccessorImpl.invoke0(Native Method)
	at sun.reflect.NativeMethodAccessorImpl.invoke(NativeMethodAccessorImpl.java:62)
	at sun.reflect.DelegatingMethodAccessorImpl.invoke(DelegatingMethodAccessorImpl.java:43)
	at java.lang.reflect.Method.invoke(Method.java:498)
	at com.carrotsearch.randomizedtesting.RandomizedRunner.invoke(RandomizedRunner.java:1764)
	at com.carrotsearch.randomizedtesting.RandomizedRunner$8.evaluate(RandomizedRunner.java:871)
	at com.carrotsearch.randomizedtesting.RandomizedRunner$9.evaluate(RandomizedRunner.java:907)
	at com.carrotsearch.randomizedtesting.RandomizedRunner$10.evaluate(RandomizedRunner.java:921)
	at com.carrotsearch.randomizedtesting.rules.SystemPropertiesRestoreRule$1.evaluate(SystemPropertiesRestoreRule.java:57)
	at org.apache.lucene.util.TestRuleSetupTeardownChained$1.evaluate(TestRuleSetupTeardownChained.java:49)
	at org.apache.lucene.util.AbstractBeforeAfterRule$1.evaluate(AbstractBeforeAfterRule.java:45)
	at org.apache.lucene.util.TestRuleThreadAndTestName$1.evaluate(TestRuleThreadAndTestName.java:48)
	at org.apache.lucene.util.TestRuleIgnoreAfterMaxFailures$1.evaluate(TestRuleIgnoreAfterMaxFailures.java:64)
	at org.apache.lucene.util.TestRuleMarkFailure$1.evaluate(TestRuleMarkFailure.java:47)
	at com.carrotsearch.randomizedtesting.rules.StatementAdapter.evaluate(StatementAdapter.java:36)
	at com.carrotsearch.randomizedtesting.ThreadLeakControl$StatementRunner.run(ThreadLeakControl.java:367)
	at com.carrotsearch.randomizedtesting.ThreadLeakControl.forkTimeoutingTask(ThreadLeakControl.java:809)
	at com.carrotsearch.randomizedtesting.ThreadLeakControl$3.evaluate(ThreadLeakControl.java:460)
	at com.carrotsearch.randomizedtesting.RandomizedRunner.runSingleTest(RandomizedRunner.java:880)
	at com.carrotsearch.randomizedtesting.RandomizedRunner$5.evaluate(RandomizedRunner.java:781)
	at com.carrotsearch.randomizedtesting.RandomizedRunner$6.evaluate(RandomizedRunner.java:816)
	at com.carrotsearch.randomizedtesting.RandomizedRunner$7.evaluate(RandomizedRunner.java:827)
	at com.carrotsearch.randomizedtesting.rules.StatementAdapter.evaluate(StatementAdapter.java:36)
	at com.carrotsearch.randomizedtesting.rules.SystemPropertiesRestoreRule$1.evaluate(SystemPropertiesRestoreRule.java:57)
	at org.apache.lucene.util.AbstractBeforeAfterRule$1.evaluate(AbstractBeforeAfterRule.java:45)
	at com.carrotsearch.randomizedtesting.rules.StatementAdapter.evaluate(StatementAdapter.java:36)
	at org.apache.lucene.util.TestRuleStoreClassName$1.evaluate(TestRuleStoreClassName.java:41)
	at com.carrotsearch.randomizedtesting.rules.NoShadowingOrOverridesOnMethodsRule$1.evaluate(NoShadowingOrOverridesOnMethodsRule.java:40)
	at com.carrotsearch.randomizedtesting.rules.NoShadowingOrOverridesOnMethodsRule$1.evaluate(NoShadowingOrOverridesOnMethodsRule.java:40)
	at com.carrotsearch.randomizedtesting.rules.StatementAdapter.evaluate(StatementAdapter.java:36)
	at com.carrotsearch.randomizedtesting.rules.StatementAdapter.evaluate(StatementAdapter.java:36)
	at com.carrotsearch.randomizedtesting.rules.StatementAdapter.evaluate(StatementAdapter.java:36)
	at org.apache.lucene.util.TestRuleAssertionsRequired$1.evaluate(TestRuleAssertionsRequired.java:53)
	at org.apache.lucene.util.TestRuleMarkFailure$1.evaluate(TestRuleMarkFailure.java:47)
	at org.apache.lucene.util.TestRuleIgnoreAfterMaxFailures$1.evaluate(TestRuleIgnoreAfterMaxFailures.java:64)
	at org.apache.lucene.util.TestRuleIgnoreTestSuites$1.evaluate(TestRuleIgnoreTestSuites.java:54)
	at com.carrotsearch.randomizedtesting.rules.StatementAdapter.evaluate(StatementAdapter.java:36)
	at com.carrotsearch.randomizedtesting.ThreadLeakControl$StatementRunner.run(ThreadLeakControl.java:367)
	at java.lang.Thread.run(Thread.java:745)




Build Log:
[...truncated 11559 lines...]
   [junit4] Suite: org.apache.solr.handler.TestReplicationHandler
   [junit4]   2> Creating dataDir: C:\Users\jenkins\workspace\Lucene-Solr-master-Windows\solr\build\solr-core\test\J1\temp\solr.handler.TestReplicationHandler_B2CDAAABBE2C88D6-001\init-core-data-001
   [junit4]   2> 1695742 INFO  (TEST-TestReplicationHandler.doTestReplicateAfterStartupWithNoActivity-seed#[B2CDAAABBE2C88D6]) [    ] o.a.s.SolrTestCaseJ4 ###Starting doTestReplicateAfterStartupWithNoActivity
   [junit4]   2> 1695743 INFO  (TEST-TestReplicationHandler.doTestReplicateAfterStartupWithNoActivity-seed#[B2CDAAABBE2C88D6]) [    ] o.a.s.SolrTestCaseJ4 Writing core.properties file to C:\Users\jenkins\workspace\Lucene-Solr-master-Windows\solr\build\solr-core\test\J1\temp\solr.handler.TestReplicationHandler_B2CDAAABBE2C88D6-001\solr-instance-001\collection1
   [junit4]   2> 1695761 INFO  (TEST-TestReplicationHandler.doTestReplicateAfterStartupWithNoActivity-seed#[B2CDAAABBE2C88D6]) [    ] o.e.j.s.Server jetty-9.3.8.v20160314
   [junit4]   2> 1695762 INFO  (TEST-TestReplicationHandler.doTestReplicateAfterStartupWithNoActivity-seed#[B2CDAAABBE2C88D6]) [    ] o.e.j.s.h.ContextHandler Started o.e.j.s.ServletContextHandler@20e9cc55{/solr,null,AVAILABLE}
   [junit4]   2> 1695763 INFO  (TEST-TestReplicationHandler.doTestReplicateAfterStartupWithNoActivity-seed#[B2CDAAABBE2C88D6]) [    ] o.e.j.s.ServerConnector Started ServerConnector@43835d5d{HTTP/1.1,[http/1.1]}{127.0.0.1:63503}
   [junit4]   2> 1695763 INFO  (TEST-TestReplicationHandler.doTestReplicateAfterStartupWithNoActivity-seed#[B2CDAAABBE2C88D6]) [    ] o.e.j.s.Server Started @1700506ms
   [junit4]   2> 1695763 INFO  (TEST-TestReplicationHandler.doTestReplicateAfterStartupWithNoActivity-seed#[B2CDAAABBE2C88D6]) [    ] o.a.s.c.s.e.JettySolrRunner Jetty properties: {solr.data.dir=C:\Users\jenkins\workspace\Lucene-Solr-master-Windows\solr\build\solr-core\test\J1\temp\solr.handler.TestReplicationHandler_B2CDAAABBE2C88D6-001\solr-instance-001\collection1\data, hostContext=/solr, hostPort=63503}
   [junit4]   2> 1695763 INFO  (TEST-TestReplicationHandler.doTestReplicateAfterStartupWithNoActivity-seed#[B2CDAAABBE2C88D6]) [    ] o.a.s.s.SolrDispatchFilter SolrDispatchFilter.init(): sun.misc.Launcher$AppClassLoader@73d16e93
   [junit4]   2> 1695764 INFO  (TEST-TestReplicationHandler.doTestReplicateAfterStartupWithNoActivity-seed#[B2CDAAABBE2C88D6]) [    ] o.a.s.c.SolrResourceLoader new SolrResourceLoader for directory: 'C:\Users\jenkins\workspace\Lucene-Solr-master-Windows\solr\build\solr-core\test\J1\temp\solr.handler.TestReplicationHandler_B2CDAAABBE2C88D6-001\solr-instance-001'
   [junit4]   2> 1695764 INFO  (TEST-TestReplicationHandler.doTestReplicateAfterStartupWithNoActivity-seed#[B2CDAAABBE2C88D6]) [    ] o.a.s.c.SolrResourceLoader JNDI not configured for solr (NoInitialContextEx)
   [junit4]   2> 1695764 INFO  (TEST-TestReplicationHandler.doTestReplicateAfterStartupWithNoActivity-seed#[B2CDAAABBE2C88D6]) [    ] o.a.s.c.SolrResourceLoader solr home defaulted to 'solr/' (could not find system property or JNDI)
   [junit4]   2> 1695765 INFO  (TEST-TestReplicationHandler.doTestReplicateAfterStartupWithNoActivity-seed#[B2CDAAABBE2C88D6]) [    ] o.a.s.c.SolrXmlConfig Loading container configuration from C:\Users\jenkins\workspace\Lucene-Solr-master-Windows\solr\build\solr-core\test\J1\temp\solr.handler.TestReplicationHandler_B2CDAAABBE2C88D6-001\solr-instance-001\solr.xml
   [junit4]   2> 1695777 INFO  (TEST-TestReplicationHandler.doTestReplicateAfterStartupWithNoActivity-seed#[B2CDAAABBE2C88D6]) [    ] o.a.s.c.CorePropertiesLocator Config-defined core root directory: C:\Users\jenkins\workspace\Lucene-Solr-master-Windows\solr\build\solr-core\test\J1\temp\solr.handler.TestReplicationHandler_B2CDAAABBE2C88D6-001\solr-instance-001\.
   [junit4]   2> 1695777 INFO  (TEST-TestReplicationHandler.doTestReplicateAfterStartupWithNoActivity-seed#[B2CDAAABBE2C88D6]) [    ] o.a.s.c.CoreContainer New CoreContainer 1421901467
   [junit4]   2> 1695777 INFO  (TEST-TestReplicationHandler.doTestReplicateAfterStartupWithNoActivity-seed#[B2CDAAABBE2C88D6]) [    ] o.a.s.c.CoreContainer Loading cores into CoreContainer [instanceDir=C:\Users\jenkins\workspace\Lucene-Solr-master-Windows\solr\build\solr-core\test\J1\temp\solr.handler.TestReplicationHandler_B2CDAAABBE2C88D6-001\solr-instance-001]
   [junit4]   2> 1695777 WARN  (TEST-TestReplicationHandler.doTestReplicateAfterStartupWithNoActivity-seed#[B2CDAAABBE2C88D6]) [    ] o.a.s.c.CoreContainer Couldn't add files from C:\Users\jenkins\workspace\Lucene-Solr-master-Windows\solr\build\solr-core\test\J1\temp\solr.handler.TestReplicationHandler_B2CDAAABBE2C88D6-001\solr-instance-001\lib to classpath: C:\Users\jenkins\workspace\Lucene-Solr-master-Windows\solr\build\solr-core\test\J1\temp\solr.handler.TestReplicationHandler_B2CDAAABBE2C88D6-001\solr-instance-001\lib
   [junit4]   2> 1695777 INFO  (TEST-TestReplicationHandler.doTestReplicateAfterStartupWithNoActivity-seed#[B2CDAAABBE2C88D6]) [    ] o.a.s.h.c.HttpShardHandlerFactory created with socketTimeout : 90000,urlScheme : ,connTimeout : 15000,maxConnectionsPerHost : 20,maxConnections : 10000,corePoolSize : 0,maximumPoolSize : 2147483647,maxThreadIdleTime : 5,sizeOfQueue : -1,fairnessPolicy : false,
   [junit4]   2> 1695780 INFO  (TEST-TestReplicationHandler.doTestReplicateAfterStartupWithNoActivity-seed#[B2CDAAABBE2C88D6]) [    ] o.a.s.u.UpdateShardHandler Creating UpdateShardHandler HTTP client with params: 
   [junit4]   2> 1695781 INFO  (TEST-TestReplicationHandler.doTestReplicateAfterStartupWithNoActivity-seed#[B2CDAAABBE2C88D6]) [    ] o.a.s.l.LogWatcher SLF4J impl is org.slf4j.impl.Log4jLoggerFactory
   [junit4]   2> 1695781 INFO  (TEST-TestReplicationHandler.doTestReplicateAfterStartupWithNoActivity-seed#[B2CDAAABBE2C88D6]) [    ] o.a.s.l.LogWatcher Registering Log Listener [Log4j (org.slf4j.impl.Log4jLoggerFactory)]
   [junit4]   2> 1695782 INFO  (TEST-TestReplicationHandler.doTestReplicateAfterStartupWithNoActivity-seed#[B2CDAAABBE2C88D6]) [    ] o.a.s.c.CoreContainer Security conf doesn't exist. Skipping setup for authorization module.
   [junit4]   2> 1695782 INFO  (TEST-TestReplicationHandler.doTestReplicateAfterStartupWithNoActivity-seed#[B2CDAAABBE2C88D6]) [    ] o.a.s.c.CoreContainer No authentication plugin used.
   [junit4]   2> 1695783 INFO  (TEST-TestReplicationHandler.doTestReplicateAfterStartupWithNoActivity-seed#[B2CDAAABBE2C88D6]) [    ] o.a.s.c.CorePropertiesLocator Looking for core definitions underneath C:\Users\jenkins\workspace\Lucene-Solr-master-Windows\solr\build\solr-core\test\J1\temp\solr.handler.TestReplicationHandler_B2CDAAABBE2C88D6-001\solr-instance-001\.
   [junit4]   2> 1695786 INFO  (TEST-TestReplicationHandler.doTestReplicateAfterStartupWithNoActivity-seed#[B2CDAAABBE2C88D6]) [    ] o.a.s.c.CoreDescriptor Created CoreDescriptor: {name=collection1, config=solrconfig.xml, loadOnStartup=true, schema=schema.xml, configSetProperties=configsetprops.json, transient=false, dataDir=data\}
   [junit4]   2> 1695787 INFO  (TEST-TestReplicationHandler.doTestReplicateAfterStartupWithNoActivity-seed#[B2CDAAABBE2C88D6]) [    ] o.a.s.c.CorePropertiesLocator Found core collection1 in C:\Users\jenkins\workspace\Lucene-Solr-master-Windows\solr\build\solr-core\test\J1\temp\solr.handler.TestReplicationHandler_B2CDAAABBE2C88D6-001\solr-instance-001\.\collection1
   [junit4]   2> 1695787 INFO  (TEST-TestReplicationHandler.doTestReplicateAfterStartupWithNoActivity-seed#[B2CDAAABBE2C88D6]) [    ] o.a.s.c.CorePropertiesLocator Found 1 core definitions
   [junit4]   2> 1695788 INFO  (TEST-TestReplicationHandler.doTestReplicateAfterStartupWithNoActivity-seed#[B2CDAAABBE2C88D6]) [    ] o.a.s.s.SolrDispatchFilter user.dir=C:\Users\jenkins\workspace\Lucene-Solr-master-Windows\solr\build\solr-core\test\J1
   [junit4]   2> 1695788 INFO  (TEST-TestReplicationHandler.doTestReplicateAfterStartupWithNoActivity-seed#[B2CDAAABBE2C88D6]) [    ] o.a.s.s.SolrDispatchFilter SolrDispatchFilter.init() done
   [junit4]   2> 1695788 INFO  (coreLoadExecutor-5562-thread-1) [    ] o.a.s.c.SolrResourceLoader new SolrResourceLoader for directory: 'C:\Users\jenkins\workspace\Lucene-Solr-master-Windows\solr\build\solr-core\test\J1\temp\solr.handler.TestReplicationHandler_B2CDAAABBE2C88D6-001\solr-instance-001\collection1'
   [junit4]   2> 1695788 INFO  (coreLoadExecutor-5562-thread-1) [    ] o.a.s.c.SolrResourceLoader JNDI not configured for solr (NoInitialContextEx)
   [junit4]   2> 1695788 INFO  (coreLoadExecutor-5562-thread-1) [    ] o.a.s.c.SolrResourceLoader solr home defaulted to 'solr/' (could not find system property or JNDI)
   [junit4]   2> 1695815 INFO  (coreLoadExecutor-5562-thread-1) [    ] o.a.s.c.SolrConfig current version of requestparams : -1
   [junit4]   2> 1695818 INFO  (coreLoadExecutor-5562-thread-1) [    ] o.a.s.c.SolrConfig Using Lucene MatchVersion: 7.0.0
   [junit4]   2> 1695822 INFO  (coreLoadExecutor-5562-thread-1) [    ] o.a.s.c.SolrConfig Loaded SolrConfig: solrconfig.xml
   [junit4]   2> 1695825 INFO  (coreLoadExecutor-5562-thread-1) [    ] o.a.s.s.IndexSchema [collection1] Schema name=test
   [junit4]   2> 1695831 INFO  (coreLoadExecutor-5562-thread-1) [    ] o.a.s.s.IndexSchema unique key field: id
   [junit4]   2> 1695837 INFO  (coreLoadExecutor-5562-thread-1) [    ] o.a.s.c.ConfigSetProperties Did not find ConfigSet properties, assuming default properties: Can't find resource 'configsetprops.json' in classpath or 'C:\Users\jenkins\workspace\Lucene-Solr-master-Windows\solr\build\solr-core\test\J1\temp\solr.handler.TestReplicationHandler_B2CDAAABBE2C88D6-001\solr-instance-001\collection1'
   [junit4]   2> 1695838 INFO  (coreLoadExecutor-5562-thread-1) [    ] o.a.s.c.CoreContainer Creating SolrCore 'collection1' using configuration from instancedir C:\Users\jenkins\workspace\Lucene-Solr-master-Windows\solr\build\solr-core\test\J1\temp\solr.handler.TestReplicationHandler_B2CDAAABBE2C88D6-001\solr-instance-001\.\collection1
   [junit4]   2> 1695838 INFO  (coreLoadExecutor-5562-thread-1) [    x:collection1] o.a.s.c.SolrCore org.apache.solr.core.MockDirectoryFactory
   [junit4]   2> 1695838 INFO  (coreLoadExecutor-5562-thread-1) [    x:collection1] o.a.s.c.SolrCore [[collection1] ] Opening new SolrCore at [C:\Users\jenkins\workspace\Lucene-Solr-master-Windows\solr\build\solr-core\test\J1\temp\solr.handler.TestReplicationHandler_B2CDAAABBE2C88D6-001\solr-instance-001\collection1], dataDir=[C:\Users\jenkins\workspace\Lucene-Solr-master-Windows\solr\build\solr-core\test\J1\temp\solr.handler.TestReplicationHandler_B2CDAAABBE2C88D6-001\solr-instance-001\.\collection1\data\]
   [junit4]   2> 1695838 INFO  (coreLoadExecutor-5562-thread-1) [    x:collection1] o.a.s.c.SolrCore JMX monitoring not detected for core: collection1
   [junit4]   2> 1695838 INFO  (coreLoadExecutor-5562-thread-1) [    x:collection1] o.a.s.c.CachingDirectoryFactory return new directory for C:\Users\jenkins\workspace\Lucene-Solr-master-Windows\solr\build\solr-core\test\J1\temp\solr.handler.TestReplicationHandler_B2CDAAABBE2C88D6-001\solr-instance-001\.\collection1\data\
   [junit4]   2> 1695838 INFO  (coreLoadExecutor-5562-thread-1) [    x:collection1] o.a.s.c.SolrCore New index directory detected: old=null new=C:\Users\jenkins\workspace\Lucene-Solr-master-Windows\solr\build\solr-core\test\J1\temp\solr.handler.TestReplicationHandler_B2CDAAABBE2C88D6-001\solr-instance-001\.\collection1\data\index/
   [junit4]   2> 1695838 WARN  (coreLoadExecutor-5562-thread-1) [    x:collection1] o.a.s.c.SolrCore [collection1] Solr index directory 'C:\Users\jenkins\workspace\Lucene-Solr-master-Windows\solr\build\solr-core\test\J1\temp\solr.handler.TestReplicationHandler_B2CDAAABBE2C88D6-001\solr-instance-001\.\collection1\data\index' doesn't exist. Creating new index...
   [junit4]   2> 1695839 INFO  (coreLoadExecutor-5562-thread-1) [    x:collection1] o.a.s.c.CachingDirectoryFactory return new directory for C:\Users\jenkins\workspace\Lucene-Solr-master-Windows\solr\build\solr-core\test\J1\temp\solr.handler.TestReplicationHandler_B2CDAAABBE2C88D6-001\solr-instance-001\.\collection1\data\index
   [junit4]   2> 1695839 INFO  (coreLoadExecutor-5562-thread-1) [    x:collection1] o.a.s.u.RandomMergePolicy RandomMergePolicy wrapping class org.apache.lucene.index.AlcoholicMergePolicy: [AlcoholicMergePolicy: minMergeSize=0, mergeFactor=10, maxMergeSize=655720530, maxMergeSizeForForcedMerge=9223372036854775807, calibrateSizeByDeletes=true, maxMergeDocs=2147483647, maxCFSSegmentSizeMB=8.796093022207999E12, noCFSRatio=0.1]
   [junit4]   2> 1695839 INFO  (coreLoadExecutor-5562-thread-1) [    x:collection1] o.a.s.c.SolrDeletionPolicy SolrDeletionPolicy.onCommit: commits: num=1
   [junit4]   2> 	commit{dir=MockDirectoryWrapper(RAMDirectory@7ba9205a lockFactory=org.apache.lucene.store.SingleInstanceLockFactory@29a2d215),segFN=segments_1,generation=1}
   [junit4]   2> 1695839 INFO  (coreLoadExecutor-5562-thread-1) [    x:collection1] o.a.s.c.SolrDeletionPolicy newest commit generation = 1
   [junit4]   2> 1695840 INFO  (OldIndexDirectoryCleanupThreadForCore-collection1) [    x:collection1] o.a.s.c.SolrCore Looking for old index directories to cleanup for core collection1 in C:\Users\jenkins\workspace\Lucene-Solr-master-Windows\solr\build\solr-core\test\J1\temp\solr.handler.TestReplicationHandler_B2CDAAABBE2C88D6-001\solr-instance-001\.\collection1\data\
   [junit4]   2> 1695841 INFO  (coreLoadExecutor-5562-thread-1) [    x:collection1] o.a.s.c.SolrCore no updateRequestProcessorChain defined as default, creating implicit default
   [junit4]   2> 1695857 INFO  (coreLoadExecutor-5562-thread-1) [    x:collection1] o.a.s.h.l.XMLLoader xsltCacheLifetimeSeconds=60
   [junit4]   2> 1695858 INFO  (coreLoadExecutor-5562-thread-1) [    x:collection1] o.a.s.h.l.XMLLoader xsltCacheLifetimeSeconds=60
   [junit4]   2> 1695859 INFO  (coreLoadExecutor-5562-thread-1) [    x:collection1] o.a.s.h.l.XMLLoader xsltCacheLifetimeSeconds=60
   [junit4]   2> 1695861 INFO  (coreLoadExecutor-5562-thread-1) [    x:collection1] o.a.s.h.l.XMLLoader xsltCacheLifetimeSeconds=60
   [junit4]   2> 1695863 INFO  (coreLoadExecutor-5562-thread-1) [    x:collection1] o.a.s.c.PluginBag requestHandler : 'lazy' created with startup=lazy 
   [junit4]   2> 1695863 INFO  (coreLoadExecutor-5562-thread-1) [    x:collection1] o.a.s.c.RequestHandlers Registered paths: /admin/mbeans,standard,lazy,/update/json/docs,/admin/luke,/export,/get,/admin/properties,/update/json,/admin/threads,/update/csv,/sql,/admin/segments,/admin/system,/replication,defaults,/config,/stream,/schema,/admin/plugins,/admin/logging,/admin/ping,/update,/admin/file
   [junit4]   2> 1695863 INFO  (coreLoadExecutor-5562-thread-1) [    x:collection1] o.a.s.c.SolrCore Using default statsCache cache: org.apache.solr.search.stats.LocalStatsCache
   [junit4]   2> 1695863 INFO  (coreLoadExecutor-5562-thread-1) [    x:collection1] o.a.s.u.CommitTracker Hard AutoCommit: disabled
   [junit4]   2> 1695863 INFO  (coreLoadExecutor-5562-thread-1) [    x:collection1] o.a.s.u.CommitTracker Soft AutoCommit: disabled
   [junit4]   2> 1695863 INFO  (coreLoadExecutor-5562-thread-1) [    x:collection1] o.a.s.u.RandomMergePolicy RandomMergePolicy wrapping class org.apache.lucene.index.TieredMergePolicy: [TieredMergePolicy: maxMergeAtOnce=18, maxMergeAtOnceExplicit=10, maxMergedSegmentMB=40.794921875, floorSegmentMB=0.2255859375, forceMergeDeletesPctAllowed=19.961101649621067, segmentsPerTier=29.0, maxCFSSegmentSizeMB=8.796093022207999E12, noCFSRatio=0.0
   [junit4]   2> 1695864 INFO  (coreLoadExecutor-5562-thread-1) [    x:collection1] o.a.s.c.SolrDeletionPolicy SolrDeletionPolicy.onInit: commits: num=1
   [junit4]   2> 	commit{dir=MockDirectoryWrapper(RAMDirectory@7ba9205a lockFactory=org.apache.lucene.store.SingleInstanceLockFactory@29a2d215),segFN=segments_1,generation=1}
   [junit4]   2> 1695864 INFO  (coreLoadExecutor-5562-thread-1) [    x:collection1] o.a.s.c.SolrDeletionPolicy newest commit generation = 1
   [junit4]   2> 1695864 INFO  (coreLoadExecutor-5562-thread-1) [    x:collection1] o.a.s.s.SolrIndexSearcher Opening [Searcher@27095cc0[collection1] main]
   [junit4]   2> 1695864 INFO  (coreLoadExecutor-5562-thread-1) [    x:collection1] o.a.s.r.ManagedResourceStorage File-based storage initialized to use dir: C:\Users\jenkins\workspace\Lucene-Solr-master-Windows\solr\build\solr-core\test\J1\temp\solr.handler.TestReplicationHandler_B2CDAAABBE2C88D6-001\solr-instance-001\collection1\conf
   [junit4]   2> 1695864 INFO  (coreLoadExecutor-5562-thread-1) [    x:collection1] o.a.s.r.RestManager Initializing RestManager with initArgs: {storageDir=C:\Users\jenkins\workspace\Lucene-Solr-master-Windows\solr\build\solr-core\test\J1\temp\solr.handler.TestReplicationHandler_B2CDAAABBE2C88D6-001\solr-instance-001\collection1\conf}
   [junit4]   2> 1695864 INFO  (coreLoadExecutor-5562-thread-1) [    x:collection1] o.a.s.r.ManagedResourceStorage Reading _rest_managed.json using file:dir=C:\Users\jenkins\workspace\Lucene-Solr-master-Windows\solr\build\solr-core\test\J1\temp\solr.handler.TestReplicationHandler_B2CDAAABBE2C88D6-001\solr-instance-001\collection1\conf
   [junit4]   2> 1695866 INFO  (coreLoadExecutor-5562-thread-1) [    x:collection1] o.a.s.r.RestManager Initializing 0 registered ManagedResources
   [junit4]   2> 1695866 INFO  (coreLoadExecutor-5562-thread-1) [    x:collection1] o.a.s.h.ReplicationHandler Replication enabled for following config files: schema.xml,xslt/dummy.xsl
   [junit4]   2> 1695866 INFO  (coreLoadExecutor-5562-thread-1) [    x:collection1] o.a.s.h.ReplicationHandler Commits will be reserved for  10000
   [junit4]   2> 1695866 INFO  (searcherExecutor-5563-thread-1-processing-x:collection1) [    x:collection1] o.a.s.c.SolrCore [collection1] Registered new searcher Searcher@27095cc0[collection1] main{ExitableDirectoryReader(UninvertingDirectoryReader())}
   [junit4]   2> 1695866 INFO  (coreLoadExecutor-5562-thread-1) [    x:collection1] o.a.s.c.CoreContainer registering core: collection1
   [junit4]   2> 1696296 INFO  (TEST-TestReplicationHandler.doTestReplicateAfterStartupWithNoActivity-seed#[B2CDAAABBE2C88D6]) [    ] o.a.s.SolrTestCaseJ4 Writing core.properties file to C:\Users\jenkins\workspace\Lucene-Solr-master-Windows\solr\build\solr-core\test\J1\temp\solr.handler.TestReplicationHandler_B2CDAAABBE2C88D6-001\solr-instance-002\collection1
   [junit4]   2> 1696308 INFO  (TEST-TestReplicationHandler.doTestReplicateAfterStartupWithNoActivity-seed#[B2CDAAABBE2C88D6]) [    ] o.e.j.s.Server jetty-9.3.8.v20160314
   [junit4]   2> 1696308 INFO  (TEST-TestReplicationHandler.doTestReplicateAfterStartupWithNoActivity-seed#[B2CDAAABBE2C88D6]) [    ] o.e.j.s.h.ContextHandler Started o.e.j.s.ServletContextHandler@3b1a45f5{/solr,null,AVAILABLE}
   [junit4]   2> 1696309 INFO  (TEST-TestReplicationHandler.doTestReplicateAfterStartupWithNoActivity-seed#[B2CDAAABBE2C88D6]) [    ] o.e.j.s.ServerConnector Started ServerConnector@49977d95{HTTP/1.1,[http/1.1]}{127.0.0.1:63507}
   [junit4]   2> 1696309 INFO  (TEST-TestReplicationHandler.doTestReplicateAfterStartupWithNoActivity-seed#[B2CDAAABBE2C88D6]) [    ] o.e.j.s.Server Started @1701053ms
   [junit4]   2> 1696309 INFO  (TEST-TestReplicationHandler.doTestReplicateAfterStartupWithNoActivity-seed#[B2CDAAABBE2C88D6]) [    ] o.a.s.c.s.e.JettySolrRunner Jetty properties: {solr.data.dir=C:\Users\jenkins\workspace\Lucene-Solr-master-Windows\solr\build\solr-core\test\J1\temp\solr.handler.TestReplicationHandler_B2CDAAABBE2C88D6-001\solr-instance-002\collection1\data, hostContext=/solr, hostPort=63507}
   [junit4]   2> 1696311 INFO  (TEST-TestReplicationHandler.doTestReplicateAfterStartupWithNoActivity-seed#[B2CDAAABBE2C88D6]) [    ] o.a.s.s.SolrDispatchFilter SolrDispatchFilter.init(): sun.misc.Launcher$AppClassLoader@73d16e93
   [junit4]   2> 1696311 INFO  (TEST-TestReplicationHandler.doTestReplicateAfterStartupWithNoActivity-seed#[B2CDAAABBE2C88D6]) [    ] o.a.s.c.SolrResourceLoader new SolrResourceLoader for directory: 'C:\Users\jenkins\workspace\Lucene-Solr-master-Windows\solr\build\solr-core\test\J1\temp\solr.handler.TestReplicationHandler_B2CDAAABBE2C88D6-001\solr-instance-002'
   [junit4]   2> 1696311 INFO  (TEST-TestReplicationHandler.doTestReplicateAfterStartupWithNoActivity-seed#[B2CDAAABBE2C88D6]) [    ] o.a.s.c.SolrResourceLoader JNDI not configured for solr (NoInitialContextEx)
   [junit4]   2> 1696311 INFO  (TEST-TestReplicationHandler.doTestReplicateAfterStartupWithNoActivity-seed#[B2CDAAABBE2C88D6]) [    ] o.a.s.c.SolrResourceLoader solr home defaulted to 'solr/' (could not find system property or JNDI)
   [junit4]   2> 1696312 INFO  (TEST-TestReplicationHandler.doTestReplicateAfterStartupWithNoActivity-seed#[B2CDAAABBE2C88D6]) [    ] o.a.s.c.SolrXmlConfig Loading container configuration from C:\Users\jenkins\workspace\Lucene-Solr-master-Windows\solr\build\solr-core\test\J1\temp\solr.handler.TestReplicationHandler_B2CDAAABBE2C88D6-001\solr-instance-002\solr.xml
   [junit4]   2> 1696315 INFO  (TEST-TestReplicationHandler.doTestReplicateAfterStartupWithNoActivity-seed#[B2CDAAABBE2C88D6]) [    ] o.a.s.c.CorePropertiesLocator Config-defined core root directory: C:\Users\jenkins\workspace\Lucene-Solr-master-Windows\solr\build\solr-core\test\J1\temp\solr.handler.TestReplicationHandler_B2CDAAABBE2C88D6-001\solr-instance-002\.
   [junit4]   2> 1696315 INFO  (TEST-TestReplicationHandler.doTestReplicateAfterStartupWithNoActivity-seed#[B2CDAAABBE2C88D6]) [    ] o.a.s.c.CoreContainer New CoreContainer 847860256
   [junit4]   2> 1696315 INFO  (TEST-TestReplicationHandler.doTestReplicateAfterStartupWithNoActivity-seed#[B2CDAAABBE2C88D6]) [    ] o.a.s.c.CoreContainer Loading cores into CoreContainer [instanceDir=C:\Users\jenkins\workspace\Lucene-Solr-master-Windows\solr\build\solr-core\test\J1\temp\solr.handler.TestReplicationHandler_B2CDAAABBE2C88D6-001\solr-instance-002]
   [junit4]   2> 1696315 WARN  (TEST-TestReplicationHandler.doTestReplicateAfterStartupWithNoActivity-seed#[B2CDAAABBE2C88D6]) [    ] o.a.s.c.CoreContainer Couldn't add files from C:\Users\jenkins\workspace\Lucene-Solr-master-Windows\solr\build\solr-core\test\J1\temp\solr.handler.TestReplicationHandler_B2CDAAABBE2C88D6-001\solr-instance-002\lib to classpath: C:\Users\jenkins\workspace\Lucene-Solr-master-Windows\solr\build\solr-core\test\J1\temp\solr.handler.TestReplicationHandler_B2CDAAABBE2C88D6-001\solr-instance-002\lib
   [junit4]   2> 1696316 INFO  (TEST-TestReplicationHandler.doTestReplicateAfterStartupWithNoActivity-seed#[B2CDAAABBE2C88D6]) [    ] o.a.s.h.c.HttpShardHandlerFactory created with socketTimeout : 90000,urlScheme : ,connTimeout : 15000,maxConnectionsPerHost : 20,maxConnections : 10000,corePoolSize : 0,maximumPoolSize : 2147483647,maxThreadIdleTime : 5,sizeOfQueue : -1,fairnessPolicy : false,
   [junit4]   2> 1696316 INFO  (TEST-TestReplicationHandler.doTestReplicateAfterStartupWithNoActivity-seed#[B2CDAAABBE2C88D6]) [    ] o.a.s.u.UpdateShardHandler Creating UpdateShardHandler HTTP client with params: 
   [junit4]   2> 1696318 INFO  (TEST-TestReplicationHandler.doTestReplicateAfterStartupWithNoActivity-seed#[B2CDAAABBE2C88D6]) [    ] o.a.s.l.LogWatcher SLF4J impl is org.slf4j.impl.Log4jLoggerFactory
   [junit4]   2> 1696318 INFO  (TEST-TestReplicationHandler.doTestReplicateAfterStartupWithNoActivity-seed#[B2CDAAABBE2C88D6]) [    ] o.a.s.l.LogWatcher Registering Log Listener [Log4j (org.slf4j.impl.Log4jLoggerFactory)]
   [junit4]   2> 1696318 INFO  (TEST-TestReplicationHandler.doTestReplicateAfterStartupWithNoActivity-seed#[B2CDAAABBE2C88D6]) [    ] o.a.s.c.CoreContainer Security conf doesn't exist. Skipping setup for authorization module.
   [junit4]   2> 1696319 INFO  (TEST-TestReplicationHandler.doTestReplicateAfterStartupWithNoActivity-seed#[B2CDAAABBE2C88D6]) [    ] o.a.s.c.CoreContainer No authentication plugin used.
   [junit4]   2> 1696319 INFO  (TEST-TestReplicationHandler.doTestReplicateAfterStartupWithNoActivity-seed#[B2CDAAABBE2C88D6]) [    ] o.a.s.c.CorePropertiesLocator Looking for core definitions underneath C:\Users\jenkins\workspace\Lucene-Solr-master-Windows\solr\build\solr-core\test\J1\temp\solr.handler.TestReplicationHandler_B2CDAAABBE2C88D6-001\solr-instance-002\.
   [junit4]   2> 1696322 INFO  (TEST-TestReplicationHandler.doTestReplicateAfterStartupWithNoActivity-seed#[B2CDAAABBE2C88D6]) [    ] o.a.s.c.CoreDescriptor Created CoreDescriptor: {name=collection1, config=solrconfig.xml, loadOnStartup=true, schema=schema.xml, configSetProperties=configsetprops.json, transient=false, dataDir=data\}
   [junit4]   2> 1696323 INFO  (TEST-TestReplicationHandler.doTestReplicateAfterStartupWithNoActivity-seed#[B2CDAAABBE2C88D6]) [    ] o.a.s.c.CorePropertiesLocator Found core collection1 in C:\Users\jenkins\workspace\Lucene-Solr-master-Windows\solr\build\solr-core\test\J1\temp\solr.handler.TestReplicationHandler_B2CDAAABBE2C88D6-001\solr-instance-002\.\collection1
   [junit4]   2> 1696323 INFO  (TEST-TestReplicationHandler.doTestReplicateAfterStartupWithNoActivity-seed#[B2CDAAABBE2C88D6]) [    ] o.a.s.c.CorePropertiesLocator Found 1 core definitions
   [junit4]   2> 1696324 INFO  (TEST-TestReplicationHandler.doTestReplicateAfterStartupWithNoActivity-seed#[B2CDAAABBE2C88D6]) [    ] o.a.s.s.SolrDispatchFilter user.dir=C:\Users\jenkins\workspace\Lucene-Solr-master-Windows\solr\build\solr-core\test\J1
   [junit4]   2> 1696324 INFO  (TEST-TestReplicationHandler.doTestReplicateAfterStartupWithNoActivity-seed#[B2CDAAABBE2C88D6]) [    ] o.a.s.s.SolrDispatchFilter SolrDispatchFilter.init() done
   [junit4]   2> 1696324 INFO  (coreLoadExecutor-5572-thread-1) [    ] o.a.s.c.SolrResourceLoader new SolrResourceLoader for directory: 'C:\Users\jenkins\workspace\Lucene-Solr-master-Windows\solr\build\solr-core\test\J1\temp\solr.handler.TestReplicationHandler_B2CDAAABBE2C88D6-001\solr-instance-002\collection1'
   [junit4]   2> 1696325 INFO  (coreLoadExecutor-5572-thread-1) [    ] o.a.s.c.SolrResourceLoader JNDI not configured for solr (NoInitialContextEx)
   [junit4]   2> 1696325 INFO  (coreLoadExecutor-5572-thread-1) [    ] o.a.s.c.SolrResourceLoader solr home defaulted to 'solr/' (could not find system property or JNDI)
   [junit4]   2> 1696332 INFO  (coreLoadExecutor-5572-thread-1) [    ] o.a.s.c.SolrConfig current version of requestparams : -1
   [junit4]   2> 1696334 INFO  (coreLoadExecutor-5572-thread-1) [    ] o.a.s.c.SolrConfig Using Lucene MatchVersion: 7.0.0
   [junit4]   2> 1696339 INFO  (coreLoadExecutor-5572-thread-1) [    ] o.a.s.c.SolrConfig Loaded SolrConfig: solrconfig.xml
   [junit4]   2> 1696343 INFO  (coreLoadExecutor-5572-thread-1) [    ] o.a.s.s.IndexSchema [collection1] Schema name=test
   [junit4]   2> 1696347 INFO  (coreLoadExecutor-5572-thread-1) [    ] o.a.s.s.IndexSchema unique key field: id
   [junit4]   2> 1696349 INFO  (coreLoadExecutor-5572-thread-1) [    ] o.a.s.c.ConfigSetProperties Did not find ConfigSet properties, assuming default properties: Can't find resource 'configsetprops.json' in classpath or 'C:\Users\jenkins\workspace\Lucene-Solr-master-Windows\solr\build\solr-core\test\J1\temp\solr.handler.TestReplicationHandler_B2CDAAABBE2C88D6-001\solr-instance-002\collection1'
   [junit4]   2> 1696349 INFO  (coreLoadExecutor-5572-thread-1) [    ] o.a.s.c.CoreContainer Creating SolrCore 'collection1' using configuration from instancedir C:\Users\jenkins\workspace\Lucene-Solr-master-Windows\solr\build\solr-core\test\J1\temp\solr.handler.TestReplicationHandler_B2CDAAABBE2C88D6-001\solr-instance-002\.\collection1
   [junit4]   2> 1696349 INFO  (coreLoadExecutor-5572-thread-1) [    x:collection1] o.a.s.c.SolrCore org.apache.solr.core.MockDirectoryFactory
   [junit4]   2> 1696349 INFO  (coreLoadExecutor-5572-thread-1) [    x:collection1] o.a.s.c.SolrCore [[collection1] ] Opening new SolrCore at [C:\Users\jenkins\workspace\Lucene-Solr-master-Windows\solr\build\solr-core\test\J1\temp\solr.handler.TestReplicationHandler_B2CDAAABBE2C88D6-001\solr-instance-002\collection1], dataDir=[C:\Users\jenkins\workspace\Lucene-Solr-master-Windows\solr\build\solr-core\test\J1\temp\solr.handler.TestReplicationHandler_B2CDAAABBE2C88D6-001\solr-instance-002\.\collection1\data\]
   [junit4]   2> 1696350 INFO  (coreLoadExecutor-5572-thread-1) [    x:collection1] o.a.s.c.SolrCore JMX monitoring not detected for core: collection1
   [junit4]   2> 1696350 INFO  (coreLoadExecutor-5572-thread-1) [    x:collection1] o.a.s.c.CachingDirectoryFactory return new directory for C:\Users\jenkins\workspace\Lucene-Solr-master-Windows\solr\build\solr-core\test\J1\temp\solr.handler.TestReplicationHandler_B2CDAAABBE2C88D6-001\solr-instance-002\.\collection1\data\
   [junit4]   2> 1696350 INFO  (coreLoadExecutor-5572-thread-1) [    x:collection1] o.a.s.c.SolrCore New index directory detected: old=null new=C:\Users\jenkins\workspace\Lucene-Solr-master-Windows\solr\build\solr-core\test\J1\temp\solr.handler.TestReplicationHandler_B2CDAAABBE2C88D6-001\solr-instance-002\.\collection1\data\index/
   [junit4]   2> 1696350 WARN  (coreLoadExecutor-5572-thread-1) [    x:collection1] o.a.s.c.SolrCore [collection1] Solr index directory 'C:\Users\jenkins\workspace\Lucene-Solr-master-Windows\solr\build\solr-core\test\J1\temp\solr.handler.TestReplicationHandler_B2CDAAABBE2C88D6-001\solr-instance-002\.\collection1\data\index' doesn't exist. Creating new index...
   [junit4]   2> 1696350 INFO  (coreLoadExecutor-5572-thread-1) [    x:collection1] o.a.s.c.CachingDirectoryFactory return new directory for C:\Users\jenkins\workspace\Lucene-Solr-master-Windows\solr\build\solr-core\test\J1\temp\solr.handler.TestReplicationHandler_B2CDAAABBE2C88D6-001\solr-instance-002\.\collection1\data\index
   [junit4]   2> 1696351 INFO  (coreLoadExecutor-5572-thread-1) [    x:collection1] o.a.s.u.RandomMergePolicy RandomMergePolicy wrapping class org.apache.lucene.index.AlcoholicMergePolicy: [AlcoholicMergePolicy: minMergeSize=0, mergeFactor=10, maxMergeSize=655720530, maxMergeSizeForForcedMerge=9223372036854775807, calibrateSizeByDeletes=true, maxMergeDocs=2147483647, maxCFSSegmentSizeMB=8.796093022207999E12, noCFSRatio=0.1]
   [junit4]   2> 1696351 INFO  (coreLoadExecutor-5572-thread-1) [    x:collection1] o.a.s.c.SolrDeletionPolicy SolrDeletionPolicy.onCommit: commits: num=1
   [junit4]   2> 	commit{dir=MockDirectoryWrapper(RAMDirectory@d94ddcb lockFactory=org.apache.lucene.store.SingleInstanceLockFactory@3ccb0d91),segFN=segments_1,generation=1}
   [junit4]   2> 1696352 INFO  (coreLoadExecutor-5572-thread-1) [    x:collection1] o.a.s.c.SolrDeletionPolicy newest commit generation = 1
   [junit4]   2> 1696354 INFO  (OldIndexDirectoryCleanupThreadForCore-collection1) [    x:collection1] o.a.s.c.SolrCore Looking for old index directories to cleanup for core collection1 in C:\Users\jenkins\workspace\Lucene-Solr-master-Windows\solr\build\solr-core\test\J1\temp\solr.handler.TestReplicationHandler_B2CDAAABBE2C88D6-001\solr-instance-002\.\collection1\data\
   [junit4]   2> 1696354 INFO  (coreLoadExecutor-5572-thread-1) [    x:collection1] o.a.s.c.SolrCore no updateRequestProcessorChain defined as default, creating implicit default
   [junit4]   2> 1696356 INFO  (coreLoadExecutor-5572-thread-1) [    x:collection1] o.a.s.h.l.XMLLoader xsltCacheLifetimeSeconds=60
   [junit4]   2> 1696356 INFO  (coreLoadExecutor-5572-thread-1) [    x:collection1] o.a.s.h.l.XMLLoader xsltCacheLifetimeSeconds=60
   [junit4]   2> 1696358 INFO  (coreLoadExecutor-5572-thread-1) [    x:collection1] o.a.s.h.l.XMLLoader xsltCacheLifetimeSeconds=60
   [junit4]   2> 1696359 INFO  (coreLoadExecutor-5572-thread-1) [    x:collection1] o.a.s.h.l.XMLLoader xsltCacheLifetimeSeconds=60
   [junit4]   2> 1696360 INFO  (coreLoadExecutor-5572-thread-1) [    x:collection1] o.a.s.c.PluginBag requestHandler : 'lazy' created with startup=lazy 
   [junit4]   2> 1696360 INFO  (coreLoadExecutor-5572-thread-1) [    x:collection1] o.a.s.c.RequestHandlers Registered paths: /admin/mbeans,standard,lazy,/update/json/docs,/admin/luke,/export,/get,/admin/properties,/update/json,/admin/threads,/update/csv,/sql,/admin/segments,/admin/system,/replication,defaults,/config,/stream,/schema,/admin/plugins,/admin/logging,/admin/ping,/update,/admin/file
   [junit4]   2> 1696360 INFO  (coreLoadExecutor-5572-thread-1) [    x:collection1] o.a.s.c.SolrCore Using default statsCache cache: org.apache.solr.search.stats.LocalStatsCache
   [junit4]   2> 1696360 INFO  (coreLoadExecutor-5572-thread-1) [    x:collection1] o.a.s.u.CommitTracker Hard AutoCommit: disabled
   [junit4]   2> 1696360 INFO  (coreLoadExecutor-5572-thread-1) [    x:collection1] o.a.s.u.CommitTracker Soft AutoCommit: disabled
   [junit4]   2> 1696360 INFO  (coreLoadExecutor-5572-thread-1) [    x:collection1] o.a.s.u.RandomMergePolicy RandomMergePolicy wrapping class org.apache.lucene.index.TieredMergePolicy: [TieredMergePolicy: maxMergeAtOnce=18, maxMergeAtOnceExplicit=10, maxMergedSegmentMB=40.794921875, floorSegmentMB=0.2255859375, forceMergeDeletesPctAllowed=19.961101649621067, segmentsPerTier=29.0, maxCFSSegmentSizeMB=8.796093022207999E12, noCFSRatio=0.0
   [junit4]   2> 1696361 INFO  (coreLoadExecutor-5572-thread-1) [    x:collection1] o.a.s.c.SolrDeletionPolicy SolrDeletionPolicy.onInit: commits: num=1
   [junit4]   2> 	commit{dir=MockDirectoryWrapper(RAMDirectory@d94ddcb lockFactory=org.apache.lucene.store.SingleInstanceLockFactory@3ccb0d91),segFN=segments_1,generation=1}
   [junit4]   2> 1696361 INFO  (coreLoadExecutor-5572-thread-1) [    x:collection1] o.a.s.c.SolrDeletionPolicy newest commit generation = 1
   [junit4]   2> 1696361 INFO  (coreLoadExecutor-5572-thread-1) [    x:collection1] o.a.s.s.SolrIndexSearcher Opening [Searcher@2edaa27f[collection1] main]
   [junit4]   2> 1696361 INFO  (coreLoadExecutor-5572-thread-1) [    x:collection1] o.a.s.r.ManagedResourceStorage File-based storage initialized to use dir: C:\Users\jenkins\workspace\Lucene-Solr-master-Windows\solr\build\solr-core\test\J1\temp\solr.handler.TestReplicationHandler_B2CDAAABBE2C88D6-001\solr-instance-002\collection1\conf
   [junit4]   2> 1696361 INFO  (coreLoadExecutor-5572-thread-1) [    x:collection1] o.a.s.r.RestManager Initializing RestManager with initArgs: {storageDir=C:\Users\jenkins\workspace\Lucene-Solr-master-Windows\solr\build\solr-core\test\J1\temp\solr.handler.TestReplicationHandler_B2CDAAABBE2C88D6-001\solr-instance-002\collection1\conf}
   [junit4]   2> 1696361 INFO  (coreLoadExecutor-5572-thread-1) [    x:collection1] o.a.s.r.ManagedResourceStorage Reading _rest_managed.json using file:dir=C:\Users\jenkins\workspace\Lucene-Solr-master-Windows\solr\build\solr-core\test\J1\temp\solr.handler.TestReplicationHandler_B2CDAAABBE2C88D6-001\solr-instance-002\collection1\conf
   [junit4]   2> 1696362 INFO  (coreLoadExecutor-5572-thread-1) [    x:collection1] o.a.s.r.RestManager Initializing 0 registered ManagedResources
   [junit4]   2> 1696364 INFO  (coreLoadExecutor-5572-thread-1) [    x:collection1] o.a.s.h.ReplicationHandler Poll scheduled at an interval of 1000ms
   [junit4]   2> 1696364 INFO  (searcherExecutor-5573-thread-1-processing-x:collection1) [    x:collection1] o.a.s.c.SolrCore [collection1] Registered new searcher Searcher@2edaa27f[collection1] main{ExitableDirectoryReader(UninvertingDirectoryReader())}
   [junit4]   2> 1696364 INFO  (coreLoadExecutor-5572-thread-1) [    x:collection1] o.a.s.c.CoreContainer registering core: collection1
   [junit4]   2> 1696368 INFO  (qtp373920553-12877) [    x:collection1] o.a.s.c.S.Request [collection1]  webapp=/solr path=/replication params={qt=/replication&wt=javabin&version=2&command=indexversion} status=0 QTime=0
   [junit4]   2> 1696826 INFO  (TEST-TestReplicationHandler.doTestReplicateAfterStartupWithNoActivity-seed#[B2CDAAABBE2C88D6]) [    ] o.e.j.s.ServerConnector Stopped ServerConnector@49977d95{HTTP/1.1,[http/1.1]}{127.0.0.1:0}
   [junit4]   2> 1696826 INFO  (TEST-TestReplicationHandler.doTestReplicateAfterStartupWithNoActivity-seed#[B2CDAAABBE2C88D6]) [    ] o.a.s.c.CoreContainer Shutting down CoreContainer instance=847860256
   [junit4]   2> 1696829 INFO  (coreCloseExecutor-5578-thread-1) [    x:collection1] o.a.s.c.SolrCore [collection1]  CLOSING SolrCore org.apache.solr.core.SolrCore@5df50a57
   [junit4]   2> 1696829 INFO  (coreCloseExecutor-5578-thread-1) [    x:collection1] o.a.s.u.DirectUpdateHandler2 closing DirectUpdateHandler2{commits=0,autocommits=0,soft autocommits=0,optimizes=0,rollbacks=0,expungeDeletes=0,docsPending=0,adds=0,deletesById=0,deletesByQuery=0,errors=0,cumulative_adds=0,cumulative_deletesById=0,cumulative_deletesByQuery=0,cumulative_errors=0}
   [junit4]   2> 1696829 INFO  (coreCloseExecutor-5578-thread-1) [    x:collection1] o.a.s.u.SolrCoreState Closing SolrCoreState
   [junit4]   2> 1696829 INFO  (coreCloseExecutor-5578-thread-1) [    x:collection1] o.a.s.u.DefaultSolrCoreState SolrCoreState ref count has reached 0 - closing IndexWriter
   [junit4]   2> 1696829 INFO  (coreCloseExecutor-5578-thread-1) [    x:collection1] o.a.s.u.DefaultSolrCoreState closing IndexWriter with IndexWriterCloser
   [junit4]   2> 1696829 INFO  (coreCloseExecutor-5578-thread-1) [    x:collection1] o.a.s.c.SolrCore [collection1] Closing main searcher on request.
   [junit4]   2> 1696829 INFO  (coreCloseExecutor-5578-thread-1) [    x:collection1] o.a.s.c.CachingDirectoryFactory Closing MockDirectoryFactory - 2 directories currently being tracked
   [junit4]   2> 1696829 INFO  (coreCloseExecutor-5578-thread-1) [    x:collection1] o.a.s.c.CachingDirectoryFactory looking to close C:\Users\jenkins\workspace\Lucene-Solr-master-Windows\solr\build\solr-core\test\J1\temp\solr.handler.TestReplicationHandler_B2CDAAABBE2C88D6-001\solr-instance-002\.\collection1\data\ [CachedDir<<refCount=0;path=C:\Users\jenkins\workspace\Lucene-Solr-master-Windows\solr\build\solr-core\test\J1\temp\solr.handler.TestReplicationHandler_B2CDAAABBE2C88D6-001\solr-instance-002\.\collection1\data\;done=false>>]
   [junit4]   2> 1696829 INFO  (coreCloseExecutor-5578-thread-1) [    x:collection1] o.a.s.c.CachingDirectoryFactory Closing directory, CoreContainer#isShutdown=true
   [junit4]   2> 1696829 INFO  (coreCloseExecutor-5578-thread-1) [    x:collection1] o.a.s.c.CachingDirectoryFactory Closing directory: C:\Users\jenkins\workspace\Lucene-Solr-master-Windows\solr\build\solr-core\test\J1\temp\solr.handler.TestReplicationHandler_B2CDAAABBE2C88D6-001\solr-instance-002\.\collection1\data\
   [junit4]   2> 1696829 INFO  (coreCloseExecutor-5578-thread-1) [    x:collection1] o.a.s.c.CachingDirectoryFactory looking to close C:\Users\jenkins\workspace\Lucene-Solr-master-Windows\solr\build\solr-core\test\J1\temp\solr.handler.TestReplicationHandler_B2CDAAABBE2C88D6-001\solr-instance-002\.\collection1\data\index [CachedDir<<refCount=0;path=C:\Users\jenkins\workspace\Lucene-Solr-master-Windows\solr\build\solr-core\test\J1\temp\solr.handler.TestReplicationHandler_B2CDAAABBE2C88D6-001\solr-instance-002\.\collection1\data\index;done=false>>]
   [junit4]   2> 1696829 INFO  (coreCloseExecutor-5578-thread-1) [    x:collection1] o.a.s.c.CachingDirectoryFactory Closing directory, CoreContainer#isShutdown=true
   [junit4]   2> 1696829 INFO  (coreCloseExecutor-5578-thread-1) [    x:collection1] o.a.s.c.CachingDirectoryFactory Closing directory: C:\Users\jenkins\workspace\Lucene-Solr-master-Windows\solr\build\solr-core\test\J1\temp\solr.handler.TestReplicationHandler_B2CDAAABBE2C88D6-001\solr-instance-002\.\collection1\data\index
   [junit4]   2> 1696831 INFO  (TEST-TestReplicationHandler.doTestReplicateAfterStartupWithNoActivity-seed#[B2CDAAABBE2C88D6]) [    ] o.e.j.s.h.ContextHandler Stopped o.e.j.s.ServletContextHandler@3b1a45f5{/solr,null,UNAVAILABLE}
   [junit4]   2> 1696843 INFO  (qtp373920553-12882) [    x:collection1] o.a.s.u.DirectUpdateHandler2 [collection1] REMOVING ALL DOCUMENTS FROM INDEX
   [junit4]   2> 1696843 INFO  (qtp373920553-12882) [    x:collection1] o.a.s.u.p.LogUpdateProcessorFactory [collection1]  webapp=/solr path=/update params={wt=javabin&version=2}{deleteByQuery=*:*} 0 0
   [junit4]   2> 1696844 INFO  (qtp373920553-12881) [    x:collection1] o.a.s.u.DirectUpdateHandler2 start commit{,optimize=false,openSearcher=true,waitSearcher=true,expungeDeletes=false,softCommit=false,prepareCommit=false}
   [junit4]   2> 1696844 INFO  (qtp373920553-12881) [    x:collection1] o.a.s.c.SolrDeletionPolicy SolrDeletionPolicy.onCommit: commits: num=2
   [junit4]   2> 	commit{dir=MockDirectoryWrapper(RAMDirectory@7ba9205a lockFactory=org.apache.lucene.store.SingleInstanceLockFactory@29a2d215),segFN=segments_1,generation=1}
   [junit4]   2> 	commit{dir=MockDirectoryWrapper(RAMDirectory@7ba9205a lockFactory=org.apache.lucene.store.SingleInstanceLockFactory@29a2d215),segFN=segments_2,generation=2}
   [junit4]   2> 1696844 INFO  (qtp373920553-12881) [    x:collection1] o.a.s.c.SolrDeletionPolicy newest commit generation = 2
   [junit4]   2> 1696845 INFO  (qtp373920553-12881) [    x:collection1] o.a.s.s.SolrIndexSearcher Opening [Searcher@14c83397[collection1] main]
   [junit4]   2> 1696845 INFO  (qtp373920553-12881) [    x:collection1] o.a.s.u.DirectUpdateHandler2 end_commit_flush
   [junit4]   2> 1696845 INFO  (searcherExecutor-5563-thread-1-processing-x:collection1) [    x:collection1] o.a.s.c.SolrCore [collection1] Registered new searcher Searcher@14c83397[collection1] main{ExitableDirectoryReader(UninvertingDirectoryReader())}
   [junit4]   2> 1696846 INFO  (qtp373920553-12881) [    x:collection1] o.a.s.u.p.LogUpdateProcessorFactory [collection1]  webapp=/solr path=/update params={waitSearcher=true&commit=true&softCommit=false&wt=javabin&version=2}{commit=} 0 2
   [junit4]   2> 1696848 INFO  (TEST-TestReplicationHandler.doTestReplicateAfterStartupWithNoActivity-seed#[B2CDAAABBE2C88D6]) [    ] o.e.j.s.ServerConnector Stopped ServerConnector@43835d5d{HTTP/1.1,[http/1.1]}{127.0.0.1:0}
   [junit4]   2> 1696848 INFO  (TEST-TestReplicationHandler.doTestReplicateAfterStartupWithNoActivity-seed#[B2CDAAABBE2C88D6]) [    ] o.a.s.c.CoreContainer Shutting down CoreContainer instance=1421901467
   [junit4]   2> 1696850 INFO  (coreCloseExecutor-5580-thread-1) [    x:collection1] o.a.s.c.SolrCore [collection1]  CLOSING SolrCore org.apache.solr.core.SolrCore@df21ca
   [junit4]   2> 1696850 INFO  (coreCloseExecutor-5580-thread-1) [    x:collection1] o.a.s.u.DirectUpdateHandler2 closing DirectUpdateHandler2{commits=1,autocommits=0,soft autocommits=0,optimizes=0,rollbacks=0,expungeDeletes=0,docsPending=0,adds=0,deletesById=0,deletesByQuery=0,errors=0,cumulative_adds=0,cumulative_deletesById=0,cumulative_deletesByQuery=1,cumulative_errors=0}
   [junit4]   2> 1696850 INFO  (coreCloseExecutor-5580-thread-1) [    x:collection1] o.a.s.u.SolrCoreState Closing SolrCoreState
   [junit4]   2> 1696850 INFO  (coreCloseExecutor-5580-thread-1) [    x:collection1] o.a.s.u.DefaultSolrCoreState SolrCoreState ref count has reached 0 - closing IndexWriter
   [junit4]   2> 1696850 INFO  (coreCloseExecutor-5580-thread-1) [    x:collection1] o.a.s.u.DefaultSolrCoreState closing IndexWriter with IndexWriterCloser
   [junit4]   2> 1696850 INFO  (coreCloseExecutor-5580-thread-1) [    x:collection1] o.a.s.c.SolrCore [collection1] Closing main searcher on request.
   [junit4]   2> 1696850 INFO  (coreCloseExecutor-5580-thread-1) [    x:collection1] o.a.s.c.CachingDirectoryFactory Closing MockDirectoryFactory - 2 directories currently being tracked
   [junit4]   2> 1696851 INFO  (coreCloseExecutor-5580-thread-1) [    x:collection1] o.a.s.c.CachingDirectoryFactory looking to close C:\Users\jenkins\workspace\Lucene-Solr-master-Windows\solr\build\solr-core\test\J1\temp\solr.handler.TestReplicationHandler_B2CDAAABBE2C88D6-001\solr-instance-001\.\collection1\data\ [CachedDir<<refCount=0;path=C:\Users\jenkins\workspace\Lucene-Solr-master-Windows\solr\build\solr-core\test\J1\temp\solr.handler.TestReplicationHandler_B2CDAAABBE2C88D6-001\solr-instance-001\.\collection1\data\;done=false>>]
   [junit4]   2> 1696851 INFO  (coreCloseExecutor-5580-thread-1) [    x:collection1] o.a.s.c.CachingDirectoryFactory Closing directory, CoreContainer#isShutdown=true
   [junit4]   2> 1696851 INFO  (coreCloseExecutor-5580-thread-1) [    x:collection1] o.a.s.c.CachingDirectoryFactory Closing directory: C:\Users\jenkins\workspace\Lucene-Solr-master-Windows\solr\build\solr-core\test\J1\temp\solr.handler.TestReplicationHandler_B2CDAAABBE2C88D6-001\solr-instance-001\.\collection1\data\
   [junit4]   2> 1696851 INFO  (coreCloseExecutor-5580-thread-1) [    x:collection1] o.a.s.c.CachingDirectoryFactory looking to close C:\Users\jenkins\workspace\Lucene-Solr-master-Windows\solr\build\solr-core\test\J1\temp\solr.handler.TestReplicationHandler_B2CDAAABBE2C88D6-001\solr-instance-001\.\collection1\data\index [CachedDir<<refCount=0;path=C:\Users\jenkins\workspace\Lucene-Solr-master-Windows\solr\build\solr-core\test\J1\temp\solr.handler.TestReplicationHandler_B2CDAAABBE2C88D6-001\solr-instance-001\.\collection1\data\index;done=false>>]
   [junit4]   2> 1696851 INFO  (coreCloseExecutor-5580-thread-1) [    x:collection1] o.a.s.c.CachingDirectoryFactory Closing directory, CoreContainer#isShutdown=true
   [junit4]   2> 1696851 INFO  (coreCloseExecutor-5580-thread-1) [    x:collection1] o.a.s.c.CachingDirectoryFactory Closing directory: C:\Users\jenkins\workspace\Lucene-Solr-master-Windows\solr\build\solr-core\test\J1\temp\solr.handler.TestReplicationHandler_B2CDAAABBE2C88D6-001\solr-instance-001\.\collection1\data\index
   [junit4]   2> 1696851 INFO  (TEST-TestReplicationHandler.doTestReplicateAfterStartupWithNoActivity-seed#[B2CDAAABBE2C88D6]) [    ] o.e.j.s.h.ContextHandler Stopped o.e.j.s.ServletContextHandler@20e9cc55{/solr,null,UNAVAILABLE}
   [junit4]   2> 1696859 INFO  (TEST-TestReplicationHandler.doTestReplicateAfterStartupWithNoActivity-seed#[B2CDAAABBE2C88D6]) [    ] o.e.j.s.Server jetty-9.3.8.v20160314
   [junit4]   2> 1696860 INFO  (TEST-TestReplicationHandler.doTestReplicateAfterStartupWithNoActivity-seed#[B2CDAAABBE2C88D6]) [    ] o.e.j.s.h.ContextHandler Started o.e.j.s.ServletContextHandler@39c96735{/solr,null,AVAILABLE}
   [junit4]   2> 1696861 INFO  (TEST-TestReplicationHandler.doTestReplicateAfterStartupWithNoActivity-seed#[B2CDAAABBE2C88D6]) [    ] o.e.j.s.ServerConnector Started ServerConnector@d0d08a{HTTP/1.1,[http/1.1]}{127.0.0.1:63524}
   [junit4]   2> 1696862 INFO  (TEST-TestReplicationHandler.doTestReplicateAfterStartupWithNoActivity-seed#[B2CDAAABBE2C88D6]) [    ] o.e.j.s.Server Started @1701605ms
   [junit4]   2> 1696862 INFO  (TEST-TestReplicationHandler.doTestReplicateAfterStartupWithNoActivity-seed#[B2CDAAABBE2C88D6]) [    ] o.a.s.c.s.e.JettySolrRunner Jetty properties: {solr.data.dir=C:\Users\jenkins\workspace\Lucene-Solr-master-Windows\solr\build\solr-core\test\J1\temp\solr.handler.TestReplicationHandler_B2CDAAABBE2C88D6-001\solr-instance-001\collection1\data, hostContext=/solr, hostPort=63524}
   [junit4]   2> 1696862 INFO  (TEST-TestReplicationHandler.doTestReplicateAfterStartupWithNoActivity-seed#[B2CDAAABBE2C88D6]) [    ] o.a.s.s.SolrDispatchFilter SolrDispatchFilter.init(): sun.misc.Launcher$AppClassLoader@73d16e93
   [junit4]   2> 1696862 INFO  (TEST-TestReplicationHandler.doTestReplicateAfterStartupWithNoActivity-seed#[B2CDAAABBE2C88D6]) [    ] o.a.s.c.SolrResourceLoader new SolrResourceLoader for directory: 'C:\Users\jenkins\workspace\Lucene-Solr-master-Windows\solr\build\solr-core\test\J1\temp\solr.handler.TestReplicationHandler_B2CDAAABBE2C88D6-001\solr-instance-001'
   [junit4]   2> 1696862 INFO  (TEST-TestReplicationHandler.doTestReplicateAfterStartupWithNoActivity-seed#[B2CDAAABBE2C88D6]) [    ] o.a.s.c.SolrResourceLoader JNDI not configured for solr (NoInitialContextEx)
   [junit4]   2> 1696862 INFO  (TEST-TestReplicationHandler.doTestReplicateAfterStartupWithNoActivity-seed#[B2CDAAABBE2C88D6]) [    ] o.a.s.c.SolrResourceLoader solr home defaulted to 'solr/' (could not find system property or JNDI)
   [junit4]   2> 1696863 INFO  (TEST-TestReplicationHandler.doTestReplicateAfterStartupWithNoActivity-seed#[B2CDAAABBE2C88D6]) [    ] o.a.s.c.SolrXmlConfig Loading container configuration from C:\Users\jenkins\workspace\Lucene-Solr-master-Windows\solr\build\solr-core\test\J1\temp\solr.handler.TestReplicationHandler_B2CDAAABBE2C88D6-001\solr-instance-001\solr.xml
   [junit4]   2> 1696866 INFO  (TEST-TestReplicationHandler.doTestReplicateAfterStartupWithNoActivity-seed#[B2CDAAABBE2C88D6]) [    ] o.a.s.c.CorePropertiesLocator Config-defined core root directory: C:\Users\jenkins\workspace\Lucene-Solr-master-Windows\solr\build\solr-core\test\J1\temp\solr.handler.TestReplicationHandler_B2CDAAABBE2C88D6-001\solr-instance-001\.
   [junit4]   2> 1696866 INFO  (TEST-TestReplicationHandler.doTestReplicateAfterStartupWithNoActivity-seed#[B2CDAAABBE2C88D6]) [    ] o.a.s.c.CoreContainer New CoreContainer 79601927
   [junit4]   2> 1696866 INFO  (TEST-TestReplicationHandler.doTestReplicateAfterStartupWithNoActivity-seed#[B2CDAAABBE2C88D6]) [    ] o.a.s.c.CoreContainer Loading cores into CoreContainer [instanceDir=C:\Users\jenkins\workspace\Lucene-Solr-master-Windows\solr\build\solr-core\test\J1\temp\solr.handler.TestReplicationHandler_B2CDAAABBE2C88D6-001\solr-instance-001]
   [junit4]   2> 1696867 WARN  (TEST-TestReplicationHandler.doTestReplicateAfterStartupWithNoActivity-seed#[B2CDAAABBE2C88D6]) [    ] o.a.s.c.CoreContainer Couldn't add files from C:\Users\jenkins\workspace\Lucene-Solr-master-Windows\solr\build\solr-core\test\J1\temp\solr.handler.TestReplicationHandler_B2CDAAABBE2C88D6-001\solr-instance-001\lib to classpath: C:\Users\jenkins\workspace\Lucene-Solr-master-Windows\solr\build\solr-core\test\J1\temp\solr.handler.TestReplicationHandler_B2CDAAABBE2C88D6-001\solr-instance-001\lib
   [junit4]   2> 1696867 INFO  (TEST-TestReplicationHandler.doTestReplicateAfterStartupWithNoActivity-seed#[B2CDAAABBE2C88D6]) [    ] o.a.s.h.c.HttpShardHandlerFactory created with socketTimeout : 90000,urlScheme : ,connTimeout : 15000,maxConnectionsPerHost : 20,maxConnections : 10000,corePoolSize : 0,maximumPoolSize : 2147483647,maxThreadIdleTime : 5,sizeOfQueue : -1,fairnessPolicy : false,
   [junit4]   2> 1696868 INFO  (TEST-TestReplicationHandler.doTestReplicateAfterStartupWithNoActivity-seed#[B2CDAAABBE2C88D6]) [    ] o.a.s.u.UpdateShardHandler Creating UpdateShardHandler HTTP client with params: 
   [junit4]   2> 1696869 INFO  (TEST-TestReplicationHandler.doTestReplicateAfterStartupWithNoActivity-seed#[B2CDAAABBE2C88D6]) [    ] o.a.s.l.LogWatcher SLF4J impl is org.slf4j.impl.Log4jLoggerFactory
   [junit4]   2> 1696869 INFO  (TEST-TestReplicationHandler.doTestReplicateAfterStartupWithNoActivity-seed#[B2CDAAABBE2C88D6]) [    ] o.a.s.l.LogWatcher Registering Log Listener [Log4j (org.slf4j.impl.Log4jLoggerFactory)]
   [junit4]   2> 1696869 INFO  (TEST-TestReplicationHandler.doTestReplicateAfterStartupWithNoActivity-seed#[B2CDAAABBE2C88D6]) [    ] o.a.s.c.CoreContainer Security conf doesn't exist. Skipping setup for authorization module.
   [junit4]   2> 1696869 INFO  (TEST-TestReplicationHandler.doTestReplicateAfterStartupWithNoActivity-seed#[B2CDAAABBE2C88D6]) [    ] o.a.s.c.CoreContainer No authentication plugin used.
   [junit4]   2> 1696869 INFO  (TEST-TestReplicationHandler.doTestReplicateAfterStartupWithNoActivity-seed#[B2CDAAABBE2C88D6]) [    ] o.a.s.c.CorePropertiesLocator Looking for core definitions underneath C:\Users\jenkins\workspace\Lucene-Solr-master-Windows\solr\build\solr-core\test\J1\temp\solr.handler.TestReplicationHandler_B2CDAAABBE2C88D6-001\solr-instance-001\.
   [junit4]   2> 1696871 INFO  (TEST-TestReplicationHandler.doTestReplicateAfterStartupWithNoActivity-seed#[B2CDAAABBE2C88D6]) [    ] o.a.s.c.CoreDescriptor Created CoreDescriptor: {name=collection1, config=solrconfig.xml, loadOnStartup=true, schema=schema.xml, configSetProperties=configsetprops.json, transient=false, dataDir=data\}
   [junit4]   2> 1696871 INFO  (TEST-TestReplicationHandler.doTestReplicateAfterStartupWithNoActivity-seed#[B2CDAAABBE2C88D6]) [    ] o.a.s.c.CorePropertiesLocator Found core collection1 in C:\Users\jenkins\workspace\Lucene-Solr-master-Windows\solr\build\solr-core\test\J1\temp\solr.handler.TestReplicationHandler_B2CDAAABBE2C88D6-001\solr-instance-001\.\collection1
   [junit4]   2> 1696871 INFO  (TEST-TestReplicationHandler.doTestReplicateAfterStartupWithNoActivity-seed#[B2CDAAABBE2C88D6]) [    ] o.a.s.c.CorePropertiesLocator Found 1 core definitions
   [junit4]   2> 1696872 INFO  (TEST-TestReplicationHandler.doTestReplicateAfterStartupWithNoActivity-seed#[B2CDAAABBE2C88D6]) [    ] o.a.s.s.SolrDispatchFilter user.dir=C:\Users\jenkins\workspace\Lucene-Solr-master-Windows\solr\build\solr-core\test\J1
   [junit4]   2> 1696872 INFO  (TEST-TestReplicationHandler.doTestReplicateAfterStartupWithNoActivity-seed#[B2CDAAABBE2C88D6]) [    ] o.a.s.s.SolrDispatchFilter SolrDispatchFilter.init() done
   [junit4]   2> 1696872 INFO  (coreLoadExecutor-5587-thread-1) [    ] o.a.s.c.SolrResourceLoader new SolrResourceLoader for directory: 'C:\Users\jenkins\workspace\Lucene-Solr-master-Windows\solr\build\solr-core\test\J1\temp\solr.handler.TestReplicationHandler_B2CDAAABBE2C88D6-001\solr-instance-001\collection1'
   [junit4]   2> 1696872 INFO  (coreLoadExecutor-5587-thread-1) [    ] o.a.s.c.SolrResourceLoader JNDI not configured for solr (NoInitialContextEx)
   [junit4]   2> 1696872 INFO  (coreLoadExecutor-5587-thread-1) [    ] o.a.s.c.SolrResourceLoader solr home defaulted to 'solr/' (could not find system property or JNDI)
   [junit4]   2> 1696877 INFO  (coreLoadExecutor-5587-thread-1) [    ] o.a.s.c.SolrConfig current version of requestparams : -1
   [junit4]   2> 1696887 INFO  (coreLoadExecutor-5587-thread-1) [    ] o.a.s.c.SolrConfig Using Lucene MatchVersion: 7.0.0
   [junit4]   2> 1696891 INFO  (coreLoadExecutor-5587-thread-1) [    ] o.a.s.c.SolrConfig Loaded SolrConfig: solrconfig.xml
   [junit4]   2> 1696894 INFO  (coreLoadExecutor-5587-thread-1) [    ] o.a.s.s.IndexSchema [collection1] Schema name=test
   [junit4]   2> 1696895 INFO  (coreLoadExecutor-5587-thread-1) [    ] o.a.s.s.IndexSchema unique key field: id
   [junit4]   2> 1696896 INFO  (coreLoadExecutor-5587-thread-1) [    ] o.a.s.c.ConfigSetProperties Did not find ConfigSet properties, assuming default properties: Can't find resource 'configsetprops.json' in classpath or 'C:\Users\jenkins\workspace\Lucene-Solr-master-Windows\solr\build\solr-core\test\J1\temp\solr.handler.TestReplicationHandler_B2CDAAABBE2C88D6-001\solr-instance-001\collection1'
   [junit4]   2> 1696896 INFO  (coreLoadExecutor-5587-thread-1) [    ] o.a.s.c.CoreContainer Creating SolrCore 'collection1' using configuration from instancedir C:\Users\jenkins\workspace\Lucene-Solr-master-Windows\solr\build\solr-core\test\J1\temp\solr.handler.TestReplicationHandler_B2CDAAABBE2C88D6-001\solr-instance-001\.\collection1
   [junit4]   2> 1696896 INFO  (coreLoadExecutor-5587-thread-1) [    x:collection1] o.a.s.c.SolrCore solr.NRTCachingDirectoryFactory
   [junit4]   2> 1696897 INFO  (coreLoadExecutor-5587-thread-1) [    x:collection1] o.a.s.c.SolrCore [[collection1] ] Opening new SolrCore at [C:\Users\jenkins\workspace\Lucene-Solr-master-Windows\solr\build\solr-core\test\J1\temp\solr.handler.TestReplicationHandler_B2CDAAABBE2C88D6-001\solr-instance-001\collection1], dataDir=[C:\Users\jenkins\workspace\Lucene-Solr-master-Windows\solr\build\solr-core\test\J1\temp\solr.handler.TestReplicationHandler_B2CDAAABBE2C88D6-001\solr-instance-001\.\collection1\data\]
   [junit4]   2> 1696897 INFO  (coreLoadExecutor-5587-thread-1) [    x:collection1] o.a.s.c.SolrCore JMX monitoring not detected for core: collection1
   [junit4]   2> 1696898 INFO  (coreLoadExecutor-5587-thread-1) [    x:collection1] o.a.s.c.CachingDirectoryFactory return new directory for C:\Users\jenkins\workspace\Lucene-Solr-master-Windows\solr\build\solr-core\test\J1\temp\solr.handler.TestReplicationHandler_B2CDAAABBE2C88D6-001\solr-instance-001\collection1\data
   [junit4]   2> 1696898 INFO  (coreLoadExecutor-5587-thread-1) [    x:collection1] o.a.s.c.SolrCore New index directory detected: old=null new=C:\Users\jenkins\workspace\Lucene-Solr-master-Windows\solr\build\solr-core\test\J1\temp\solr.handler.TestReplicationHandler_B2CDAAABBE2C88D6-001\solr-instance-001\.\collection1\data\index/
   [junit4]   2> 1696899 WARN  (coreLoadExecutor-5587-thread-1) [    x:collection1] o.a.s.c.SolrCore [collection1] Solr index directory 'C:\Users\jenkins\workspace\Lucene-Solr-master-Windows\solr\build\solr-core\test\J1\temp\solr.handler.TestReplicationHandler_B2CDAAABBE2C88D6-001\solr-instance-001\.\collection1\data\index' doesn't exist. Creating new index...
   [junit4]   2> 1696900 INFO  (coreLoadExecutor-5587-thread-1) [    x:collection1] o.a.s.c.CachingDirectoryFactory return new directory for C:\Users\jenkins\workspace\Lucene-Solr-master-Windows\solr\build\solr-core\test\J1\temp\solr.handler.TestReplicationHandler_B2CDAAABBE2C88D6-001\solr-instance-001\collection1\data\index
   [junit4]   2> 1696900 INFO  (coreLoadExecutor-5587-thread-1) [    x:collection1] o.a.s.u.RandomMergePolicy RandomMergePolicy wrapping class org.apache.lucene.index.TieredMergePolicy: [TieredMergePolicy: maxMergeAtOnce=39, maxMergeAtOnceExplicit=42, maxMergedSegmentMB=32.54296875, floorSegmentMB=1.5439453125, forceMergeDeletesPctAllowed=4.656693052235218, segmentsPerTier=10.0, maxCFSSegmentSizeMB=8.796093022207999E12, noCFSRatio=0.7249424896519964
   [junit4]   2> 1696906 INFO  (coreLoadExecutor-5587-thread-1) [    x:collection1] o.a.s.c.SolrDeletionPolicy SolrDeletionPolicy.onCommit: commits: num=1
   [junit4]   2> 	commit{dir=NRTCachingDirectory(MMapDirectory@C:\Users\jenkins\workspace\Lucene-Solr-master-Windows\solr\build\solr-core\test\J1\temp\solr.handler.TestReplicationHandler_B2CDAAABBE2C88D6-001\solr-instance-001\collection1\data\index lockFactory=org.apache.lucene.store.SingleInstanceLockFactory@4cf2a004; maxCacheMB=48.0 maxMergeSizeMB=4.0),segFN=segments_1,generation=1}
   [junit4]   2> 1696906 INFO  (coreLoadExecutor-5587-thread-1) [    x:collection1] o.a.s.c.SolrDeletionPolicy newest commit generation = 1
   [junit4]   2> 1696906 INFO  (OldIndexDirectoryCleanupThreadForCore-collection1) [    x:collection1] o.a.s.c.SolrCore Looking for old index directories to cleanup for core collection1 in C:\Users\jenkins\workspace\Lucene-Solr-master-Windows\solr\build\solr-core\test\J1\temp\solr.handler.TestReplicationHandler_B2CDAAABBE2C88D6-001\solr-instance-001\.\collection1\data\
   [junit4]   2> 1696908 INFO  (coreLoadExecutor-5587-thread-1) [    x:collection1] o.a.s.c.SolrCore no updateRequestProcessorChain defined as default, creating implicit default
   [junit4]   2> 1696909 INFO  (coreLoadExecutor-5587-thread-1) [    x:collection1] o.a.s.h.l.XMLLoader xsltCacheLifetimeSeconds=60
   [junit4]   2> 1696910 INFO  (coreLoadExecutor-5587-thread-1) [    x:collection1] o.a.s.h.l.XMLLoader xsltCacheLifetimeSeconds=60
   [junit4]   2> 1696911 INFO  (coreLoadExecutor-5587-thread-1) [    x:collection1] o.a.s.h.l.XMLLoader xsltCacheLifetimeSeconds=60
   [junit4]   2> 1696911 INFO  (coreLoadExecutor-5587-thread-1) [    x:collection1] o.a.s.h.l.XMLLoader xsltCacheLifetimeSeconds=60
   [junit4]   2> 1696912 INFO  (coreLoadExecutor-5587-thread-1) [    x:collection1] o.a.s.c.PluginBag requestHandler : 'lazy' created with startup=lazy 
   [junit4]   2> 1696912 INFO  (coreLoadExecutor-5587-thread-1) [    x:collection1] o.a.s.c.RequestHandlers Registered paths: /admin/mbeans,standard,lazy,/update/json/docs,/admin/luke,/export,/get,/admin/properties,/update/json,/admin/threads,/update/csv,/sql,/admin/segments,/admin/system,/replication,defaults,/config,/stream,/schema,/admin/plugins,/admin/logging,/admin/ping,/update,/admin/file
   [junit4]   2> 1696912 INFO  (coreLoadExecutor-5587-thread-1) [    x:collection1] o.a.s.c.SolrCore Using default statsCache cache: org.apache.solr.search.stats.LocalStatsCache
   [junit4]   2> 1696913 INFO  (coreLoadExecutor-5587-thread-1) [    x:collection1] o.a.s.u.CommitTracker Hard AutoCommit: disabled
   [junit4]   2> 1696913 INFO  (coreLoadExecutor-5587-thread-1) [    x:collection1] o.a.s.u.CommitTracker Soft AutoCommit: disabled
   [junit4]   2> 1696913 INFO  (coreLoadExecutor-5587-thread-1) [    x:collection1] o.a.s.u.RandomMergePolicy RandomMergePolicy wrapping class org.apache.lucene.index.LogDocMergePolicy: [LogDocMergePolicy: minMergeSize=1000, mergeFactor=29, maxMergeSize=9223372036854775807, maxMergeSizeForForcedMerge=9223372036854775807, calibrateSizeByDeletes=true, maxMergeDocs=2147483647, maxCFSSegmentSizeMB=8.796093022207999E12, noCFSRatio=0.0]
   [junit4]   2> 1696914 INFO  (coreLoadExecutor-5587-thread-1) [    x:collection1] o.a.s.c.SolrDeletionPolicy SolrDeletionPolicy.onInit: commits: num=1
   [junit4]   2> 	commit{dir=NRTCachingDirectory(MMapDirectory@C:\Users\jenkins\workspace\Lucene-Solr-master-Windows\solr\build\solr-core\test\J1\temp\solr.handler.TestReplicationHandler_B2CDAAABBE2C88D6-001\solr-instance-001\collection1\data\index lockFactory=org.apache.lucene.store.SingleInstanceLockFactory@4cf2a004; maxCacheMB=48.0 maxMergeSizeMB=4.0),segFN=segments_1,generation=1}
   [junit4]   2> 1696914 INFO  (coreLoadExecutor-5587-thread-1) [    x:collection1] o.a.s.c.SolrDeletionPolicy newest commit generation = 1
   [junit4]   2> 1696914 INFO  (coreLoadExecutor-5587-thread-1) [    x:collection1] o.a.s.s.SolrIndexSearcher Opening [Searcher@4e4cc202[collection1] main]
   [junit4]   2> 1696914 INFO  (coreLoadExecutor-5587-thread-1) [    x:collection1] o.a.s.r.ManagedResourceStorage File-based storage initialized to use dir: C:\Users\jenkins\workspace\Lucene-Solr-master-Windows\solr\build\solr-core\test\J1\temp\solr.handler.TestReplicationHandler_B2CDAAABBE2C88D6-001\solr-instance-001\collection1\conf
   [junit4]   2> 1696914 INFO  (coreLoadExecutor-5587-thread-1) [    x:collection1] o.a.s.r.RestManager Initializing RestManager with initArgs: {storageDir=C:\Users\jenkins\workspace\Lucene-Solr-master-Windows\solr\build\solr-core\test\J1\temp\solr.handler.TestReplicationHandler_B2CDAAABBE2C88D6-001\solr-instance-001\collection1\conf}
   [junit4]   2> 1696914 INFO  (coreLoadExecutor-5587-thread-1) [    x:collection1] o.a.s.r.ManagedResourceStorage Reading _rest_managed.json using file:dir=C:\Users\jenkins\workspace\Lucene-Solr-master-Windows\solr\build\solr-core\test\J1\temp\solr.handler.TestReplicationHandler_B2CDAAABBE2C88D6-001\solr-instance-001\collection1\conf
   [junit4]   2> 1696914 INFO  (coreLoadExecutor-5587-thread-1) [    x:collection1] o.a.s.r.RestManager Initializing 0 registered ManagedResources
   [junit4]   2> 1696914 INFO  (coreLoadExecutor-5587-thread-1) [    x:collection1] o.a.s.h.ReplicationHandler Replication enabled for following config files: schema.xml
   [junit4]   2> 1696915 INFO  (coreLoadExecutor-5587-thread-1) [    x:collection1] o.a.s.h.ReplicationHandler Commits will be reserved for  10000
   [junit4]   2> 1696915 INFO  (searcherExecutor-5588-thread-1-processing-x:collection1) [    x:collection1] o.a.s.c.SolrCore [collection1] Registered new searcher Searcher@4e4cc202[collection1] main{ExitableDirectoryReader(UninvertingDirectoryReader())}
   [junit4]   2> 1696915 INFO  (coreLoadExecutor-5587-thread-1) [    x:collection1] o.a.s.c.CoreContainer registering core: collection1
   [junit4]   2> 1697379 INFO  (qtp1791846525-12926) [    x:collection1] o.a.s.u.p.LogUpdateProcessorFactory [collection1]  webapp=/solr path=/update params={wt=javabin&version=2}{add=[0]} 0 1
   [junit4]   2> 1697379 INFO  (qtp1791846525-12927) [    x:collection1] o.a.s.u.p.LogUpdateProcessorFactory [collection1]  webapp=/solr path=/update params={wt=javabin&version=2}{add=[1]} 0 0
   [junit4]   2> 1697381 INFO  (qtp1791846525-12928) [    x:collection1] o.a.s.u.p.LogUpdateProcessorFactory [collection1]  webapp=/solr path=/update params={wt=javabin&version=2}{add=[2]} 0 0
   [junit4]   2> 1697381 INFO  (qtp1791846525-12929) [    x:collection1] o.a.s.u.p.LogUpdateProcessorFactory [collection1]  webapp=/solr path=/update params={wt=javabin&version=2}{add=[3]} 0 0
   [junit4]   2> 1697382 INFO  (qtp1791846525-12930) [    x:collection1] o.a.s.u.p.LogUpdateProcessorFactory [collection1]  webapp=/solr path=/update params={wt=javabin&version=2}{add=[4]} 0 0
   [junit4]   2> 1697382 INFO  (qtp1791846525-12931) [    x:collection1] o.a.s.u.p.LogUpdateProcessorFactory [collection1]  webapp=/solr path=/update params={wt=javabin&version=2}{add=[5]} 0 0
   [junit4]   2> 1697382 INFO  (qtp1791846525-12924) [    x:collection1] o.a.s.u.p.LogUpdateProcessorFactory [collection1]  webapp=/solr path=/update params={wt=javabin&version=2}{add=[6]} 0 0
   [junit4]   2> 1697383 INFO  (qtp1791846525-12926) [    x:collection1] o.a.s.u.p.LogUpdateProcessorFactory [collection1]  webapp=/solr path=/update params={wt=javabin&version=2}{add=[7]} 0 0
   [junit4]   2> 1697383 INFO  (qtp1791846525-12927) [    x:collection1] o.a.s.u.p.LogUpdateProcessorFactory [collection1]  webapp=/solr path=/update params={wt=javabin&version=2}{add=[8]} 0 0
   [junit4]   2> 1697384 INFO  (qtp1791846525-12928) [    x:collection1] o.a.s.u.p.LogUpdateProcessorFactory [collection1]  webapp=/solr path=/update params={wt=javabin&version=2}{add=[9]} 0 0
   [junit4]   2> 1697384 INFO  (qtp1791846525-12929) [    x:collection1] o.a.s.u.p.LogUpdateProcessorFactory [collection1]  webapp=/solr path=/update params={wt=javabin&version=2}{add=[10]} 0 0
   [junit4]   2> 1697385 INFO  (qtp1791846525-12930) [    x:collection1] o.a.s.u.p.LogUpdateProcessorFactory [collection1]  webapp=/solr path=/update params={wt=javabin&version=2}{add=[11]} 0 0
   [junit4]   2> 1697385 INFO  (qtp1791846525-12931) [    x:collection1] o.a.s.u.p.LogUpdateProcessorFactory [collection1]  webapp=/solr path=/update params={wt=javabin&version=2}{add=[12]} 0 0
   [junit4]   2> 1697385 INFO  (qtp1791846525-12924) [    x:collection1] o.a.s.u.p.LogUpdateProcessorFactory [collection1]  webapp=/solr path=/update params={wt=javabin&version=2}{add=[13]} 0 0
   [junit4]   2> 1697385 INFO  (qtp1791846525-12926) [    x:collection1] o.a.s.u.p.LogUpdateProcessorFactory [collection1]  webapp=/solr path=/update params={wt=javabin&version=2}{add=[14]} 0 0
   [junit4]   2> 1697385 INFO  (qtp1791846525-12927) [    x:collection1] o.a.s.u.p.LogUpdateProcessorFactory [collection1]  webapp=/solr path=/update params={wt=javabin&version=2}{add=[15]} 0 0
   [junit4]   2> 1697386 INFO  (qtp1791846525-12928) [    x:collection1] o.a.s.u.p.LogUpdateProcessorFactory [collection1]  webapp=/solr path=/update params={wt=javabin&version=2}{add=[16]} 0 0
   [junit4]   2> 1697386 INFO  (qtp1791846525-12929) [    x:collection1] o.a.s.u.p.LogUpdateProcessorFactory [collection1]  webapp=/solr path=/update params={wt=javabin&version=2}{add=[17]} 0 0
   [junit4]   2> 1697387 INFO  (qtp1791846525-12930) [    x:collection1] o.a.s.u.p.LogUpdateProcessorFactory [collection1]  webapp=/solr path=/update params={wt=javabin&version=2}{add=[18]} 0 0
   [junit4]   2> 1697387 INFO  (qtp1791846525-12931) [    x:collection1] o.a.s.u.p.LogUpdateProcessorFactory [collection1]  webapp=/solr path=/update params={wt=javabin&version=2}{add=[19]} 0 0
   [junit4]   2> 1697388 INFO  (qtp1791846525-12924) [    x:collection1] o.a.s.u.p.LogUpdateProcessorFactory [collection1]  webapp=/solr path=/update params={wt=javabin&version=2}{add=[20]} 0 0
   [junit4]   2> 1697388 INFO  (qtp1791846525-12926) [    x:collection1] o.a.s.u.p.LogUpdateProcessorFactory [collection1]  webapp=/solr path=/update params={wt=javabin&version=2}{add=[21]} 0 0
   [junit4]   2> 1697388 INFO  (qtp1791846525-12927) [    x:collection1] o.a.s.u.p.LogUpdateProcessorFactory [collection1]  webapp=/solr path=/update params={wt=javabin&version=2}{add=[22]} 0 0
   [junit4]   2> 1697391 INFO  (qtp1791846525-12928) [    x:collection1] o.a.s.u.p.LogUpdateProcessorFactory [collection1]  webapp=/solr path=/update params={wt=javabin&version=2}{add=[23]} 0 0
   [junit4]   2> 1697391 INFO  (qtp1791846525-12929) [    x:collection1] o.a.s.u.p.LogUpdateProcessorFactory [collection1]  webapp=/solr path=/update params={wt=javabin&version=2}{add=[24]} 0 0
   [junit4]   2> 1697391 INFO  (qtp1791846525-12930) [    x:collection1] o.a.s.u.p.LogUpdateProcessorFactory [collection1]  webapp=/solr path=/update params={wt=javabin&version=2}{add=[25]} 0 0
   [junit4]   2> 1697392 INFO  (qtp1791846525-12931) [    x:collection1] o.a.s.u.p.LogUpdateProcessorFactory [collection1]  webapp=/solr path=/update params={wt=javabin&version=2}{add=[26]} 0 0
   [junit4]   2> 1697392 INFO  (qtp1791846525-12924) [    x:collection1] o.a.s.u.p.LogUpdateProcessorFactory [collection1]  webapp=/solr path=/update params={wt=javabin&version=2}{add=[27]} 0 0
   [junit4]   2> 1697393 INFO  (qtp1791846525-12926) [    x:collection1] o.a.s.u.p.LogUpdateProcessorFactory [collection1]  webapp=/solr path=/update params={wt=javabin&version=2}{add=[28]} 0 0
   [junit4]   2> 1697393 INFO  (qtp1791846525-12927) [    x:collection1] o.a.s.u.p.LogUpdateProcessorFactory [collection1]  webapp=/solr path=/update params={wt=javabin&version=2}{add=[29]} 0 0
   [junit4]   2> 1697393 INFO  (qtp1791846525-12928) [    x:collection1] o.a.s.u.p.LogUpdateProcessorFactory [collection1]  webapp=/solr path=/update params={wt=javabin&version=2}{add=[30]} 0 0
   [junit4]   2> 1697394 INFO  (qtp1791846525-12929) [    x:collection1] o.a.s.u.p.LogUpdateProcessorFactory [collection1]  webapp=/solr path=/update params={wt=javabin&version=2}{add=[31]} 0 0
   [junit4]   2> 1697394 INFO  (qtp1791846525-12930) [    x:collection1] o.a.s.u.p.LogUpdateProcessorFactory [collection1]  webapp=/solr path=/update params={wt=javabin&version=2}{add=[32]} 0 0
   [junit4]   2> 1697395 INFO  (qtp1791846525-12931) [    x:collection1] o.a.s.u.p.LogUpdateProcessorFactory [collection1]  webapp=/solr path=/update params={wt=javabin&version=2}{add=[33]} 0 0
   [junit4]   2> 1697395 INFO  (qtp1791846525-12924) [    x:collection1] o.a.s.u.p.LogUpdateProcessorFactory [collection1]  webapp=/solr path=/update params={wt=javabin&version=2}{add=[34]} 0 0
   [junit4]   2> 1697395 INFO  (qtp1791846525-12926) [    x:collection1] o.a.s.u.p.LogUpdateProcessorFactory [collection1]  webapp=/solr path=/update params={wt=javabin&version=2}{add=[35]} 0 0
   [junit4]   2> 1697396 INFO  (qtp1791846525-12927) [    x:collection1] o.a.s.u.p.LogUpdateProcessorFactory [collection1]  webapp=/solr path=/update params={wt=javabin&version=2}{add=[36]} 0 0
   [junit4]   2> 1697396 INFO  (qtp1791846525-12928) [    x:collection1] o.a.s.u.p.LogUpdateProcessorFactory [collection1]  webapp=/solr path=/update params={wt=javabin&version=2}{add=[37]} 0 0
   [junit4]   2> 1697397 INFO  (qtp1791846525-12929) [    x:collection1] o.a.s.u.p.LogUpdateProcessorFactory [collection1]  webapp=/solr path=/update params={wt=javabin&version=2}{add=[38]} 0 0
   [junit4]   2> 1697397 INFO  (qtp1791846525-12930) [    x:collection1] o.a.s.u.p.LogUpdateProcessorFactory [collection1]  webapp=/solr path=/update params={wt=javabin&version=2}{add=[39]} 0 0
   [junit4]   2> 1697397 INFO  (qtp1791846525-12931) [    x:collection1] o.a.s.u.p.LogUpdateProcessorFactory [collection1]  webapp=/solr path=/update params={wt=javabin&version=2}{add=[40]} 0 0
   [junit4]   2> 1697399 INFO  (qtp1791846525-12924) [    x:collection1] o.a.s.u.p.LogUpdateProcessorFactory [collection1]  webapp=/solr path=/update params={wt=javabin&version=2}{add=[41]} 0 0
   [junit4]   2> 1697399 INFO  (qtp1791846525-12924) [    x:collection1] o.a.s.u.p.LogUpdateProcessorFactory [collection1]  webapp=/solr path=/update params={wt=javabin&version=2}{add=[42]} 0 0
   [junit4]   2> 1697399 INFO  (qtp1791846525-12926) [    x:collection1] o.a.s.u.p.LogUpdateProcessorFactory [collection1]  webapp=/solr path=/update params={wt=javabin&version=2}{add=[43]} 0 0
   [junit4]   2> 1697400 INFO  (qtp1791846525-12927) [    x:collection1] o.a.s.u.p.LogUpdateProcessorFactory [collection1]  webapp=/solr path=/update params={wt=javabin&version=2}{add=[44]} 0 0
   [junit4]   2> 1697400 INFO  (qtp1791846525-12928) [    x:collection1] o.a.s.u.p.LogUpdateProcessorFactory [collection1]  webapp=/solr path=/update params={wt=javabin&version=2}{add=[45]} 0 0
   [junit4]   2> 1697401 INFO  (qtp1791846525-12929) [    x:collection1] o.a.s.u.p.LogUpdateProcessorFactory [collection1]  webapp=/solr path=/update params={wt=javabin&version=2}{add=[46]} 0 0
   [junit4]   2> 1697401 INFO  (qtp1791846525-12930) [    x:collection1] o.a.s.u.p.LogUpdateProcessorFactory [collection1]  webapp=/solr path=/update params={wt=javabin&version=2}{add=[47]} 0 0
   [junit4]   2> 1697401 INFO  (qtp1791846525-12931) [    x:collection1] o.a.s.u.p.LogUpdateProcessorFactory [collection1]  webapp=/solr path=/update params={wt=javabin&version=2}{add=[48]} 0 0
   [junit4]   2> 1697402 INFO  (qtp1791846525-12924) [    x:collection1] o.a.s.u.p.LogUpdateProcessorFactory [collection1]  webapp=/solr path=/update params={wt=javabin&version=2}{add=[49]} 0 0
   [junit4]   2> 1697402 INFO  (qtp1791846525-12926) [    x:collection1] o.a.s.u.p.LogUpdateProcessorFactory [collection1]  webapp=/solr path=/update params={wt=javabin&version=2}{add=[50]} 0 0
   [junit4]   2> 1697404 INFO  (qtp1791846525-12927) [    x:collection1] o.a.s.u.p.LogUpdateProcessorFactory [collection1]  webapp=/solr path=/update params={wt=javabin&version=2}{add=[51]} 0 0
   [junit4]   2> 1697404 INFO  (qtp1791846525-12928) [    x:collection1] o.a.s.u.p.LogUpdateProcessorFactory [collection1]  webapp=/solr path=/update params={wt=javabin&version=2}{add=[52]} 0 0
   [junit4]   2> 1697405 INFO  (qtp1791846525-12929) [    x:collection1] o.a.s.u.p.LogUpdateProcessorFactory [collection1]  webapp=/solr path=/update params={wt=javabin&version=2}{add=[53]} 0 0
   [junit4]   2> 1697405 INFO  (qtp1791846525-12930) [    x:collection1] o.a.s.u.p.LogUpdateProcessorFactory [collection1]  webapp=/solr path=/update params={wt=javabin&version=2}{add=[54]} 0 0
   [junit4]   2> 1697406 INFO  (qtp1791846525-12931) [    x:collection1] o.a.s.u.p.LogUpdateProcessorFactory [collection1]  webapp=/solr path=/update params={wt=javabin&version=2}{add=[55]} 0 0
   [junit4]   2> 1697406 INFO  (qtp1791846525-12924) [    x:collection1] o.a.s.u.p.LogUpdateProcessorFactory [collection1]  webapp=/solr path=/update params={wt=javabin&version=2}{add=[56]} 0 0
   [junit4]   2> 1697407 INFO  (qtp1791846525-12926) [    x:collection1] o.a.s.u.p.LogUpdateProcessorFactory [collection1]  webapp=/solr path=/update params={wt=javabin&version=2}{add=[57]} 0 0
   [junit4]   2> 1697407 INFO  (qtp1791846525-12927) [    x:collection1] o.a.s.u.p.LogUpdateProcessorFactory [collection1]  webapp=/solr path=/update params={wt=javabin&version=2}{add=[58]} 0 0
   [junit4]   2> 1697407 INFO  (qtp1791846525-12928) [    x:collection1] o.a.s.u.p.LogUpdateProcessorFactory [collection1]  webapp=/solr path=/update params={wt=javabin&version=2}{add=[59]} 0 0
   [junit4]   2> 1697408 INFO  (qtp1791846525-12929) [    x:collection1] o.a.s.u.p.LogUpdateProcessorFactory [collection1]  webapp=/solr path=/update params={wt=javabin&version=2}{add=[60]} 0 0
   [junit4]   2> 1697408 INFO  (qtp1791846525-12930) [    x:collection1] o.a.s.u.p.LogUpdateProcessorFactory [collection1]  webapp=/solr path=/update params={wt=javabin&version=2}{add=[61]} 0 0
   [junit4]   2> 1697409 INFO  (qtp1791846525-12931) [    x:collection1] o.a.s.u.p.LogUpdateProcessorFactory [collection1]  webapp=/solr path=/update params={wt=javabin&version=2}{add=[62]} 0 0
   [junit4]   2> 1697410 INFO  (qtp1791846525-12924) [    x:collection1] o.a.s.u.p.LogUpdateProcessorFactory [collection1]  webapp=/solr path=/update params={wt=javabin&version=2}{add=[63]} 0 0
   [junit4]   2> 1697410 INFO  (qtp1791846525-12926) [    x:collection1] o.a.s.u.p.LogUpdateProcessorFactory [collection1]  webapp=/solr path=/update params={wt=javabin&version=2}{add=[64]} 0 0
   [junit4]   2> 1697410 INFO  (qtp1791846525-12927) [    x:collection1] o.a.s.u.p.LogUpdateProcessorFactory [collection1]  webapp=/solr path=/update params={wt=javabin&version=2}{add=[65]} 0 0
   [junit4]   2> 1697410 INFO  (qtp1791846525-12928) [    x:collection1] o.a.s.u.p.LogUpdateProcessorFactory [collection1]  webapp=/solr path=/update params={wt=javabin&version=2}{add=[66]} 0 0
   [junit4]   2> 1697410 INFO  (qtp1791846525-12929) [    x:collection1] o.a.s.u.p.LogUpdateProcessorFactory [collection1]  webapp=/solr path=/update params={wt=javabin&version=2}{add=[67]} 0 0
   [junit4]   2> 1697411 INFO  (qtp1791846525-12930) [    x:collection1] o.a.s.u.p.LogUpdateProcessorFactory [collection1]  webapp=/solr path=/update params={wt=javabin&version=2}{add=[68]} 0 0
   [junit4]   2> 1697411 INFO  (qtp1791846525-12931) [    x:collection1] o.a.s.u.p.LogUpdateProcessorFactory [collection1]  webapp=/solr path=/update params={wt=javabin&version=2}{add=[69]} 0 0
   [junit4]   2> 1697412 INFO  (qtp1791846525-12924) [    x:collection1] o.a.s.u.p.LogUpdateProcessorFactory [collection1]  webapp=/solr path=/update params={wt=javabin&version=2}{add=[70]} 0 0
   [junit4]   2> 1697412 INFO  (qtp1791846525-12926) [    x:collection1] o.a.s.u.p.LogUpdateProcessorFactory [collection1]  webapp=/solr path=/update params={wt=javabin&version=2}{add=[71]} 0 0
   [junit4]   2> 1697412 INFO  (qtp1791846525-12927) [    x:collection1] o.a.s.u.p.LogUpdateProcessorFactory [collection1]  webapp=/solr path=/update params={wt=javabin&version=2}{add=[72]} 0 0
   [junit4]   2> 1697413 INFO  (qtp1791846525-12928) [    x:collection1] o.a.s.u.p.LogUpdateProcessorFactory [collection1]  webapp=/solr path=/update params={wt=javabin&version=2}{add=[73]} 0 0
   [junit4]   2> 1697414 INFO  (qtp1791846525-12929) [    x:collection1] o.a.s.u.p.LogUpdateProcessorFactory [collection1]  webapp=/solr path=/update params={wt=javabin&version=2}{add=[74]} 0 0
   [junit4]   2> 1697414 INFO  (qtp1791846525-12930) [    x:collection1] o.a.s.u.p.LogUpdateProcessorFactory [collection1]  webapp=/solr path=/update params={wt=javabin&version=2}{add=[75]} 0 0
   [junit4]   2> 1697415 INFO  (qtp1791846525-12931) [    x:collection1] o.a.s.u.p.LogUpdateProcessorFactory [collection1]  webapp=/solr path=/update params={wt=javabin&version=2}{add=[76]} 0 0
   [junit4]   2> 1697415 INFO  (qtp1791846525-12924) [    x:collection1] o.a.s.u.p.LogUpdateProcessorFactory [collection1]  webapp=/solr path=/update params={wt=javabin&version=2}{add=[77]} 0 0
   [junit4]   2> 1697415 INFO  (qtp1791846525-12926) [    x:collection1] o.a.s.u.p.LogUpdateProcessorFactory [collection1]  webapp=/solr path=/update params={wt=javabin&version=2}{add=[78]} 0 0
   [junit4]   2> 1697416 INFO  (qtp1791846525-12927) [    x:collection1] o.a.s.u.p.LogUpdateProcessorFactory [collection1]  webapp=/solr path=/update params={wt=javabin&version=2}{add=[79]} 0 0
   [junit4]   2> 1697416 INFO  (qtp1791846525-12928) [    x:collection1] o.a.s.u.p.LogUpdateProcessorFactory [collection1]  webapp=/solr path=/update params={wt=javabin&version=2}{add=[80]} 0 0
   [junit4]   2> 1697416 INFO  (qtp1791846525-12929) [    x:collection1] o.a.s.u.p.LogUpdateProcessorFactory [collection1]  webapp=/solr path=/update params={wt=javabin&version=2}{add=[81]} 0 0
   [junit4]   2> 1697417 INFO  (qtp1791846525-12930) [    x:collection1] o.a.s.u.p.LogUpdateProcessorFactory [collection1]  webapp=/solr path=/update params={wt=javabin&version=2}{add=[82]} 0 0
   [junit4]   2> 1697417 INFO  (qtp1791846525-12931) [    x:collection1] o.a.s.u.p.LogUpdateProcessorFactory [collection1]  webapp=/solr path=/update params={wt=javabin&version=2}{add=[83]} 0 0
   [junit4]   2> 1697417 INFO  (qtp1791846525-12924) [    x:collection1] o.a.s.u.p.LogUpdateProcessorFactory [collection1]  webapp=/solr path=/update params={wt=javabin&version=2}{add=[84]} 0 0
   [junit4]   2> 1697418 INFO  (qtp1791846525-12926) [    x:collection1] o.a.s.u.p.LogUpdateProcessorFactory [collection1]  webapp=/solr path=/update params={wt=javabin&version=2}{add=[85]} 0 0
   [junit4]   2> 1697418 INFO  (qtp1791846525-12927) [    x:collection1] o.a.s.u.p.LogUpdateProcessorFactory [collection1]  webapp=/solr path=/update params={wt=javabin&version=2}{add=[86]} 0 0
   [junit4]   2> 1697418 INFO  (qtp1791846525-12928) [    x:collection1] o.a.s.u.p.LogUpdateProcessorFactory [collection1]  webapp=/solr path=/update params={wt=javabin&version=2}{add=[87]} 0 0
   [junit4]   2> 1697420 INFO  (qtp1791846525-12929) [    x:collection1] o.a.s.u.p.LogUpdateProcessorFactory [collection1]  webapp=/solr path=/update params={wt=javabin&version=2}{add=[88]} 0 0
   [junit4]   2> 1697420 INFO  (qtp1791846525-12930) [    x:collection1] o.a.s.u.p.LogUpdateProcessorFactory [collection1]  webapp=/solr path=/update params={wt=javabin&version=2}{add=[89]} 0 0
   [junit4]   2> 1697420 INFO  (qtp1791846525-12931) [    x:collection1] o.a.s.u.p.LogUpdateProcessorFactory [collection1]  webapp=/solr path=/update params={wt=javabin&version=2}{add=[90]} 0 0
   [junit4]   2> 1697421 INFO  (qtp1791846525-12924) [    x:collection1] o.a.s.u.p.LogUpdateProcessorFactory [collection1]  webapp=/solr path=/update params={wt=javabin&version=2}{add=[91]} 0 0
   [junit4]   2> 1697421 INFO  (qtp1791846525-12926) [    x:collection1] o.a.s.u.p.LogUpdateProcessorFactory [collection1]  webapp=/solr path=/update params={wt=javabin&version=2}{add=[92]} 0 0
   [junit4]   2> 1697422 INFO  (qtp1791846525-12927) [    x:collection1] o.a.s.u.p.LogUpdateProcessorFactory [collection1]  webapp=/solr path=/update params={wt=javabin&version=2}{add=[93]} 0 0
   [junit4]   2> 1697422 INFO  (qtp1791846525-12928) [    x:collection1] o.a.s.u.p.LogUpdateProcessorFactory [collection1]  webapp=/solr path=/update params={wt=javabin&version=2}{add=[94]} 0 0
   [junit4]   2> 1697422 INFO  (qtp1791846525-12928) [    x:collection1] o.a.s.u.p.LogUpdateProcessorFactory [collection1]  webapp=/solr path=/update params={wt=javabin&version=2}{add=[95]} 0 0
   [junit4]   2> 1697423 INFO  (qtp1791846525-12929) [    x:collection1] o.a.s.u.p.LogUpdateProcessorFactory [collection1]  webapp=/solr path=/update params={wt=javabin&version=2}{add=[96]} 0 0
   [junit4]   2> 1697423 INFO  (qtp1791846525-12930) [    x:collection1] o.a.s.u.p.LogUpdateProcessorFactory [collection1]  webapp=/solr path=/update params={wt=javabin&version=2}{add=[97]} 0 0
   [junit4]   2> 1697425 INFO  (qtp1791846525-12931) [    x:collection1] o.a.s.u.p.LogUpdateProcessorFactory [collection1]  webapp=/solr path=/update params={wt=javabin&version=2}{add=[98]} 0 0
   [junit4]   2> 1697425 INFO  (qtp1791846525-12924) [    x:collection1] o.a.s.u.p.LogUpdateProcessorFactory [collection1]  webapp=/solr path=/update params={wt=javabin&version=2}{add=[99]} 0 0
   [junit4]   2> 1697425 INFO  (qtp1791846525-12926) [    x:collection1] o.a.s.u.p.LogUpdateProcessorFactory [collection1]  webapp=/solr path=/update params={wt=javabin&version=2}{add=[100]} 0 0
   [junit4]   2> 1697426 INFO  (qtp1791846525-12927) [    x:collection1] o.a.s.u.p.LogUpdateProcessorFactory [collection1]  webapp=/solr path=/update params={wt=javabin&version=2}{add=[101]} 0 0
   [junit4]   2> 1697427 INFO  (qtp1791846525-12928) [    x:collection1] o.a.s.u.p.LogUpdateProcessorFactory [collection1]  webapp=/solr path=/update params={wt=javabin&version=2}{add=[102]} 0 0
   [junit4]   2> 1697427 INFO  (qtp1791846525-12929) [    x:collection1] o.a.s.u.p.LogUpdateProcessorFactory [collection1]  webapp=/solr path=/update params={wt=javabin&version=2}{add=[103]} 0 0
   [junit4]   2> 1697427 INFO  (qtp1791846525-12930) [    x:collection1] o.a.s.u.p.LogUpdateProcessorFactory [collection1]  webapp=/solr path=/update params={wt=javabin&version=2}{add=[104]} 0 0
   [junit4]   2> 1697428 INFO  (qtp1791846525-12931) [    x:collection1] o.a.s.u.p.LogUpdateProcessorFactory [collection1]  webapp=/solr path=/update params={wt=javabin&version=2}{add=[105]} 0 0
   [junit4]   2> 1697428 INFO  (qtp1791846525-12924) [    x:collection1] o.a.s.u.p.LogUpdateProcessorFactory [collection1]  webapp=/solr path=/update params={wt=javabin&version=2}{add=[106]} 0 0
   [junit4]   2> 1697428 INFO  (qtp1791846525-12926) [    x:collection1] o.a.s.u.p.LogUpdateProcessorFactory [collection1]  webapp=/solr path=/update params={wt=javabin&version=2}{add=[107]} 0 0
   [junit4]   2> 1697428 INFO  (qtp1791846525-12927) [    x:collection1] o.a.s.u.p.LogUpdateProcessorFactory [collection1]  webapp=/solr path=/update params={wt=javabin&version=2}{add=[108]} 0 0
   [junit4]   2> 1697428 INFO  (qtp1791846525-12928) [    x:collection1] o.a.s.u.p.LogUpdateProcessorFactory [collection1]  webapp=/solr path=/update params={wt=javabin&version=2}{add=[109]} 0 0
   [junit4]   2> 1697430 INFO  (qtp1791846525-12929) [    x:collection1] o.a.s.u.p.LogUpdateProcessorFactory [collection1]  webapp=/solr path=/update params={wt=javabin&version=2}{add=[110]} 0 0
   [junit4]   2> 1697431 INFO  (qtp1791846525-12930) [    x:collection1] o.a.s.u.p.LogUpdateProcessorFactory [co

[...truncated too long message...]

ndler Stopped o.e.j.s.ServletContextHandler@2e03cdfa{/solr,null,UNAVAILABLE}
   [junit4]   2> 1835754 INFO  (TEST-TestReplicationHandler.testRateLimitedReplication-seed#[B2CDAAABBE2C88D6]) [    ] o.e.j.s.ServerConnector Stopped ServerConnector@4f4783df{HTTP/1.1,[http/1.1]}{127.0.0.1:0}
   [junit4]   2> 1835754 INFO  (TEST-TestReplicationHandler.testRateLimitedReplication-seed#[B2CDAAABBE2C88D6]) [    ] o.a.s.c.CoreContainer Shutting down CoreContainer instance=786600545
   [junit4]   2> 1835758 INFO  (coreCloseExecutor-6215-thread-1) [    x:collection1] o.a.s.c.SolrCore [collection1]  CLOSING SolrCore org.apache.solr.core.SolrCore@5bb3e351
   [junit4]   2> 1835758 INFO  (coreCloseExecutor-6215-thread-1) [    x:collection1] o.a.s.u.DirectUpdateHandler2 closing DirectUpdateHandler2{commits=0,autocommits=0,soft autocommits=0,optimizes=0,rollbacks=0,expungeDeletes=0,docsPending=0,adds=0,deletesById=0,deletesByQuery=0,errors=0,cumulative_adds=0,cumulative_deletesById=0,cumulative_deletesByQuery=0,cumulative_errors=0}
   [junit4]   2> 1835758 INFO  (coreCloseExecutor-6215-thread-1) [    x:collection1] o.a.s.u.SolrCoreState Closing SolrCoreState
   [junit4]   2> 1835758 INFO  (coreCloseExecutor-6215-thread-1) [    x:collection1] o.a.s.u.DefaultSolrCoreState SolrCoreState ref count has reached 0 - closing IndexWriter
   [junit4]   2> 1835758 INFO  (coreCloseExecutor-6215-thread-1) [    x:collection1] o.a.s.u.DefaultSolrCoreState closing IndexWriter with IndexWriterCloser
   [junit4]   2> 1835759 INFO  (coreCloseExecutor-6215-thread-1) [    x:collection1] o.a.s.c.SolrCore [collection1] Closing main searcher on request.
   [junit4]   2> 1835760 INFO  (coreCloseExecutor-6215-thread-1) [    x:collection1] o.a.s.c.CachingDirectoryFactory Closing StandardDirectoryFactory - 2 directories currently being tracked
   [junit4]   2> 1835760 INFO  (coreCloseExecutor-6215-thread-1) [    x:collection1] o.a.s.c.CachingDirectoryFactory looking to close C:\Users\jenkins\workspace\Lucene-Solr-master-Windows\solr\build\solr-core\test\J1\temp\solr.handler.TestReplicationHandler_B2CDAAABBE2C88D6-001\solr-instance-030\collection1\data [CachedDir<<refCount=0;path=C:\Users\jenkins\workspace\Lucene-Solr-master-Windows\solr\build\solr-core\test\J1\temp\solr.handler.TestReplicationHandler_B2CDAAABBE2C88D6-001\solr-instance-030\collection1\data;done=false>>]
   [junit4]   2> 1835760 INFO  (coreCloseExecutor-6215-thread-1) [    x:collection1] o.a.s.c.CachingDirectoryFactory Closing directory, CoreContainer#isShutdown=true
   [junit4]   2> 1835760 INFO  (coreCloseExecutor-6215-thread-1) [    x:collection1] o.a.s.c.CachingDirectoryFactory Closing directory: C:\Users\jenkins\workspace\Lucene-Solr-master-Windows\solr\build\solr-core\test\J1\temp\solr.handler.TestReplicationHandler_B2CDAAABBE2C88D6-001\solr-instance-030\collection1\data
   [junit4]   2> 1835760 INFO  (coreCloseExecutor-6215-thread-1) [    x:collection1] o.a.s.c.CachingDirectoryFactory looking to close C:\Users\jenkins\workspace\Lucene-Solr-master-Windows\solr\build\solr-core\test\J1\temp\solr.handler.TestReplicationHandler_B2CDAAABBE2C88D6-001\solr-instance-030\collection1\data\index [CachedDir<<refCount=0;path=C:\Users\jenkins\workspace\Lucene-Solr-master-Windows\solr\build\solr-core\test\J1\temp\solr.handler.TestReplicationHandler_B2CDAAABBE2C88D6-001\solr-instance-030\collection1\data\index;done=false>>]
   [junit4]   2> 1835760 INFO  (coreCloseExecutor-6215-thread-1) [    x:collection1] o.a.s.c.CachingDirectoryFactory Closing directory, CoreContainer#isShutdown=true
   [junit4]   2> 1835760 INFO  (coreCloseExecutor-6215-thread-1) [    x:collection1] o.a.s.c.CachingDirectoryFactory Closing directory: C:\Users\jenkins\workspace\Lucene-Solr-master-Windows\solr\build\solr-core\test\J1\temp\solr.handler.TestReplicationHandler_B2CDAAABBE2C88D6-001\solr-instance-030\collection1\data\index
   [junit4]   2> 1835765 INFO  (TEST-TestReplicationHandler.testRateLimitedReplication-seed#[B2CDAAABBE2C88D6]) [    ] o.e.j.s.h.ContextHandler Stopped o.e.j.s.ServletContextHandler@2a8b6f56{/solr,null,UNAVAILABLE}
   [junit4]   2> 1835791 INFO  (SUITE-TestReplicationHandler-seed#[B2CDAAABBE2C88D6]-worker) [    ] o.a.s.SolrTestCaseJ4 ###deleteCore
   [junit4]   2> NOTE: leaving temporary files on disk at: C:\Users\jenkins\workspace\Lucene-Solr-master-Windows\solr\build\solr-core\test\J1\temp\solr.handler.TestReplicationHandler_B2CDAAABBE2C88D6-001
   [junit4]   2> NOTE: test params are: codec=Asserting(Lucene60): {name=PostingsFormat(name=Memory doPackFST= true), id=PostingsFormat(name=Memory doPackFST= true), newname=PostingsFormat(name=Memory doPackFST= true)}, docValues:{}, maxPointsInLeafNode=1204, maxMBSortInHeap=5.523164362847609, sim=RandomSimilarity(queryNorm=true,coord=crazy): {}, locale=hu-HU, timezone=Africa/Algiers
   [junit4]   2> NOTE: Windows 10 10.0 amd64/Oracle Corporation 1.8.0_92 (64-bit)/cpus=3,threads=1,free=230704928,total=526909440
   [junit4]   2> NOTE: All tests run in this JVM: [OpenExchangeRatesOrgProviderTest, TestFastWriter, DistributedMLTComponentTest, TestAtomicUpdateErrorCases, SharedFSAutoReplicaFailoverUtilsTest, DeleteStatusTest, SolrCloudExampleTest, TestRandomFaceting, PKIAuthenticationIntegrationTest, DirectSolrConnectionTest, HdfsTlogReplayBufferedWhileIndexingTest, TestPerFieldSimilarity, FieldAnalysisRequestHandlerTest, TestJsonRequest, TestRealTimeGet, CoreMergeIndexesAdminHandlerTest, TestManagedResourceStorage, TestZkChroot, TestLeaderElectionZkExpiry, TestQueryTypes, CurrencyFieldOpenExchangeTest, AnalyticsMergeStrategyTest, TestMaxScoreQueryParser, SpellPossibilityIteratorTest, TestInitParams, ZkSolrClientTest, TestOnReconnectListenerSupport, BufferStoreTest, CloneFieldUpdateProcessorFactoryTest, DistributedDebugComponentTest, SpellCheckCollatorTest, TestSha256AuthenticationProvider, LeaderFailoverAfterPartitionTest, TermVectorComponentTest, TestXmlQParser, TestSolrIndexConfig, TestCustomSort, JavabinLoaderTest, TestSmileRequest, ZkStateWriterTest, TestIndexSearcher, TestSolrFieldCacheMBean, TestReload, TestReversedWildcardFilterFactory, TestRecovery, TestSolrJ, ExplicitHLLTest, TestHashQParserPlugin, TermVectorComponentDistributedTest, HdfsLockFactoryTest, HdfsSyncSliceTest, TestLMJelinekMercerSimilarityFactory, ConjunctionSolrSpellCheckerTest, AnalysisErrorHandlingTest, NoCacheHeaderTest, TestShortCircuitedRequests, TestRTimerTree, DateRangeFieldTest, MultiThreadedOCPTest, CleanupOldIndexTest, HdfsChaosMonkeySafeLeaderTest, TestDefaultStatsCache, IgnoreCommitOptimizeUpdateProcessorFactoryTest, DistanceFunctionTest, LukeRequestHandlerTest, PreAnalyzedUpdateProcessorTest, TestPHPSerializedResponseWriter, RuleEngineTest, ShardRoutingCustomTest, DistributedQueryComponentOptimizationTest, OverseerRolesTest, QueryParsingTest, SolrPluginUtilsTest, TestConfigSetsAPIExclusivity, ForceLeaderTest, TestAuthenticationFramework, CursorMarkTest, TestStressUserVersions, CacheHeaderTest, RankQueryTest, TestFiltering, TestSchemaNameResource, DirectUpdateHandlerOptimizeTest, TestChildDocTransformer, SuggestComponentContextFilterQueryTest, TestQuerySenderListener, DateFieldTest, TestTestInjection, BadCopyFieldTest, DistributedFacetPivotLargeTest, HdfsWriteToMultipleCollectionsTest, FieldMutatingUpdateProcessorTest, AsyncCallRequestStatusResponseTest, TestSchemaSimilarityResource, SecurityConfHandlerTest, TestJoin, HLLSerializationTest, SSLMigrationTest, RestartWhileUpdatingTest, TestDistributedMissingSort, CSVRequestHandlerTest, TestBulkSchemaAPI, TestSerializedLuceneMatchVersion, TestStressRecovery, FacetPivotSmallTest, IndexSchemaRuntimeFieldTest, TestBulkSchemaConcurrent, TestCSVResponseWriter, TestBadConfig, PluginInfoTest, TestCollectionAPI, TestFilteredDocIdSet, TestBinaryResponseWriter, EnumFieldTest, CoreAdminCreateDiscoverTest, StatsComponentTest, TestJettySolrRunner, ConvertedLegacyTest, TestRawTransformer, ZkNodePropsTest, TestCollapseQParserPlugin, CollectionsAPISolrJTest, TestSolrQueryParser, TestGeoJSONResponseWriter, HdfsRecoveryZkTest, DistributedQueueTest, TestImplicitCoreProperties, TestTrie, MinimalSchemaTest, DistribDocExpirationUpdateProcessorTest, ResponseLogComponentTest, TestSolrDeletionPolicy2, DistributedFacetPivotSmallAdvancedTest, DataDrivenBlockJoinTest, BlockCacheTest, TestCryptoKeys, BasicDistributedZk2Test, BasicZkTest, SolrInfoMBeanTest, TestSystemIdResolver, TestDFISimilarityFactory, TestScoreJoinQPNoScore, ConnectionReuseTest, BasicDistributedZkTest, ChaosMonkeySafeLeaderTest, CollectionsAPIDistributedZkTest, RecoveryZkTest, TestReplicationHandler]
   [junit4] Completed [321/591 (1!)] on J1 in 140.09s, 14 tests, 1 error <<< FAILURES!

[...truncated 873 lines...]
BUILD FAILED
C:\Users\jenkins\workspace\Lucene-Solr-master-Windows\build.xml:740: The following error occurred while executing this line:
C:\Users\jenkins\workspace\Lucene-Solr-master-Windows\build.xml:684: The following error occurred while executing this line:
C:\Users\jenkins\workspace\Lucene-Solr-master-Windows\build.xml:59: The following error occurred while executing this line:
C:\Users\jenkins\workspace\Lucene-Solr-master-Windows\solr\build.xml:233: The following error occurred while executing this line:
C:\Users\jenkins\workspace\Lucene-Solr-master-Windows\solr\common-build.xml:529: The following error occurred while executing this line:
C:\Users\jenkins\workspace\Lucene-Solr-master-Windows\lucene\common-build.xml:1457: The following error occurred while executing this line:
C:\Users\jenkins\workspace\Lucene-Solr-master-Windows\lucene\common-build.xml:1014: There were test failures: 591 suites (10 ignored), 2388 tests, 1 error, 123 ignored (79 assumptions) [seed: B2CDAAABBE2C88D6]

Total time: 71 minutes 15 seconds
Build step 'Invoke Ant' marked build as failure
Archiving artifacts
[WARNINGS] Skipping publisher since build result is FAILURE
Recording test results
Email was triggered for: Failure - Any
Sending email for trigger: Failure - Any



Mime
View raw message