lucene-dev mailing list archives

Site index · List index
Message view « Date » · « Thread »
Top « Date » · « Thread »
From Policeman Jenkins Server <jenk...@thetaphi.de>
Subject [JENKINS] Lucene-Solr-6.0-Linux (32bit/jdk1.8.0_72) - Build # 57 - Still Failing!
Date Sat, 09 Apr 2016 19:42:48 GMT
Build: http://jenkins.thetaphi.de/job/Lucene-Solr-6.0-Linux/57/
Java: 32bit/jdk1.8.0_72 -client -XX:+UseG1GC

1 tests failed.
FAILED:  org.apache.solr.cloud.ChaosMonkeyNothingIsSafeTest.test

Error Message:
document count mismatch.  control=408 sum(shards)=407 cloudClient=407

Stack Trace:
java.lang.AssertionError: document count mismatch.  control=408 sum(shards)=407 cloudClient=407
	at __randomizedtesting.SeedInfo.seed([89AB750D2C291D3D:1FF4AD782D570C5]:0)
	at org.junit.Assert.fail(Assert.java:93)
	at org.apache.solr.cloud.AbstractFullDistribZkTestBase.checkShardConsistency(AbstractFullDistribZkTestBase.java:1317)
	at org.apache.solr.cloud.ChaosMonkeyNothingIsSafeTest.test(ChaosMonkeyNothingIsSafeTest.java:226)
	at sun.reflect.NativeMethodAccessorImpl.invoke0(Native Method)
	at sun.reflect.NativeMethodAccessorImpl.invoke(NativeMethodAccessorImpl.java:62)
	at sun.reflect.DelegatingMethodAccessorImpl.invoke(DelegatingMethodAccessorImpl.java:43)
	at java.lang.reflect.Method.invoke(Method.java:498)
	at com.carrotsearch.randomizedtesting.RandomizedRunner.invoke(RandomizedRunner.java:1764)
	at com.carrotsearch.randomizedtesting.RandomizedRunner$8.evaluate(RandomizedRunner.java:871)
	at com.carrotsearch.randomizedtesting.RandomizedRunner$9.evaluate(RandomizedRunner.java:907)
	at com.carrotsearch.randomizedtesting.RandomizedRunner$10.evaluate(RandomizedRunner.java:921)
	at org.apache.solr.BaseDistributedSearchTestCase$ShardsRepeatRule$ShardsFixedStatement.callStatement(BaseDistributedSearchTestCase.java:992)
	at org.apache.solr.BaseDistributedSearchTestCase$ShardsRepeatRule$ShardsStatement.evaluate(BaseDistributedSearchTestCase.java:967)
	at com.carrotsearch.randomizedtesting.rules.SystemPropertiesRestoreRule$1.evaluate(SystemPropertiesRestoreRule.java:57)
	at org.apache.lucene.util.TestRuleSetupTeardownChained$1.evaluate(TestRuleSetupTeardownChained.java:49)
	at org.apache.lucene.util.AbstractBeforeAfterRule$1.evaluate(AbstractBeforeAfterRule.java:45)
	at org.apache.lucene.util.TestRuleThreadAndTestName$1.evaluate(TestRuleThreadAndTestName.java:48)
	at org.apache.lucene.util.TestRuleIgnoreAfterMaxFailures$1.evaluate(TestRuleIgnoreAfterMaxFailures.java:64)
	at org.apache.lucene.util.TestRuleMarkFailure$1.evaluate(TestRuleMarkFailure.java:47)
	at com.carrotsearch.randomizedtesting.rules.StatementAdapter.evaluate(StatementAdapter.java:36)
	at com.carrotsearch.randomizedtesting.ThreadLeakControl$StatementRunner.run(ThreadLeakControl.java:367)
	at com.carrotsearch.randomizedtesting.ThreadLeakControl.forkTimeoutingTask(ThreadLeakControl.java:809)
	at com.carrotsearch.randomizedtesting.ThreadLeakControl$3.evaluate(ThreadLeakControl.java:460)
	at com.carrotsearch.randomizedtesting.RandomizedRunner.runSingleTest(RandomizedRunner.java:880)
	at com.carrotsearch.randomizedtesting.RandomizedRunner$5.evaluate(RandomizedRunner.java:781)
	at com.carrotsearch.randomizedtesting.RandomizedRunner$6.evaluate(RandomizedRunner.java:816)
	at com.carrotsearch.randomizedtesting.RandomizedRunner$7.evaluate(RandomizedRunner.java:827)
	at com.carrotsearch.randomizedtesting.rules.StatementAdapter.evaluate(StatementAdapter.java:36)
	at com.carrotsearch.randomizedtesting.rules.SystemPropertiesRestoreRule$1.evaluate(SystemPropertiesRestoreRule.java:57)
	at org.apache.lucene.util.AbstractBeforeAfterRule$1.evaluate(AbstractBeforeAfterRule.java:45)
	at com.carrotsearch.randomizedtesting.rules.StatementAdapter.evaluate(StatementAdapter.java:36)
	at org.apache.lucene.util.TestRuleStoreClassName$1.evaluate(TestRuleStoreClassName.java:41)
	at com.carrotsearch.randomizedtesting.rules.NoShadowingOrOverridesOnMethodsRule$1.evaluate(NoShadowingOrOverridesOnMethodsRule.java:40)
	at com.carrotsearch.randomizedtesting.rules.NoShadowingOrOverridesOnMethodsRule$1.evaluate(NoShadowingOrOverridesOnMethodsRule.java:40)
	at com.carrotsearch.randomizedtesting.rules.StatementAdapter.evaluate(StatementAdapter.java:36)
	at com.carrotsearch.randomizedtesting.rules.StatementAdapter.evaluate(StatementAdapter.java:36)
	at com.carrotsearch.randomizedtesting.rules.StatementAdapter.evaluate(StatementAdapter.java:36)
	at org.apache.lucene.util.TestRuleAssertionsRequired$1.evaluate(TestRuleAssertionsRequired.java:53)
	at org.apache.lucene.util.TestRuleMarkFailure$1.evaluate(TestRuleMarkFailure.java:47)
	at org.apache.lucene.util.TestRuleIgnoreAfterMaxFailures$1.evaluate(TestRuleIgnoreAfterMaxFailures.java:64)
	at org.apache.lucene.util.TestRuleIgnoreTestSuites$1.evaluate(TestRuleIgnoreTestSuites.java:54)
	at com.carrotsearch.randomizedtesting.rules.StatementAdapter.evaluate(StatementAdapter.java:36)
	at com.carrotsearch.randomizedtesting.ThreadLeakControl$StatementRunner.run(ThreadLeakControl.java:367)
	at java.lang.Thread.run(Thread.java:745)




Build Log:
[...truncated 11878 lines...]
   [junit4] Suite: org.apache.solr.cloud.ChaosMonkeyNothingIsSafeTest
   [junit4]   2> Creating dataDir: /home/jenkins/workspace/Lucene-Solr-6.0-Linux/solr/build/solr-core/test/J1/temp/solr.cloud.ChaosMonkeyNothingIsSafeTest_89AB750D2C291D3D-001/init-core-data-001
   [junit4]   2> 1161897 INFO  (SUITE-ChaosMonkeyNothingIsSafeTest-seed#[89AB750D2C291D3D]-worker) [    ] o.a.s.BaseDistributedSearchTestCase Setting hostContext system property: /ra/yk
   [junit4]   2> 1161900 INFO  (TEST-ChaosMonkeyNothingIsSafeTest.test-seed#[89AB750D2C291D3D]) [    ] o.a.s.c.ZkTestServer STARTING ZK TEST SERVER
   [junit4]   2> 1161900 INFO  (Thread-3428) [    ] o.a.s.c.ZkTestServer client port:0.0.0.0/0.0.0.0:0
   [junit4]   2> 1161900 INFO  (Thread-3428) [    ] o.a.s.c.ZkTestServer Starting server
   [junit4]   2> 1162000 INFO  (TEST-ChaosMonkeyNothingIsSafeTest.test-seed#[89AB750D2C291D3D]) [    ] o.a.s.c.ZkTestServer start zk server on port:35398
   [junit4]   2> 1162000 INFO  (TEST-ChaosMonkeyNothingIsSafeTest.test-seed#[89AB750D2C291D3D]) [    ] o.a.s.c.c.SolrZkClient Using default ZkCredentialsProvider
   [junit4]   2> 1162001 INFO  (TEST-ChaosMonkeyNothingIsSafeTest.test-seed#[89AB750D2C291D3D]) [    ] o.a.s.c.c.ConnectionManager Waiting for client to connect to ZooKeeper
   [junit4]   2> 1162003 INFO  (zkCallback-1365-thread-1) [    ] o.a.s.c.c.ConnectionManager Watcher org.apache.solr.common.cloud.ConnectionManager@3ca161 name:ZooKeeperConnection Watcher:127.0.0.1:35398 got event WatchedEvent state:SyncConnected type:None path:null path:null type:None
   [junit4]   2> 1162004 INFO  (TEST-ChaosMonkeyNothingIsSafeTest.test-seed#[89AB750D2C291D3D]) [    ] o.a.s.c.c.ConnectionManager Client is connected to ZooKeeper
   [junit4]   2> 1162004 INFO  (TEST-ChaosMonkeyNothingIsSafeTest.test-seed#[89AB750D2C291D3D]) [    ] o.a.s.c.c.SolrZkClient Using default ZkACLProvider
   [junit4]   2> 1162004 INFO  (TEST-ChaosMonkeyNothingIsSafeTest.test-seed#[89AB750D2C291D3D]) [    ] o.a.s.c.c.SolrZkClient makePath: /solr
   [junit4]   2> 1162006 INFO  (TEST-ChaosMonkeyNothingIsSafeTest.test-seed#[89AB750D2C291D3D]) [    ] o.a.s.c.c.SolrZkClient Using default ZkCredentialsProvider
   [junit4]   2> 1162007 INFO  (TEST-ChaosMonkeyNothingIsSafeTest.test-seed#[89AB750D2C291D3D]) [    ] o.a.s.c.c.ConnectionManager Waiting for client to connect to ZooKeeper
   [junit4]   2> 1162008 INFO  (zkCallback-1366-thread-1) [    ] o.a.s.c.c.ConnectionManager Watcher org.apache.solr.common.cloud.ConnectionManager@115d298 name:ZooKeeperConnection Watcher:127.0.0.1:35398/solr got event WatchedEvent state:SyncConnected type:None path:null path:null type:None
   [junit4]   2> 1162008 INFO  (TEST-ChaosMonkeyNothingIsSafeTest.test-seed#[89AB750D2C291D3D]) [    ] o.a.s.c.c.ConnectionManager Client is connected to ZooKeeper
   [junit4]   2> 1162008 INFO  (TEST-ChaosMonkeyNothingIsSafeTest.test-seed#[89AB750D2C291D3D]) [    ] o.a.s.c.c.SolrZkClient Using default ZkACLProvider
   [junit4]   2> 1162008 INFO  (TEST-ChaosMonkeyNothingIsSafeTest.test-seed#[89AB750D2C291D3D]) [    ] o.a.s.c.c.SolrZkClient makePath: /collections/collection1
   [junit4]   2> 1162010 INFO  (TEST-ChaosMonkeyNothingIsSafeTest.test-seed#[89AB750D2C291D3D]) [    ] o.a.s.c.c.SolrZkClient makePath: /collections/collection1/shards
   [junit4]   2> 1162012 INFO  (TEST-ChaosMonkeyNothingIsSafeTest.test-seed#[89AB750D2C291D3D]) [    ] o.a.s.c.c.SolrZkClient makePath: /collections/control_collection
   [junit4]   2> 1162014 INFO  (TEST-ChaosMonkeyNothingIsSafeTest.test-seed#[89AB750D2C291D3D]) [    ] o.a.s.c.c.SolrZkClient makePath: /collections/control_collection/shards
   [junit4]   2> 1162016 INFO  (TEST-ChaosMonkeyNothingIsSafeTest.test-seed#[89AB750D2C291D3D]) [    ] o.a.s.c.AbstractZkTestCase put /home/jenkins/workspace/Lucene-Solr-6.0-Linux/solr/core/src/test-files/solr/collection1/conf/solrconfig-tlog.xml to /configs/conf1/solrconfig.xml
   [junit4]   2> 1162016 INFO  (TEST-ChaosMonkeyNothingIsSafeTest.test-seed#[89AB750D2C291D3D]) [    ] o.a.s.c.c.SolrZkClient makePath: /configs/conf1/solrconfig.xml
   [junit4]   2> 1162019 INFO  (TEST-ChaosMonkeyNothingIsSafeTest.test-seed#[89AB750D2C291D3D]) [    ] o.a.s.c.AbstractZkTestCase put /home/jenkins/workspace/Lucene-Solr-6.0-Linux/solr/core/src/test-files/solr/collection1/conf/schema15.xml to /configs/conf1/schema.xml
   [junit4]   2> 1162019 INFO  (TEST-ChaosMonkeyNothingIsSafeTest.test-seed#[89AB750D2C291D3D]) [    ] o.a.s.c.c.SolrZkClient makePath: /configs/conf1/schema.xml
   [junit4]   2> 1162021 INFO  (TEST-ChaosMonkeyNothingIsSafeTest.test-seed#[89AB750D2C291D3D]) [    ] o.a.s.c.AbstractZkTestCase put /home/jenkins/workspace/Lucene-Solr-6.0-Linux/solr/core/src/test-files/solr/collection1/conf/solrconfig.snippet.randomindexconfig.xml to /configs/conf1/solrconfig.snippet.randomindexconfig.xml
   [junit4]   2> 1162021 INFO  (TEST-ChaosMonkeyNothingIsSafeTest.test-seed#[89AB750D2C291D3D]) [    ] o.a.s.c.c.SolrZkClient makePath: /configs/conf1/solrconfig.snippet.randomindexconfig.xml
   [junit4]   2> 1162023 INFO  (TEST-ChaosMonkeyNothingIsSafeTest.test-seed#[89AB750D2C291D3D]) [    ] o.a.s.c.AbstractZkTestCase put /home/jenkins/workspace/Lucene-Solr-6.0-Linux/solr/core/src/test-files/solr/collection1/conf/stopwords.txt to /configs/conf1/stopwords.txt
   [junit4]   2> 1162024 INFO  (TEST-ChaosMonkeyNothingIsSafeTest.test-seed#[89AB750D2C291D3D]) [    ] o.a.s.c.c.SolrZkClient makePath: /configs/conf1/stopwords.txt
   [junit4]   2> 1162025 INFO  (TEST-ChaosMonkeyNothingIsSafeTest.test-seed#[89AB750D2C291D3D]) [    ] o.a.s.c.AbstractZkTestCase put /home/jenkins/workspace/Lucene-Solr-6.0-Linux/solr/core/src/test-files/solr/collection1/conf/protwords.txt to /configs/conf1/protwords.txt
   [junit4]   2> 1162025 INFO  (TEST-ChaosMonkeyNothingIsSafeTest.test-seed#[89AB750D2C291D3D]) [    ] o.a.s.c.c.SolrZkClient makePath: /configs/conf1/protwords.txt
   [junit4]   2> 1162027 INFO  (TEST-ChaosMonkeyNothingIsSafeTest.test-seed#[89AB750D2C291D3D]) [    ] o.a.s.c.AbstractZkTestCase put /home/jenkins/workspace/Lucene-Solr-6.0-Linux/solr/core/src/test-files/solr/collection1/conf/currency.xml to /configs/conf1/currency.xml
   [junit4]   2> 1162027 INFO  (TEST-ChaosMonkeyNothingIsSafeTest.test-seed#[89AB750D2C291D3D]) [    ] o.a.s.c.c.SolrZkClient makePath: /configs/conf1/currency.xml
   [junit4]   2> 1162028 INFO  (TEST-ChaosMonkeyNothingIsSafeTest.test-seed#[89AB750D2C291D3D]) [    ] o.a.s.c.AbstractZkTestCase put /home/jenkins/workspace/Lucene-Solr-6.0-Linux/solr/core/src/test-files/solr/collection1/conf/enumsConfig.xml to /configs/conf1/enumsConfig.xml
   [junit4]   2> 1162028 INFO  (TEST-ChaosMonkeyNothingIsSafeTest.test-seed#[89AB750D2C291D3D]) [    ] o.a.s.c.c.SolrZkClient makePath: /configs/conf1/enumsConfig.xml
   [junit4]   2> 1162030 INFO  (TEST-ChaosMonkeyNothingIsSafeTest.test-seed#[89AB750D2C291D3D]) [    ] o.a.s.c.AbstractZkTestCase put /home/jenkins/workspace/Lucene-Solr-6.0-Linux/solr/core/src/test-files/solr/collection1/conf/open-exchange-rates.json to /configs/conf1/open-exchange-rates.json
   [junit4]   2> 1162030 INFO  (TEST-ChaosMonkeyNothingIsSafeTest.test-seed#[89AB750D2C291D3D]) [    ] o.a.s.c.c.SolrZkClient makePath: /configs/conf1/open-exchange-rates.json
   [junit4]   2> 1162031 INFO  (TEST-ChaosMonkeyNothingIsSafeTest.test-seed#[89AB750D2C291D3D]) [    ] o.a.s.c.AbstractZkTestCase put /home/jenkins/workspace/Lucene-Solr-6.0-Linux/solr/core/src/test-files/solr/collection1/conf/mapping-ISOLatin1Accent.txt to /configs/conf1/mapping-ISOLatin1Accent.txt
   [junit4]   2> 1162031 INFO  (TEST-ChaosMonkeyNothingIsSafeTest.test-seed#[89AB750D2C291D3D]) [    ] o.a.s.c.c.SolrZkClient makePath: /configs/conf1/mapping-ISOLatin1Accent.txt
   [junit4]   2> 1162033 INFO  (TEST-ChaosMonkeyNothingIsSafeTest.test-seed#[89AB750D2C291D3D]) [    ] o.a.s.c.AbstractZkTestCase put /home/jenkins/workspace/Lucene-Solr-6.0-Linux/solr/core/src/test-files/solr/collection1/conf/old_synonyms.txt to /configs/conf1/old_synonyms.txt
   [junit4]   2> 1162033 INFO  (TEST-ChaosMonkeyNothingIsSafeTest.test-seed#[89AB750D2C291D3D]) [    ] o.a.s.c.c.SolrZkClient makePath: /configs/conf1/old_synonyms.txt
   [junit4]   2> 1162035 INFO  (TEST-ChaosMonkeyNothingIsSafeTest.test-seed#[89AB750D2C291D3D]) [    ] o.a.s.c.AbstractZkTestCase put /home/jenkins/workspace/Lucene-Solr-6.0-Linux/solr/core/src/test-files/solr/collection1/conf/synonyms.txt to /configs/conf1/synonyms.txt
   [junit4]   2> 1162035 INFO  (TEST-ChaosMonkeyNothingIsSafeTest.test-seed#[89AB750D2C291D3D]) [    ] o.a.s.c.c.SolrZkClient makePath: /configs/conf1/synonyms.txt
   [junit4]   2> 1162107 INFO  (TEST-ChaosMonkeyNothingIsSafeTest.test-seed#[89AB750D2C291D3D]) [    ] o.a.s.SolrTestCaseJ4 Writing core.properties file to /home/jenkins/workspace/Lucene-Solr-6.0-Linux/solr/build/solr-core/test/J1/temp/solr.cloud.ChaosMonkeyNothingIsSafeTest_89AB750D2C291D3D-001/control-001/cores/collection1
   [junit4]   2> 1162109 INFO  (TEST-ChaosMonkeyNothingIsSafeTest.test-seed#[89AB750D2C291D3D]) [    ] o.e.j.s.Server jetty-9.3.8.v20160314
   [junit4]   2> 1162111 INFO  (TEST-ChaosMonkeyNothingIsSafeTest.test-seed#[89AB750D2C291D3D]) [    ] o.e.j.s.h.ContextHandler Started o.e.j.s.ServletContextHandler@5249a0{/ra/yk,null,AVAILABLE}
   [junit4]   2> 1162112 INFO  (TEST-ChaosMonkeyNothingIsSafeTest.test-seed#[89AB750D2C291D3D]) [    ] o.e.j.s.ServerConnector Started ServerConnector@1635cc4{HTTP/1.1,[http/1.1]}{127.0.0.1:36018}
   [junit4]   2> 1162112 INFO  (TEST-ChaosMonkeyNothingIsSafeTest.test-seed#[89AB750D2C291D3D]) [    ] o.e.j.s.Server Started @1163522ms
   [junit4]   2> 1162112 INFO  (TEST-ChaosMonkeyNothingIsSafeTest.test-seed#[89AB750D2C291D3D]) [    ] o.a.s.c.s.e.JettySolrRunner Jetty properties: {solr.data.dir=/home/jenkins/workspace/Lucene-Solr-6.0-Linux/solr/build/solr-core/test/J1/temp/solr.cloud.ChaosMonkeyNothingIsSafeTest_89AB750D2C291D3D-001/tempDir-001/control/data, hostContext=/ra/yk, hostPort=36018, coreRootDirectory=/home/jenkins/workspace/Lucene-Solr-6.0-Linux/solr/build/solr-core/test/J1/../../../../../../../../../home/jenkins/workspace/Lucene-Solr-6.0-Linux/solr/build/solr-core/test/J1/temp/solr.cloud.ChaosMonkeyNothingIsSafeTest_89AB750D2C291D3D-001/control-001/cores}
   [junit4]   2> 1162112 INFO  (TEST-ChaosMonkeyNothingIsSafeTest.test-seed#[89AB750D2C291D3D]) [    ] o.a.s.s.SolrDispatchFilter SolrDispatchFilter.init(): sun.misc.Launcher$AppClassLoader@1d16e93
   [junit4]   2> 1162112 INFO  (TEST-ChaosMonkeyNothingIsSafeTest.test-seed#[89AB750D2C291D3D]) [    ] o.a.s.c.SolrResourceLoader new SolrResourceLoader for directory: '/home/jenkins/workspace/Lucene-Solr-6.0-Linux/solr/build/solr-core/test/J1/temp/solr.cloud.ChaosMonkeyNothingIsSafeTest_89AB750D2C291D3D-001/control-001'
   [junit4]   2> 1162113 INFO  (TEST-ChaosMonkeyNothingIsSafeTest.test-seed#[89AB750D2C291D3D]) [    ] o.a.s.c.SolrResourceLoader JNDI not configured for solr (NoInitialContextEx)
   [junit4]   2> 1162113 INFO  (TEST-ChaosMonkeyNothingIsSafeTest.test-seed#[89AB750D2C291D3D]) [    ] o.a.s.c.SolrResourceLoader solr home defaulted to 'solr/' (could not find system property or JNDI)
   [junit4]   2> 1162113 INFO  (TEST-ChaosMonkeyNothingIsSafeTest.test-seed#[89AB750D2C291D3D]) [    ] o.a.s.c.c.SolrZkClient Using default ZkCredentialsProvider
   [junit4]   2> 1162113 INFO  (TEST-ChaosMonkeyNothingIsSafeTest.test-seed#[89AB750D2C291D3D]) [    ] o.a.s.c.c.ConnectionManager Waiting for client to connect to ZooKeeper
   [junit4]   2> 1162114 INFO  (zkCallback-1367-thread-1) [    ] o.a.s.c.c.ConnectionManager Watcher org.apache.solr.common.cloud.ConnectionManager@1ac8ad9 name:ZooKeeperConnection Watcher:127.0.0.1:35398/solr got event WatchedEvent state:SyncConnected type:None path:null path:null type:None
   [junit4]   2> 1162114 INFO  (TEST-ChaosMonkeyNothingIsSafeTest.test-seed#[89AB750D2C291D3D]) [    ] o.a.s.c.c.ConnectionManager Client is connected to ZooKeeper
   [junit4]   2> 1162115 INFO  (TEST-ChaosMonkeyNothingIsSafeTest.test-seed#[89AB750D2C291D3D]) [    ] o.a.s.c.c.SolrZkClient Using default ZkACLProvider
   [junit4]   2> 1162116 INFO  (TEST-ChaosMonkeyNothingIsSafeTest.test-seed#[89AB750D2C291D3D]) [    ] o.a.s.s.SolrDispatchFilter Loading solr.xml from SolrHome (not found in ZooKeeper)
   [junit4]   2> 1162116 INFO  (TEST-ChaosMonkeyNothingIsSafeTest.test-seed#[89AB750D2C291D3D]) [    ] o.a.s.c.SolrXmlConfig Loading container configuration from /home/jenkins/workspace/Lucene-Solr-6.0-Linux/solr/build/solr-core/test/J1/temp/solr.cloud.ChaosMonkeyNothingIsSafeTest_89AB750D2C291D3D-001/control-001/solr.xml
   [junit4]   2> 1162128 INFO  (TEST-ChaosMonkeyNothingIsSafeTest.test-seed#[89AB750D2C291D3D]) [    ] o.a.s.c.CorePropertiesLocator Config-defined core root directory: /home/jenkins/workspace/Lucene-Solr-6.0-Linux/solr/build/solr-core/test/J1/../../../../../../../../../home/jenkins/workspace/Lucene-Solr-6.0-Linux/solr/build/solr-core/test/J1/temp/solr.cloud.ChaosMonkeyNothingIsSafeTest_89AB750D2C291D3D-001/control-001/cores
   [junit4]   2> 1162128 INFO  (TEST-ChaosMonkeyNothingIsSafeTest.test-seed#[89AB750D2C291D3D]) [    ] o.a.s.c.CoreContainer New CoreContainer 22542219
   [junit4]   2> 1162128 INFO  (TEST-ChaosMonkeyNothingIsSafeTest.test-seed#[89AB750D2C291D3D]) [    ] o.a.s.c.CoreContainer Loading cores into CoreContainer [instanceDir=/home/jenkins/workspace/Lucene-Solr-6.0-Linux/solr/build/solr-core/test/J1/temp/solr.cloud.ChaosMonkeyNothingIsSafeTest_89AB750D2C291D3D-001/control-001]
   [junit4]   2> 1162129 WARN  (TEST-ChaosMonkeyNothingIsSafeTest.test-seed#[89AB750D2C291D3D]) [    ] o.a.s.c.CoreContainer Couldn't add files from /home/jenkins/workspace/Lucene-Solr-6.0-Linux/solr/build/solr-core/test/J1/temp/solr.cloud.ChaosMonkeyNothingIsSafeTest_89AB750D2C291D3D-001/control-001/lib to classpath: /home/jenkins/workspace/Lucene-Solr-6.0-Linux/solr/build/solr-core/test/J1/temp/solr.cloud.ChaosMonkeyNothingIsSafeTest_89AB750D2C291D3D-001/control-001/lib
   [junit4]   2> 1162129 INFO  (TEST-ChaosMonkeyNothingIsSafeTest.test-seed#[89AB750D2C291D3D]) [    ] o.a.s.h.c.HttpShardHandlerFactory created with socketTimeout : 90000,urlScheme : ,connTimeout : 15000,maxConnectionsPerHost : 20,maxConnections : 10000,corePoolSize : 0,maximumPoolSize : 2147483647,maxThreadIdleTime : 5,sizeOfQueue : -1,fairnessPolicy : false,useRetries : false,
   [junit4]   2> 1162130 INFO  (TEST-ChaosMonkeyNothingIsSafeTest.test-seed#[89AB750D2C291D3D]) [    ] o.a.s.u.UpdateShardHandler Creating UpdateShardHandler HTTP client with params: socketTimeout=340000&connTimeout=45000&retry=true
   [junit4]   2> 1162130 INFO  (TEST-ChaosMonkeyNothingIsSafeTest.test-seed#[89AB750D2C291D3D]) [    ] o.a.s.l.LogWatcher SLF4J impl is org.slf4j.impl.Log4jLoggerFactory
   [junit4]   2> 1162130 INFO  (TEST-ChaosMonkeyNothingIsSafeTest.test-seed#[89AB750D2C291D3D]) [    ] o.a.s.l.LogWatcher Registering Log Listener [Log4j (org.slf4j.impl.Log4jLoggerFactory)]
   [junit4]   2> 1162131 INFO  (TEST-ChaosMonkeyNothingIsSafeTest.test-seed#[89AB750D2C291D3D]) [    ] o.a.s.c.ZkContainer Zookeeper client=127.0.0.1:35398/solr
   [junit4]   2> 1162131 INFO  (TEST-ChaosMonkeyNothingIsSafeTest.test-seed#[89AB750D2C291D3D]) [    ] o.a.s.c.ZkController zkHost includes chroot
   [junit4]   2> 1162131 INFO  (TEST-ChaosMonkeyNothingIsSafeTest.test-seed#[89AB750D2C291D3D]) [    ] o.a.s.c.c.SolrZkClient Using default ZkCredentialsProvider
   [junit4]   2> 1162131 INFO  (TEST-ChaosMonkeyNothingIsSafeTest.test-seed#[89AB750D2C291D3D]) [    ] o.a.s.c.c.ConnectionManager Waiting for client to connect to ZooKeeper
   [junit4]   2> 1162133 INFO  (zkCallback-1370-thread-1) [    ] o.a.s.c.c.ConnectionManager Watcher org.apache.solr.common.cloud.ConnectionManager@17b14f2 name:ZooKeeperConnection Watcher:127.0.0.1:35398 got event WatchedEvent state:SyncConnected type:None path:null path:null type:None
   [junit4]   2> 1162133 INFO  (TEST-ChaosMonkeyNothingIsSafeTest.test-seed#[89AB750D2C291D3D]) [    ] o.a.s.c.c.ConnectionManager Client is connected to ZooKeeper
   [junit4]   2> 1162134 INFO  (TEST-ChaosMonkeyNothingIsSafeTest.test-seed#[89AB750D2C291D3D]) [    ] o.a.s.c.c.SolrZkClient Using default ZkACLProvider
   [junit4]   2> 1162135 INFO  (TEST-ChaosMonkeyNothingIsSafeTest.test-seed#[89AB750D2C291D3D]) [n:127.0.0.1:36018_ra%2Fyk    ] o.a.s.c.c.ConnectionManager Waiting for client to connect to ZooKeeper
   [junit4]   2> 1162136 INFO  (zkCallback-1371-thread-1-processing-n:127.0.0.1:36018_ra%2Fyk) [n:127.0.0.1:36018_ra%2Fyk    ] o.a.s.c.c.ConnectionManager Watcher org.apache.solr.common.cloud.ConnectionManager@1996d6d name:ZooKeeperConnection Watcher:127.0.0.1:35398/solr got event WatchedEvent state:SyncConnected type:None path:null path:null type:None
   [junit4]   2> 1162136 INFO  (TEST-ChaosMonkeyNothingIsSafeTest.test-seed#[89AB750D2C291D3D]) [n:127.0.0.1:36018_ra%2Fyk    ] o.a.s.c.c.ConnectionManager Client is connected to ZooKeeper
   [junit4]   2> 1162137 INFO  (TEST-ChaosMonkeyNothingIsSafeTest.test-seed#[89AB750D2C291D3D]) [n:127.0.0.1:36018_ra%2Fyk    ] o.a.s.c.c.SolrZkClient makePath: /overseer/queue
   [junit4]   2> 1162139 INFO  (TEST-ChaosMonkeyNothingIsSafeTest.test-seed#[89AB750D2C291D3D]) [n:127.0.0.1:36018_ra%2Fyk    ] o.a.s.c.c.SolrZkClient makePath: /overseer/collection-queue-work
   [junit4]   2> 1162142 INFO  (TEST-ChaosMonkeyNothingIsSafeTest.test-seed#[89AB750D2C291D3D]) [n:127.0.0.1:36018_ra%2Fyk    ] o.a.s.c.c.SolrZkClient makePath: /overseer/collection-map-running
   [junit4]   2> 1162144 INFO  (TEST-ChaosMonkeyNothingIsSafeTest.test-seed#[89AB750D2C291D3D]) [n:127.0.0.1:36018_ra%2Fyk    ] o.a.s.c.c.SolrZkClient makePath: /overseer/collection-map-completed
   [junit4]   2> 1162145 INFO  (TEST-ChaosMonkeyNothingIsSafeTest.test-seed#[89AB750D2C291D3D]) [n:127.0.0.1:36018_ra%2Fyk    ] o.a.s.c.c.SolrZkClient makePath: /overseer/collection-map-failure
   [junit4]   2> 1162147 INFO  (TEST-ChaosMonkeyNothingIsSafeTest.test-seed#[89AB750D2C291D3D]) [n:127.0.0.1:36018_ra%2Fyk    ] o.a.s.c.c.SolrZkClient makePath: /live_nodes
   [junit4]   2> 1162149 INFO  (TEST-ChaosMonkeyNothingIsSafeTest.test-seed#[89AB750D2C291D3D]) [n:127.0.0.1:36018_ra%2Fyk    ] o.a.s.c.c.SolrZkClient makePath: /aliases.json
   [junit4]   2> 1162150 INFO  (TEST-ChaosMonkeyNothingIsSafeTest.test-seed#[89AB750D2C291D3D]) [n:127.0.0.1:36018_ra%2Fyk    ] o.a.s.c.c.SolrZkClient makePath: /clusterstate.json
   [junit4]   2> 1162151 INFO  (TEST-ChaosMonkeyNothingIsSafeTest.test-seed#[89AB750D2C291D3D]) [n:127.0.0.1:36018_ra%2Fyk    ] o.a.s.c.c.SolrZkClient makePath: /security.json
   [junit4]   2> 1162152 INFO  (TEST-ChaosMonkeyNothingIsSafeTest.test-seed#[89AB750D2C291D3D]) [n:127.0.0.1:36018_ra%2Fyk    ] o.a.s.c.c.ZkStateReader Updating cluster state from ZooKeeper... 
   [junit4]   2> 1162153 INFO  (TEST-ChaosMonkeyNothingIsSafeTest.test-seed#[89AB750D2C291D3D]) [n:127.0.0.1:36018_ra%2Fyk    ] o.a.s.c.c.ZkStateReader Updated live nodes from ZooKeeper... (0) -> (0)
   [junit4]   2> 1162155 INFO  (TEST-ChaosMonkeyNothingIsSafeTest.test-seed#[89AB750D2C291D3D]) [n:127.0.0.1:36018_ra%2Fyk    ] o.a.s.c.c.SolrZkClient makePath: /overseer_elect
   [junit4]   2> 1162156 INFO  (TEST-ChaosMonkeyNothingIsSafeTest.test-seed#[89AB750D2C291D3D]) [n:127.0.0.1:36018_ra%2Fyk    ] o.a.s.c.c.SolrZkClient makePath: /overseer_elect/election
   [junit4]   2> 1162157 INFO  (TEST-ChaosMonkeyNothingIsSafeTest.test-seed#[89AB750D2C291D3D]) [n:127.0.0.1:36018_ra%2Fyk    ] o.a.s.c.Overseer Overseer (id=null) closing
   [junit4]   2> 1162158 INFO  (TEST-ChaosMonkeyNothingIsSafeTest.test-seed#[89AB750D2C291D3D]) [n:127.0.0.1:36018_ra%2Fyk    ] o.a.s.c.LeaderElector Joined leadership election with path: /overseer_elect/election/95697640795013124-127.0.0.1:36018_ra%2Fyk-n_0000000000
   [junit4]   2> 1162158 INFO  (TEST-ChaosMonkeyNothingIsSafeTest.test-seed#[89AB750D2C291D3D]) [n:127.0.0.1:36018_ra%2Fyk    ] o.a.s.c.OverseerElectionContext I am going to be the leader 127.0.0.1:36018_ra%2Fyk
   [junit4]   2> 1162158 INFO  (TEST-ChaosMonkeyNothingIsSafeTest.test-seed#[89AB750D2C291D3D]) [n:127.0.0.1:36018_ra%2Fyk    ] o.a.s.c.c.SolrZkClient makePath: /overseer_elect/leader
   [junit4]   2> 1162159 INFO  (TEST-ChaosMonkeyNothingIsSafeTest.test-seed#[89AB750D2C291D3D]) [n:127.0.0.1:36018_ra%2Fyk    ] o.a.s.c.Overseer Overseer (id=95697640795013124-127.0.0.1:36018_ra%2Fyk-n_0000000000) starting
   [junit4]   2> 1162161 INFO  (TEST-ChaosMonkeyNothingIsSafeTest.test-seed#[89AB750D2C291D3D]) [n:127.0.0.1:36018_ra%2Fyk    ] o.a.s.c.c.SolrZkClient makePath: /overseer/queue-work
   [junit4]   2> 1162166 INFO  (TEST-ChaosMonkeyNothingIsSafeTest.test-seed#[89AB750D2C291D3D]) [n:127.0.0.1:36018_ra%2Fyk    ] o.a.s.c.OverseerAutoReplicaFailoverThread Starting OverseerAutoReplicaFailoverThread autoReplicaFailoverWorkLoopDelay=10000 autoReplicaFailoverWaitAfterExpiration=30000 autoReplicaFailoverBadNodeExpiration=60000
   [junit4]   2> 1162166 INFO  (OverseerCollectionConfigSetProcessor-95697640795013124-127.0.0.1:36018_ra%2Fyk-n_0000000000) [n:127.0.0.1:36018_ra%2Fyk    ] o.a.s.c.OverseerTaskProcessor Process current queue of overseer operations
   [junit4]   2> 1162167 INFO  (OverseerStateUpdate-95697640795013124-127.0.0.1:36018_ra%2Fyk-n_0000000000) [n:127.0.0.1:36018_ra%2Fyk    ] o.a.s.c.Overseer Starting to work on the main queue
   [junit4]   2> 1162167 INFO  (TEST-ChaosMonkeyNothingIsSafeTest.test-seed#[89AB750D2C291D3D]) [n:127.0.0.1:36018_ra%2Fyk    ] o.a.s.c.ZkController Register node as live in ZooKeeper:/live_nodes/127.0.0.1:36018_ra%2Fyk
   [junit4]   2> 1162168 INFO  (TEST-ChaosMonkeyNothingIsSafeTest.test-seed#[89AB750D2C291D3D]) [n:127.0.0.1:36018_ra%2Fyk    ] o.a.s.c.c.SolrZkClient makePath: /live_nodes/127.0.0.1:36018_ra%2Fyk
   [junit4]   2> 1162169 INFO  (OverseerStateUpdate-95697640795013124-127.0.0.1:36018_ra%2Fyk-n_0000000000) [n:127.0.0.1:36018_ra%2Fyk    ] o.a.s.c.c.ZkStateReader Updated live nodes from ZooKeeper... (0) -> (0)
   [junit4]   2> 1162169 INFO  (zkCallback-1371-thread-1-processing-n:127.0.0.1:36018_ra%2Fyk) [n:127.0.0.1:36018_ra%2Fyk    ] o.a.s.c.c.ZkStateReader A live node change: [WatchedEvent state:SyncConnected type:NodeChildrenChanged path:/live_nodes], has occurred - updating... (live nodes size: [0])
   [junit4]   2> 1162170 INFO  (zkCallback-1371-thread-1-processing-n:127.0.0.1:36018_ra%2Fyk) [n:127.0.0.1:36018_ra%2Fyk    ] o.a.s.c.c.ZkStateReader Updated live nodes from ZooKeeper... (0) -> (1)
   [junit4]   2> 1162221 INFO  (TEST-ChaosMonkeyNothingIsSafeTest.test-seed#[89AB750D2C291D3D]) [n:127.0.0.1:36018_ra%2Fyk    ] o.a.s.c.CoreContainer Security conf doesn't exist. Skipping setup for authorization module.
   [junit4]   2> 1162221 INFO  (TEST-ChaosMonkeyNothingIsSafeTest.test-seed#[89AB750D2C291D3D]) [n:127.0.0.1:36018_ra%2Fyk    ] o.a.s.c.CoreContainer No authentication plugin used.
   [junit4]   2> 1162222 INFO  (TEST-ChaosMonkeyNothingIsSafeTest.test-seed#[89AB750D2C291D3D]) [n:127.0.0.1:36018_ra%2Fyk    ] o.a.s.c.CorePropertiesLocator Looking for core definitions underneath /home/jenkins/workspace/Lucene-Solr-6.0-Linux/solr/build/solr-core/test/J1/../../../../../../../../../home/jenkins/workspace/Lucene-Solr-6.0-Linux/solr/build/solr-core/test/J1/temp/solr.cloud.ChaosMonkeyNothingIsSafeTest_89AB750D2C291D3D-001/control-001/cores
   [junit4]   2> 1162222 INFO  (TEST-ChaosMonkeyNothingIsSafeTest.test-seed#[89AB750D2C291D3D]) [n:127.0.0.1:36018_ra%2Fyk    ] o.a.s.c.CoreDescriptor Created CoreDescriptor: {name=collection1, config=solrconfig.xml, transient=false, schema=schema.xml, loadOnStartup=true, configSetProperties=configsetprops.json, collection=control_collection, coreNodeName=, dataDir=data/, shard=}
   [junit4]   2> 1162223 INFO  (TEST-ChaosMonkeyNothingIsSafeTest.test-seed#[89AB750D2C291D3D]) [n:127.0.0.1:36018_ra%2Fyk    ] o.a.s.c.CorePropertiesLocator Found core collection1 in /home/jenkins/workspace/Lucene-Solr-6.0-Linux/solr/build/solr-core/test/J1/../../../../../../../../../home/jenkins/workspace/Lucene-Solr-6.0-Linux/solr/build/solr-core/test/J1/temp/solr.cloud.ChaosMonkeyNothingIsSafeTest_89AB750D2C291D3D-001/control-001/cores/collection1
   [junit4]   2> 1162223 INFO  (TEST-ChaosMonkeyNothingIsSafeTest.test-seed#[89AB750D2C291D3D]) [n:127.0.0.1:36018_ra%2Fyk    ] o.a.s.c.CorePropertiesLocator Found 1 core definitions
   [junit4]   2> 1162224 INFO  (TEST-ChaosMonkeyNothingIsSafeTest.test-seed#[89AB750D2C291D3D]) [n:127.0.0.1:36018_ra%2Fyk    ] o.a.s.s.SolrDispatchFilter user.dir=/home/jenkins/workspace/Lucene-Solr-6.0-Linux/solr/build/solr-core/test/J1
   [junit4]   2> 1162224 INFO  (TEST-ChaosMonkeyNothingIsSafeTest.test-seed#[89AB750D2C291D3D]) [n:127.0.0.1:36018_ra%2Fyk    ] o.a.s.s.SolrDispatchFilter SolrDispatchFilter.init() done
   [junit4]   2> 1162224 INFO  (coreLoadExecutor-4902-thread-1-processing-n:127.0.0.1:36018_ra%2Fyk) [n:127.0.0.1:36018_ra%2Fyk c:control_collection   x:collection1] o.a.s.c.ZkController publishing state=down
   [junit4]   2> 1162224 INFO  (coreLoadExecutor-4902-thread-1-processing-n:127.0.0.1:36018_ra%2Fyk) [n:127.0.0.1:36018_ra%2Fyk c:control_collection   x:collection1] o.a.s.c.ZkController numShards not found on descriptor - reading it from system property
   [junit4]   2> 1162226 INFO  (OverseerStateUpdate-95697640795013124-127.0.0.1:36018_ra%2Fyk-n_0000000000) [n:127.0.0.1:36018_ra%2Fyk    ] o.a.s.c.Overseer processMessage: queueSize: 1, message = {
   [junit4]   2>   "core":"collection1",
   [junit4]   2>   "roles":null,
   [junit4]   2>   "base_url":"http://127.0.0.1:36018/ra/yk",
   [junit4]   2>   "node_name":"127.0.0.1:36018_ra%2Fyk",
   [junit4]   2>   "numShards":"1",
   [junit4]   2>   "state":"down",
   [junit4]   2>   "shard":null,
   [junit4]   2>   "collection":"control_collection",
   [junit4]   2>   "operation":"state"} current state version: 0
   [junit4]   2> 1162226 INFO  (coreLoadExecutor-4902-thread-1-processing-n:127.0.0.1:36018_ra%2Fyk) [n:127.0.0.1:36018_ra%2Fyk c:control_collection   x:collection1] o.a.s.c.ZkController look for our core node name
   [junit4]   2> 1162226 INFO  (OverseerStateUpdate-95697640795013124-127.0.0.1:36018_ra%2Fyk-n_0000000000) [n:127.0.0.1:36018_ra%2Fyk    ] o.a.s.c.o.ReplicaMutator Update state numShards=1 message={
   [junit4]   2>   "core":"collection1",
   [junit4]   2>   "roles":null,
   [junit4]   2>   "base_url":"http://127.0.0.1:36018/ra/yk",
   [junit4]   2>   "node_name":"127.0.0.1:36018_ra%2Fyk",
   [junit4]   2>   "numShards":"1",
   [junit4]   2>   "state":"down",
   [junit4]   2>   "shard":null,
   [junit4]   2>   "collection":"control_collection",
   [junit4]   2>   "operation":"state"}
   [junit4]   2> 1162227 INFO  (OverseerStateUpdate-95697640795013124-127.0.0.1:36018_ra%2Fyk-n_0000000000) [n:127.0.0.1:36018_ra%2Fyk    ] o.a.s.c.o.ClusterStateMutator building a new cName: control_collection
   [junit4]   2> 1162228 INFO  (OverseerStateUpdate-95697640795013124-127.0.0.1:36018_ra%2Fyk-n_0000000000) [n:127.0.0.1:36018_ra%2Fyk    ] o.a.s.c.o.ReplicaMutator Assigning new node to shard shard=shard1
   [junit4]   2> 1162229 INFO  (zkCallback-1371-thread-1-processing-n:127.0.0.1:36018_ra%2Fyk) [n:127.0.0.1:36018_ra%2Fyk    ] o.a.s.c.c.ZkStateReader A cluster state change: [WatchedEvent state:SyncConnected type:NodeDataChanged path:/clusterstate.json], has occurred - updating... (live nodes size: [1])
   [junit4]   2> 1163226 INFO  (coreLoadExecutor-4902-thread-1-processing-n:127.0.0.1:36018_ra%2Fyk) [n:127.0.0.1:36018_ra%2Fyk c:control_collection   x:collection1] o.a.s.c.ZkController waiting to find shard id in clusterstate for collection1
   [junit4]   2> 1163227 INFO  (coreLoadExecutor-4902-thread-1-processing-n:127.0.0.1:36018_ra%2Fyk) [n:127.0.0.1:36018_ra%2Fyk c:control_collection   x:collection1] o.a.s.c.ZkController Check for collection zkNode:control_collection
   [junit4]   2> 1163227 INFO  (coreLoadExecutor-4902-thread-1-processing-n:127.0.0.1:36018_ra%2Fyk) [n:127.0.0.1:36018_ra%2Fyk c:control_collection   x:collection1] o.a.s.c.ZkController Collection zkNode exists
   [junit4]   2> 1163227 INFO  (coreLoadExecutor-4902-thread-1-processing-n:127.0.0.1:36018_ra%2Fyk) [n:127.0.0.1:36018_ra%2Fyk c:control_collection   x:collection1] o.a.s.c.c.ZkStateReader Load collection config from: [/collections/control_collection]
   [junit4]   2> 1163228 INFO  (coreLoadExecutor-4902-thread-1-processing-n:127.0.0.1:36018_ra%2Fyk) [n:127.0.0.1:36018_ra%2Fyk c:control_collection   x:collection1] o.a.s.c.c.ZkStateReader path=[/collections/control_collection] [configName]=[conf1] specified config exists in ZooKeeper
   [junit4]   2> 1163228 INFO  (coreLoadExecutor-4902-thread-1-processing-n:127.0.0.1:36018_ra%2Fyk) [n:127.0.0.1:36018_ra%2Fyk c:control_collection   x:collection1] o.a.s.c.SolrResourceLoader new SolrResourceLoader for directory: '/home/jenkins/workspace/Lucene-Solr-6.0-Linux/solr/build/solr-core/test/J1/temp/solr.cloud.ChaosMonkeyNothingIsSafeTest_89AB750D2C291D3D-001/control-001/cores/collection1'
   [junit4]   2> 1163228 INFO  (coreLoadExecutor-4902-thread-1-processing-n:127.0.0.1:36018_ra%2Fyk) [n:127.0.0.1:36018_ra%2Fyk c:control_collection   x:collection1] o.a.s.c.SolrResourceLoader JNDI not configured for solr (NoInitialContextEx)
   [junit4]   2> 1163228 INFO  (coreLoadExecutor-4902-thread-1-processing-n:127.0.0.1:36018_ra%2Fyk) [n:127.0.0.1:36018_ra%2Fyk c:control_collection   x:collection1] o.a.s.c.SolrResourceLoader solr home defaulted to 'solr/' (could not find system property or JNDI)
   [junit4]   2> 1163229 INFO  (coreLoadExecutor-4902-thread-1-processing-n:127.0.0.1:36018_ra%2Fyk) [n:127.0.0.1:36018_ra%2Fyk c:control_collection   x:collection1] o.a.s.c.Config loaded config solrconfig.xml with version 0 
   [junit4]   2> 1163241 INFO  (coreLoadExecutor-4902-thread-1-processing-n:127.0.0.1:36018_ra%2Fyk) [n:127.0.0.1:36018_ra%2Fyk c:control_collection   x:collection1] o.a.s.c.SolrConfig current version of requestparams : -1
   [junit4]   2> 1163249 WARN  (coreLoadExecutor-4902-thread-1-processing-n:127.0.0.1:36018_ra%2Fyk) [n:127.0.0.1:36018_ra%2Fyk c:control_collection   x:collection1] o.a.s.c.Config Beginning with Solr 5.5, <mergePolicy> is deprecated, use <mergePolicyFactory> instead.
   [junit4]   2> 1163251 INFO  (coreLoadExecutor-4902-thread-1-processing-n:127.0.0.1:36018_ra%2Fyk) [n:127.0.0.1:36018_ra%2Fyk c:control_collection   x:collection1] o.a.s.c.SolrConfig Using Lucene MatchVersion: 6.0.0
   [junit4]   2> 1163266 INFO  (coreLoadExecutor-4902-thread-1-processing-n:127.0.0.1:36018_ra%2Fyk) [n:127.0.0.1:36018_ra%2Fyk c:control_collection   x:collection1] o.a.s.c.SolrConfig Loaded SolrConfig: solrconfig.xml
   [junit4]   2> 1163289 INFO  (coreLoadExecutor-4902-thread-1-processing-n:127.0.0.1:36018_ra%2Fyk) [n:127.0.0.1:36018_ra%2Fyk c:control_collection   x:collection1] o.a.s.s.IndexSchema [collection1] Schema name=test
   [junit4]   2> 1163394 INFO  (coreLoadExecutor-4902-thread-1-processing-n:127.0.0.1:36018_ra%2Fyk) [n:127.0.0.1:36018_ra%2Fyk c:control_collection   x:collection1] o.a.s.s.IndexSchema default search field in schema is text
   [junit4]   2> 1163395 INFO  (coreLoadExecutor-4902-thread-1-processing-n:127.0.0.1:36018_ra%2Fyk) [n:127.0.0.1:36018_ra%2Fyk c:control_collection   x:collection1] o.a.s.s.IndexSchema unique key field: id
   [junit4]   2> 1163397 INFO  (coreLoadExecutor-4902-thread-1-processing-n:127.0.0.1:36018_ra%2Fyk) [n:127.0.0.1:36018_ra%2Fyk c:control_collection   x:collection1] o.a.s.s.FileExchangeRateProvider Reloading exchange rates from file currency.xml
   [junit4]   2> 1163401 INFO  (coreLoadExecutor-4902-thread-1-processing-n:127.0.0.1:36018_ra%2Fyk) [n:127.0.0.1:36018_ra%2Fyk c:control_collection   x:collection1] o.a.s.s.FileExchangeRateProvider Reloading exchange rates from file currency.xml
   [junit4]   2> 1163423 INFO  (coreLoadExecutor-4902-thread-1-processing-n:127.0.0.1:36018_ra%2Fyk) [n:127.0.0.1:36018_ra%2Fyk c:control_collection   x:collection1] o.a.s.c.ConfigSetProperties Did not find ConfigSet properties, assuming default properties: Can't find resource 'configsetprops.json' in classpath or '/configs/conf1', cwd=/home/jenkins/workspace/Lucene-Solr-6.0-Linux/solr/build/solr-core/test/J1
   [junit4]   2> 1163423 INFO  (coreLoadExecutor-4902-thread-1-processing-n:127.0.0.1:36018_ra%2Fyk) [n:127.0.0.1:36018_ra%2Fyk c:control_collection   x:collection1] o.a.s.c.CoreContainer Creating SolrCore 'collection1' using configuration from collection control_collection
   [junit4]   2> 1163423 INFO  (coreLoadExecutor-4902-thread-1-processing-n:127.0.0.1:36018_ra%2Fyk) [n:127.0.0.1:36018_ra%2Fyk c:control_collection s:shard1 r:core_node1 x:collection1] o.a.s.c.SolrCore solr.StandardDirectoryFactory
   [junit4]   2> 1163423 INFO  (coreLoadExecutor-4902-thread-1-processing-n:127.0.0.1:36018_ra%2Fyk) [n:127.0.0.1:36018_ra%2Fyk c:control_collection s:shard1 r:core_node1 x:collection1] o.a.s.c.SolrCore [[collection1] ] Opening new SolrCore at [/home/jenkins/workspace/Lucene-Solr-6.0-Linux/solr/build/solr-core/test/J1/temp/solr.cloud.ChaosMonkeyNothingIsSafeTest_89AB750D2C291D3D-001/control-001/cores/collection1], dataDir=[/home/jenkins/workspace/Lucene-Solr-6.0-Linux/solr/build/solr-core/test/J1/../../../../../../../../../home/jenkins/workspace/Lucene-Solr-6.0-Linux/solr/build/solr-core/test/J1/temp/solr.cloud.ChaosMonkeyNothingIsSafeTest_89AB750D2C291D3D-001/control-001/cores/collection1/data/]
   [junit4]   2> 1163423 INFO  (coreLoadExecutor-4902-thread-1-processing-n:127.0.0.1:36018_ra%2Fyk) [n:127.0.0.1:36018_ra%2Fyk c:control_collection s:shard1 r:core_node1 x:collection1] o.a.s.c.JmxMonitoredMap JMX monitoring is enabled. Adding Solr mbeans to JMX Server: com.sun.jmx.mbeanserver.JmxMBeanServer@17d8859
   [junit4]   2> 1163424 INFO  (coreLoadExecutor-4902-thread-1-processing-n:127.0.0.1:36018_ra%2Fyk) [n:127.0.0.1:36018_ra%2Fyk c:control_collection s:shard1 r:core_node1 x:collection1] o.a.s.c.CachingDirectoryFactory return new directory for /home/jenkins/workspace/Lucene-Solr-6.0-Linux/solr/build/solr-core/test/J1/temp/solr.cloud.ChaosMonkeyNothingIsSafeTest_89AB750D2C291D3D-001/control-001/cores/collection1/data
   [junit4]   2> 1163424 INFO  (coreLoadExecutor-4902-thread-1-processing-n:127.0.0.1:36018_ra%2Fyk) [n:127.0.0.1:36018_ra%2Fyk c:control_collection s:shard1 r:core_node1 x:collection1] o.a.s.c.SolrCore New index directory detected: old=null new=/home/jenkins/workspace/Lucene-Solr-6.0-Linux/solr/build/solr-core/test/J1/../../../../../../../../../home/jenkins/workspace/Lucene-Solr-6.0-Linux/solr/build/solr-core/test/J1/temp/solr.cloud.ChaosMonkeyNothingIsSafeTest_89AB750D2C291D3D-001/control-001/cores/collection1/data/index/
   [junit4]   2> 1163424 WARN  (coreLoadExecutor-4902-thread-1-processing-n:127.0.0.1:36018_ra%2Fyk) [n:127.0.0.1:36018_ra%2Fyk c:control_collection s:shard1 r:core_node1 x:collection1] o.a.s.c.SolrCore [collection1] Solr index directory '/home/jenkins/workspace/Lucene-Solr-6.0-Linux/solr/build/solr-core/test/J1/../../../../../../../../../home/jenkins/workspace/Lucene-Solr-6.0-Linux/solr/build/solr-core/test/J1/temp/solr.cloud.ChaosMonkeyNothingIsSafeTest_89AB750D2C291D3D-001/control-001/cores/collection1/data/index' doesn't exist. Creating new index...
   [junit4]   2> 1163425 INFO  (coreLoadExecutor-4902-thread-1-processing-n:127.0.0.1:36018_ra%2Fyk) [n:127.0.0.1:36018_ra%2Fyk c:control_collection s:shard1 r:core_node1 x:collection1] o.a.s.c.CachingDirectoryFactory return new directory for /home/jenkins/workspace/Lucene-Solr-6.0-Linux/solr/build/solr-core/test/J1/temp/solr.cloud.ChaosMonkeyNothingIsSafeTest_89AB750D2C291D3D-001/control-001/cores/collection1/data/index
   [junit4]   2> 1163425 INFO  (coreLoadExecutor-4902-thread-1-processing-n:127.0.0.1:36018_ra%2Fyk) [n:127.0.0.1:36018_ra%2Fyk c:control_collection s:shard1 r:core_node1 x:collection1] o.a.s.u.RandomMergePolicy RandomMergePolicy wrapping class org.apache.lucene.index.LogByteSizeMergePolicy: [LogByteSizeMergePolicy: minMergeSize=1677721, mergeFactor=49, maxMergeSize=2147483648, maxMergeSizeForForcedMerge=9223372036854775807, calibrateSizeByDeletes=false, maxMergeDocs=2147483647, maxCFSSegmentSizeMB=8.796093022207999E12, noCFSRatio=0.21228786255269158]
   [junit4]   2> 1163485 INFO  (coreLoadExecutor-4902-thread-1-processing-n:127.0.0.1:36018_ra%2Fyk) [n:127.0.0.1:36018_ra%2Fyk c:control_collection s:shard1 r:core_node1 x:collection1] o.a.s.c.SolrDeletionPolicy SolrDeletionPolicy.onCommit: commits: num=1
   [junit4]   2> 	commit{dir=/home/jenkins/workspace/Lucene-Solr-6.0-Linux/solr/build/solr-core/test/J1/temp/solr.cloud.ChaosMonkeyNothingIsSafeTest_89AB750D2C291D3D-001/control-001/cores/collection1/data/index,segFN=segments_1,generation=1}
   [junit4]   2> 1163486 INFO  (coreLoadExecutor-4902-thread-1-processing-n:127.0.0.1:36018_ra%2Fyk) [n:127.0.0.1:36018_ra%2Fyk c:control_collection s:shard1 r:core_node1 x:collection1] o.a.s.c.SolrDeletionPolicy newest commit generation = 1
   [junit4]   2> 1163486 INFO  (OldIndexDirectoryCleanupThreadForCore-collection1) [n:127.0.0.1:36018_ra%2Fyk c:control_collection s:shard1 r:core_node1 x:collection1] o.a.s.c.SolrCore Looking for old index directories to cleanup for core collection1 in /home/jenkins/workspace/Lucene-Solr-6.0-Linux/solr/build/solr-core/test/J1/../../../../../../../../../home/jenkins/workspace/Lucene-Solr-6.0-Linux/solr/build/solr-core/test/J1/temp/solr.cloud.ChaosMonkeyNothingIsSafeTest_89AB750D2C291D3D-001/control-001/cores/collection1/data/
   [junit4]   2> 1163490 INFO  (coreLoadExecutor-4902-thread-1-processing-n:127.0.0.1:36018_ra%2Fyk) [n:127.0.0.1:36018_ra%2Fyk c:control_collection s:shard1 r:core_node1 x:collection1] o.a.s.u.p.UpdateRequestProcessorChain creating updateRequestProcessorChain "nodistrib"
   [junit4]   2> 1163491 INFO  (coreLoadExecutor-4902-thread-1-processing-n:127.0.0.1:36018_ra%2Fyk) [n:127.0.0.1:36018_ra%2Fyk c:control_collection s:shard1 r:core_node1 x:collection1] o.a.s.u.p.UpdateRequestProcessorChain creating updateRequestProcessorChain "dedupe"
   [junit4]   2> 1163491 INFO  (coreLoadExecutor-4902-thread-1-processing-n:127.0.0.1:36018_ra%2Fyk) [n:127.0.0.1:36018_ra%2Fyk c:control_collection s:shard1 r:core_node1 x:collection1] o.a.s.u.p.UpdateRequestProcessorChain inserting DistributedUpdateProcessorFactory into updateRequestProcessorChain "dedupe"
   [junit4]   2> 1163491 INFO  (coreLoadExecutor-4902-thread-1-processing-n:127.0.0.1:36018_ra%2Fyk) [n:127.0.0.1:36018_ra%2Fyk c:control_collection s:shard1 r:core_node1 x:collection1] o.a.s.u.p.UpdateRequestProcessorChain creating updateRequestProcessorChain "stored_sig"
   [junit4]   2> 1163491 INFO  (coreLoadExecutor-4902-thread-1-processing-n:127.0.0.1:36018_ra%2Fyk) [n:127.0.0.1:36018_ra%2Fyk c:control_collection s:shard1 r:core_node1 x:collection1] o.a.s.u.p.UpdateRequestProcessorChain inserting DistributedUpdateProcessorFactory into updateRequestProcessorChain "stored_sig"
   [junit4]   2> 1163491 INFO  (coreLoadExecutor-4902-thread-1-processing-n:127.0.0.1:36018_ra%2Fyk) [n:127.0.0.1:36018_ra%2Fyk c:control_collection s:shard1 r:core_node1 x:collection1] o.a.s.u.p.UpdateRequestProcessorChain creating updateRequestProcessorChain "distrib-dup-test-chain-explicit"
   [junit4]   2> 1163491 INFO  (coreLoadExecutor-4902-thread-1-processing-n:127.0.0.1:36018_ra%2Fyk) [n:127.0.0.1:36018_ra%2Fyk c:control_collection s:shard1 r:core_node1 x:collection1] o.a.s.u.p.UpdateRequestProcessorChain creating updateRequestProcessorChain "distrib-dup-test-chain-implicit"
   [junit4]   2> 1163491 INFO  (coreLoadExecutor-4902-thread-1-processing-n:127.0.0.1:36018_ra%2Fyk) [n:127.0.0.1:36018_ra%2Fyk c:control_collection s:shard1 r:core_node1 x:collection1] o.a.s.u.p.UpdateRequestProcessorChain inserting DistributedUpdateProcessorFactory into updateRequestProcessorChain "distrib-dup-test-chain-implicit"
   [junit4]   2> 1163492 INFO  (coreLoadExecutor-4902-thread-1-processing-n:127.0.0.1:36018_ra%2Fyk) [n:127.0.0.1:36018_ra%2Fyk c:control_collection s:shard1 r:core_node1 x:collection1] o.a.s.c.SolrCore no updateRequestProcessorChain defined as default, creating implicit default
   [junit4]   2> 1163492 WARN  (coreLoadExecutor-4902-thread-1-processing-n:127.0.0.1:36018_ra%2Fyk) [n:127.0.0.1:36018_ra%2Fyk c:control_collection s:shard1 r:core_node1 x:collection1] o.a.s.c.RequestHandlers INVALID paramSet a in requestHandler {type = requestHandler,name = /dump,class = DumpRequestHandler,args = {defaults={a=A,b=B}}}
   [junit4]   2> 1163493 INFO  (coreLoadExecutor-4902-thread-1-processing-n:127.0.0.1:36018_ra%2Fyk) [n:127.0.0.1:36018_ra%2Fyk c:control_collection s:shard1 r:core_node1 x:collection1] o.a.s.h.l.XMLLoader xsltCacheLifetimeSeconds=60
   [junit4]   2> 1163494 INFO  (coreLoadExecutor-4902-thread-1-processing-n:127.0.0.1:36018_ra%2Fyk) [n:127.0.0.1:36018_ra%2Fyk c:control_collection s:shard1 r:core_node1 x:collection1] o.a.s.h.l.XMLLoader xsltCacheLifetimeSeconds=60
   [junit4]   2> 1163495 INFO  (coreLoadExecutor-4902-thread-1-processing-n:127.0.0.1:36018_ra%2Fyk) [n:127.0.0.1:36018_ra%2Fyk c:control_collection s:shard1 r:core_node1 x:collection1] o.a.s.h.l.XMLLoader xsltCacheLifetimeSeconds=60
   [junit4]   2> 1163496 INFO  (coreLoadExecutor-4902-thread-1-processing-n:127.0.0.1:36018_ra%2Fyk) [n:127.0.0.1:36018_ra%2Fyk c:control_collection s:shard1 r:core_node1 x:collection1] o.a.s.h.l.XMLLoader xsltCacheLifetimeSeconds=60
   [junit4]   2> 1163503 INFO  (coreLoadExecutor-4902-thread-1-processing-n:127.0.0.1:36018_ra%2Fyk) [n:127.0.0.1:36018_ra%2Fyk c:control_collection s:shard1 r:core_node1 x:collection1] o.a.s.c.RequestHandlers Registered paths: /admin/mbeans,standard,/dump,/update/csv,/sql,/update/json/docs,/admin/luke,/export,/admin/segments,/get,/admin/system,/replication,/admin/properties,/config,/stream,/schema,/admin/plugins,/admin/logging,/update/json,/admin/ping,/admin/threads,/update,/admin/file
   [junit4]   2> 1163503 INFO  (coreLoadExecutor-4902-thread-1-processing-n:127.0.0.1:36018_ra%2Fyk) [n:127.0.0.1:36018_ra%2Fyk c:control_collection s:shard1 r:core_node1 x:collection1] o.a.s.c.SolrCore Using default statsCache cache: org.apache.solr.search.stats.LocalStatsCache
   [junit4]   2> 1163504 INFO  (coreLoadExecutor-4902-thread-1-processing-n:127.0.0.1:36018_ra%2Fyk) [n:127.0.0.1:36018_ra%2Fyk c:control_collection s:shard1 r:core_node1 x:collection1] o.a.s.u.UpdateHandler Using UpdateLog implementation: org.apache.solr.update.UpdateLog
   [junit4]   2> 1163504 INFO  (coreLoadExecutor-4902-thread-1-processing-n:127.0.0.1:36018_ra%2Fyk) [n:127.0.0.1:36018_ra%2Fyk c:control_collection s:shard1 r:core_node1 x:collection1] o.a.s.u.UpdateLog Initializing UpdateLog: dataDir= defaultSyncLevel=FLUSH numRecordsToKeep=100 maxNumLogsToKeep=10 numVersionBuckets=65536
   [junit4]   2> 1163504 INFO  (coreLoadExecutor-4902-thread-1-processing-n:127.0.0.1:36018_ra%2Fyk) [n:127.0.0.1:36018_ra%2Fyk c:control_collection s:shard1 r:core_node1 x:collection1] o.a.s.u.CommitTracker Hard AutoCommit: if uncommited for 15000ms; 
   [junit4]   2> 1163504 INFO  (coreLoadExecutor-4902-thread-1-processing-n:127.0.0.1:36018_ra%2Fyk) [n:127.0.0.1:36018_ra%2Fyk c:control_collection s:shard1 r:core_node1 x:collection1] o.a.s.u.CommitTracker Soft AutoCommit: disabled
   [junit4]   2> 1163505 INFO  (coreLoadExecutor-4902-thread-1-processing-n:127.0.0.1:36018_ra%2Fyk) [n:127.0.0.1:36018_ra%2Fyk c:control_collection s:shard1 r:core_node1 x:collection1] o.a.s.u.RandomMergePolicy RandomMergePolicy wrapping class org.apache.lucene.index.TieredMergePolicy: [TieredMergePolicy: maxMergeAtOnce=29, maxMergeAtOnceExplicit=29, maxMergedSegmentMB=6.2265625, floorSegmentMB=0.2666015625, forceMergeDeletesPctAllowed=16.33110929845107, segmentsPerTier=10.0, maxCFSSegmentSizeMB=8.796093022207999E12, noCFSRatio=0.5882298677601179
   [junit4]   2> 1163505 INFO  (coreLoadExecutor-4902-thread-1-processing-n:127.0.0.1:36018_ra%2Fyk) [n:127.0.0.1:36018_ra%2Fyk c:control_collection s:shard1 r:core_node1 x:collection1] o.a.s.c.SolrDeletionPolicy SolrDeletionPolicy.onInit: commits: num=1
   [junit4]   2> 	commit{dir=/home/jenkins/workspace/Lucene-Solr-6.0-Linux/solr/build/solr-core/test/J1/temp/solr.cloud.ChaosMonkeyNothingIsSafeTest_89AB750D2C291D3D-001/control-001/cores/collection1/data/index,segFN=segments_1,generation=1}
   [junit4]   2> 1163505 INFO  (coreLoadExecutor-4902-thread-1-processing-n:127.0.0.1:36018_ra%2Fyk) [n:127.0.0.1:36018_ra%2Fyk c:control_collection s:shard1 r:core_node1 x:collection1] o.a.s.c.SolrDeletionPolicy newest commit generation = 1
   [junit4]   2> 1163506 INFO  (coreLoadExecutor-4902-thread-1-processing-n:127.0.0.1:36018_ra%2Fyk) [n:127.0.0.1:36018_ra%2Fyk c:control_collection s:shard1 r:core_node1 x:collection1] o.a.s.s.SolrIndexSearcher Opening [Searcher@1d66b4f[collection1] main]
   [junit4]   2> 1163506 INFO  (coreLoadExecutor-4902-thread-1-processing-n:127.0.0.1:36018_ra%2Fyk) [n:127.0.0.1:36018_ra%2Fyk c:control_collection s:shard1 r:core_node1 x:collection1] o.a.s.c.c.ZkStateReader Load collection config from: [/collections/control_collection]
   [junit4]   2> 1163507 INFO  (coreLoadExecutor-4902-thread-1-processing-n:127.0.0.1:36018_ra%2Fyk) [n:127.0.0.1:36018_ra%2Fyk c:control_collection s:shard1 r:core_node1 x:collection1] o.a.s.c.c.ZkStateReader path=[/collections/control_collection] [configName]=[conf1] specified config exists in ZooKeeper
   [junit4]   2> 1163507 INFO  (coreLoadExecutor-4902-thread-1-processing-n:127.0.0.1:36018_ra%2Fyk) [n:127.0.0.1:36018_ra%2Fyk c:control_collection s:shard1 r:core_node1 x:collection1] o.a.s.r.ManagedResourceStorage Setting up ZooKeeper-based storage for the RestManager with znodeBase: /configs/conf1
   [junit4]   2> 1163507 INFO  (coreLoadExecutor-4902-thread-1-processing-n:127.0.0.1:36018_ra%2Fyk) [n:127.0.0.1:36018_ra%2Fyk c:control_collection s:shard1 r:core_node1 x:collection1] o.a.s.r.ManagedResourceStorage Configured ZooKeeperStorageIO with znodeBase: /configs/conf1
   [junit4]   2> 1163507 INFO  (coreLoadExecutor-4902-thread-1-processing-n:127.0.0.1:36018_ra%2Fyk) [n:127.0.0.1:36018_ra%2Fyk c:control_collection s:shard1 r:core_node1 x:collection1] o.a.s.r.RestManager Initializing RestManager with initArgs: {}
   [junit4]   2> 1163507 INFO  (coreLoadExecutor-4902-thread-1-processing-n:127.0.0.1:36018_ra%2Fyk) [n:127.0.0.1:36018_ra%2Fyk c:control_collection s:shard1 r:core_node1 x:collection1] o.a.s.r.ManagedResourceStorage Reading _rest_managed.json using ZooKeeperStorageIO:path=/configs/conf1
   [junit4]   2> 1163508 INFO  (coreLoadExecutor-4902-thread-1-processing-n:127.0.0.1:36018_ra%2Fyk) [n:127.0.0.1:36018_ra%2Fyk c:control_collection s:shard1 r:core_node1 x:collection1] o.a.s.r.ManagedResourceStorage No data found for znode /configs/conf1/_rest_managed.json
   [junit4]   2> 1163508 INFO  (coreLoadExecutor-4902-thread-1-processing-n:127.0.0.1:36018_ra%2Fyk) [n:127.0.0.1:36018_ra%2Fyk c:control_collection s:shard1 r:core_node1 x:collection1] o.a.s.r.ManagedResourceStorage Loaded null at path _rest_managed.json using ZooKeeperStorageIO:path=/configs/conf1
   [junit4]   2> 1163508 INFO  (coreLoadExecutor-4902-thread-1-processing-n:127.0.0.1:36018_ra%2Fyk) [n:127.0.0.1:36018_ra%2Fyk c:control_collection s:shard1 r:core_node1 x:collection1] o.a.s.r.RestManager Initializing 0 registered ManagedResources
   [junit4]   2> 1163508 INFO  (coreLoadExecutor-4902-thread-1-processing-n:127.0.0.1:36018_ra%2Fyk) [n:127.0.0.1:36018_ra%2Fyk c:control_collection s:shard1 r:core_node1 x:collection1] o.a.s.h.ReplicationHandler Commits will be reserved for  10000
   [junit4]   2> 1163509 INFO  (searcherExecutor-4903-thread-1-processing-n:127.0.0.1:36018_ra%2Fyk x:collection1 s:shard1 c:control_collection r:core_node1) [n:127.0.0.1:36018_ra%2Fyk c:control_collection s:shard1 r:core_node1 x:collection1] o.a.s.c.SolrCore [collection1] Registered new searcher Searcher@1d66b4f[collection1] main{ExitableDirectoryReader(UninvertingDirectoryReader())}
   [junit4]   2> 1163509 INFO  (coreLoadExecutor-4902-thread-1-processing-n:127.0.0.1:36018_ra%2Fyk) [n:127.0.0.1:36018_ra%2Fyk c:control_collection s:shard1 r:core_node1 x:collection1] o.a.s.u.UpdateLog Looking up max value of version field to seed version buckets
   [junit4]   2> 1163509 INFO  (coreLoadExecutor-4902-thread-1-processing-n:127.0.0.1:36018_ra%2Fyk) [n:127.0.0.1:36018_ra%2Fyk c:control_collection s:shard1 r:core_node1 x:collection1] o.a.s.u.VersionInfo Refreshing highest value of _version_ for 65536 version buckets from index
   [junit4]   2> 1163509 INFO  (coreLoadExecutor-4902-thread-1-processing-n:127.0.0.1:36018_ra%2Fyk) [n:127.0.0.1:36018_ra%2Fyk c:control_collection s:shard1 r:core_node1 x:collection1] o.a.s.u.VersionInfo No terms found for _version_, cannot seed version bucket highest value from index
   [junit4]   2> 1163509 INFO  (coreLoadExecutor-4902-thread-1-processing-n:127.0.0.1:36018_ra%2Fyk) [n:127.0.0.1:36018_ra%2Fyk c:control_collection s:shard1 r:core_node1 x:collection1] o.a.s.u.UpdateLog Could not find max version in index or recent updates, using new clock 1531162254406320128
   [junit4]   2> 1163512 INFO  (coreLoadExecutor-4902-thread-1-processing-n:127.0.0.1:36018_ra%2Fyk) [n:127.0.0.1:36018_ra%2Fyk c:control_collection s:shard1 r:core_node1 x:collection1] o.a.s.u.UpdateLog Took 2.0ms to seed version buckets with highest version 1531162254406320128
   [junit4]   2> 1163512 INFO  (coreLoadExecutor-4902-thread-1-processing-n:127.0.0.1:36018_ra%2Fyk) [n:127.0.0.1:36018_ra%2Fyk c:control_collection s:shard1 r:core_node1 x:collection1] o.a.s.c.ZkController watch zkdir /configs/conf1
   [junit4]   2> 1163512 INFO  (coreLoadExecutor-4902-thread-1-processing-n:127.0.0.1:36018_ra%2Fyk) [n:127.0.0.1:36018_ra%2Fyk c:control_collection s:shard1 r:core_node1 x:collection1] o.a.s.c.CoreContainer registering core: collection1
   [junit4]   2> 1163513 INFO  (coreZkRegister-4896-thread-1-processing-n:127.0.0.1:36018_ra%2Fyk x:collection1 s:shard1 c:control_collection r:core_node1) [n:127.0.0.1:36018_ra%2Fyk c:control_collection s:shard1 r:core_node1 x:collection1] o.a.s.c.ZkController Register replica - core:collection1 address:http://127.0.0.1:36018/ra/yk collection:control_collection shard:shard1
   [junit4]   2> 1163513 INFO  (coreZkRegister-4896-thread-1-processing-n:127.0.0.1:36018_ra%2Fyk x:collection1 s:shard1 c:control_collection r:core_node1) [n:127.0.0.1:36018_ra%2Fyk c:control_collection s:shard1 r:core_node1 x:collection1] o.a.s.c.c.SolrZkClient makePath: /collections/control_collection/leader_elect/shard1/election
   [junit4]   2> 1163516 INFO  (coreZkRegister-4896-thread-1-processing-n:127.0.0.1:36018_ra%2Fyk x:collection1 s:shard1 c:control_collection r:core_node1) [n:127.0.0.1:36018_ra%2Fyk c:control_collection s:shard1 r:core_node1 x:collection1] o.a.s.c.LeaderElector Joined leadership election with path: /collections/control_collection/leader_elect/shard1/election/95697640795013124-core_node1-n_0000000000
   [junit4]   2> 1163516 INFO  (coreZkRegister-4896-thread-1-processing-n:127.0.0.1:36018_ra%2Fyk x:collection1 s:shard1 c:control_collection r:core_node1) [n:127.0.0.1:36018_ra%2Fyk c:control_collection s:shard1 r:core_node1 x:collection1] o.a.s.c.ShardLeaderElectionContext Running the leader process for shard=shard1 and weAreReplacement=false and leaderVoteWait=10000
   [junit4]   2> 1163517 INFO  (coreZkRegister-4896-thread-1-processing-n:127.0.0.1:36018_ra%2Fyk x:collection1 s:shard1 c:control_collection r:core_node1) [n:127.0.0.1:36018_ra%2Fyk c:control_collection s:shard1 r:core_node1 x:collection1] o.a.s.c.ShardLeaderElectionContext Enough replicas found to continue.
   [junit4]   2> 1163517 INFO  (coreZkRegister-4896-thread-1-processing-n:127.0.0.1:36018_ra%2Fyk x:collection1 s:shard1 c:control_collection r:core_node1) [n:127.0.0.1:36018_ra%2Fyk c:control_collection s:shard1 r:core_node1 x:collection1] o.a.s.c.ShardLeaderElectionContext I may be the new leader - try and sync
   [junit4]   2> 1163517 INFO  (coreZkRegister-4896-thread-1-processing-n:127.0.0.1:36018_ra%2Fyk x:collection1 s:shard1 c:control_collection r:core_node1) [n:127.0.0.1:36018_ra%2Fyk c:control_collection s:shard1 r:core_node1 x:collection1] o.a.s.c.SyncStrategy Sync replicas to http://127.0.0.1:36018/ra/yk/collection1/
   [junit4]   2> 1163518 INFO  (coreZkRegister-4896-thread-1-processing-n:127.0.0.1:36018_ra%2Fyk x:collection1 s:shard1 c:control_collection r:core_node1) [n:127.0.0.1:36018_ra%2Fyk c:control_collection s:shard1 r:core_node1 x:collection1] o.a.s.c.SyncStrategy Sync Success - now sync replicas to me
   [junit4]   2> 1163518 INFO  (coreZkRegister-4896-thread-1-processing-n:127.0.0.1:36018_ra%2Fyk x:collection1 s:shard1 c:control_collection r:core_node1) [n:127.0.0.1:36018_ra%2Fyk c:control_collection s:shard1 r:core_node1 x:collection1] o.a.s.c.SyncStrategy http://127.0.0.1:36018/ra/yk/collection1/ has no replicas
   [junit4]   2> 1163518 INFO  (OverseerStateUpdate-95697640795013124-127.0.0.1:36018_ra%2Fyk-n_0000000000) [n:127.0.0.1:36018_ra%2Fyk    ] o.a.s.c.Overseer processMessage: queueSize: 1, message = {
   [junit4]   2>   "operation":"leader",
   [junit4]   2>   "shard":"shard1",
   [junit4]   2>   "collection":"control_collection"} current state version: 1
   [junit4]   2> 1163518 INFO  (coreZkRegister-4896-thread-1-processing-n:127.0.0.1:36018_ra%2Fyk x:collection1 s:shard1 c:control_collection r:core_node1) [n:127.0.0.1:36018_ra%2Fyk c:control_collection s:shard1 r:core_node1 x:collection1] o.a.s.c.c.SolrZkClient makePath: /collections/control_collection/leaders/shard1
   [junit4]   2> 1163520 INFO  (coreZkRegister-4896-thread-1-processing-n:127.0.0.1:36018_ra%2Fyk x:collection1 s:shard1 c:control_collection r:core_node1) [n:127.0.0.1:36018_ra%2Fyk c:control_collection s:shard1 r:core_node1 x:collection1] o.a.s.c.ShardLeaderElectionContextBase Creating leader registration node /collections/control_collection/leaders/shard1/leader after winning as /collections/control_collection/leader_elect/shard1/election/95697640795013124-core_node1-n_0000000000
   [junit4]   2> 1163521 INFO  (coreZkRegister-4896-thread-1-processing-n:127.0.0.1:36018_ra%2Fyk x:collection1 s:shard1 c:control_collection r:core_node1) [n:127.0.0.1:36018_ra%2Fyk c:control_collection s:shard1 r:core_node1 x:collection1] o.a.s.c.ShardLeaderElectionContext I am the new leader: http://127.0.0.1:36018/ra/yk/collection1/ shard1
   [junit4]   2> 1163522 INFO  (OverseerStateUpdate-95697640795013124-127.0.0.1:36018_ra%2Fyk-n_0000000000) [n:127.0.0.1:36018_ra%2Fyk    ] o.a.s.c.Overseer processMessage: queueSize: 1, message = {
   [junit4]   2>   "operation":"leader",
   [junit4]   2>   "shard":"shard1",
   [junit4]   2>   "collection":"control_collection",
   [junit4]   2>   "base_url":"http://127.0.0.1:36018/ra/yk",
   [junit4]   2>   "core":"collection1",
   [junit4]   2>   "state":"active"} current state version: 1
   [junit4]   2> 1163627 INFO  (zkCallback-1371-thread-1-processing-n:127.0.0.1:36018_ra%2Fyk) [n:127.0.0.1:36018_ra%2Fyk    ] o.a.s.c.c.ZkStateReader A cluster state change: [WatchedEvent state:SyncConnected type:NodeDataChanged path:/clusterstate.json], has occurred - updating... (live nodes size: [1])
   [junit4]   2> 1163672 INFO  (coreZkRegister-4896-thread-1-processing-n:127.0.0.1:36018_ra%2Fyk x:collection1 s:shard1 c:control_collection r:core_node1) [n:127.0.0.1:36018_ra%2Fyk c:control_collection s:shard1 r:core_node1 x:collection1] o.a.s.c.ZkController We are http://127.0.0.1:36018/ra/yk/collection1/ and leader is http://127.0.0.1:36018/ra/yk/collection1/
   [junit4]   2> 1163672 INFO  (coreZkRegister-4896-thread-1-processing-n:127.0.0.1:36018_ra%2Fyk x:collection1 s:shard1 c:control_collection r:core_node1) [n:127.0.0.1:36018_ra%2Fyk c:control_collection s:shard1 r:core_node1 x:collection1] o.a.s.c.ZkController No LogReplay needed for core=collection1 baseURL=http://127.0.0.1:36018/ra/yk
   [junit4]   2> 1163673 INFO  (coreZkRegister-4896-thread-1-processing-n:127.0.0.1:36018_ra%2Fyk x:collection1 s:shard1 c:control_collection r:core_node1) [n:127.0.0.1:36018_ra%2Fyk c:control_collection s:shard1 r:core_node1 x:collection1] o.a.s.c.ZkController I am the leader, no recovery necessary
   [junit4]   2> 1163673 INFO  (coreZkRegister-4896-thread-1-processing-n:127.0.0.1:36018_ra%2Fyk x:collection1 s:shard1 c:control_collection r:core_node1) [n:127.0.0.1:36018_ra%2Fyk c:control_collection s:shard1 r:core_node1 x:collection1] o.a.s.c.ZkController publishing state=active
   [junit4]   2> 1163673 INFO  (coreZkRegister-4896-thread-1-processing-n:127.0.0.1:36018_ra%2Fyk x:collection1 s:shard1 c:control_collection r:core_node1) [n:127.0.0.1:36018_ra%2Fyk c:control_collection s:shard1 r:core_node1 x:collection1] o.a.s.c.ZkController numShards not found on descriptor - reading it from system property
   [junit4]   2> 1163676 INFO  (OverseerStateUpdate-95697640795013124-127.0.0.1:36018_ra%2Fyk-n_0000000000) [n:127.0.0.1:36018_ra%2Fyk    ] o.a.s.c.Overseer processMessage: queueSize: 1, message = {
   [junit4]   2>   "core":"collection1",
   [junit4]   2>   "core_node_name":"core_node1",
   [junit4]   2>   "roles":null,
   [junit4]   2>   "base_url":"http://127.0.0.1:36018/ra/yk",
   [junit4]   2>   "node_name":"127.0.0.1:36018_ra%2Fyk",
   [junit4]   2>   "numShards":"1",
   [junit4]   2>   "state":"active",
   [junit4]   2>   "shard":"shard1",
   [junit4]   2>   "collection":"control_collection",
   [junit4]   2>   "operation":"state"} current state version: 2
   [junit4]   2> 1163677 INFO  (OverseerStateUpdate-95697640795013124-127.0.0.1:36018_ra%2Fyk-n_0000000000) [n:127.0.0.1:36018_ra%2Fyk    ] o.a.s.c.o.ReplicaMutator Update state numShards=1 message={
   [junit4]   2>   "core":"collection1",
   [junit4]   2>   "core_node_name":"core_node1",
   [junit4]   2>   "roles":null,
   [junit4]   2>   "base_url":"http://127.0.0.1:36018/ra/yk",
   [junit4]   2>   "node_name":"127.0.0.1:36018_ra%2Fyk",
   [junit4]   2>   "numShards":"1",
   [junit4]   2>   "state":"active",
   [junit4]   2>   "shard":"shard1",
   [junit4]   2>   "collection":"control_collection",
   [junit4]   2>   "operation":"state"}
   [junit4]   2> 1163678 INFO  (coreZkRegister-4896-thread-1-processing-n:127.0.0.1:36018_ra%2Fyk x:collection1 s:shard1 c:control_collection r:core_node1) [n:127.0.0.1:36018_ra%2Fyk c:control_collection s:shard1 r:core_node1 x:collection1] o.a.s.c.c.ZkStateReader Updated live nodes from ZooKeeper... (1) -> (1)
   [junit4]   2> 1163729 INFO  (TEST-ChaosMonkeyNothingIsSafeTest.test-seed#[89AB750D2C291D3D]) [    ] o.a.s.c.c.SolrZkClient Using default ZkCredentialsProvider
   [junit4]   2> 1163731 INFO  (TEST-ChaosMonkeyNothingIsSafeTest.test-seed#[89AB750D2C291D3D]) [    ] o.a.s.c.c.ConnectionManager Waiting for client to connect to ZooKeeper
   [junit4]   2> 1163738 INFO  (zkCallback-1373-thread-1) [    ] o.a.s.c.c.ConnectionManager Watcher org.apache.solr.common.cloud.ConnectionManager@1103f31 name:ZooKeeperConnection Watcher:127.0.0.1:35398/solr got event WatchedEvent state:SyncConnected type:None path:null path:null type:None
   [junit4]   2> 1163738 INFO  (TEST-ChaosMonkeyNothingIsSafeTest.test-seed#[89AB750D2C291D3D]) [    ] o.a.s.c.c.ConnectionManager Client is connected to ZooKeeper
   [junit4]   2> 1163739 INFO  (TEST-ChaosMonkeyNothingIsSafeTest.test-seed#[89AB750D2C291D3D]) [    ] o.a.s.c.c.SolrZkClient Using default ZkACLProvider
   [junit4]   2> 1163739 INFO  (TEST-ChaosMonkeyNothingIsSafeTest.test-seed#[89AB750D2C291D3D]) [    ] o.a.s.c.c.ZkStateReader Updating cluster state from ZooKeeper... 
   [junit4]   2> 1163741 INFO  (TEST-ChaosMonkeyNothingIsSafeTest.test-seed#[89AB750D2C291D3D]) [    ] o.a.s.c.c.ZkStateReader Updated live nodes from ZooKeeper... (0) -> (1)
   [junit4]   2> 1163741 INFO  (TEST-ChaosMonkeyNothingIsSafeTest.test-seed#[89AB750D2C291D3D]) [    ] o.a.s.c.ChaosMonkey monkey: init - expire sessions:false cause connection loss:false
   [junit4]   2> 1163741 INFO  (TEST-ChaosMonkeyNothingIsSafeTest.test-seed#[89AB750D2C291D3D]) [    ] o.a.s.c.AbstractFullDistribZkTestBase Creating collection1 with stateFormat=2
   [junit4]   2> 1163742 INFO  (TEST-ChaosMonkeyNothingIsSafeTest.test-seed#[89AB750D2C291D3D]) [    ] o.a.s.c.c.SolrZkClient Using default ZkCredentialsProvider
   [junit4]   2> 1163743 INFO  (TEST-ChaosMonkeyNothingIsSafeTest.test-seed#[89AB750D2C291D3D]) [    ] o.a.s.c.c.ConnectionManager Waiting for client to connect to ZooKeeper
   [junit4]   2> 1163745 INFO  (zkCallback-1374-thread-1) [    ] o.a.s.c.c.ConnectionManager Watcher org.apache.solr.common.cloud.ConnectionManager@70170b name:ZooKeeperConnection Watcher:127.0.0.1:35398/solr got event WatchedEvent state:SyncConnected type:None path:null path:null type:None
   [junit4]   2> 1163745 INFO  (TEST-ChaosMonkeyNothingIsSafeTest.test-seed#[89AB750D2C291D3D]) [    ] o.a.s.c.c.ConnectionManager Client is connected to ZooKeeper
   [junit4]   2> 1163745 INFO  (TEST-ChaosMonkeyNothingIsSafeTest.test-seed#[89AB750D2C291D3D]) [    ] o.a.s.c.c.SolrZkClient Using default ZkACLProvider
   [junit4]   2> 1163749 INFO  (OverseerStateUpdate-95697640795013124-127.0.0.1:36018_ra%2Fyk-n_0000000000) [n:127.0.0.1:36018_ra%2Fyk    ] o.a.s.c.Overseer processMessage: queueSize: 1, message = {
   [junit4]   2>   "operation":"create",
   [junit4]   2>   "name":"collection1",
   [junit4]   2>   "numShards":"2",
   [junit4]   2>   "stateFormat":"2"} current state version: 2
   [junit4]   2> 1163749 INFO  (OverseerStateUpdate-95697640795013124-127.0.0.1:36018_ra%2Fyk-n_0000000000) [n:127.0.0.1:36018_ra%2Fyk    ] o.a.s.c.o.ClusterStateMutator building a new cName: collection1
   [junit4]   2> 1163753 INFO  (zkCallback-1373-thread-1) [    ] o.a.s.c.c.ZkStateReader A cluster state change: [WatchedEvent state:SyncConnected type:NodeDataChanged path:/clusterstate.json], has occurred - updating... (live nodes size: [1])
   [junit4]   2> 1163753 INFO  (zkCallback-1371-thread-1-processing-n:127.0.0.1:36018_ra%2Fyk) [n:127.0.0.1:36018_ra%2Fyk    ] o.a.s.c.c.ZkStateReader A cluster state change: [WatchedEvent state:SyncConnected type:NodeDataChanged path:/clusterstate.json], has occurred - updating... (live nodes size: [1])
   [junit4]   2> 1163831 INFO  (TEST-ChaosMonkeyNothingIsSafeTest.test-seed#[89AB750D2C291D3D]) [    ] o.a.s.SolrTestCaseJ4 Writing core.properties file to /home/jenkins/workspace/Lucene-Solr-6.0-Linux/solr/build/solr-core/test/J1/temp/solr.cloud.ChaosMonkeyNothingIsSafeTest_89AB750D2C291D3D-001/shard-1-001/cores/collection1
   [junit4]   2> 1163832 INFO  (TEST-ChaosMonkeyNothingIsSafeTest.test-seed#[89AB750D2C291D3D]) [    ] o.a.s.c.AbstractFullDistribZkTestBase create jetty 1 in directory /home/jenkins/workspace/Lucene-Solr-6.0-Linux/solr/build/solr-core/test/J1/temp/solr.cloud.ChaosMonkeyNothingIsSafeTest_89AB750D2C291D3D-001/shard-1-001
   [junit4]   2> 1163832 INFO  (TEST-ChaosMonkeyNothingIsSafeTest.test-seed#[89AB750D2C291D3D]) [    ] o.e.j.s.Server jetty-9.3.8.v20160314
   [junit4]   2> 1163834 INFO  (TEST-ChaosMonkeyNothingIsSafeTest.test-seed#[89AB750D2C291D3D]) [    ] o.e.j.s.h.ContextHandler Started o.e.j.s.ServletContextHandler@a7b73b{/ra/yk,null,AVAILABLE}
   [junit4]   2> 1163835 INFO  (TEST-ChaosMonkeyNothingIsSafeTest.test-seed#[89AB750D2C291D3D]) [    ] o.e.j.s.ServerConnector Started ServerConnector@2ab60e{HTTP/1.1,[http/1.1]}{127.0.0.1:37243}
   [junit4]   2> 1163835 INFO  (TEST-ChaosMonkeyNothingIsSafeTest.test-seed#[89AB750D2C291D3D]) [    ] o.e.j.s.Server Started @1165245ms
   [junit4]   2> 1163835 INFO  (TEST-ChaosMonkeyNothingIsSafeTest.test-seed#[89AB750D2C291D3D]) [    ] o.a.s.c.s.e.JettySolrRunner Jetty properties: {solr.data.dir=/home/jenkins/workspace/Lucene-Solr-6.0-Linux/solr/build/solr-core/test/J1/temp/solr.cloud.ChaosMonkeyNothingIsSafeTest_89AB750D2C291D3D-001/tempDir-001/jetty1, solrconfig=solrconfig.xml, hostContext=/ra/yk, hostPort=37243, coreRootDirectory=/home/jenkins/workspace/Lucene-Solr-6.0-Linux/solr/build/solr-core/test/J1/../../../../../../../../../home/jenkins/workspace/Lucene-Solr-6.0-Linux/solr/build/solr-core/test/J1/temp/solr.cloud.ChaosMonkeyNothingIsSafeTest_89AB750D2C291D3D-001/shard-1-001/cores}
   [junit4]   2> 1163835 INFO  (TEST-ChaosMonkeyNothingIsSafeTest.test-seed#[89AB750D2C291D3D]) [    ] o.a.s.s.SolrDispatchFilter SolrDispatchFilter.init(): sun.misc.Launcher$AppClassLoader@1d16e93
   [junit4]   2> 1163835 INFO  (TEST-ChaosMonkeyNothingIsSafeTest.test-seed#[89AB750D2C291D3D]) [    ] o.a.s.c.SolrResourceLoader new SolrResourceLoader for directory: '/home/jenkins/workspace/Lucene-Solr-6.0-Linux/solr/build/solr-core/test/J1/temp/solr.cloud.ChaosMonkeyNothingIsSafeTest_89AB750D2C291D3D-001/shard-1-001'
   [junit4]   2> 1163836 INFO  (TEST-ChaosMonkeyNothingIsSafeTest.test-seed#[89AB750D2C291D3D]) [    ] o.a.s.c.SolrResourceLoader JNDI not configured for solr (NoInitialContextEx)
   [junit4]   2> 1163836 INFO  (TEST-ChaosMonkeyNothingIsSafeTest.test-seed#[89AB750D2C291D3D]) [    ] o.a.s.c.SolrResourceLoader solr home defaulted to 'solr/' (could not find system property or JNDI)
   [junit4]   2> 1163836 INFO  (TEST-ChaosMonkeyNothingIsSafeTest.test-seed#[89AB750D2C291D3D]) [    ] o.a.s.c.c.SolrZkClient Using default ZkCredentialsProvider
   [junit4]   2> 1163836 INFO  (TEST-ChaosMonkeyNothingIsSafeTest.test-seed#[89AB750D2C291D3D]) [    ] o.a.s.c.c.ConnectionManager Waiting for client to connect to ZooKeeper
   [junit4]   2> 1163837 INFO  (zkCallback-1375-thread-1) [    ] o.a.s.c.c.ConnectionManager Watcher org.apache.solr.common.cloud.ConnectionManager@3711d1 name:ZooKeeperConnection Watcher:127.0.0.1:35398/solr got event WatchedEvent state:SyncConnected type:None path:null path:null type:None
   [junit4]   2> 1163837 INFO  (TEST-ChaosMonkeyNothingIsSafeTest.test-seed#[89AB750D2C291D3D]) [    ] o.a.s.c.c.ConnectionManager Client is connected to ZooKeeper
   [junit4]   2> 1163838 INFO  (TEST-ChaosMonkeyNothingIsSafeTest.test-seed#[89AB750D2C291D3D]) [    ] o.a.s.c.c.SolrZkClient Using default ZkACLProvider
   [junit4]   2> 1163838 INFO  (TEST-ChaosMonkeyNothingIsSafeTest.test-seed#[89AB750D2C291D3D]) [    ] o.a.s.s.SolrDispatchFilter Loading solr.xml from SolrHome (not found in ZooKeeper)
   [junit4]   2> 1163839 INFO  (TEST-ChaosMonkeyNothingIsSafeTest.test-seed#[89AB750D2C291D3D]) [    ] o.a.s.c.SolrXmlConfig Loading container configuration from /home/jenkins/workspace/Lucene-Solr-6.0-Linux/solr/build/solr-core/test/J1/temp/solr.cloud.ChaosMonkeyNothingIsSafeTest_89AB750D2C291D3D-001/shard-1-001/solr.xml
   [junit4]   2> 1163845 INFO  (TEST-ChaosMonkeyNothingIsSafeTest.test-seed#[89AB750D2C291D3D]) [    ] o.a.s.c.CorePropertiesLocator Config-defined core root directory: /home/jenkins/workspace/Lucene-Solr-6.0-Linux/solr/build/solr-core/test/J1/../../../../../../../../../home/jenkins/workspace/Lucene-Solr-6.0-Linux/solr/build/solr-core/test/J1/temp/solr.cloud.ChaosMonkeyNothingIsSafeTest_89AB750D2C291D3D-001/shard-1-001/cores
   [junit4]   2> 1163845 INFO  (TEST-ChaosMonkeyNothingIsSafeTest.test-seed#[89AB750D2C291D3D]) [    ] o.a.s.c.CoreContainer New CoreContainer 21307709
   [junit4]   2> 1163846 INFO  (TEST-ChaosMonkeyNothingIsSafeTest.test-seed#[89AB750D2C291D3D]) [    ] o.a.s.c.CoreContainer Loading cores into CoreContainer [instanceDir=/home/jenkins/workspace/Lucene-Solr-6.0-Linux/solr/build/solr-core/test/J1/temp/solr.cloud.ChaosMonkeyNothingIsSafeTest_89AB750D2C291D3D-001/shard-1-001]
   [junit4]   2> 1163846 WARN  (TEST-ChaosMonkeyNothingIsSafeTest.test-seed#[89AB750D2C291D3D]) [    ] o.a.s.c.CoreContainer Couldn't add files from /home/jenkins/workspace/Lucene-Solr-6.0-Linux/solr/build/solr-core/test/J1/temp/solr.cloud.ChaosMonkeyNothingIsSafeTest_89AB750D2C291D3D-001/shard-1-001/lib to classpath: /home/jenkins/workspace/Lucene-Solr-6.0-Linux/solr/build/solr-core/test/J1/temp/solr.cloud.ChaosMonkeyNothingIsSafeTest_89AB750D2C291D3D-001/shard-1-001/lib
   [junit4]   2> 1163846 INFO  (TEST-ChaosMonkeyNothingIsSafeTest.test-seed#[89AB750D2C291D3D]) [    ] o.a.s.h.c.HttpShardHandlerFactory created with socketTimeout : 90000,urlScheme : ,connTimeout : 15000,maxConnectionsPerHost : 20,maxConnections : 10000,corePoolSize : 0,maximumPoolSize : 2147483647,maxThreadIdleTime : 5,sizeOfQueue : -1,fairnessPolicy : false,useRetries : false,
   [junit4]   2> 1163847 INFO  (TEST-ChaosMonkeyNothingIsSafeTest.test-seed#[89AB750D2C291D3D]) [    ] o.a.s.u.UpdateShardHandler Creating UpdateShardHandler HTTP client with params: socketTimeout=340000&connTimeout=45000&retry=true
   [junit4]   2> 1163848 INFO  (TEST-ChaosMonkeyNothingIsSafeTest.test-seed#[89AB750D2C291D3D]) [    ] o.a.s.l.LogWatcher SLF4J impl is org.slf4j.impl.Log4jLoggerFactory
   [junit4]   2> 1163848 INFO  (TEST-ChaosMonkeyNothingIsSafeTest.test-seed#[89AB750D2C291D3D]) [    ] o.a.s.l.LogWatcher Registering Log Listener [Log4j (org.slf4j.impl.Log4jLoggerFactory)]
   [junit4]   2> 1163848 INFO  (TEST-ChaosMonkeyNothingIsSafeTest.test-seed#[89AB750D2C291D3D]) [    ] o.a.s.c.ZkContainer Zookeeper client=127.0.0.1:35398/solr
   [junit4]   2> 1163848 INFO  (TEST-ChaosMonkeyNothingIsSafeTest.test-seed#[89AB750D2C291D3D]) [    ] o.a.s.c.ZkController zkHost includes chroot
   [junit4]   2> 1163848 INFO  (TEST-ChaosMonkeyNothingIsSafeTest.test-seed#[89AB750D2C291D3D]) [    ] o.a.s.c.c.SolrZkClient Using default ZkCredentialsProvider
   [junit4]   2> 1163849 INFO  (TEST-ChaosMonkeyNothingIsSafeTest.test-seed#[89AB750D2C291D3D]) [    ] o.a.s.c.c.ConnectionManager Waiting for client to connect to ZooKeeper
   [junit4]   2> 1163849 INFO  (zkCallback-1378-thread-1) [    ] o.a.s.c.c.ConnectionManager Watcher org.apache.solr.common.cloud.ConnectionManager@15776ff name:ZooKeeperConnection Watcher:127.0.0.1:35398 got event WatchedEvent state:SyncConnected type:None path:null path:null type:None
   [junit4]   2> 1163849 INFO  (TEST-ChaosMonkeyNothingIsSafeTest.test-seed#[89AB750D2C291D3D]) [    ] o.a.s.c.c.ConnectionManager Client is connected to ZooKeeper
   [junit4]   2> 1163850 INFO  (TEST-ChaosMonkeyNothingIsSafeTest.test-seed#[89AB750D2C291D3D]) [    ] o.a.s.c.c.SolrZkClient Using default ZkACLProvider
   [junit4]   2> 1163851 INFO  (TEST-ChaosMonkeyNothingIsSafeTest.test-seed#[89AB750D2C291D3D]) [n:127.0.0.1:37243_ra%2Fyk    ] o.a.s.c.c.ConnectionManager Waiting for client to connect to ZooKeeper
   [junit4]   2> 1163852 INFO  (zkCallback-1379-thread-1-processing-n:127.0.0.1:37243_ra%2Fyk) [n:127.0.0.1:37243_ra%2Fyk    ] o.a.s.c.c.ConnectionManager Watcher org.apache.solr.common.cloud.ConnectionManager@782d99 name:ZooKeeperConnection Watcher:127.0.0.1:35398/solr got event WatchedEvent state:SyncConnected type:None path:null path:null type:None
   [junit4]   2> 1163852 INFO  (TEST-ChaosMonkeyNothingIsSafeTest.test-seed#[89AB750D2C291D3D]) [n:127.0.0.1:37243_ra%2Fyk    ] o.a.s.c.c.ConnectionManager Client is connected to ZooKeeper
   [junit4]   2> 1163857 INFO  (TEST-ChaosMonkeyNothingIsSafeTest.test-seed#[89AB750D2C291D3D]) [n:127.0.0.1:37243_ra%2Fyk    ] o.a.s.c.c.ZkStateReader Updating cluster state from ZooKeeper... 
   [junit4]   2> 1163858 INFO  (TEST-ChaosMonkeyNothingIsSafeTest.test-seed#[89AB750D2C291D3D]) [n:127.0.0.1:37243_ra%2Fyk    ] o.a.s.c.c.ZkStateReader Updated live nodes from ZooKeeper... (0) -> (1)
   [junit4]   2> 1163859 INFO  (TEST-ChaosMonkeyNothingIsSafeTest.test-seed#[89AB750D2C291D3D]) [n:127.0.0.1:37243_ra%2Fyk    ] o.a.s.c.Overseer Overseer (id=null) closing
   [junit4]   2> 1163860 INFO  (TEST-ChaosMonkeyNothingIsSafeTest.test-seed#[89AB750D2C291D3D]) [n:127.0.0.1:37243_ra%2Fyk    ] o.a.s.c.LeaderElector Joined leadership election with path: /overseer_elect/election/95697640795013129-127.0.0.1:37243_ra%2Fyk-n_0000000001
   [junit4]   2> 1163860 INFO  (OverseerStateUpdate-95697640795013124-127.0.0.1:36018_ra%2Fyk-n_0000000000) [n:127.0.0.1:36018_ra%2Fyk    ] o.a.s.c.o.ZkStateWriter going to create_collection /collections/collection1/state.json
   [junit4]   2> 1163860 INFO  (TEST-ChaosMonkeyNothingIsSafeTest.test-seed#[89AB750D2C291D3D]) [n:127.0.0.1:37243_ra%2Fyk    ] o.a.s.c.LeaderElector Watching path /overseer_elect/election/95697640795013124-127.0.0.1:36018_ra%2Fyk-n_0000000000 to know if I could be the leader
   [junit4]   2> 1163861 INFO  (TEST-ChaosMonkeyNothingIsSafeTest.test-seed#[89AB750D2C291D3D]) [n:127.0.0.1:37243_ra%2Fyk    ] o.a.s.c.ZkController Publish node=127.0.0.1:37243_ra%2Fyk as DOWN
   [junit4]   2> 1163863 INFO  (OverseerStateUpdate-95697640795013124-127.0.0.1:36018_ra%2Fyk-n_0000000000) [n:127.0.0.1:36018_ra%2Fyk    ] o.a.s.c.Overseer processMessage: queueSize: 1, message = {
   [junit4]   2>   "operation":"downnode",
   [junit4]   2>   "node_name":"127.0.0.1:37243_ra%2Fyk"} current state version: 3
   [junit4]   2> 1163863 INFO  (OverseerStateUpdate-95697640795013124-127.0.0.1:36018_ra%2Fyk-n_0000000000) [n:127.0.0.1:36018_ra%2Fyk    ] o.a.s.c.o.NodeMutator DownNode state invoked for node: 127.0.0.1:37243_ra%2Fyk
   [junit4]   2> 1163864 INFO  (OverseerStateUpdate-95697640795013124-127.0.0.1:36018_ra%2Fyk-n_0000000000) [n:127.0.0.1:36018_ra%2Fyk    ] o.a.s.c.o.ZkStateWriter going to update_collection /collections/collection1/state.json version: 0
   [junit4]   2> 1163968 INFO  (zkCallback-1373-thread-1) [    ] o.a.s.c.c.ZkStateReader A cluster state change: [WatchedEvent state:SyncConnected type:NodeDataChanged path:/clusterstate.json], has occurred - updating... (live nodes size: [1])
   [junit4]   2> 1163968 INFO  (zkCallback-1371-thread-1-processing-n:127.0.0.1:36018_ra%2Fyk) [n:127.0.0.1:36018_ra%2Fyk    ] o.a.s.c.c.ZkStateReader A cluster state change: [WatchedEvent state:SyncConnected type:NodeDataChanged path:/clusterstate.json], has occurred - updating... (live nodes size: [1])
   [junit4]   2> 1163968 INFO  (zkCallback-1379-thread-1-processing-n:127.0.0.1:37243_ra%2Fyk) [n:127.0.0.1:37243_ra%2Fyk    ] o.a.s.c.c.ZkStateReader A cluster state change: [WatchedEvent state:SyncConnected type:NodeDataChanged path:/clusterstate.json], has occurred - updating... (live nodes size: [1])
   [junit4]   2> 1164863 INFO  (TEST-ChaosMonkeyNothingIsSafeTest.test-seed#[89AB750D2C291D3D]) [n:127.0.0.1:37243_ra%2Fyk    ] o.a.s.c.ZkController Register node as live in ZooKeeper:/live_nodes/127.0.0.1:37243_ra%2Fyk
   [junit4]   2> 1164864 INFO  (TEST-ChaosMonkeyNothingIsSafeTest.test-seed#[89AB750D2C291D3D]) [n:127.0.0.1:37243_ra%2Fyk    ] o.a.s.c.c.SolrZkClient makePath: /live_nodes/127.0.0.1:37243_ra%2Fyk
   [junit4]   2> 1164865 INFO  (zkCallback-1371-thread-1-processing-n:127.0.0.1:36018_ra%2Fyk) [n:127.0.0.1:36018_ra%2Fyk    ] o.a.s.c.c.ZkStateReader A live node change: [WatchedEvent state:SyncConnected type:NodeChildrenChanged path:/live_nodes], has occurred - updating... (live nodes size: [1])
   [junit4]   2> 1164865 INFO  (zkCallback-1373-thread-1) [    ] o.a.s.c.c.ZkStateReader A live node change: [WatchedEvent state:SyncConnected type:NodeChildrenChanged path:/live_nodes], has occurred - updating... (live nodes size: [1])
   [junit4]   2> 1164865 INFO  (zkCallback-1379-thread-1-processing-n:127.0.0.1:37243_ra%2Fyk) [n:127.0.0.1:37243_ra%2Fyk    ] o.a.s.c.c.ZkStateReader A live node change: [WatchedEvent state:SyncConnected type:NodeChildrenChanged path:/live_nodes], has occurred - updating... (live nodes size: [1])
   [junit4]   2> 1164865 INFO  (zkCallback-1373-thread-1) [    ] o.a.s.c.c.ZkStateReader Updated live nodes from ZooKeeper... (1) -> (2)
   [junit4]   2> 1164865 INFO  (zkCallback-1379-thread-1-processing-n:127.0.0.1:37243_ra%2Fyk) [n:127.0.0.1:37243_ra%2Fyk    ] o.a.s.c.c.ZkStateReader Updated live nodes from ZooKeeper... (1) -> (2)
   [junit4]   2> 1164865 INFO  (zkCallback-1371-thread-1-processing-n:127.0.0.1:36018_ra%2Fyk) [n:127.0.0.1:36018_ra%2Fyk    ] o.a.s.c.c.ZkStateReader Updated live nodes from ZooKeeper... (1) -> (2)
   [junit4]   2> 1164918 INFO  (TEST-ChaosMonkeyNothingIsSafeTest.test-seed#[89AB750D2C291D3D]) [n:127.0.0.1:37243_ra%2Fyk    ] o.a.s.c.CoreContainer Security conf doesn't exist. Skipping setup for authorization module.
   [junit4]   2> 1164918 INFO  (TEST-ChaosMonkeyNothingIsSafeTest.test-seed#[89AB750D2C291D3D]) [n:127.0.0.1:37243_ra%2Fyk    ] o.a.s.c.CoreContainer No authentication plugin used.
   [junit4]   2> 1164919 INFO  (TEST-ChaosMonkeyNothingIsSafeTest.test-seed#[89AB750D2C291D3D]) [n:127.0.0.1:37243_ra%2Fyk    ] o.a.s.c.CorePropertiesLocator Looking for core definitions underneath /home/jenkins/workspace/Lucene-Solr-6.0-Linux/solr/build/solr-core/test/J1/../../../../../../../../../home/jenkins/workspace/Lucene-Solr-6.0-Linux/solr/build/solr-core/test/J1/temp/solr.cloud.ChaosMonkeyNothingIsSafeTest_89AB750D2C291D3D-001/shard-1-001/cores
   [junit4]   2> 1164920 INFO  (TEST-ChaosMonkeyNothingIsSafeTest.test-seed#[89AB750D2C291D3D]) [n:127.0.0.1:37243_ra%2Fyk    ] o.a.s.c.CoreDescriptor Created CoreDescriptor: {name=collection1, config=solrconfig.xml, transient=false, schema=schema.xml, loadOnStartup=true, configSetProperties=configsetprops.json, collection=collection1, coreNodeName=, dataDir=data/, shard=}
   [junit4]   2> 1164920 INFO  (TEST-ChaosMonkeyNothingIsSafeTest.test-seed#[89AB750D2C291D3D]) [n:127.0.0.1:37243_ra%2Fyk    ] o.a.s.c.CorePropertiesLocator Found core collection1 in /home/jenkins/workspace/Lucene-Solr-6.0-Linux/solr/build/solr-core/test/J1/../../../../../../../../../home/jenkins/workspace/Lucene-Solr-6.0-Linux/solr/build/solr-core/test/J1/temp/solr.cloud.ChaosMonkeyNothingIsSafeTest_89AB750D2C291D3D-001/shard-1-001/cores/collection1
   [junit4]   2> 1164920 INFO  (TEST-ChaosMonkeyNothingIsSafeTest.test-seed#[89AB750D2C291D3D]) [n:127.0.0.1:37243_ra%2Fyk    ] o.a.s.c.CorePropertiesLocator Found 1 core definitions
   [junit4]   2> 1164921 INFO  (TEST-ChaosMonkeyNothingIsSafeTest.test-seed#[89AB750D2C291D3D]) [n:127.0.0.1:37243_ra%2Fyk    ] o.a.s.s.SolrDispatchFilter user.dir=/home/jenkins/workspace/Lucene-Solr-6.0-Linux/solr/build/solr-core/test/J1
   [junit4]   2> 1164921 INFO  (TEST-ChaosMonkeyNothingIsSafeTest.test-seed#[89AB750D2C291D3D]) [n:127.0.0.1:37243_ra%2Fyk    ] o.a.s.s.SolrDispatchFilter SolrDispatchFilter.init() done
   [junit4]   2> 1164922 INFO  (coreLoadExecutor-4913-thread-1-processing-n:127.0.0.1:37243_ra%2Fyk) [n:127.0.0.1:37243_ra%2Fyk c:collection1   x:collection1] o.a.s.c.ZkController publishing state=down
   [junit4]   2> 1164922 INFO  (coreLoadExecutor-4913-thread-1-processing-n:127.0.0.1:37243_ra%2Fyk) [n:127.0.0.1:37243_ra%2Fyk c:collection1   x:collection1] o.a.s.c.ZkController numShards not found on descriptor - reading it from system property
   [junit4]   2> 1164923 INFO  (coreLoadExecutor-4913-thread-1-processing-n:127.0.0.1:37243_ra%2Fyk) [n:127.0.0.1:37243_ra%2Fyk c:collection1   x:collection1] o.a.s.c.ZkController Registering watch for collection collection1
   [junit4]   2> 1164924 INFO  (coreLoadExecutor-4913-thread-1-processing-n:127.0.0.1:37243_ra%2Fyk) [n:127.0.0.1:37243_ra%2Fyk c:collection1   x:collection1] o.a.s.c.c.ZkStateReader addZkWatch [collection1]
   [junit4]   2> 1164924 INFO  (OverseerStateUpdate-95697640795013124-127.0.0.1:36018_ra%2Fyk-n_0000000000) [n:127.0.0.1:36018_ra%2Fyk    ] o.a.s.c.Overseer processMessage: queueSize: 1, message = {
   [junit4]   2>   "core":"collection1",
   [junit4]   2>   "roles":null,
   [junit4]   2>   "base_url":"http://127.0.0.1:37243/ra/yk",
   [junit4]   2>   "node_name":"127.0.0.1:37243_ra%2Fyk",
   [junit4]   2>   "numShards":"2",
   [junit4]   2>   "state":"down",
   [junit4]   2>   "shard":null,
   [junit4]   2>   "collection":"collection1",
   [junit4]   2>   "operation":"state"} current state version: 4
   [junit4]   2> 1164924 INFO  (coreLoadExecutor-4913-thread-1-processing-n:127.0.0.1:37243_ra%2Fyk) [n:127.0.0.1:37243_ra%2Fyk c:collection1   x:collection1] o.a.s.c.c.ZkStateReader Add data for [collection1] ver [1]
   [junit4]   2> 1164924 INFO  (coreLoadExecutor-4913-thread-1-processing-n:127.0.0.1:37243_ra%2Fyk) [n:127.0.0.1:37243_ra%2Fyk c:collection1   x:collection1] o.a.s.c.ZkController look for our core node name
   [junit4]   2> 1164925 INFO  (OverseerStateUpdate-95697640795013124-127.0.0.1:36018_ra%2Fyk-n_0000000000) [n:127.0.0.1:36018_ra%2Fyk    ] o.a.s.c.o.ReplicaMutator Update state numShards=2 message={
   [junit4]   2>   "core":"collection1",
   [junit4]   2>   "roles":null,
   [junit4]   2>   "base_url":"http://127.0.0.1:37243/ra/yk",
   [junit4]   2>   "node_name":"127.0.0.1:37243_ra%2Fyk",
   [junit4]   2>   "numShards":"2",
   [junit4]   2>   "state":"down",
   [junit4]   2>   "shard":null,
   [junit4]   2>   "collection":"collection1",
   [junit4]   2>   "operation":"state"}
   [junit4]   2> 1164925 INFO  (OverseerStateUpdate-95697640795013124-127.0.0.1:36018_ra%2Fyk-n_0000000000) [n:127.0.0.1:36018_ra%2Fyk    ] o.a.s.c.o.ReplicaMutator Collection already exists with numShards=2
   [junit4]   2> 1164925 INFO  (OverseerStateUpdate-95697640795013124-127.0.0.1:36018_ra%2Fyk-n_0000000000) [n:127.0.0.1:36018_ra%2Fyk    ] o.a.s.c.o.ReplicaMutator Assigning new node to shard shard=shard2
   [junit4]   2> 1165027 INFO  (OverseerStateUpdate-95697640795013124-127.0.0.1:36018_ra%2Fyk-n_0000000000) [n:127.0.0.1:36018_ra%2Fyk    ] o.a.s.c.o.ZkStateWriter going to update_collection /collections/collection1/state.json version: 1
   [junit4]   2> 1165028 INFO  (zkCallback-1379-thread-1-processing-n:127.0.0.1:37243_ra%2Fyk) [n:127.0.0.1:37243_ra%2Fyk    ] o.a.s.c.c.ZkStateReader A cluster state change: [WatchedEvent state:SyncConnected type:NodeDataChanged path:/collections/collection1/state.json] for collection [collection1] has occurred - updating... (live nodes size: [2])
   [junit4]   2> 1165028 INFO  (zkCallback-1379-thread-1-processing-n:127.0.0.1:37243_ra%2Fyk) [n:127.0.0.1:37243_ra%2Fyk    ] o.a.s.c.c.ZkStateReader Updating data for [collection1] from [1] to [2]
   [junit4]   2> 1165925 INFO  (coreLoadExecutor-4913-thread-1-processing-n:127.0.0.1:37243_ra%2Fyk) [n:127.0.0.1:37243_ra%2Fyk c:collection1   x:collection1] o.a.s.c.ZkController waiting to find shard id in clusterstate for collection1
   [junit4]   2> 1165925 INFO  (coreLoadExecutor-4913-thread-1-processing-n:127.0.0.1:37243_ra%2Fyk) [n:127.0.0.1:37243_ra%2Fyk c:collection1   x:collection1] o.a.s.c.ZkController Check for collection zkNode:collection1
   [junit4]   2> 1165925 INFO  (coreLoadExecutor-4913-thread-1-processing-n:127.0.0.1:37243_ra%2Fyk) [n:127.0.0.1:37243_ra%2Fyk c:collection1   x:collection1] o.a.s.c.ZkController Collection zkNode exists
   [junit4]   2> 1165926 INFO  (coreLoadExecutor-4913-thread-1-processing-n:127.0.0.1:37243_ra%2Fyk) [n:127.0.0.1:37243_ra%2Fyk c:collection1   x:collection1] o.a.s.c.c.ZkStateReader Load collection config from: [/collections/collection1]
   [junit4]   2> 1165926 INFO  (coreLoadExecutor-4913-thread-1-processing-n:127.0.0.1:37243_ra%2Fyk) [n:127.0.0.1:37243_ra%2Fyk c:collection1   x:collection1] o.a.s.c.c.ZkStateReader path=[/collections/collection1] [configName]=[conf1] specified config exists in ZooKeeper
   [junit4]   2> 1165926 INFO  (coreLoadExecutor-4913-thread-1-processing-n:127.0.0.1:37243_ra%2Fyk) [n:127.0.0.1:37243_ra%2Fyk c:collection1   x:collection1] o.a.s.c.SolrResourceLoader new SolrResourceLoader for directory: '/home/jenkins/workspace/Lucene-Solr-6.0-Linux/solr/build/solr-core/test/J1/temp/solr.cloud.ChaosMonkeyNothingIsSafeTest_89AB750D2C291D3D-001/shard-1-001/cores/collection1'
   [junit4]   2> 1165926 INFO  (coreLoadExecutor-4913-thread-1-processing-n:127.0.0.1:37243_ra%2Fyk) [n:127.0.0.1:37243_ra%2Fyk c:collection1   x:collection1] o.a.s.c.SolrResourceLoader JNDI not configured for solr (NoInitialContextEx)
   [junit4]   2> 1165927 INFO  (coreLoadExecutor-4913-thread-1-processing-n:127.0.0.1:37243_ra%2Fyk) [n:127.0.0.1:37243_ra%2Fyk c:collection1   x:collection1] o.a.s.c.SolrResourceLoader solr home defaulted to 'solr/' (could not find system property or JNDI)
   [junit4]   2> 1165928 INFO  (coreLoadExecutor-4913-thread-1-processing-n:127.0.0.1:37243_ra%2Fyk) [n:127.0.0.1:37243_ra%2Fyk c:collection1   x:collection1] o.a.s.c.Config loaded config solrconfig.xml with version 0 
   [junit4]   2> 1165934 INFO  (coreLoadExecutor-4913-thread-1-processing-n:127.0.0.1:37243_ra%2Fyk) [n:127.0.0.1:37243_ra%2Fyk c:collection1   x:collection1] o.a.s.c.SolrConfig current version of requestparams : -1
   [junit4]   2> 1165938 WARN  (coreLoadExecutor-4913-thread-1-processing-n:127.0.0.1:37243_ra%2Fyk) [n:127.0.0.1:37243_ra%2Fyk c:collection1   x:collection1] o.a.s.c.Config Beginning with Solr 5.5, <mergePolicy> is deprecated, use <mergePolicyFactory> instead.
   [junit4]   2> 1165939 INFO  (coreLoadExecutor-4913-thread-1-processing-n:127.0.0.1:37243_ra%2Fyk) [n:127.0.0.1:37243_ra%2Fyk c:collection1   x:collection1] o.a.s.c.SolrConfig Using Lucene MatchVersion: 6.0.0
   [junit4]   2> 1165948 INFO  (coreLoadExecutor-4913-thread-1-processing-n:127.0.0.1:37243_ra%2Fyk) [n:127.0.0.1:37243_ra%2Fyk c:collection1   x:collection1] o.a.s.c.SolrConfig Loaded SolrConfig: solrconfig.xml
   [ju

[...truncated too long message...]

C291D3D-001/shard-4-001/cores/collection1/data/index;done=false>>]
   [junit4]   2> 1213841 INFO  (coreCloseExecutor-4963-thread-1) [n:127.0.0.1:44667_ra%2Fyk c:collection1 s:shard1 r:core_node4 x:collection1] o.a.s.c.CachingDirectoryFactory Closing directory: /home/jenkins/workspace/Lucene-Solr-6.0-Linux/solr/build/solr-core/test/J1/temp/solr.cloud.ChaosMonkeyNothingIsSafeTest_89AB750D2C291D3D-001/shard-4-001/cores/collection1/data/index
   [junit4]   2> 1213842 INFO  (TEST-ChaosMonkeyNothingIsSafeTest.test-seed#[89AB750D2C291D3D]) [    ] o.a.s.c.Overseer Overseer (id=95697640795013138-127.0.0.1:44667_ra%2Fyk-n_0000000004) closing
   [junit4]   2> 1213842 INFO  (OverseerStateUpdate-95697640795013138-127.0.0.1:44667_ra%2Fyk-n_0000000004) [n:127.0.0.1:44667_ra%2Fyk    ] o.a.s.c.Overseer Overseer Loop exiting : 127.0.0.1:44667_ra%2Fyk
   [junit4]   2> 1213843 INFO  (zkCallback-1395-thread-5-processing-n:127.0.0.1:44667_ra%2Fyk) [n:127.0.0.1:44667_ra%2Fyk    ] o.a.s.c.c.ZkStateReader A cluster state change: [WatchedEvent state:SyncConnected type:NodeDataChanged path:/collections/collection1/state.json] for collection [collection1] has occurred - updating... (live nodes size: [1])
   [junit4]   2> 1213844 INFO  (zkCallback-1395-thread-2-processing-n:127.0.0.1:44667_ra%2Fyk) [n:127.0.0.1:44667_ra%2Fyk    ] o.a.s.c.c.ZkStateReader A live node change: [WatchedEvent state:SyncConnected type:NodeChildrenChanged path:/live_nodes], has occurred - updating... (live nodes size: [1])
   [junit4]   2> 1215343 WARN  (zkCallback-1395-thread-5-processing-n:127.0.0.1:44667_ra%2Fyk) [n:127.0.0.1:44667_ra%2Fyk    ] o.a.s.c.c.ZkStateReader ZooKeeper watch triggered, but Solr cannot talk to ZK: [KeeperErrorCode = Session expired for /collections/collection1/state.json]
   [junit4]   2> 1215344 WARN  (zkCallback-1395-thread-2-processing-n:127.0.0.1:44667_ra%2Fyk) [n:127.0.0.1:44667_ra%2Fyk    ] o.a.s.c.c.ZkStateReader ZooKeeper watch triggered, but Solr cannot talk to ZK: [KeeperErrorCode = Session expired for /live_nodes]
   [junit4]   2> 1215345 INFO  (TEST-ChaosMonkeyNothingIsSafeTest.test-seed#[89AB750D2C291D3D]) [    ] o.e.j.s.ServerConnector Stopped ServerConnector@9b1be1{HTTP/1.1,[http/1.1]}{127.0.0.1:0}
   [junit4]   2> 1215345 INFO  (TEST-ChaosMonkeyNothingIsSafeTest.test-seed#[89AB750D2C291D3D]) [    ] o.e.j.s.h.ContextHandler Stopped o.e.j.s.ServletContextHandler@256f40{/ra/yk,null,UNAVAILABLE}
   [junit4]   2> 1215348 INFO  (TEST-ChaosMonkeyNothingIsSafeTest.test-seed#[89AB750D2C291D3D]) [    ] o.a.s.c.ZkTestServer connecting to 127.0.0.1:35398 35398
   [junit4]   2> 1215463 INFO  (Thread-3497) [    ] o.a.s.c.ZkTestServer connecting to 127.0.0.1:35398 35398
   [junit4]   2> 1215464 WARN  (Thread-3497) [    ] o.a.s.c.ZkTestServer Watch limit violations: 
   [junit4]   2> Maximum concurrent children watches above limit:
   [junit4]   2> 
   [junit4]   2> 	3	/solr/overseer/queue
   [junit4]   2> 	3	/solr/overseer/collection-queue-work
   [junit4]   2> 	2	/solr/overseer/queue-work
   [junit4]   2> 
   [junit4]   2> NOTE: reproduce with: ant test  -Dtestcase=ChaosMonkeyNothingIsSafeTest -Dtests.method=test -Dtests.seed=89AB750D2C291D3D -Dtests.multiplier=3 -Dtests.slow=true -Dtests.locale=es-PR -Dtests.timezone=America/Indiana/Indianapolis -Dtests.asserts=true -Dtests.file.encoding=UTF-8
   [junit4] FAILURE 53.6s J1 | ChaosMonkeyNothingIsSafeTest.test <<<
   [junit4]    > Throwable #1: java.lang.AssertionError: document count mismatch.  control=408 sum(shards)=407 cloudClient=407
   [junit4]    > 	at __randomizedtesting.SeedInfo.seed([89AB750D2C291D3D:1FF4AD782D570C5]:0)
   [junit4]    > 	at org.apache.solr.cloud.AbstractFullDistribZkTestBase.checkShardConsistency(AbstractFullDistribZkTestBase.java:1317)
   [junit4]    > 	at org.apache.solr.cloud.ChaosMonkeyNothingIsSafeTest.test(ChaosMonkeyNothingIsSafeTest.java:226)
   [junit4]    > 	at org.apache.solr.BaseDistributedSearchTestCase$ShardsRepeatRule$ShardsFixedStatement.callStatement(BaseDistributedSearchTestCase.java:992)
   [junit4]    > 	at org.apache.solr.BaseDistributedSearchTestCase$ShardsRepeatRule$ShardsStatement.evaluate(BaseDistributedSearchTestCase.java:967)
   [junit4]    > 	at java.lang.Thread.run(Thread.java:745)
   [junit4]   2> 1215469 INFO  (SUITE-ChaosMonkeyNothingIsSafeTest-seed#[89AB750D2C291D3D]-worker) [    ] o.a.s.SolrTestCaseJ4 ###deleteCore
   [junit4]   2> NOTE: leaving temporary files on disk at: /home/jenkins/workspace/Lucene-Solr-6.0-Linux/solr/build/solr-core/test/J1/temp/solr.cloud.ChaosMonkeyNothingIsSafeTest_89AB750D2C291D3D-001
   [junit4]   2> Apr 09, 2016 7:29:28 PM com.carrotsearch.randomizedtesting.ThreadLeakControl checkThreadLeaks
   [junit4]   2> WARNING: Will linger awaiting termination of 1 leaked thread(s).
   [junit4]   2> NOTE: test params are: codec=Lucene60, sim=RandomSimilarity(queryNorm=true,coord=crazy): {}, locale=es-PR, timezone=America/Indiana/Indianapolis
   [junit4]   2> NOTE: Linux 4.2.0-34-generic i386/Oracle Corporation 1.8.0_72 (32-bit)/cpus=12,threads=1,free=247128424,total=536870912
   [junit4]   2> NOTE: All tests run in this JVM: [RollingRestartTest, SoftAutoCommitTest, SpatialRPTFieldTypeTest, TestSolrDeletionPolicy2, HdfsWriteToMultipleCollectionsTest, TestCodecSupport, LeaderFailoverAfterPartitionTest, TestSolrQueryResponse, CollectionsAPIDistributedZkTest, TestSolrCoreProperties, LoggingHandlerTest, DistributedIntervalFacetingTest, MBeansHandlerTest, TestSurroundQueryParser, TestUseDocValuesAsStored2, DistributedTermsComponentTest, DeleteInactiveReplicaTest, TestFieldSortValues, SuggesterFSTTest, TestDocumentBuilder, SpellPossibilityIteratorTest, DistributedSuggestComponentTest, TestDefaultStatsCache, RemoteQueryErrorTest, TestSolrQueryParserResource, TestNRTOpen, TestQuerySenderNoQuery, TestStressVersions, CdcrReplicationHandlerTest, TestLFUCache, TestRTimerTree, TestTrie, TestDistributedGrouping, DistributedVersionInfoTest, TestMiniSolrCloudClusterBase, HdfsCollectionsAPIDistributedZkTest, JavabinLoaderTest, WordBreakSolrSpellCheckerTest, ConvertedLegacyTest, HdfsRecoveryZkTest, RuleEngineTest, TestSchemaNameResource, DistributedMLTComponentTest, ZkCLITest, SpellCheckComponentTest, TestRecoveryHdfs, NotRequiredUniqueKeyTest, ShardRoutingCustomTest, PKIAuthenticationIntegrationTest, HdfsDirectoryTest, TestSchemaVersionResource, TestQueryTypes, BasicFunctionalityTest, TestDynamicFieldCollectionResource, DateRangeFieldTest, ZkStateReaderTest, TestDistribDocBasedVersion, TestManagedSynonymFilterFactory, BigEndianAscendingWordDeserializerTest, TestLMJelinekMercerSimilarityFactory, DirectSolrSpellCheckerTest, UniqFieldsUpdateProcessorFactoryTest, ExplicitHLLTest, NumericFieldsTest, BlockCacheTest, TestJsonRequest, CloneFieldUpdateProcessorFactoryTest, TestSQLHandler, AsyncMigrateRouteKeyTest, TimeZoneUtilsTest, ShardRoutingTest, SolrInfoMBeanTest, DistributedDebugComponentTest, UUIDUpdateProcessorFallbackTest, TestLeaderElectionZkExpiry, SimplePostToolTest, MultiTermTest, CheckHdfsIndexTest, VersionInfoTest, TriLevelCompositeIdRoutingTest, TestInitQParser, RequestLoggingTest, FileUtilsTest, TestOrdValues, TestSystemIdResolver, TestFileDictionaryLookup, ClusterStateUpdateTest, TestRandomRequestDistribution, TestExactStatsCache, MoreLikeThisHandlerTest, TestRequestForwarding, TestRuleBasedAuthorizationPlugin, TestXmlQParser, TestSimpleTrackingShardHandler, ChaosMonkeySafeLeaderTest, OpenCloseCoreStressTest, BasicZkTest, FullSolrCloudDistribCmdsTest, TermVectorComponentDistributedTest, HardAutoCommitTest, SolrCoreTest, SolrCmdDistributorTest, PeerSyncTest, TestBadConfig, SolrIndexSplitterTest, TestCoreDiscovery, SpellCheckCollatorTest, TestFoldingMultitermQuery, DocValuesTest, DefaultValueUpdateProcessorTest, SortByFunctionTest, TestRemoteStreaming, TestSolrDeletionPolicy1, IndexBasedSpellCheckerTest, TestQueryUtils, PrimitiveFieldTypeTest, TestOmitPositions, TermsComponentTest, DocumentBuilderTest, TestIndexingPerformance, FieldAnalysisRequestHandlerTest, IndexSchemaRuntimeFieldTest, TestJmxIntegration, QueryParsingTest, TestPartialUpdateDeduplication, TestPHPSerializedResponseWriter, CSVRequestHandlerTest, TestComponentsName, TestBinaryResponseWriter, HighlighterConfigTest, SOLR749Test, TestQuerySenderListener, AlternateDirectoryTest, CopyFieldTest, SolrIndexConfigTest, TestMergePolicyConfig, TestDocSet, TestBinaryField, TestSearchPerf, MinimalSchemaTest, TestElisionMultitermQuery, TestConfig, ExternalFileFieldSortTest, TestPostingsSolrHighlighter, TestLuceneMatchVersion, TestPhraseSuggestions, SynonymTokenizerTest, EchoParamsTest, ResourceLoaderTest, URLClassifyProcessorTest, ChaosMonkeyNothingIsSafeTest]
   [junit4] Completed [426/579 (1!)] on J1 in 54.61s, 1 test, 1 failure <<< FAILURES!

[...truncated 491 lines...]
BUILD FAILED
/home/jenkins/workspace/Lucene-Solr-6.0-Linux/build.xml:740: The following error occurred while executing this line:
/home/jenkins/workspace/Lucene-Solr-6.0-Linux/build.xml:684: The following error occurred while executing this line:
/home/jenkins/workspace/Lucene-Solr-6.0-Linux/build.xml:59: The following error occurred while executing this line:
/home/jenkins/workspace/Lucene-Solr-6.0-Linux/solr/build.xml:233: The following error occurred while executing this line:
/home/jenkins/workspace/Lucene-Solr-6.0-Linux/solr/common-build.xml:527: The following error occurred while executing this line:
/home/jenkins/workspace/Lucene-Solr-6.0-Linux/lucene/common-build.xml:1457: The following error occurred while executing this line:
/home/jenkins/workspace/Lucene-Solr-6.0-Linux/lucene/common-build.xml:1014: There were test failures: 579 suites (10 ignored), 2309 tests, 1 failure, 114 ignored (70 assumptions) [seed: 89AB750D2C291D3D]

Total time: 59 minutes 52 seconds
Build step 'Invoke Ant' marked build as failure
Archiving artifacts
[WARNINGS] Skipping publisher since build result is FAILURE
Recording test results
Email was triggered for: Failure - Any
Sending email for trigger: Failure - Any



Mime
View raw message