lucene-dev mailing list archives

Site index · List index
Message view « Date » · « Thread »
Top « Date » · « Thread »
From Policeman Jenkins Server <jenk...@thetaphi.de>
Subject [JENKINS-EA] Lucene-Solr-master-Linux (32bit/jdk-9-ea+111-patched) - Build # 16398 - Failure!
Date Fri, 01 Apr 2016 04:10:28 GMT
Build: http://jenkins.thetaphi.de/job/Lucene-Solr-master-Linux/16398/
Java: 32bit/jdk-9-ea+111-patched -client -XX:+UseConcMarkSweepGC -XX:-CompactStrings

1 tests failed.
FAILED:  org.apache.solr.cloud.TestRandomRequestDistribution.test

Error Message:
Shard a1x2_shard1_replica1 received all 10 requests

Stack Trace:
java.lang.AssertionError: Shard a1x2_shard1_replica1 received all 10 requests
	at __randomizedtesting.SeedInfo.seed([5CEE40AF8B2480B9:D4BA7F7525D8ED41]:0)
	at org.junit.Assert.fail(Assert.java:93)
	at org.junit.Assert.assertTrue(Assert.java:43)
	at org.apache.solr.cloud.TestRandomRequestDistribution.testRequestTracking(TestRandomRequestDistribution.java:121)
	at org.apache.solr.cloud.TestRandomRequestDistribution.test(TestRandomRequestDistribution.java:65)
	at sun.reflect.NativeMethodAccessorImpl.invoke0(java.base@9-ea/Native Method)
	at sun.reflect.NativeMethodAccessorImpl.invoke(java.base@9-ea/NativeMethodAccessorImpl.java:62)
	at sun.reflect.DelegatingMethodAccessorImpl.invoke(java.base@9-ea/DelegatingMethodAccessorImpl.java:43)
	at java.lang.reflect.Method.invoke(java.base@9-ea/Method.java:531)
	at com.carrotsearch.randomizedtesting.RandomizedRunner.invoke(RandomizedRunner.java:1764)
	at com.carrotsearch.randomizedtesting.RandomizedRunner$8.evaluate(RandomizedRunner.java:871)
	at com.carrotsearch.randomizedtesting.RandomizedRunner$9.evaluate(RandomizedRunner.java:907)
	at com.carrotsearch.randomizedtesting.RandomizedRunner$10.evaluate(RandomizedRunner.java:921)
	at org.apache.solr.BaseDistributedSearchTestCase$ShardsRepeatRule$ShardsFixedStatement.callStatement(BaseDistributedSearchTestCase.java:992)
	at org.apache.solr.BaseDistributedSearchTestCase$ShardsRepeatRule$ShardsStatement.evaluate(BaseDistributedSearchTestCase.java:967)
	at com.carrotsearch.randomizedtesting.rules.SystemPropertiesRestoreRule$1.evaluate(SystemPropertiesRestoreRule.java:57)
	at org.apache.lucene.util.TestRuleSetupTeardownChained$1.evaluate(TestRuleSetupTeardownChained.java:49)
	at org.apache.lucene.util.AbstractBeforeAfterRule$1.evaluate(AbstractBeforeAfterRule.java:45)
	at org.apache.lucene.util.TestRuleThreadAndTestName$1.evaluate(TestRuleThreadAndTestName.java:48)
	at org.apache.lucene.util.TestRuleIgnoreAfterMaxFailures$1.evaluate(TestRuleIgnoreAfterMaxFailures.java:64)
	at org.apache.lucene.util.TestRuleMarkFailure$1.evaluate(TestRuleMarkFailure.java:47)
	at com.carrotsearch.randomizedtesting.rules.StatementAdapter.evaluate(StatementAdapter.java:36)
	at com.carrotsearch.randomizedtesting.ThreadLeakControl$StatementRunner.run(ThreadLeakControl.java:367)
	at com.carrotsearch.randomizedtesting.ThreadLeakControl.forkTimeoutingTask(ThreadLeakControl.java:809)
	at com.carrotsearch.randomizedtesting.ThreadLeakControl$3.evaluate(ThreadLeakControl.java:460)
	at com.carrotsearch.randomizedtesting.RandomizedRunner.runSingleTest(RandomizedRunner.java:880)
	at com.carrotsearch.randomizedtesting.RandomizedRunner$5.evaluate(RandomizedRunner.java:781)
	at com.carrotsearch.randomizedtesting.RandomizedRunner$6.evaluate(RandomizedRunner.java:816)
	at com.carrotsearch.randomizedtesting.RandomizedRunner$7.evaluate(RandomizedRunner.java:827)
	at com.carrotsearch.randomizedtesting.rules.StatementAdapter.evaluate(StatementAdapter.java:36)
	at com.carrotsearch.randomizedtesting.rules.SystemPropertiesRestoreRule$1.evaluate(SystemPropertiesRestoreRule.java:57)
	at org.apache.lucene.util.AbstractBeforeAfterRule$1.evaluate(AbstractBeforeAfterRule.java:45)
	at com.carrotsearch.randomizedtesting.rules.StatementAdapter.evaluate(StatementAdapter.java:36)
	at org.apache.lucene.util.TestRuleStoreClassName$1.evaluate(TestRuleStoreClassName.java:41)
	at com.carrotsearch.randomizedtesting.rules.NoShadowingOrOverridesOnMethodsRule$1.evaluate(NoShadowingOrOverridesOnMethodsRule.java:40)
	at com.carrotsearch.randomizedtesting.rules.NoShadowingOrOverridesOnMethodsRule$1.evaluate(NoShadowingOrOverridesOnMethodsRule.java:40)
	at com.carrotsearch.randomizedtesting.rules.StatementAdapter.evaluate(StatementAdapter.java:36)
	at com.carrotsearch.randomizedtesting.rules.StatementAdapter.evaluate(StatementAdapter.java:36)
	at com.carrotsearch.randomizedtesting.rules.StatementAdapter.evaluate(StatementAdapter.java:36)
	at org.apache.lucene.util.TestRuleAssertionsRequired$1.evaluate(TestRuleAssertionsRequired.java:53)
	at org.apache.lucene.util.TestRuleMarkFailure$1.evaluate(TestRuleMarkFailure.java:47)
	at org.apache.lucene.util.TestRuleIgnoreAfterMaxFailures$1.evaluate(TestRuleIgnoreAfterMaxFailures.java:64)
	at org.apache.lucene.util.TestRuleIgnoreTestSuites$1.evaluate(TestRuleIgnoreTestSuites.java:54)
	at com.carrotsearch.randomizedtesting.rules.StatementAdapter.evaluate(StatementAdapter.java:36)
	at com.carrotsearch.randomizedtesting.ThreadLeakControl$StatementRunner.run(ThreadLeakControl.java:367)
	at java.lang.Thread.run(java.base@9-ea/Thread.java:804)




Build Log:
[...truncated 12153 lines...]
   [junit4] Suite: org.apache.solr.cloud.TestRandomRequestDistribution
   [junit4]   2> Creating dataDir: /home/jenkins/workspace/Lucene-Solr-master-Linux/solr/build/solr-core/test/J1/temp/solr.cloud.TestRandomRequestDistribution_5CEE40AF8B2480B9-001/init-core-data-001
   [junit4]   2> 1884818 INFO  (SUITE-TestRandomRequestDistribution-seed#[5CEE40AF8B2480B9]-worker) [    ] o.a.s.BaseDistributedSearchTestCase Setting hostContext system property: /et_iwc/
   [junit4]   2> 1884820 INFO  (TEST-TestRandomRequestDistribution.test-seed#[5CEE40AF8B2480B9]) [    ] o.a.s.c.ZkTestServer STARTING ZK TEST SERVER
   [junit4]   2> 1884820 INFO  (Thread-4293) [    ] o.a.s.c.ZkTestServer client port:0.0.0.0/0.0.0.0:0
   [junit4]   2> 1884820 INFO  (Thread-4293) [    ] o.a.s.c.ZkTestServer Starting server
   [junit4]   2> 1884920 INFO  (TEST-TestRandomRequestDistribution.test-seed#[5CEE40AF8B2480B9]) [    ] o.a.s.c.ZkTestServer start zk server on port:42043
   [junit4]   2> 1884920 INFO  (TEST-TestRandomRequestDistribution.test-seed#[5CEE40AF8B2480B9]) [    ] o.a.s.c.c.SolrZkClient Using default ZkCredentialsProvider
   [junit4]   2> 1884921 INFO  (TEST-TestRandomRequestDistribution.test-seed#[5CEE40AF8B2480B9]) [    ] o.a.s.c.c.ConnectionManager Waiting for client to connect to ZooKeeper
   [junit4]   2> 1884922 INFO  (zkCallback-2424-thread-1) [    ] o.a.s.c.c.ConnectionManager Watcher org.apache.solr.common.cloud.ConnectionManager@11344f5 name:ZooKeeperConnection Watcher:127.0.0.1:42043 got event WatchedEvent state:SyncConnected type:None path:null path:null type:None
   [junit4]   2> 1884922 INFO  (TEST-TestRandomRequestDistribution.test-seed#[5CEE40AF8B2480B9]) [    ] o.a.s.c.c.ConnectionManager Client is connected to ZooKeeper
   [junit4]   2> 1884923 INFO  (TEST-TestRandomRequestDistribution.test-seed#[5CEE40AF8B2480B9]) [    ] o.a.s.c.c.SolrZkClient Using default ZkACLProvider
   [junit4]   2> 1884923 INFO  (TEST-TestRandomRequestDistribution.test-seed#[5CEE40AF8B2480B9]) [    ] o.a.s.c.c.SolrZkClient makePath: /solr
   [junit4]   2> 1884924 INFO  (TEST-TestRandomRequestDistribution.test-seed#[5CEE40AF8B2480B9]) [    ] o.a.s.c.c.SolrZkClient Using default ZkCredentialsProvider
   [junit4]   2> 1884924 INFO  (TEST-TestRandomRequestDistribution.test-seed#[5CEE40AF8B2480B9]) [    ] o.a.s.c.c.ConnectionManager Waiting for client to connect to ZooKeeper
   [junit4]   2> 1884925 INFO  (zkCallback-2425-thread-1) [    ] o.a.s.c.c.ConnectionManager Watcher org.apache.solr.common.cloud.ConnectionManager@b1753f name:ZooKeeperConnection Watcher:127.0.0.1:42043/solr got event WatchedEvent state:SyncConnected type:None path:null path:null type:None
   [junit4]   2> 1884925 INFO  (TEST-TestRandomRequestDistribution.test-seed#[5CEE40AF8B2480B9]) [    ] o.a.s.c.c.ConnectionManager Client is connected to ZooKeeper
   [junit4]   2> 1884925 INFO  (TEST-TestRandomRequestDistribution.test-seed#[5CEE40AF8B2480B9]) [    ] o.a.s.c.c.SolrZkClient Using default ZkACLProvider
   [junit4]   2> 1884925 INFO  (TEST-TestRandomRequestDistribution.test-seed#[5CEE40AF8B2480B9]) [    ] o.a.s.c.c.SolrZkClient makePath: /collections/collection1
   [junit4]   2> 1884926 INFO  (TEST-TestRandomRequestDistribution.test-seed#[5CEE40AF8B2480B9]) [    ] o.a.s.c.c.SolrZkClient makePath: /collections/collection1/shards
   [junit4]   2> 1884927 INFO  (TEST-TestRandomRequestDistribution.test-seed#[5CEE40AF8B2480B9]) [    ] o.a.s.c.c.SolrZkClient makePath: /collections/control_collection
   [junit4]   2> 1884927 INFO  (TEST-TestRandomRequestDistribution.test-seed#[5CEE40AF8B2480B9]) [    ] o.a.s.c.c.SolrZkClient makePath: /collections/control_collection/shards
   [junit4]   2> 1884928 INFO  (TEST-TestRandomRequestDistribution.test-seed#[5CEE40AF8B2480B9]) [    ] o.a.s.c.AbstractZkTestCase put /home/jenkins/workspace/Lucene-Solr-master-Linux/solr/core/src/test-files/solr/collection1/conf/solrconfig-tlog.xml to /configs/conf1/solrconfig.xml
   [junit4]   2> 1884928 INFO  (TEST-TestRandomRequestDistribution.test-seed#[5CEE40AF8B2480B9]) [    ] o.a.s.c.c.SolrZkClient makePath: /configs/conf1/solrconfig.xml
   [junit4]   2> 1884930 INFO  (TEST-TestRandomRequestDistribution.test-seed#[5CEE40AF8B2480B9]) [    ] o.a.s.c.AbstractZkTestCase put /home/jenkins/workspace/Lucene-Solr-master-Linux/solr/core/src/test-files/solr/collection1/conf/schema.xml to /configs/conf1/schema.xml
   [junit4]   2> 1884930 INFO  (TEST-TestRandomRequestDistribution.test-seed#[5CEE40AF8B2480B9]) [    ] o.a.s.c.c.SolrZkClient makePath: /configs/conf1/schema.xml
   [junit4]   2> 1884930 INFO  (TEST-TestRandomRequestDistribution.test-seed#[5CEE40AF8B2480B9]) [    ] o.a.s.c.AbstractZkTestCase put /home/jenkins/workspace/Lucene-Solr-master-Linux/solr/core/src/test-files/solr/collection1/conf/solrconfig.snippet.randomindexconfig.xml to /configs/conf1/solrconfig.snippet.randomindexconfig.xml
   [junit4]   2> 1884931 INFO  (TEST-TestRandomRequestDistribution.test-seed#[5CEE40AF8B2480B9]) [    ] o.a.s.c.c.SolrZkClient makePath: /configs/conf1/solrconfig.snippet.randomindexconfig.xml
   [junit4]   2> 1884931 INFO  (TEST-TestRandomRequestDistribution.test-seed#[5CEE40AF8B2480B9]) [    ] o.a.s.c.AbstractZkTestCase put /home/jenkins/workspace/Lucene-Solr-master-Linux/solr/core/src/test-files/solr/collection1/conf/stopwords.txt to /configs/conf1/stopwords.txt
   [junit4]   2> 1884932 INFO  (TEST-TestRandomRequestDistribution.test-seed#[5CEE40AF8B2480B9]) [    ] o.a.s.c.c.SolrZkClient makePath: /configs/conf1/stopwords.txt
   [junit4]   2> 1884932 INFO  (TEST-TestRandomRequestDistribution.test-seed#[5CEE40AF8B2480B9]) [    ] o.a.s.c.AbstractZkTestCase put /home/jenkins/workspace/Lucene-Solr-master-Linux/solr/core/src/test-files/solr/collection1/conf/protwords.txt to /configs/conf1/protwords.txt
   [junit4]   2> 1884932 INFO  (TEST-TestRandomRequestDistribution.test-seed#[5CEE40AF8B2480B9]) [    ] o.a.s.c.c.SolrZkClient makePath: /configs/conf1/protwords.txt
   [junit4]   2> 1884933 INFO  (TEST-TestRandomRequestDistribution.test-seed#[5CEE40AF8B2480B9]) [    ] o.a.s.c.AbstractZkTestCase put /home/jenkins/workspace/Lucene-Solr-master-Linux/solr/core/src/test-files/solr/collection1/conf/currency.xml to /configs/conf1/currency.xml
   [junit4]   2> 1884933 INFO  (TEST-TestRandomRequestDistribution.test-seed#[5CEE40AF8B2480B9]) [    ] o.a.s.c.c.SolrZkClient makePath: /configs/conf1/currency.xml
   [junit4]   2> 1884934 INFO  (TEST-TestRandomRequestDistribution.test-seed#[5CEE40AF8B2480B9]) [    ] o.a.s.c.AbstractZkTestCase put /home/jenkins/workspace/Lucene-Solr-master-Linux/solr/core/src/test-files/solr/collection1/conf/enumsConfig.xml to /configs/conf1/enumsConfig.xml
   [junit4]   2> 1884934 INFO  (TEST-TestRandomRequestDistribution.test-seed#[5CEE40AF8B2480B9]) [    ] o.a.s.c.c.SolrZkClient makePath: /configs/conf1/enumsConfig.xml
   [junit4]   2> 1884935 INFO  (TEST-TestRandomRequestDistribution.test-seed#[5CEE40AF8B2480B9]) [    ] o.a.s.c.AbstractZkTestCase put /home/jenkins/workspace/Lucene-Solr-master-Linux/solr/core/src/test-files/solr/collection1/conf/open-exchange-rates.json to /configs/conf1/open-exchange-rates.json
   [junit4]   2> 1884935 INFO  (TEST-TestRandomRequestDistribution.test-seed#[5CEE40AF8B2480B9]) [    ] o.a.s.c.c.SolrZkClient makePath: /configs/conf1/open-exchange-rates.json
   [junit4]   2> 1884935 INFO  (TEST-TestRandomRequestDistribution.test-seed#[5CEE40AF8B2480B9]) [    ] o.a.s.c.AbstractZkTestCase put /home/jenkins/workspace/Lucene-Solr-master-Linux/solr/core/src/test-files/solr/collection1/conf/mapping-ISOLatin1Accent.txt to /configs/conf1/mapping-ISOLatin1Accent.txt
   [junit4]   2> 1884936 INFO  (TEST-TestRandomRequestDistribution.test-seed#[5CEE40AF8B2480B9]) [    ] o.a.s.c.c.SolrZkClient makePath: /configs/conf1/mapping-ISOLatin1Accent.txt
   [junit4]   2> 1884936 INFO  (TEST-TestRandomRequestDistribution.test-seed#[5CEE40AF8B2480B9]) [    ] o.a.s.c.AbstractZkTestCase put /home/jenkins/workspace/Lucene-Solr-master-Linux/solr/core/src/test-files/solr/collection1/conf/old_synonyms.txt to /configs/conf1/old_synonyms.txt
   [junit4]   2> 1884936 INFO  (TEST-TestRandomRequestDistribution.test-seed#[5CEE40AF8B2480B9]) [    ] o.a.s.c.c.SolrZkClient makePath: /configs/conf1/old_synonyms.txt
   [junit4]   2> 1884937 INFO  (TEST-TestRandomRequestDistribution.test-seed#[5CEE40AF8B2480B9]) [    ] o.a.s.c.AbstractZkTestCase put /home/jenkins/workspace/Lucene-Solr-master-Linux/solr/core/src/test-files/solr/collection1/conf/synonyms.txt to /configs/conf1/synonyms.txt
   [junit4]   2> 1884938 INFO  (TEST-TestRandomRequestDistribution.test-seed#[5CEE40AF8B2480B9]) [    ] o.a.s.c.c.SolrZkClient makePath: /configs/conf1/synonyms.txt
   [junit4]   2> 1885010 INFO  (TEST-TestRandomRequestDistribution.test-seed#[5CEE40AF8B2480B9]) [    ] o.a.s.SolrTestCaseJ4 Writing core.properties file to /home/jenkins/workspace/Lucene-Solr-master-Linux/solr/build/solr-core/test/J1/temp/solr.cloud.TestRandomRequestDistribution_5CEE40AF8B2480B9-001/control-001/cores/collection1
   [junit4]   2> 1885011 INFO  (TEST-TestRandomRequestDistribution.test-seed#[5CEE40AF8B2480B9]) [    ] o.e.j.s.Server jetty-9.3.8.v20160314
   [junit4]   2> 1885012 INFO  (TEST-TestRandomRequestDistribution.test-seed#[5CEE40AF8B2480B9]) [    ] o.e.j.s.h.ContextHandler Started o.e.j.s.ServletContextHandler@1d45be1{/et_iwc,null,AVAILABLE}
   [junit4]   2> 1885015 INFO  (TEST-TestRandomRequestDistribution.test-seed#[5CEE40AF8B2480B9]) [    ] o.e.j.s.ServerConnector Started ServerConnector@eea036{HTTP/1.1,[http/1.1]}{127.0.0.1:37317}
   [junit4]   2> 1885015 INFO  (TEST-TestRandomRequestDistribution.test-seed#[5CEE40AF8B2480B9]) [    ] o.e.j.s.Server Started @1886412ms
   [junit4]   2> 1885015 INFO  (TEST-TestRandomRequestDistribution.test-seed#[5CEE40AF8B2480B9]) [    ] o.a.s.c.s.e.JettySolrRunner Jetty properties: {solr.data.dir=/home/jenkins/workspace/Lucene-Solr-master-Linux/solr/build/solr-core/test/J1/temp/solr.cloud.TestRandomRequestDistribution_5CEE40AF8B2480B9-001/tempDir-001/control/data, hostContext=/et_iwc, hostPort=37317, coreRootDirectory=/home/jenkins/workspace/Lucene-Solr-master-Linux/solr/build/solr-core/test/J1/../../../../../../../../../home/jenkins/workspace/Lucene-Solr-master-Linux/solr/build/solr-core/test/J1/temp/solr.cloud.TestRandomRequestDistribution_5CEE40AF8B2480B9-001/control-001/cores}
   [junit4]   2> 1885015 INFO  (TEST-TestRandomRequestDistribution.test-seed#[5CEE40AF8B2480B9]) [    ] o.a.s.s.SolrDispatchFilter SolrDispatchFilter.init(): jdk.internal.loader.ClassLoaders$AppClassLoader@c0663d
   [junit4]   2> 1885015 INFO  (TEST-TestRandomRequestDistribution.test-seed#[5CEE40AF8B2480B9]) [    ] o.a.s.c.SolrResourceLoader new SolrResourceLoader for directory: '/home/jenkins/workspace/Lucene-Solr-master-Linux/solr/build/solr-core/test/J1/temp/solr.cloud.TestRandomRequestDistribution_5CEE40AF8B2480B9-001/control-001'
   [junit4]   2> 1885015 INFO  (TEST-TestRandomRequestDistribution.test-seed#[5CEE40AF8B2480B9]) [    ] o.a.s.c.SolrResourceLoader JNDI not configured for solr (NoInitialContextEx)
   [junit4]   2> 1885016 INFO  (TEST-TestRandomRequestDistribution.test-seed#[5CEE40AF8B2480B9]) [    ] o.a.s.c.SolrResourceLoader solr home defaulted to 'solr/' (could not find system property or JNDI)
   [junit4]   2> 1885016 INFO  (TEST-TestRandomRequestDistribution.test-seed#[5CEE40AF8B2480B9]) [    ] o.a.s.c.c.SolrZkClient Using default ZkCredentialsProvider
   [junit4]   2> 1885016 INFO  (TEST-TestRandomRequestDistribution.test-seed#[5CEE40AF8B2480B9]) [    ] o.a.s.c.c.ConnectionManager Waiting for client to connect to ZooKeeper
   [junit4]   2> 1885017 INFO  (zkCallback-2426-thread-1) [    ] o.a.s.c.c.ConnectionManager Watcher org.apache.solr.common.cloud.ConnectionManager@efc90 name:ZooKeeperConnection Watcher:127.0.0.1:42043/solr got event WatchedEvent state:SyncConnected type:None path:null path:null type:None
   [junit4]   2> 1885017 INFO  (TEST-TestRandomRequestDistribution.test-seed#[5CEE40AF8B2480B9]) [    ] o.a.s.c.c.ConnectionManager Client is connected to ZooKeeper
   [junit4]   2> 1885017 INFO  (TEST-TestRandomRequestDistribution.test-seed#[5CEE40AF8B2480B9]) [    ] o.a.s.c.c.SolrZkClient Using default ZkACLProvider
   [junit4]   2> 1885018 INFO  (TEST-TestRandomRequestDistribution.test-seed#[5CEE40AF8B2480B9]) [    ] o.a.s.s.SolrDispatchFilter Loading solr.xml from SolrHome (not found in ZooKeeper)
   [junit4]   2> 1885018 INFO  (TEST-TestRandomRequestDistribution.test-seed#[5CEE40AF8B2480B9]) [    ] o.a.s.c.SolrXmlConfig Loading container configuration from /home/jenkins/workspace/Lucene-Solr-master-Linux/solr/build/solr-core/test/J1/temp/solr.cloud.TestRandomRequestDistribution_5CEE40AF8B2480B9-001/control-001/solr.xml
   [junit4]   2> 1885023 INFO  (TEST-TestRandomRequestDistribution.test-seed#[5CEE40AF8B2480B9]) [    ] o.a.s.c.CorePropertiesLocator Config-defined core root directory: /home/jenkins/workspace/Lucene-Solr-master-Linux/solr/build/solr-core/test/J1/../../../../../../../../../home/jenkins/workspace/Lucene-Solr-master-Linux/solr/build/solr-core/test/J1/temp/solr.cloud.TestRandomRequestDistribution_5CEE40AF8B2480B9-001/control-001/cores
   [junit4]   2> 1885023 INFO  (TEST-TestRandomRequestDistribution.test-seed#[5CEE40AF8B2480B9]) [    ] o.a.s.c.CoreContainer New CoreContainer 3406074
   [junit4]   2> 1885023 INFO  (TEST-TestRandomRequestDistribution.test-seed#[5CEE40AF8B2480B9]) [    ] o.a.s.c.CoreContainer Loading cores into CoreContainer [instanceDir=/home/jenkins/workspace/Lucene-Solr-master-Linux/solr/build/solr-core/test/J1/temp/solr.cloud.TestRandomRequestDistribution_5CEE40AF8B2480B9-001/control-001]
   [junit4]   2> 1885023 WARN  (TEST-TestRandomRequestDistribution.test-seed#[5CEE40AF8B2480B9]) [    ] o.a.s.c.CoreContainer Couldn't add files from /home/jenkins/workspace/Lucene-Solr-master-Linux/solr/build/solr-core/test/J1/temp/solr.cloud.TestRandomRequestDistribution_5CEE40AF8B2480B9-001/control-001/lib to classpath: /home/jenkins/workspace/Lucene-Solr-master-Linux/solr/build/solr-core/test/J1/temp/solr.cloud.TestRandomRequestDistribution_5CEE40AF8B2480B9-001/control-001/lib
   [junit4]   2> 1885023 INFO  (TEST-TestRandomRequestDistribution.test-seed#[5CEE40AF8B2480B9]) [    ] o.a.s.h.c.HttpShardHandlerFactory created with socketTimeout : 90000,urlScheme : ,connTimeout : 15000,maxConnectionsPerHost : 20,maxConnections : 10000,corePoolSize : 0,maximumPoolSize : 2147483647,maxThreadIdleTime : 5,sizeOfQueue : -1,fairnessPolicy : false,useRetries : false,
   [junit4]   2> 1885024 INFO  (TEST-TestRandomRequestDistribution.test-seed#[5CEE40AF8B2480B9]) [    ] o.a.s.u.UpdateShardHandler Creating UpdateShardHandler HTTP client with params: socketTimeout=340000&connTimeout=45000&retry=true
   [junit4]   2> 1885025 INFO  (TEST-TestRandomRequestDistribution.test-seed#[5CEE40AF8B2480B9]) [    ] o.a.s.l.LogWatcher SLF4J impl is org.slf4j.impl.Log4jLoggerFactory
   [junit4]   2> 1885025 INFO  (TEST-TestRandomRequestDistribution.test-seed#[5CEE40AF8B2480B9]) [    ] o.a.s.l.LogWatcher Registering Log Listener [Log4j (org.slf4j.impl.Log4jLoggerFactory)]
   [junit4]   2> 1885025 INFO  (TEST-TestRandomRequestDistribution.test-seed#[5CEE40AF8B2480B9]) [    ] o.a.s.c.ZkContainer Zookeeper client=127.0.0.1:42043/solr
   [junit4]   2> 1885025 INFO  (TEST-TestRandomRequestDistribution.test-seed#[5CEE40AF8B2480B9]) [    ] o.a.s.c.ZkController zkHost includes chroot
   [junit4]   2> 1885025 INFO  (TEST-TestRandomRequestDistribution.test-seed#[5CEE40AF8B2480B9]) [    ] o.a.s.c.c.SolrZkClient Using default ZkCredentialsProvider
   [junit4]   2> 1885025 INFO  (TEST-TestRandomRequestDistribution.test-seed#[5CEE40AF8B2480B9]) [    ] o.a.s.c.c.ConnectionManager Waiting for client to connect to ZooKeeper
   [junit4]   2> 1885026 INFO  (zkCallback-2429-thread-1) [    ] o.a.s.c.c.ConnectionManager Watcher org.apache.solr.common.cloud.ConnectionManager@ecff76 name:ZooKeeperConnection Watcher:127.0.0.1:42043 got event WatchedEvent state:SyncConnected type:None path:null path:null type:None
   [junit4]   2> 1885026 INFO  (TEST-TestRandomRequestDistribution.test-seed#[5CEE40AF8B2480B9]) [    ] o.a.s.c.c.ConnectionManager Client is connected to ZooKeeper
   [junit4]   2> 1885027 INFO  (TEST-TestRandomRequestDistribution.test-seed#[5CEE40AF8B2480B9]) [    ] o.a.s.c.c.SolrZkClient Using default ZkACLProvider
   [junit4]   2> 1885028 INFO  (TEST-TestRandomRequestDistribution.test-seed#[5CEE40AF8B2480B9]) [    ] o.a.s.c.c.ConnectionManager Waiting for client to connect to ZooKeeper
   [junit4]   2> 1885028 INFO  (zkCallback-2430-thread-1) [    ] o.a.s.c.c.ConnectionManager Watcher org.apache.solr.common.cloud.ConnectionManager@1136df9 name:ZooKeeperConnection Watcher:127.0.0.1:42043/solr got event WatchedEvent state:SyncConnected type:None path:null path:null type:None
   [junit4]   2> 1885028 INFO  (TEST-TestRandomRequestDistribution.test-seed#[5CEE40AF8B2480B9]) [    ] o.a.s.c.c.ConnectionManager Client is connected to ZooKeeper
   [junit4]   2> 1885029 INFO  (TEST-TestRandomRequestDistribution.test-seed#[5CEE40AF8B2480B9]) [    ] o.a.s.c.c.SolrZkClient makePath: /overseer/queue
   [junit4]   2> 1885030 INFO  (TEST-TestRandomRequestDistribution.test-seed#[5CEE40AF8B2480B9]) [    ] o.a.s.c.c.SolrZkClient makePath: /overseer/collection-queue-work
   [junit4]   2> 1885031 INFO  (TEST-TestRandomRequestDistribution.test-seed#[5CEE40AF8B2480B9]) [    ] o.a.s.c.c.SolrZkClient makePath: /overseer/collection-map-running
   [junit4]   2> 1885032 INFO  (TEST-TestRandomRequestDistribution.test-seed#[5CEE40AF8B2480B9]) [    ] o.a.s.c.c.SolrZkClient makePath: /overseer/collection-map-completed
   [junit4]   2> 1885033 INFO  (TEST-TestRandomRequestDistribution.test-seed#[5CEE40AF8B2480B9]) [    ] o.a.s.c.c.SolrZkClient makePath: /overseer/collection-map-failure
   [junit4]   2> 1885034 INFO  (TEST-TestRandomRequestDistribution.test-seed#[5CEE40AF8B2480B9]) [    ] o.a.s.c.c.SolrZkClient makePath: /live_nodes
   [junit4]   2> 1885035 INFO  (TEST-TestRandomRequestDistribution.test-seed#[5CEE40AF8B2480B9]) [    ] o.a.s.c.c.SolrZkClient makePath: /aliases.json
   [junit4]   2> 1885035 INFO  (TEST-TestRandomRequestDistribution.test-seed#[5CEE40AF8B2480B9]) [    ] o.a.s.c.c.SolrZkClient makePath: /clusterstate.json
   [junit4]   2> 1885036 INFO  (TEST-TestRandomRequestDistribution.test-seed#[5CEE40AF8B2480B9]) [    ] o.a.s.c.c.SolrZkClient makePath: /security.json
   [junit4]   2> 1885036 INFO  (TEST-TestRandomRequestDistribution.test-seed#[5CEE40AF8B2480B9]) [    ] o.a.s.c.c.ZkStateReader Updating cluster state from ZooKeeper... 
   [junit4]   2> 1885037 INFO  (TEST-TestRandomRequestDistribution.test-seed#[5CEE40AF8B2480B9]) [    ] o.a.s.c.c.ZkStateReader Updated live nodes from ZooKeeper... (0) -> (0)
   [junit4]   2> 1885038 INFO  (TEST-TestRandomRequestDistribution.test-seed#[5CEE40AF8B2480B9]) [    ] o.a.s.c.c.SolrZkClient makePath: /overseer_elect
   [junit4]   2> 1885039 INFO  (TEST-TestRandomRequestDistribution.test-seed#[5CEE40AF8B2480B9]) [    ] o.a.s.c.c.SolrZkClient makePath: /overseer_elect/election
   [junit4]   2> 1885039 INFO  (TEST-TestRandomRequestDistribution.test-seed#[5CEE40AF8B2480B9]) [    ] o.a.s.c.Overseer Overseer (id=null) closing
   [junit4]   2> 1885039 INFO  (TEST-TestRandomRequestDistribution.test-seed#[5CEE40AF8B2480B9]) [    ] o.a.s.c.LeaderElector Joined leadership election with path: /overseer_elect/election/95648708843798532-127.0.0.1:37317_et_iwc-n_0000000000
   [junit4]   2> 1885040 INFO  (TEST-TestRandomRequestDistribution.test-seed#[5CEE40AF8B2480B9]) [    ] o.a.s.c.OverseerElectionContext I am going to be the leader 127.0.0.1:37317_et_iwc
   [junit4]   2> 1885040 INFO  (TEST-TestRandomRequestDistribution.test-seed#[5CEE40AF8B2480B9]) [    ] o.a.s.c.c.SolrZkClient makePath: /overseer_elect/leader
   [junit4]   2> 1885040 INFO  (TEST-TestRandomRequestDistribution.test-seed#[5CEE40AF8B2480B9]) [    ] o.a.s.c.Overseer Overseer (id=95648708843798532-127.0.0.1:37317_et_iwc-n_0000000000) starting
   [junit4]   2> 1885041 INFO  (TEST-TestRandomRequestDistribution.test-seed#[5CEE40AF8B2480B9]) [    ] o.a.s.c.c.SolrZkClient makePath: /overseer/queue-work
   [junit4]   2> 1885043 INFO  (TEST-TestRandomRequestDistribution.test-seed#[5CEE40AF8B2480B9]) [    ] o.a.s.c.OverseerAutoReplicaFailoverThread Starting OverseerAutoReplicaFailoverThread autoReplicaFailoverWorkLoopDelay=10000 autoReplicaFailoverWaitAfterExpiration=30000 autoReplicaFailoverBadNodeExpiration=60000
   [junit4]   2> 1885044 INFO  (OverseerCollectionConfigSetProcessor-95648708843798532-127.0.0.1:37317_et_iwc-n_0000000000) [    ] o.a.s.c.OverseerTaskProcessor Process current queue of overseer operations
   [junit4]   2> 1885044 INFO  (OverseerStateUpdate-95648708843798532-127.0.0.1:37317_et_iwc-n_0000000000) [    ] o.a.s.c.Overseer Starting to work on the main queue
   [junit4]   2> 1885044 INFO  (TEST-TestRandomRequestDistribution.test-seed#[5CEE40AF8B2480B9]) [    ] o.a.s.c.ZkController Register node as live in ZooKeeper:/live_nodes/127.0.0.1:37317_et_iwc
   [junit4]   2> 1885045 INFO  (TEST-TestRandomRequestDistribution.test-seed#[5CEE40AF8B2480B9]) [    ] o.a.s.c.c.SolrZkClient makePath: /live_nodes/127.0.0.1:37317_et_iwc
   [junit4]   2> 1885046 INFO  (OverseerStateUpdate-95648708843798532-127.0.0.1:37317_et_iwc-n_0000000000) [    ] o.a.s.c.c.ZkStateReader Updated live nodes from ZooKeeper... (0) -> (0)
   [junit4]   2> 1885046 INFO  (zkCallback-2430-thread-1) [    ] o.a.s.c.c.ZkStateReader A live node change: [WatchedEvent state:SyncConnected type:NodeChildrenChanged path:/live_nodes], has occurred - updating... (live nodes size: [0])
   [junit4]   2> 1885046 INFO  (zkCallback-2430-thread-1) [    ] o.a.s.c.c.ZkStateReader Updated live nodes from ZooKeeper... (0) -> (1)
   [junit4]   2> 1885082 INFO  (TEST-TestRandomRequestDistribution.test-seed#[5CEE40AF8B2480B9]) [    ] o.a.s.c.CoreContainer Security conf doesn't exist. Skipping setup for authorization module.
   [junit4]   2> 1885082 INFO  (TEST-TestRandomRequestDistribution.test-seed#[5CEE40AF8B2480B9]) [    ] o.a.s.c.CoreContainer No authentication plugin used.
   [junit4]   2> 1885082 INFO  (TEST-TestRandomRequestDistribution.test-seed#[5CEE40AF8B2480B9]) [    ] o.a.s.c.CorePropertiesLocator Looking for core definitions underneath /home/jenkins/workspace/Lucene-Solr-master-Linux/solr/build/solr-core/test/J1/../../../../../../../../../home/jenkins/workspace/Lucene-Solr-master-Linux/solr/build/solr-core/test/J1/temp/solr.cloud.TestRandomRequestDistribution_5CEE40AF8B2480B9-001/control-001/cores
   [junit4]   2> 1885083 INFO  (TEST-TestRandomRequestDistribution.test-seed#[5CEE40AF8B2480B9]) [    ] o.a.s.c.CoreDescriptor Created CoreDescriptor: {name=collection1, config=solrconfig.xml, transient=false, schema=schema.xml, loadOnStartup=true, configSetProperties=configsetprops.json, collection=control_collection, coreNodeName=, dataDir=data/, shard=}
   [junit4]   2> 1885083 INFO  (TEST-TestRandomRequestDistribution.test-seed#[5CEE40AF8B2480B9]) [    ] o.a.s.c.CorePropertiesLocator Found core collection1 in /home/jenkins/workspace/Lucene-Solr-master-Linux/solr/build/solr-core/test/J1/../../../../../../../../../home/jenkins/workspace/Lucene-Solr-master-Linux/solr/build/solr-core/test/J1/temp/solr.cloud.TestRandomRequestDistribution_5CEE40AF8B2480B9-001/control-001/cores/collection1
   [junit4]   2> 1885083 INFO  (TEST-TestRandomRequestDistribution.test-seed#[5CEE40AF8B2480B9]) [    ] o.a.s.c.CorePropertiesLocator Found 1 core definitions
   [junit4]   2> 1885084 INFO  (TEST-TestRandomRequestDistribution.test-seed#[5CEE40AF8B2480B9]) [    ] o.a.s.s.SolrDispatchFilter user.dir=/home/jenkins/workspace/Lucene-Solr-master-Linux/solr/build/solr-core/test/J1
   [junit4]   2> 1885084 INFO  (TEST-TestRandomRequestDistribution.test-seed#[5CEE40AF8B2480B9]) [    ] o.a.s.s.SolrDispatchFilter SolrDispatchFilter.init() done
   [junit4]   2> 1885084 INFO  (coreLoadExecutor-6567-thread-1) [    ] o.a.s.c.ZkController publishing state=down
   [junit4]   2> 1885084 INFO  (coreLoadExecutor-6567-thread-1) [    ] o.a.s.c.ZkController numShards not found on descriptor - reading it from system property
   [junit4]   2> 1885085 INFO  (OverseerStateUpdate-95648708843798532-127.0.0.1:37317_et_iwc-n_0000000000) [    ] o.a.s.c.Overseer processMessage: queueSize: 1, message = {
   [junit4]   2>   "core":"collection1",
   [junit4]   2>   "roles":null,
   [junit4]   2>   "base_url":"http://127.0.0.1:37317/et_iwc",
   [junit4]   2>   "node_name":"127.0.0.1:37317_et_iwc",
   [junit4]   2>   "numShards":"1",
   [junit4]   2>   "state":"down",
   [junit4]   2>   "shard":null,
   [junit4]   2>   "collection":"control_collection",
   [junit4]   2>   "operation":"state"} current state version: 0
   [junit4]   2> 1885085 INFO  (coreLoadExecutor-6567-thread-1) [    ] o.a.s.c.ZkController look for our core node name
   [junit4]   2> 1885086 INFO  (OverseerStateUpdate-95648708843798532-127.0.0.1:37317_et_iwc-n_0000000000) [    ] o.a.s.c.o.ReplicaMutator Update state numShards=1 message={
   [junit4]   2>   "core":"collection1",
   [junit4]   2>   "roles":null,
   [junit4]   2>   "base_url":"http://127.0.0.1:37317/et_iwc",
   [junit4]   2>   "node_name":"127.0.0.1:37317_et_iwc",
   [junit4]   2>   "numShards":"1",
   [junit4]   2>   "state":"down",
   [junit4]   2>   "shard":null,
   [junit4]   2>   "collection":"control_collection",
   [junit4]   2>   "operation":"state"}
   [junit4]   2> 1885086 INFO  (OverseerStateUpdate-95648708843798532-127.0.0.1:37317_et_iwc-n_0000000000) [    ] o.a.s.c.o.ClusterStateMutator building a new cName: control_collection
   [junit4]   2> 1885086 INFO  (OverseerStateUpdate-95648708843798532-127.0.0.1:37317_et_iwc-n_0000000000) [    ] o.a.s.c.o.ReplicaMutator Assigning new node to shard shard=shard1
   [junit4]   2> 1885087 INFO  (zkCallback-2430-thread-1) [    ] o.a.s.c.c.ZkStateReader A cluster state change: [WatchedEvent state:SyncConnected type:NodeDataChanged path:/clusterstate.json], has occurred - updating... (live nodes size: [1])
   [junit4]   2> 1886086 INFO  (coreLoadExecutor-6567-thread-1) [    ] o.a.s.c.ZkController waiting to find shard id in clusterstate for collection1
   [junit4]   2> 1886086 INFO  (coreLoadExecutor-6567-thread-1) [    ] o.a.s.c.ZkController Check for collection zkNode:control_collection
   [junit4]   2> 1886086 INFO  (coreLoadExecutor-6567-thread-1) [    ] o.a.s.c.ZkController Collection zkNode exists
   [junit4]   2> 1886086 INFO  (coreLoadExecutor-6567-thread-1) [    ] o.a.s.c.c.ZkStateReader Load collection config from: [/collections/control_collection]
   [junit4]   2> 1886087 INFO  (coreLoadExecutor-6567-thread-1) [    ] o.a.s.c.c.ZkStateReader path=[/collections/control_collection] [configName]=[conf1] specified config exists in ZooKeeper
   [junit4]   2> 1886087 INFO  (coreLoadExecutor-6567-thread-1) [    ] o.a.s.c.SolrResourceLoader new SolrResourceLoader for directory: '/home/jenkins/workspace/Lucene-Solr-master-Linux/solr/build/solr-core/test/J1/temp/solr.cloud.TestRandomRequestDistribution_5CEE40AF8B2480B9-001/control-001/cores/collection1'
   [junit4]   2> 1886087 INFO  (coreLoadExecutor-6567-thread-1) [    ] o.a.s.c.SolrResourceLoader JNDI not configured for solr (NoInitialContextEx)
   [junit4]   2> 1886087 INFO  (coreLoadExecutor-6567-thread-1) [    ] o.a.s.c.SolrResourceLoader solr home defaulted to 'solr/' (could not find system property or JNDI)
   [junit4]   2> 1886088 INFO  (coreLoadExecutor-6567-thread-1) [    ] o.a.s.c.Config loaded config solrconfig.xml with version 0 
   [junit4]   2> 1886092 INFO  (coreLoadExecutor-6567-thread-1) [    ] o.a.s.c.SolrConfig current version of requestparams : -1
   [junit4]   2> 1886095 WARN  (coreLoadExecutor-6567-thread-1) [    ] o.a.s.c.Config Beginning with Solr 5.5, <mergePolicy> is deprecated, use <mergePolicyFactory> instead.
   [junit4]   2> 1886103 INFO  (coreLoadExecutor-6567-thread-1) [    ] o.a.s.c.SolrConfig Using Lucene MatchVersion: 7.0.0
   [junit4]   2> 1886110 INFO  (coreLoadExecutor-6567-thread-1) [    ] o.a.s.c.SolrConfig Loaded SolrConfig: solrconfig.xml
   [junit4]   2> 1886116 INFO  (coreLoadExecutor-6567-thread-1) [    ] o.a.s.s.IndexSchema [collection1] Schema name=test
   [junit4]   2> 1886196 INFO  (coreLoadExecutor-6567-thread-1) [    ] o.a.s.s.OpenExchangeRatesOrgProvider Initialized with rates=open-exchange-rates.json, refreshInterval=1440.
   [junit4]   2> 1886202 INFO  (coreLoadExecutor-6567-thread-1) [    ] o.a.s.s.IndexSchema default search field in schema is text
   [junit4]   2> 1886203 INFO  (coreLoadExecutor-6567-thread-1) [    ] o.a.s.s.IndexSchema unique key field: id
   [junit4]   2> 1886209 INFO  (coreLoadExecutor-6567-thread-1) [    ] o.a.s.s.FileExchangeRateProvider Reloading exchange rates from file currency.xml
   [junit4]   2> 1886211 INFO  (coreLoadExecutor-6567-thread-1) [    ] o.a.s.s.FileExchangeRateProvider Reloading exchange rates from file currency.xml
   [junit4]   2> 1886213 INFO  (coreLoadExecutor-6567-thread-1) [    ] o.a.s.s.OpenExchangeRatesOrgProvider Reloading exchange rates from open-exchange-rates.json
   [junit4]   2> 1886214 INFO  (coreLoadExecutor-6567-thread-1) [    ] o.a.s.s.OpenExchangeRatesOrgProvider Reloading exchange rates from open-exchange-rates.json
   [junit4]   2> 1886215 INFO  (coreLoadExecutor-6567-thread-1) [    ] o.a.s.c.ConfigSetProperties Did not find ConfigSet properties, assuming default properties: Can't find resource 'configsetprops.json' in classpath or '/configs/conf1', cwd=/home/jenkins/workspace/Lucene-Solr-master-Linux/solr/build/solr-core/test/J1
   [junit4]   2> 1886215 INFO  (coreLoadExecutor-6567-thread-1) [    ] o.a.s.c.CoreContainer Creating SolrCore 'collection1' using configuration from collection control_collection
   [junit4]   2> 1886215 INFO  (coreLoadExecutor-6567-thread-1) [    ] o.a.s.c.SolrCore org.apache.solr.core.MockDirectoryFactory
   [junit4]   2> 1886215 INFO  (coreLoadExecutor-6567-thread-1) [    ] o.a.s.c.SolrCore [[collection1] ] Opening new SolrCore at [/home/jenkins/workspace/Lucene-Solr-master-Linux/solr/build/solr-core/test/J1/temp/solr.cloud.TestRandomRequestDistribution_5CEE40AF8B2480B9-001/control-001/cores/collection1], dataDir=[/home/jenkins/workspace/Lucene-Solr-master-Linux/solr/build/solr-core/test/J1/../../../../../../../../../home/jenkins/workspace/Lucene-Solr-master-Linux/solr/build/solr-core/test/J1/temp/solr.cloud.TestRandomRequestDistribution_5CEE40AF8B2480B9-001/control-001/cores/collection1/data/]
   [junit4]   2> 1886215 INFO  (coreLoadExecutor-6567-thread-1) [    ] o.a.s.c.JmxMonitoredMap JMX monitoring is enabled. Adding Solr mbeans to JMX Server: com.sun.jmx.mbeanserver.JmxMBeanServer@106d8b2
   [junit4]   2> 1886216 INFO  (coreLoadExecutor-6567-thread-1) [    ] o.a.s.c.CachingDirectoryFactory return new directory for /home/jenkins/workspace/Lucene-Solr-master-Linux/solr/build/solr-core/test/J1/../../../../../../../../../home/jenkins/workspace/Lucene-Solr-master-Linux/solr/build/solr-core/test/J1/temp/solr.cloud.TestRandomRequestDistribution_5CEE40AF8B2480B9-001/control-001/cores/collection1/data
   [junit4]   2> 1886216 INFO  (coreLoadExecutor-6567-thread-1) [    ] o.a.s.c.SolrCore New index directory detected: old=null new=/home/jenkins/workspace/Lucene-Solr-master-Linux/solr/build/solr-core/test/J1/../../../../../../../../../home/jenkins/workspace/Lucene-Solr-master-Linux/solr/build/solr-core/test/J1/temp/solr.cloud.TestRandomRequestDistribution_5CEE40AF8B2480B9-001/control-001/cores/collection1/data/index/
   [junit4]   2> 1886216 WARN  (coreLoadExecutor-6567-thread-1) [    ] o.a.s.c.SolrCore [collection1] Solr index directory '/home/jenkins/workspace/Lucene-Solr-master-Linux/solr/build/solr-core/test/J1/../../../../../../../../../home/jenkins/workspace/Lucene-Solr-master-Linux/solr/build/solr-core/test/J1/temp/solr.cloud.TestRandomRequestDistribution_5CEE40AF8B2480B9-001/control-001/cores/collection1/data/index' doesn't exist. Creating new index...
   [junit4]   2> 1886217 INFO  (coreLoadExecutor-6567-thread-1) [    ] o.a.s.c.CachingDirectoryFactory return new directory for /home/jenkins/workspace/Lucene-Solr-master-Linux/solr/build/solr-core/test/J1/../../../../../../../../../home/jenkins/workspace/Lucene-Solr-master-Linux/solr/build/solr-core/test/J1/temp/solr.cloud.TestRandomRequestDistribution_5CEE40AF8B2480B9-001/control-001/cores/collection1/data/index
   [junit4]   2> 1886217 INFO  (coreLoadExecutor-6567-thread-1) [    ] o.a.s.u.RandomMergePolicy RandomMergePolicy wrapping class org.apache.lucene.index.TieredMergePolicy: [TieredMergePolicy: maxMergeAtOnce=11, maxMergeAtOnceExplicit=25, maxMergedSegmentMB=36.7861328125, floorSegmentMB=1.1630859375, forceMergeDeletesPctAllowed=21.167663473632842, segmentsPerTier=19.0, maxCFSSegmentSizeMB=8.796093022207999E12, noCFSRatio=0.5974339977055007
   [junit4]   2> 1886217 INFO  (coreLoadExecutor-6567-thread-1) [    ] o.a.s.c.SolrDeletionPolicy SolrDeletionPolicy.onCommit: commits: num=1
   [junit4]   2> 	commit{dir=MockDirectoryWrapper(RAMDirectory@1f3ec6e lockFactory=org.apache.lucene.store.SingleInstanceLockFactory@15ab449),segFN=segments_1,generation=1}
   [junit4]   2> 1886217 INFO  (coreLoadExecutor-6567-thread-1) [    ] o.a.s.c.SolrDeletionPolicy newest commit generation = 1
   [junit4]   2> 1886218 INFO  (OldIndexDirectoryCleanupThreadForCore-collection1) [    ] o.a.s.c.SolrCore Looking for old index directories to cleanup for core collection1 in /home/jenkins/workspace/Lucene-Solr-master-Linux/solr/build/solr-core/test/J1/../../../../../../../../../home/jenkins/workspace/Lucene-Solr-master-Linux/solr/build/solr-core/test/J1/temp/solr.cloud.TestRandomRequestDistribution_5CEE40AF8B2480B9-001/control-001/cores/collection1/data/
   [junit4]   2> 1886218 WARN  (OldIndexDirectoryCleanupThreadForCore-collection1) [    ] o.a.s.c.DirectoryFactory /home/jenkins/workspace/Lucene-Solr-master-Linux/solr/build/solr-core/test/J1/../../../../../../../../../home/jenkins/workspace/Lucene-Solr-master-Linux/solr/build/solr-core/test/J1/temp/solr.cloud.TestRandomRequestDistribution_5CEE40AF8B2480B9-001/control-001/cores/collection1/data/ does not point to a valid data directory; skipping clean-up of old index directories.
   [junit4]   2> 1886220 INFO  (coreLoadExecutor-6567-thread-1) [    ] o.a.s.u.p.UpdateRequestProcessorChain creating updateRequestProcessorChain "nodistrib"
   [junit4]   2> 1886220 INFO  (coreLoadExecutor-6567-thread-1) [    ] o.a.s.u.p.UpdateRequestProcessorChain creating updateRequestProcessorChain "dedupe"
   [junit4]   2> 1886220 INFO  (coreLoadExecutor-6567-thread-1) [    ] o.a.s.u.p.UpdateRequestProcessorChain inserting DistributedUpdateProcessorFactory into updateRequestProcessorChain "dedupe"
   [junit4]   2> 1886220 INFO  (coreLoadExecutor-6567-thread-1) [    ] o.a.s.u.p.UpdateRequestProcessorChain creating updateRequestProcessorChain "stored_sig"
   [junit4]   2> 1886220 INFO  (coreLoadExecutor-6567-thread-1) [    ] o.a.s.u.p.UpdateRequestProcessorChain inserting DistributedUpdateProcessorFactory into updateRequestProcessorChain "stored_sig"
   [junit4]   2> 1886220 INFO  (coreLoadExecutor-6567-thread-1) [    ] o.a.s.u.p.UpdateRequestProcessorChain creating updateRequestProcessorChain "distrib-dup-test-chain-explicit"
   [junit4]   2> 1886220 INFO  (coreLoadExecutor-6567-thread-1) [    ] o.a.s.u.p.UpdateRequestProcessorChain creating updateRequestProcessorChain "distrib-dup-test-chain-implicit"
   [junit4]   2> 1886221 INFO  (coreLoadExecutor-6567-thread-1) [    ] o.a.s.u.p.UpdateRequestProcessorChain inserting DistributedUpdateProcessorFactory into updateRequestProcessorChain "distrib-dup-test-chain-implicit"
   [junit4]   2> 1886221 INFO  (coreLoadExecutor-6567-thread-1) [    ] o.a.s.c.SolrCore no updateRequestProcessorChain defined as default, creating implicit default
   [junit4]   2> 1886221 WARN  (coreLoadExecutor-6567-thread-1) [    ] o.a.s.c.RequestHandlers INVALID paramSet a in requestHandler {type = requestHandler,name = /dump,class = DumpRequestHandler,args = {defaults={a=A,b=B}}}
   [junit4]   2> 1886223 INFO  (coreLoadExecutor-6567-thread-1) [    ] o.a.s.h.l.XMLLoader xsltCacheLifetimeSeconds=60
   [junit4]   2> 1886224 INFO  (coreLoadExecutor-6567-thread-1) [    ] o.a.s.h.l.XMLLoader xsltCacheLifetimeSeconds=60
   [junit4]   2> 1886225 INFO  (coreLoadExecutor-6567-thread-1) [    ] o.a.s.h.l.XMLLoader xsltCacheLifetimeSeconds=60
   [junit4]   2> 1886226 INFO  (coreLoadExecutor-6567-thread-1) [    ] o.a.s.h.l.XMLLoader xsltCacheLifetimeSeconds=60
   [junit4]   2> 1886231 INFO  (coreLoadExecutor-6567-thread-1) [    ] o.a.s.c.RequestHandlers Registered paths: /admin/mbeans,standard,/dump,/update/csv,/sql,/update/json/docs,/admin/luke,/export,/admin/segments,/get,/admin/system,/replication,/admin/properties,/config,/stream,/schema,/admin/plugins,/admin/logging,/update/json,/admin/ping,/admin/threads,/update,/admin/file
   [junit4]   2> 1886232 INFO  (coreLoadExecutor-6567-thread-1) [    ] o.a.s.c.SolrCore Using default statsCache cache: org.apache.solr.search.stats.LocalStatsCache
   [junit4]   2> 1886232 INFO  (coreLoadExecutor-6567-thread-1) [    ] o.a.s.u.UpdateHandler Using UpdateLog implementation: org.apache.solr.update.UpdateLog
   [junit4]   2> 1886232 INFO  (coreLoadExecutor-6567-thread-1) [    ] o.a.s.u.UpdateLog Initializing UpdateLog: dataDir= defaultSyncLevel=FLUSH numRecordsToKeep=100 maxNumLogsToKeep=10 numVersionBuckets=65536
   [junit4]   2> 1886233 INFO  (coreLoadExecutor-6567-thread-1) [    ] o.a.s.u.CommitTracker Hard AutoCommit: disabled
   [junit4]   2> 1886233 INFO  (coreLoadExecutor-6567-thread-1) [    ] o.a.s.u.CommitTracker Soft AutoCommit: disabled
   [junit4]   2> 1886234 INFO  (coreLoadExecutor-6567-thread-1) [    ] o.a.s.u.RandomMergePolicy RandomMergePolicy wrapping class org.apache.lucene.index.LogDocMergePolicy: [LogDocMergePolicy: minMergeSize=1000, mergeFactor=36, maxMergeSize=9223372036854775807, maxMergeSizeForForcedMerge=9223372036854775807, calibrateSizeByDeletes=true, maxMergeDocs=2147483647, maxCFSSegmentSizeMB=8.796093022207999E12, noCFSRatio=1.0]
   [junit4]   2> 1886234 INFO  (coreLoadExecutor-6567-thread-1) [    ] o.a.s.c.SolrDeletionPolicy SolrDeletionPolicy.onInit: commits: num=1
   [junit4]   2> 	commit{dir=MockDirectoryWrapper(RAMDirectory@1f3ec6e lockFactory=org.apache.lucene.store.SingleInstanceLockFactory@15ab449),segFN=segments_1,generation=1}
   [junit4]   2> 1886234 INFO  (coreLoadExecutor-6567-thread-1) [    ] o.a.s.c.SolrDeletionPolicy newest commit generation = 1
   [junit4]   2> 1886234 INFO  (coreLoadExecutor-6567-thread-1) [    ] o.a.s.s.SolrIndexSearcher Opening [Searcher@142565b[collection1] main]
   [junit4]   2> 1886234 INFO  (coreLoadExecutor-6567-thread-1) [    ] o.a.s.c.c.ZkStateReader Load collection config from: [/collections/control_collection]
   [junit4]   2> 1886235 INFO  (coreLoadExecutor-6567-thread-1) [    ] o.a.s.c.c.ZkStateReader path=[/collections/control_collection] [configName]=[conf1] specified config exists in ZooKeeper
   [junit4]   2> 1886235 INFO  (coreLoadExecutor-6567-thread-1) [    ] o.a.s.r.ManagedResourceStorage Setting up ZooKeeper-based storage for the RestManager with znodeBase: /configs/conf1
   [junit4]   2> 1886235 INFO  (coreLoadExecutor-6567-thread-1) [    ] o.a.s.r.ManagedResourceStorage Configured ZooKeeperStorageIO with znodeBase: /configs/conf1
   [junit4]   2> 1886235 INFO  (coreLoadExecutor-6567-thread-1) [    ] o.a.s.r.RestManager Initializing RestManager with initArgs: {}
   [junit4]   2> 1886235 INFO  (coreLoadExecutor-6567-thread-1) [    ] o.a.s.r.ManagedResourceStorage Reading _rest_managed.json using ZooKeeperStorageIO:path=/configs/conf1
   [junit4]   2> 1886236 INFO  (coreLoadExecutor-6567-thread-1) [    ] o.a.s.r.ManagedResourceStorage No data found for znode /configs/conf1/_rest_managed.json
   [junit4]   2> 1886236 INFO  (coreLoadExecutor-6567-thread-1) [    ] o.a.s.r.ManagedResourceStorage Loaded null at path _rest_managed.json using ZooKeeperStorageIO:path=/configs/conf1
   [junit4]   2> 1886236 INFO  (coreLoadExecutor-6567-thread-1) [    ] o.a.s.r.RestManager Initializing 0 registered ManagedResources
   [junit4]   2> 1886236 INFO  (coreLoadExecutor-6567-thread-1) [    ] o.a.s.h.ReplicationHandler Commits will be reserved for  10000
   [junit4]   2> 1886237 INFO  (searcherExecutor-6568-thread-1) [    ] o.a.s.c.SolrCore [collection1] Registered new searcher Searcher@142565b[collection1] main{ExitableDirectoryReader(UninvertingDirectoryReader())}
   [junit4]   2> 1886238 INFO  (coreLoadExecutor-6567-thread-1) [    ] o.a.s.u.UpdateLog Looking up max value of version field to seed version buckets
   [junit4]   2> 1886238 INFO  (coreLoadExecutor-6567-thread-1) [    ] o.a.s.u.VersionInfo Refreshing highest value of _version_ for 65536 version buckets from index
   [junit4]   2> 1886238 INFO  (coreLoadExecutor-6567-thread-1) [    ] o.a.s.u.VersionInfo No terms found for _version_, cannot seed version bucket highest value from index
   [junit4]   2> 1886238 INFO  (coreLoadExecutor-6567-thread-1) [    ] o.a.s.u.UpdateLog Could not find max version in index or recent updates, using new clock 1530379342986608640
   [junit4]   2> 1886239 INFO  (coreLoadExecutor-6567-thread-1) [    ] o.a.s.u.UpdateLog Took 1.0ms to seed version buckets with highest version 1530379342986608640
   [junit4]   2> 1886239 INFO  (coreLoadExecutor-6567-thread-1) [    ] o.a.s.c.ZkController watch zkdir /configs/conf1
   [junit4]   2> 1886240 INFO  (coreLoadExecutor-6567-thread-1) [    ] o.a.s.c.CoreContainer registering core: collection1
   [junit4]   2> 1886240 INFO  (coreZkRegister-6561-thread-1) [    ] o.a.s.c.ZkController Register replica - core:collection1 address:http://127.0.0.1:37317/et_iwc collection:control_collection shard:shard1
   [junit4]   2> 1886241 INFO  (coreZkRegister-6561-thread-1) [    ] o.a.s.c.c.SolrZkClient makePath: /collections/control_collection/leader_elect/shard1/election
   [junit4]   2> 1886242 INFO  (coreZkRegister-6561-thread-1) [    ] o.a.s.c.LeaderElector Joined leadership election with path: /collections/control_collection/leader_elect/shard1/election/95648708843798532-core_node1-n_0000000000
   [junit4]   2> 1886242 INFO  (coreZkRegister-6561-thread-1) [    ] o.a.s.c.ShardLeaderElectionContext Running the leader process for shard=shard1 and weAreReplacement=false and leaderVoteWait=10000
   [junit4]   2> 1886243 INFO  (coreZkRegister-6561-thread-1) [    ] o.a.s.c.ShardLeaderElectionContext Enough replicas found to continue.
   [junit4]   2> 1886243 INFO  (coreZkRegister-6561-thread-1) [    ] o.a.s.c.ShardLeaderElectionContext I may be the new leader - try and sync
   [junit4]   2> 1886243 INFO  (coreZkRegister-6561-thread-1) [    ] o.a.s.c.SyncStrategy Sync replicas to http://127.0.0.1:37317/et_iwc/collection1/
   [junit4]   2> 1886243 INFO  (coreZkRegister-6561-thread-1) [    ] o.a.s.c.SyncStrategy Sync Success - now sync replicas to me
   [junit4]   2> 1886243 INFO  (OverseerStateUpdate-95648708843798532-127.0.0.1:37317_et_iwc-n_0000000000) [    ] o.a.s.c.Overseer processMessage: queueSize: 1, message = {
   [junit4]   2>   "operation":"leader",
   [junit4]   2>   "shard":"shard1",
   [junit4]   2>   "collection":"control_collection"} current state version: 1
   [junit4]   2> 1886243 INFO  (coreZkRegister-6561-thread-1) [    ] o.a.s.c.SyncStrategy http://127.0.0.1:37317/et_iwc/collection1/ has no replicas
   [junit4]   2> 1886244 INFO  (coreZkRegister-6561-thread-1) [    ] o.a.s.c.c.SolrZkClient makePath: /collections/control_collection/leaders/shard1
   [junit4]   2> 1886245 INFO  (coreZkRegister-6561-thread-1) [    ] o.a.s.c.ShardLeaderElectionContextBase Creating leader registration node /collections/control_collection/leaders/shard1/leader after winning as /collections/control_collection/leader_elect/shard1/election/95648708843798532-core_node1-n_0000000000
   [junit4]   2> 1886246 INFO  (coreZkRegister-6561-thread-1) [    ] o.a.s.c.ShardLeaderElectionContext I am the new leader: http://127.0.0.1:37317/et_iwc/collection1/ shard1
   [junit4]   2> 1886246 INFO  (OverseerStateUpdate-95648708843798532-127.0.0.1:37317_et_iwc-n_0000000000) [    ] o.a.s.c.Overseer processMessage: queueSize: 1, message = {
   [junit4]   2>   "operation":"leader",
   [junit4]   2>   "shard":"shard1",
   [junit4]   2>   "collection":"control_collection",
   [junit4]   2>   "base_url":"http://127.0.0.1:37317/et_iwc",
   [junit4]   2>   "core":"collection1",
   [junit4]   2>   "state":"active"} current state version: 1
   [junit4]   2> 1886348 INFO  (zkCallback-2430-thread-1) [    ] o.a.s.c.c.ZkStateReader A cluster state change: [WatchedEvent state:SyncConnected type:NodeDataChanged path:/clusterstate.json], has occurred - updating... (live nodes size: [1])
   [junit4]   2> 1886397 INFO  (coreZkRegister-6561-thread-1) [    ] o.a.s.c.ZkController We are http://127.0.0.1:37317/et_iwc/collection1/ and leader is http://127.0.0.1:37317/et_iwc/collection1/
   [junit4]   2> 1886397 INFO  (coreZkRegister-6561-thread-1) [    ] o.a.s.c.ZkController No LogReplay needed for core=collection1 baseURL=http://127.0.0.1:37317/et_iwc
   [junit4]   2> 1886397 INFO  (coreZkRegister-6561-thread-1) [    ] o.a.s.c.ZkController I am the leader, no recovery necessary
   [junit4]   2> 1886397 INFO  (coreZkRegister-6561-thread-1) [    ] o.a.s.c.ZkController publishing state=active
   [junit4]   2> 1886397 INFO  (coreZkRegister-6561-thread-1) [    ] o.a.s.c.ZkController numShards not found on descriptor - reading it from system property
   [junit4]   2> 1886398 INFO  (OverseerStateUpdate-95648708843798532-127.0.0.1:37317_et_iwc-n_0000000000) [    ] o.a.s.c.Overseer processMessage: queueSize: 1, message = {
   [junit4]   2>   "core":"collection1",
   [junit4]   2>   "core_node_name":"core_node1",
   [junit4]   2>   "roles":null,
   [junit4]   2>   "base_url":"http://127.0.0.1:37317/et_iwc",
   [junit4]   2>   "node_name":"127.0.0.1:37317_et_iwc",
   [junit4]   2>   "numShards":"1",
   [junit4]   2>   "state":"active",
   [junit4]   2>   "shard":"shard1",
   [junit4]   2>   "collection":"control_collection",
   [junit4]   2>   "operation":"state"} current state version: 2
   [junit4]   2> 1886399 INFO  (OverseerStateUpdate-95648708843798532-127.0.0.1:37317_et_iwc-n_0000000000) [    ] o.a.s.c.o.ReplicaMutator Update state numShards=1 message={
   [junit4]   2>   "core":"collection1",
   [junit4]   2>   "core_node_name":"core_node1",
   [junit4]   2>   "roles":null,
   [junit4]   2>   "base_url":"http://127.0.0.1:37317/et_iwc",
   [junit4]   2>   "node_name":"127.0.0.1:37317_et_iwc",
   [junit4]   2>   "numShards":"1",
   [junit4]   2>   "state":"active",
   [junit4]   2>   "shard":"shard1",
   [junit4]   2>   "collection":"control_collection",
   [junit4]   2>   "operation":"state"}
   [junit4]   2> 1886500 INFO  (zkCallback-2430-thread-1) [    ] o.a.s.c.c.ZkStateReader A cluster state change: [WatchedEvent state:SyncConnected type:NodeDataChanged path:/clusterstate.json], has occurred - updating... (live nodes size: [1])
   [junit4]   2> 1886586 INFO  (TEST-TestRandomRequestDistribution.test-seed#[5CEE40AF8B2480B9]) [    ] o.a.s.c.c.SolrZkClient Using default ZkCredentialsProvider
   [junit4]   2> 1886586 INFO  (TEST-TestRandomRequestDistribution.test-seed#[5CEE40AF8B2480B9]) [    ] o.a.s.c.c.ConnectionManager Waiting for client to connect to ZooKeeper
   [junit4]   2> 1886587 INFO  (zkCallback-2432-thread-1) [    ] o.a.s.c.c.ConnectionManager Watcher org.apache.solr.common.cloud.ConnectionManager@130a11a name:ZooKeeperConnection Watcher:127.0.0.1:42043/solr got event WatchedEvent state:SyncConnected type:None path:null path:null type:None
   [junit4]   2> 1886587 INFO  (TEST-TestRandomRequestDistribution.test-seed#[5CEE40AF8B2480B9]) [    ] o.a.s.c.c.ConnectionManager Client is connected to ZooKeeper
   [junit4]   2> 1886588 INFO  (TEST-TestRandomRequestDistribution.test-seed#[5CEE40AF8B2480B9]) [    ] o.a.s.c.c.SolrZkClient Using default ZkACLProvider
   [junit4]   2> 1886588 INFO  (TEST-TestRandomRequestDistribution.test-seed#[5CEE40AF8B2480B9]) [    ] o.a.s.c.c.ZkStateReader Updating cluster state from ZooKeeper... 
   [junit4]   2> 1886589 INFO  (TEST-TestRandomRequestDistribution.test-seed#[5CEE40AF8B2480B9]) [    ] o.a.s.c.c.ZkStateReader Updated live nodes from ZooKeeper... (0) -> (1)
   [junit4]   2> 1886589 INFO  (TEST-TestRandomRequestDistribution.test-seed#[5CEE40AF8B2480B9]) [    ] o.a.s.c.ChaosMonkey monkey: init - expire sessions:false cause connection loss:false
   [junit4]   2> 1886589 INFO  (TEST-TestRandomRequestDistribution.test-seed#[5CEE40AF8B2480B9]) [    ] o.a.s.c.AbstractFullDistribZkTestBase Creating collection1 with stateFormat=2
   [junit4]   2> 1886589 INFO  (TEST-TestRandomRequestDistribution.test-seed#[5CEE40AF8B2480B9]) [    ] o.a.s.c.c.SolrZkClient Using default ZkCredentialsProvider
   [junit4]   2> 1886590 INFO  (TEST-TestRandomRequestDistribution.test-seed#[5CEE40AF8B2480B9]) [    ] o.a.s.c.c.ConnectionManager Waiting for client to connect to ZooKeeper
   [junit4]   2> 1886590 INFO  (zkCallback-2433-thread-1) [    ] o.a.s.c.c.ConnectionManager Watcher org.apache.solr.common.cloud.ConnectionManager@443643 name:ZooKeeperConnection Watcher:127.0.0.1:42043/solr got event WatchedEvent state:SyncConnected type:None path:null path:null type:None
   [junit4]   2> 1886590 INFO  (TEST-TestRandomRequestDistribution.test-seed#[5CEE40AF8B2480B9]) [    ] o.a.s.c.c.ConnectionManager Client is connected to ZooKeeper
   [junit4]   2> 1886591 INFO  (TEST-TestRandomRequestDistribution.test-seed#[5CEE40AF8B2480B9]) [    ] o.a.s.c.c.SolrZkClient Using default ZkACLProvider
   [junit4]   2> 1886592 INFO  (OverseerStateUpdate-95648708843798532-127.0.0.1:37317_et_iwc-n_0000000000) [    ] o.a.s.c.Overseer processMessage: queueSize: 1, message = {
   [junit4]   2>   "operation":"create",
   [junit4]   2>   "name":"collection1",
   [junit4]   2>   "numShards":"2",
   [junit4]   2>   "stateFormat":"2"} current state version: 3
   [junit4]   2> 1886592 INFO  (OverseerStateUpdate-95648708843798532-127.0.0.1:37317_et_iwc-n_0000000000) [    ] o.a.s.c.o.ClusterStateMutator building a new cName: collection1
   [junit4]   2> 1886664 INFO  (TEST-TestRandomRequestDistribution.test-seed#[5CEE40AF8B2480B9]) [    ] o.a.s.SolrTestCaseJ4 Writing core.properties file to /home/jenkins/workspace/Lucene-Solr-master-Linux/solr/build/solr-core/test/J1/temp/solr.cloud.TestRandomRequestDistribution_5CEE40AF8B2480B9-001/shard-1-001/cores/collection1
   [junit4]   2> 1886665 INFO  (TEST-TestRandomRequestDistribution.test-seed#[5CEE40AF8B2480B9]) [    ] o.a.s.c.AbstractFullDistribZkTestBase create jetty 1 in directory /home/jenkins/workspace/Lucene-Solr-master-Linux/solr/build/solr-core/test/J1/temp/solr.cloud.TestRandomRequestDistribution_5CEE40AF8B2480B9-001/shard-1-001
   [junit4]   2> 1886666 INFO  (TEST-TestRandomRequestDistribution.test-seed#[5CEE40AF8B2480B9]) [    ] o.e.j.s.Server jetty-9.3.8.v20160314
   [junit4]   2> 1886667 INFO  (TEST-TestRandomRequestDistribution.test-seed#[5CEE40AF8B2480B9]) [    ] o.e.j.s.h.ContextHandler Started o.e.j.s.ServletContextHandler@66fb8a{/et_iwc,null,AVAILABLE}
   [junit4]   2> 1886668 INFO  (TEST-TestRandomRequestDistribution.test-seed#[5CEE40AF8B2480B9]) [    ] o.e.j.s.ServerConnector Started ServerConnector@4c41c1{HTTP/1.1,[http/1.1]}{127.0.0.1:34044}
   [junit4]   2> 1886668 INFO  (TEST-TestRandomRequestDistribution.test-seed#[5CEE40AF8B2480B9]) [    ] o.e.j.s.Server Started @1888065ms
   [junit4]   2> 1886668 INFO  (TEST-TestRandomRequestDistribution.test-seed#[5CEE40AF8B2480B9]) [    ] o.a.s.c.s.e.JettySolrRunner Jetty properties: {solr.data.dir=/home/jenkins/workspace/Lucene-Solr-master-Linux/solr/build/solr-core/test/J1/temp/solr.cloud.TestRandomRequestDistribution_5CEE40AF8B2480B9-001/tempDir-001/jetty1, solrconfig=solrconfig.xml, hostContext=/et_iwc, hostPort=34044, coreRootDirectory=/home/jenkins/workspace/Lucene-Solr-master-Linux/solr/build/solr-core/test/J1/../../../../../../../../../home/jenkins/workspace/Lucene-Solr-master-Linux/solr/build/solr-core/test/J1/temp/solr.cloud.TestRandomRequestDistribution_5CEE40AF8B2480B9-001/shard-1-001/cores}
   [junit4]   2> 1886668 INFO  (TEST-TestRandomRequestDistribution.test-seed#[5CEE40AF8B2480B9]) [    ] o.a.s.s.SolrDispatchFilter SolrDispatchFilter.init(): jdk.internal.loader.ClassLoaders$AppClassLoader@c0663d
   [junit4]   2> 1886668 INFO  (TEST-TestRandomRequestDistribution.test-seed#[5CEE40AF8B2480B9]) [    ] o.a.s.c.SolrResourceLoader new SolrResourceLoader for directory: '/home/jenkins/workspace/Lucene-Solr-master-Linux/solr/build/solr-core/test/J1/temp/solr.cloud.TestRandomRequestDistribution_5CEE40AF8B2480B9-001/shard-1-001'
   [junit4]   2> 1886668 INFO  (TEST-TestRandomRequestDistribution.test-seed#[5CEE40AF8B2480B9]) [    ] o.a.s.c.SolrResourceLoader JNDI not configured for solr (NoInitialContextEx)
   [junit4]   2> 1886668 INFO  (TEST-TestRandomRequestDistribution.test-seed#[5CEE40AF8B2480B9]) [    ] o.a.s.c.SolrResourceLoader solr home defaulted to 'solr/' (could not find system property or JNDI)
   [junit4]   2> 1886669 INFO  (TEST-TestRandomRequestDistribution.test-seed#[5CEE40AF8B2480B9]) [    ] o.a.s.c.c.SolrZkClient Using default ZkCredentialsProvider
   [junit4]   2> 1886669 INFO  (TEST-TestRandomRequestDistribution.test-seed#[5CEE40AF8B2480B9]) [    ] o.a.s.c.c.ConnectionManager Waiting for client to connect to ZooKeeper
   [junit4]   2> 1886670 INFO  (zkCallback-2434-thread-1) [    ] o.a.s.c.c.ConnectionManager Watcher org.apache.solr.common.cloud.ConnectionManager@9a6341 name:ZooKeeperConnection Watcher:127.0.0.1:42043/solr got event WatchedEvent state:SyncConnected type:None path:null path:null type:None
   [junit4]   2> 1886670 INFO  (TEST-TestRandomRequestDistribution.test-seed#[5CEE40AF8B2480B9]) [    ] o.a.s.c.c.ConnectionManager Client is connected to ZooKeeper
   [junit4]   2> 1886671 INFO  (TEST-TestRandomRequestDistribution.test-seed#[5CEE40AF8B2480B9]) [    ] o.a.s.c.c.SolrZkClient Using default ZkACLProvider
   [junit4]   2> 1886671 INFO  (TEST-TestRandomRequestDistribution.test-seed#[5CEE40AF8B2480B9]) [    ] o.a.s.s.SolrDispatchFilter Loading solr.xml from SolrHome (not found in ZooKeeper)
   [junit4]   2> 1886671 INFO  (TEST-TestRandomRequestDistribution.test-seed#[5CEE40AF8B2480B9]) [    ] o.a.s.c.SolrXmlConfig Loading container configuration from /home/jenkins/workspace/Lucene-Solr-master-Linux/solr/build/solr-core/test/J1/temp/solr.cloud.TestRandomRequestDistribution_5CEE40AF8B2480B9-001/shard-1-001/solr.xml
   [junit4]   2> 1886675 INFO  (TEST-TestRandomRequestDistribution.test-seed#[5CEE40AF8B2480B9]) [    ] o.a.s.c.CorePropertiesLocator Config-defined core root directory: /home/jenkins/workspace/Lucene-Solr-master-Linux/solr/build/solr-core/test/J1/../../../../../../../../../home/jenkins/workspace/Lucene-Solr-master-Linux/solr/build/solr-core/test/J1/temp/solr.cloud.TestRandomRequestDistribution_5CEE40AF8B2480B9-001/shard-1-001/cores
   [junit4]   2> 1886675 INFO  (TEST-TestRandomRequestDistribution.test-seed#[5CEE40AF8B2480B9]) [    ] o.a.s.c.CoreContainer New CoreContainer 17075597
   [junit4]   2> 1886675 INFO  (TEST-TestRandomRequestDistribution.test-seed#[5CEE40AF8B2480B9]) [    ] o.a.s.c.CoreContainer Loading cores into CoreContainer [instanceDir=/home/jenkins/workspace/Lucene-Solr-master-Linux/solr/build/solr-core/test/J1/temp/solr.cloud.TestRandomRequestDistribution_5CEE40AF8B2480B9-001/shard-1-001]
   [junit4]   2> 1886675 WARN  (TEST-TestRandomRequestDistribution.test-seed#[5CEE40AF8B2480B9]) [    ] o.a.s.c.CoreContainer Couldn't add files from /home/jenkins/workspace/Lucene-Solr-master-Linux/solr/build/solr-core/test/J1/temp/solr.cloud.TestRandomRequestDistribution_5CEE40AF8B2480B9-001/shard-1-001/lib to classpath: /home/jenkins/workspace/Lucene-Solr-master-Linux/solr/build/solr-core/test/J1/temp/solr.cloud.TestRandomRequestDistribution_5CEE40AF8B2480B9-001/shard-1-001/lib
   [junit4]   2> 1886676 INFO  (TEST-TestRandomRequestDistribution.test-seed#[5CEE40AF8B2480B9]) [    ] o.a.s.h.c.HttpShardHandlerFactory created with socketTimeout : 90000,urlScheme : ,connTimeout : 15000,maxConnectionsPerHost : 20,maxConnections : 10000,corePoolSize : 0,maximumPoolSize : 2147483647,maxThreadIdleTime : 5,sizeOfQueue : -1,fairnessPolicy : false,useRetries : false,
   [junit4]   2> 1886676 INFO  (TEST-TestRandomRequestDistribution.test-seed#[5CEE40AF8B2480B9]) [    ] o.a.s.u.UpdateShardHandler Creating UpdateShardHandler HTTP client with params: socketTimeout=340000&connTimeout=45000&retry=true
   [junit4]   2> 1886677 INFO  (TEST-TestRandomRequestDistribution.test-seed#[5CEE40AF8B2480B9]) [    ] o.a.s.l.LogWatcher SLF4J impl is org.slf4j.impl.Log4jLoggerFactory
   [junit4]   2> 1886677 INFO  (TEST-TestRandomRequestDistribution.test-seed#[5CEE40AF8B2480B9]) [    ] o.a.s.l.LogWatcher Registering Log Listener [Log4j (org.slf4j.impl.Log4jLoggerFactory)]
   [junit4]   2> 1886677 INFO  (TEST-TestRandomRequestDistribution.test-seed#[5CEE40AF8B2480B9]) [    ] o.a.s.c.ZkContainer Zookeeper client=127.0.0.1:42043/solr
   [junit4]   2> 1886677 INFO  (TEST-TestRandomRequestDistribution.test-seed#[5CEE40AF8B2480B9]) [    ] o.a.s.c.ZkController zkHost includes chroot
   [junit4]   2> 1886677 INFO  (TEST-TestRandomRequestDistribution.test-seed#[5CEE40AF8B2480B9]) [    ] o.a.s.c.c.SolrZkClient Using default ZkCredentialsProvider
   [junit4]   2> 1886678 INFO  (TEST-TestRandomRequestDistribution.test-seed#[5CEE40AF8B2480B9]) [    ] o.a.s.c.c.ConnectionManager Waiting for client to connect to ZooKeeper
   [junit4]   2> 1886679 INFO  (zkCallback-2437-thread-1) [    ] o.a.s.c.c.ConnectionManager Watcher org.apache.solr.common.cloud.ConnectionManager@173bde4 name:ZooKeeperConnection Watcher:127.0.0.1:42043 got event WatchedEvent state:SyncConnected type:None path:null path:null type:None
   [junit4]   2> 1886679 INFO  (TEST-TestRandomRequestDistribution.test-seed#[5CEE40AF8B2480B9]) [    ] o.a.s.c.c.ConnectionManager Client is connected to ZooKeeper
   [junit4]   2> 1886679 INFO  (TEST-TestRandomRequestDistribution.test-seed#[5CEE40AF8B2480B9]) [    ] o.a.s.c.c.SolrZkClient Using default ZkACLProvider
   [junit4]   2> 1886680 INFO  (TEST-TestRandomRequestDistribution.test-seed#[5CEE40AF8B2480B9]) [    ] o.a.s.c.c.ConnectionManager Waiting for client to connect to ZooKeeper
   [junit4]   2> 1886681 INFO  (zkCallback-2438-thread-1) [    ] o.a.s.c.c.ConnectionManager Watcher org.apache.solr.common.cloud.ConnectionManager@aed8b2 name:ZooKeeperConnection Watcher:127.0.0.1:42043/solr got event WatchedEvent state:SyncConnected type:None path:null path:null type:None
   [junit4]   2> 1886681 INFO  (TEST-TestRandomRequestDistribution.test-seed#[5CEE40AF8B2480B9]) [    ] o.a.s.c.c.ConnectionManager Client is connected to ZooKeeper
   [junit4]   2> 1886684 INFO  (TEST-TestRandomRequestDistribution.test-seed#[5CEE40AF8B2480B9]) [    ] o.a.s.c.c.ZkStateReader Updating cluster state from ZooKeeper... 
   [junit4]   2> 1886685 INFO  (TEST-TestRandomRequestDistribution.test-seed#[5CEE40AF8B2480B9]) [    ] o.a.s.c.c.ZkStateReader Updated live nodes from ZooKeeper... (0) -> (1)
   [junit4]   2> 1886686 INFO  (TEST-TestRandomRequestDistribution.test-seed#[5CEE40AF8B2480B9]) [    ] o.a.s.c.Overseer Overseer (id=null) closing
   [junit4]   2> 1886686 INFO  (TEST-TestRandomRequestDistribution.test-seed#[5CEE40AF8B2480B9]) [    ] o.a.s.c.LeaderElector Joined leadership election with path: /overseer_elect/election/95648708843798537-127.0.0.1:34044_et_iwc-n_0000000001
   [junit4]   2> 1886686 INFO  (TEST-TestRandomRequestDistribution.test-seed#[5CEE40AF8B2480B9]) [    ] o.a.s.c.LeaderElector Watching path /overseer_elect/election/95648708843798532-127.0.0.1:37317_et_iwc-n_0000000000 to know if I could be the leader
   [junit4]   2> 1886687 INFO  (TEST-TestRandomRequestDistribution.test-seed#[5CEE40AF8B2480B9]) [    ] o.a.s.c.ZkController Publish node=127.0.0.1:34044_et_iwc as DOWN
   [junit4]   2> 1886688 INFO  (OverseerStateUpdate-95648708843798532-127.0.0.1:37317_et_iwc-n_0000000000) [    ] o.a.s.c.Overseer processMessage: queueSize: 1, message = {
   [junit4]   2>   "operation":"downnode",
   [junit4]   2>   "node_name":"127.0.0.1:34044_et_iwc"} current state version: 3
   [junit4]   2> 1886688 INFO  (OverseerStateUpdate-95648708843798532-127.0.0.1:37317_et_iwc-n_0000000000) [    ] o.a.s.c.o.NodeMutator DownNode state invoked for node: 127.0.0.1:34044_et_iwc
   [junit4]   2> 1886689 INFO  (OverseerStateUpdate-95648708843798532-127.0.0.1:37317_et_iwc-n_0000000000) [    ] o.a.s.c.o.ZkStateWriter going to create_collection /collections/collection1/state.json
   [junit4]   2> 1886792 INFO  (zkCallback-2438-thread-1) [    ] o.a.s.c.c.ZkStateReader A cluster state change: [WatchedEvent state:SyncConnected type:NodeDataChanged path:/clusterstate.json], has occurred - updating... (live nodes size: [1])
   [junit4]   2> 1886792 INFO  (zkCallback-2432-thread-1) [    ] o.a.s.c.c.ZkStateReader A cluster state change: [WatchedEvent state:SyncConnected type:NodeDataChanged path:/clusterstate.json], has occurred - updating... (live nodes size: [1])
   [junit4]   2> 1886792 INFO  (zkCallback-2430-thread-1) [    ] o.a.s.c.c.ZkStateReader A cluster state change: [WatchedEvent state:SyncConnected type:NodeDataChanged path:/clusterstate.json], has occurred - updating... (live nodes size: [1])
   [junit4]   2> 1887688 INFO  (TEST-TestRandomRequestDistribution.test-seed#[5CEE40AF8B2480B9]) [    ] o.a.s.c.ZkController Register node as live in ZooKeeper:/live_nodes/127.0.0.1:34044_et_iwc
   [junit4]   2> 1887688 INFO  (TEST-TestRandomRequestDistribution.test-seed#[5CEE40AF8B2480B9]) [    ] o.a.s.c.c.SolrZkClient makePath: /live_nodes/127.0.0.1:34044_et_iwc
   [junit4]   2> 1887689 INFO  (zkCallback-2438-thread-1) [    ] o.a.s.c.c.ZkStateReader A live node change: [WatchedEvent state:SyncConnected type:NodeChildrenChanged path:/live_nodes], has occurred - updating... (live nodes size: [1])
   [junit4]   2> 1887690 INFO  (zkCallback-2432-thread-1) [    ] o.a.s.c.c.ZkStateReader A live node change: [WatchedEvent state:SyncConnected type:NodeChildrenChanged path:/live_nodes], has occurred - updating... (live nodes size: [1])
   [junit4]   2> 1887689 INFO  (zkCallback-2430-thread-1) [    ] o.a.s.c.c.ZkStateReader A live node change: [WatchedEvent state:SyncConnected type:NodeChildrenChanged path:/live_nodes], has occurred - updating... (live nodes size: [1])
   [junit4]   2> 1887690 INFO  (zkCallback-2438-thread-1) [    ] o.a.s.c.c.ZkStateReader Updated live nodes from ZooKeeper... (1) -> (2)
   [junit4]   2> 1887690 INFO  (zkCallback-2432-thread-1) [    ] o.a.s.c.c.ZkStateReader Updated live nodes from ZooKeeper... (1) -> (2)
   [junit4]   2> 1887690 INFO  (zkCallback-2430-thread-1) [    ] o.a.s.c.c.ZkStateReader Updated live nodes from ZooKeeper... (1) -> (2)
   [junit4]   2> 1887713 INFO  (TEST-TestRandomRequestDistribution.test-seed#[5CEE40AF8B2480B9]) [    ] o.a.s.c.CoreContainer Security conf doesn't exist. Skipping setup for authorization module.
   [junit4]   2> 1887713 INFO  (TEST-TestRandomRequestDistribution.test-seed#[5CEE40AF8B2480B9]) [    ] o.a.s.c.CoreContainer No authentication plugin used.
   [junit4]   2> 1887714 INFO  (TEST-TestRandomRequestDistribution.test-seed#[5CEE40AF8B2480B9]) [    ] o.a.s.c.CorePropertiesLocator Looking for core definitions underneath /home/jenkins/workspace/Lucene-Solr-master-Linux/solr/build/solr-core/test/J1/../../../../../../../../../home/jenkins/workspace/Lucene-Solr-master-Linux/solr/build/solr-core/test/J1/temp/solr.cloud.TestRandomRequestDistribution_5CEE40AF8B2480B9-001/shard-1-001/cores
   [junit4]   2> 1887714 INFO  (TEST-TestRandomRequestDistribution.test-seed#[5CEE40AF8B2480B9]) [    ] o.a.s.c.CoreDescriptor Created CoreDescriptor: {name=collection1, config=solrconfig.xml, transient=false, schema=schema.xml, loadOnStartup=true, configSetProperties=configsetprops.json, collection=collection1, coreNodeName=, dataDir=data/, shard=}
   [junit4]   2> 1887714 INFO  (TEST-TestRandomRequestDistribution.test-seed#[5CEE40AF8B2480B9]) [    ] o.a.s.c.CorePropertiesLocator Found core collection1 in /home/jenkins/workspace/Lucene-Solr-master-Linux/solr/build/solr-core/test/J1/../../../../../../../../../home/jenkins/workspace/Lucene-Solr-master-Linux/solr/build/solr-core/test/J1/temp/solr.cloud.TestRandomRequestDistribution_5CEE40AF8B2480B9-001/shard-1-001/cores/collection1
   [junit4]   2> 1887714 INFO  (TEST-TestRandomRequestDistribution.test-seed#[5CEE40AF8B2480B9]) [    ] o.a.s.c.CorePropertiesLocator Found 1 core definitions
   [junit4]   2> 1887715 INFO  (TEST-TestRandomRequestDistribution.test-seed#[5CEE40AF8B2480B9]) [    ] o.a.s.s.SolrDispatchFilter user.dir=/home/jenkins/workspace/Lucene-Solr-master-Linux/solr/build/solr-core/test/J1
   [junit4]   2> 1887715 INFO  (TEST-TestRandomRequestDistribution.test-seed#[5CEE40AF8B2480B9]) [    ] o.a.s.s.SolrDispatchFilter SolrDispatchFilter.init() done
   [junit4]   2> 1887715 INFO  (coreLoadExecutor-6578-thread-1) [    ] o.a.s.c.ZkController publishing state=down
   [junit4]   2> 1887715 INFO  (coreLoadExecutor-6578-thread-1) [    ] o.a.s.c.ZkController numShards not found on descriptor - reading it from system property
   [junit4]   2> 1887716 INFO  (coreLoadExecutor-6578-thread-1) [    ] o.a.s.c.ZkController Registering watch for collection collection1
   [junit4]   2> 1887716 INFO  (coreLoadExecutor-6578-thread-1) [    ] o.a.s.c.c.ZkStateReader addZkWatch [collection1]
   [junit4]   2> 1887716 INFO  (OverseerStateUpdate-95648708843798532-127.0.0.1:37317_et_iwc-n_0000000000) [    ] o.a.s.c.Overseer processMessage: queueSize: 1, message = {
   [junit4]   2>   "core":"collection1",
   [junit4]   2>   "roles":null,
   [junit4]   2>   "base_url":"http://127.0.0.1:34044/et_iwc",
   [junit4]   2>   "node_name":"127.0.0.1:34044_et_iwc",
   [junit4]   2>   "numShards":"2",
   [junit4]   2>   "state":"down",
   [junit4]   2>   "shard":null,
   [junit4]   2>   "collection":"collection1",
   [junit4]   2>   "operation":"state"} current state version: 4
   [junit4]   2> 1887716 INFO  (coreLoadExecutor-6578-thread-1) [    ] o.a.s.c.c.ZkStateReader Add data for [collection1] ver [0]
   [junit4]   2> 1887717 INFO  (coreLoadExecutor-6578-thread-1) [    ] o.a.s.c.ZkController look for our core node name
   [junit4]   2> 1887717 INFO  (OverseerStateUpdate-95648708843798532-127.0.0.1:37317_et_iwc-n_0000000000) [    ] o.a.s.c.o.ReplicaMutator Update state numShards=2 message={
   [junit4]   2>   "core":"collection1",
   [junit4]   2>   "roles":null,
   [junit4]   2>   "base_url":"http://127.0.0.1:34044/et_iwc",
   [junit4]   2>   "node_name":"127.0.0.1:34044_et_iwc",
   [junit4]   2>   "numShards":"2",
   [junit4]   2>   "state":"down",
   [junit4]   2>   "shard":null,
   [junit4]   2>   "collection":"collection1",
   [junit4]   2>   "operation":"state"}
   [junit4]   2> 1887717 INFO  (OverseerStateUpdate-95648708843798532-127.0.0.1:37317_et_iwc-n_0000000000) [    ] o.a.s.c.o.ReplicaMutator Collection already exists with numShards=2
   [junit4]   2> 1887717 INFO  (OverseerStateUpdate-95648708843798532-127.0.0.1:37317_et_iwc-n_0000000000) [    ] o.a.s.c.o.ReplicaMutator Assigning new node to shard shard=shard2
   [junit4]   2> 1887818 INFO  (OverseerStateUpdate-95648708843798532-127.0.0.1:37317_et_iwc-n_0000000000) [    ] o.a.s.c.o.ZkStateWriter going to update_collection /collections/collection1/state.json version: 0
   [junit4]   2> 1887819 INFO  (zkCallback-2438-thread-1) [    ] o.a.s.c.c.ZkStateReader A cluster state change: [WatchedEvent state:SyncConnected type:NodeDataChanged path:/collections/collection1/state.json] for collection [collection1] has occurred - updating... (live nodes size: [2])
   [junit4]   2> 1887819 INFO  (zkCallback-2438-thread-1) [    ] o.a.s.c.c.ZkStateReader Updating data for [collection1] from [0] to [1]
   [junit4]   2> 1888717 INFO  (coreLoadExecutor-6578-thread-1) [    ] o.a.s.c.ZkController waiting to find shard id in clusterstate for collection1
   [junit4]   2> 1888717 INFO  (coreLoadExecutor-6578-thread-1) [    ] o.a.s.c.ZkController Check for collection zkNode:collection1
   [junit4]   2> 1888717 INFO  (coreLoadExecutor-6578-thread-1) [    ] o.a.s.c.ZkController Collection zkNode exists
   [junit4]   2> 1888717 INFO  (coreLoadExecutor-6578-thread-1) [    ] o.a.s.c.c.ZkStateReader Load collection config from: [/collections/collection1]
   [junit4]   2> 1888718 INFO  (coreLoadExecutor-6578-thread-1) [    ] o.a.s.c.c.ZkStateReader path=[/collections/collection1] [configName]=[conf1] specified config exists in ZooKeeper
   [junit4]   2> 1888718 INFO  (coreLoadExecutor-6578-thread-1) [    ] o.a.s.c.SolrResourceLoader new SolrResourceLoader for directory: '/home/jenkins/workspace/Lucene-Solr-master-Linux/solr/build/solr-core/test/J1/temp/solr.cloud.TestRandomRequestDistribution_5CEE40AF8B2480B9-001/shard-1-001/cores/collection1'
   [junit4]   2> 1888718 INFO  (coreLoadExecutor-6578-thread-1) [    ] o.a.s.c.SolrResourceLoader JNDI not configured for solr (NoInitialContextEx)
   [junit4]   2> 1888718 INFO  (coreLoadExecutor-6578-thread-1) [    ] o.a.s.c.SolrResourceLoader solr home defaulted to 'solr/' (could not find system property or JNDI)
   [junit4]   2> 1888719 INFO  (coreLoadExecutor-6578-thread-1) [    ] o.a.s.c.Config loaded config solrconfig.xml with version 0 
   [junit4]   2> 1888724 INFO  (coreLoadExecutor-6578-thread-1) [    ] o.a.s.c.SolrConfig current version of requestparams : -1
   [junit4]   2> 1888727 WARN  (coreLoadExecutor-6578-thread-1) [    ] o.a.s.c.Config Beginning with Solr 5.5, <mergePolicy> is deprecated, use <mergePolicyFactory> instead.
   [junit4]   2> 1888727 INFO  (coreLoadExecutor-6578-thread-1) [    ] o.a.s.c.SolrConfig Using Lucene MatchVersion: 7.0.0
   [junit4]   2> 1888735 INFO  (coreLoadExecutor-6578-thread-1) [    ] o.a.s.c.SolrConfig Loaded SolrConfig: solrconfig.xml
   [junit4]   2> 1888742 INFO  (coreLoadExecutor-6578-thread-1) [    ] o.a.s.s.IndexSchema [collection1] Schema name=test
   [junit4]   2> 1888828 INFO  (coreLoadExecutor-6578-thread-1) [    ] o.a.s.s.OpenExchangeRatesOrgProvider Initialized with rates=open-exchange-rates.json, refreshInterval=1440.
   [junit4]   2> 1888833 INFO  (coreLoadExecutor-6578-thread-1) [    ] o.a.s.s.IndexSchema default search field in schema is text
   [junit4]   2> 1888834 INFO  (coreLoadExecutor-6578-thread-1) [    ] o.a.s.s.IndexSchema unique key field: id
   [junit4]   2> 1888840 INFO  (coreLoadExecutor-6578-thread-1) [    ] o.a.s.s.FileExchangeRateProvider Reloading exchange rates from file currency.xml
   [junit4]   2> 1888841 INFO  (coreLoadExecutor-6578-thread-1) [    ] o.a.s.s.FileExchangeRateProvider Reloading exchange rates from file currency.xml
   [junit4]   2> 1888843 INFO  (coreLoadExecutor-6578-thread-1) [    ] o.a.s.s.OpenExchangeRatesOrgProvider Reloading exchange rates from open-exchange-rates.json
   [junit4]   2> 1888843 INFO  (coreLoadExecutor-6578-thread-1) [    ] o.a.s.s.OpenExchangeRatesOrgProvider Reloading exchange rates from open-exchange-rates.json
   [junit4]   2> 1888844 INFO  (coreLoadExecutor-6578-thread-1) [    ] o.a.s.c.ConfigSetProperties Did not find ConfigSet properties, assuming default properties: Can't find resource 'configsetprops.json' in classpath or '/configs/conf1', cwd=/home/jenkins/workspace/Lucene-Solr-master-Linux/solr/build/solr-core/test/J1
   [junit4]   2> 1888844 INFO  (coreLoadExecutor-6578-thread-1) [    ] o.a.s.c.CoreContainer Creating SolrCore 'collection1' using configuration from collection collection1
   [junit4]   2> 1888844 INFO  (coreLoadExecutor-6578-thread-1) [    ] o.a.s.c.SolrCore org.apache.solr.core.MockDirectoryFactory
   [junit4]   2> 1888844 INFO  (coreLoadExecutor-6578-thread-1) [    ] o.a.s.c.SolrCore [[collection1] ] Opening new SolrCore at [/home/jenkins/workspace/Lucene-Solr-master-Linux/solr/build/solr-core/test/J1/temp/solr.cloud.TestRandomRequestDistribution_5CEE40AF8B2480B9-001/shard-1-001/cores/collection1], dataDir=[/home/jenkins/workspace/Lucene-Solr-master-Linux/solr/build/solr-core/test/J1/../../../../../../../../../home/jenkins/workspace/Lucene-Solr-master-Linux/solr/build/solr-core/test/J1/temp/solr.cloud.TestRandomRequestDistribution_5CEE40AF8B2480B9-001/shard-1-001/cores/collection1/data/]
   [junit4]   2> 1888845 INFO  (coreLoadExecutor-6578-thread-1) [    ] o.a.s.c.JmxMonitoredMap JMX monitoring is enabled. Adding Solr mbeans to JMX Server: com.sun.jmx.mbeanserver.JmxMBeanServer@106d8b2
   [junit4]   2> 1888845 INFO  (coreLoadExecutor-6578-thread-1) [    ] o.a.s.c.CachingDirectoryFactory return new directory for /home/jenkins/workspace/Lucene-Solr-master-Linux/solr/build/solr-core/test/J1/../../../../../../../../../home/jenkins/workspace/Lucene-Solr-master-Linux/solr/build/solr-core/test/J1/temp/solr.cloud.TestRandomRequestDistribution_5CEE40AF8B2480B9-001/shard-1-001/cores/collection1/data
   [junit4]   2> 1888845 INFO  (coreLoadExecutor-6578-thread-1) [    ] o.a.s.c.SolrCore New index directory detected: old=null new=/home/jenkins/workspace/Lucene-Solr-master-Linux/solr/build/solr-core/test/J1/../../../../../../../../../home/jenkins/workspace/Lucene-Solr-master-Linux/solr/build/solr-core/test/J1/temp/solr.cloud.TestRandomRequestDistribution_5CEE40AF8B2480B9-001/shard-1-001/cores/collection1/data/index/
   [junit4]   2> 1888846 WARN  (coreLoadExecutor-6578-thread-1) [    ] o.a.s.c.SolrCore [collection1] Solr index directory '/home/jenkins/workspace/Lucene-Solr-master-Linux/solr/build/solr-core/test/J1/../../../../../../../../../home/jenkins/workspace/Lucene-Solr-master-Linux/solr/build/solr-core/test/J1/temp/solr.cloud.TestRandomRequestDistribution_5CEE40AF8B2480B9-001/shard-1-001/cores/collection1/data/index' doesn't exist. Creating new index...
   [junit4]   2> 1888846 INFO  (coreLoadExecutor-6578-thread-1) [    ] o.a.s.c.CachingDirectoryFactory return new directory for /home/jenkins/workspace/Lucene-Solr-master-Linux/solr/build/solr-core/test/J1/../../../../../../../../../home/jenkins/workspace/Lucene-Solr-master-Linux/solr/build/solr-core/test/J1/temp/solr.cloud.TestRandomRequestDistribution_5CEE40AF8B2480B9-001/shard-1-001/cores/collection1/data/index
   [junit4]   2> 1888846 INFO  (coreLoadExecutor-6578-thread-1) [    ] o.a.s.u.RandomMergePolicy RandomMergePolicy wrapping class org.apache.lucene.index.TieredMergePolicy: [TieredMergePolicy: maxMergeAtOnce=11, maxMergeAtOnceExplicit=25, maxMergedSegmentMB=36.7861328125, floorSegmentMB=1.1630859375, forceMergeDeletesPctAllowed=21.167663473632842, segmentsPerTier=19.0, maxCFSSegmentSizeMB=8.796093022207999E12, noCFSRatio=0.5974339977055007
   [junit4]   2> 1888847 INFO  (coreLoadExecutor-6578-thread-1) [    ] o.a.s.c.SolrDeletionPolicy SolrDeletionPolicy.onCommit: commits: num=1
   [junit4]   2> 	commit{dir=MockDirectoryWrapper(RAMDirectory@81c214 lockFactory=org.apache.lucene.store.SingleInstanceLockFactory@17b19d1),segFN=segments_1,generation=1}
   [junit4]   2> 1888847 INFO  (coreLoadExecutor-6578-thread-1) [    ] o.a.s.c.SolrDeletionPolicy newest commit generation = 1
   [junit4]   2> 1888847 INFO  (OldIndexDirectoryCleanupThreadForCore-collection1) [    ] o.a.s.c.SolrCore Looking for old index directories to cleanup for core collection1 in /home/jenkins/workspace/Lucene-Solr-master-Linux/solr/build/solr-core/test/J1/../../../../../../../../../home/jenkins/workspace/Lucene-Solr-master-Linux/solr/build/solr-core/test/J1/temp/solr.cloud.TestRandomRequestDistribution_5CEE40AF8B2480B9-001/shard-1-001/cores/collection1/data/
   [junit4]   2> 1888847 WARN  (OldIndexDirectoryCleanupThreadForCore-collection1) [    ] o.a.s.c.DirectoryFactory /home/jenkins/workspace/Lucene-Solr-master-Linux/solr/build/solr-core/test/J1/../../../../../../../../../home/jenkins/workspace/Lucene-Solr-master-Linux/solr/build/solr-core/test/J1/temp/solr.cloud.TestRandomRequestDistribution_5CEE40AF8B2480B9-001/shard-1-001/cores/collection1/data/ does not point to a valid data directory; skipping clean-up of old index directories.
   [junit4]   2> 1888851 INFO  (coreLoadExecutor-6578-thread-1) [    ] o.a.s.u.p.UpdateRequestProcessorChain creating updateRequestProcessorChain "nodistrib"
   [junit4]   2> 1888851 INFO  (coreLoadExecutor-6578-thread-1) [    ] o.a.s.u.p.UpdateRequestProcessorChain creating updateRequestProcessorChain "dedupe"
   [junit4]   2> 1888851 INFO  (coreLoadExecutor-6578-thread-1) [    ] o.a.s.u.p.UpdateRequestProcessorChain inserting DistributedUpdateProcessorFactory into updateRequestProcessorChain "dedupe"
   [junit4]   2> 1888851 INFO  (coreLoadExecutor-6578-thread-1) [    ] o.a.s.u.p.UpdateRequestProcessorChain creating updateRequestProcessorChain "stored_sig"
   [junit4]   2> 1888851 INFO  (coreLoadExecutor-6578-thread-1) [    ] o.a.s.u.p.UpdateRequestProcessorChain inserting DistributedUpdateProcessorFactory into updateRequestProcessorChain "stored_sig"
   [junit4]   2> 1888851 INFO  (coreLoadExecutor-6578-thread-1) [    ] o.a.s.u.p.UpdateRequestProcessorChain creating updateRequestProcessorChain "distrib-dup-test-chain-explicit"
   [junit4]   2> 1888851 INFO  (coreLoadExecutor-6578-thread-1) [    ] o.a.s.u.p.UpdateRequestProcessorChain creating updateRequestProcessorChain "distrib-dup-test-chain-implicit"
   [junit4]   2> 1888851 INFO  (coreLoadExecutor-6578-thread-1) [    ] o.a.s.u.p.UpdateRequestProcessorChain inserting DistributedUpdateProcessorFactory into updateRequestProcessorChain "distrib-dup-test-chain-implicit"
   [junit4]   2> 1888851 INFO  (coreLoadExecutor-6578-thread-1) [    ] o.a.s.c.SolrCore no updateRequestProcessorChain defined as default, creating implicit default
   [junit4]   2> 1888852 WARN  (coreLoadExecutor-6578-thread-1) [    ] o.a.s.c.RequestHandlers INVALID paramSet a in requestHandler {type = requestHandler,name = /dump,class = DumpRequestHandler,args = {defaults={a=A,b=B}}}
   [junit4]   2> 1888853 INFO  (coreLoadExecutor-6578-thread-1) [    ] o.a.s.h.l.XMLLoader xsltCacheLifetimeSeconds=60
   [junit4]   2> 1888855 INFO  (coreLoadExecutor-6578-thread-1) [    ] o.a.s.h.l.XMLLoader xsltCacheLifetimeSeconds=60
   [junit4]   2> 1888856 INFO  (coreLoadExecutor-6578-thread-1) [    ] o.a.s.h.l.XMLLoader xsltCacheLifetimeSeconds=60
   [junit4]   2> 1888857 INFO  (coreLoadExecutor-6578-thread-1) [    ] o.a.s.h.l.XMLLoader xsltCacheLifetimeSeconds=60
   [junit4]   2> 1888864 INFO  (coreLoadExecutor-6578-thread-1) [    ] o.a.s.c.RequestHandlers Registered paths: /admin/mbeans,standard,/dump,/update/csv,/sql,/update/json/docs,/admin/luke,/export,/admin/segments,/get,/admin/system,/replication,/admin/properties,/config,/stream,/schema,/admin/plugins,/admin/logging,/update/json,/admin/ping,/admin/threads,/update,/admin/file
   [junit4]   2> 1888864 INFO  (coreLoadExecutor-6578-thread-1) [    ] o.a.s.c.SolrCore Using default statsCache cache: org.apache.solr.search.stats.LocalStatsCache
   [junit4]   2> 1888864 INFO  (coreLoadExecutor-6578-thread-1) [    ] o.a.s.u.UpdateHandler Using UpdateLog implementation: org.apache.solr.update.UpdateLog
   [junit4]   2> 1888865 INFO  (coreLoadExecutor-6578-thread-1) [    ] o.a.s.u.UpdateLog Initializing UpdateLog: dataDir= defaultSyncLevel=FLUSH numRecordsToKeep=100 maxNumLogsToKeep=10 numVersionBuckets=65536
   [junit4]   2> 1888865 INFO  (coreLoadExecutor-6578-thread-1) [    ] o.a.s.u.CommitTracker Hard AutoCommit: disabled
   [junit4]   2> 1888866 INFO  (coreLoadExecutor-6578-thread-1) [    ] o.a.s.u.CommitTracker Soft AutoCommit: disabled
   [junit4]   2> 1888866 INFO  (coreLoadExecutor-6578-thread-1) [    ] o.a.s.u.RandomMergePolicy RandomMergePolicy wrapping class org.apache.lucene.index.LogDocMergePolicy: [LogDocMergePolicy: minMergeSize=1000, mergeFactor=36, maxMergeSize=9223372036854775807, maxMergeSizeForForcedMerge=9223372036854775807, calibrateSizeByDeletes=true, maxMergeDocs=2147483647, maxCFSSegmentSizeMB=8.796093022207999E12, noCFSRatio=1.0]
   [junit4]   2> 1888867 INFO  (coreLoadExecutor-6578-thread-1) [    ] o.a.s.c.SolrDeletionPolicy SolrDeletionPolicy.onInit: commits: num=1
   [junit4]   2> 	commit{dir=MockDirectoryWrapper(RAMDirectory@81c214 lockFactory=org.apache.lucene.store.SingleInstanceLockFactory@17b19d1),segFN=segments_1,generation=1}
   [junit4]   2> 1888867 INFO  (coreLoadExecutor-6578-thread-1) [    ] o.a.s.c.SolrDeletionPolicy newest commit generation = 1
   [junit4]   2> 1888867 INFO  (coreLoadExecutor-6578-thread-1) [    ] o.a.s.s.SolrIndexSearcher Opening [Searcher@e00d83[collection1] main]
   [junit4]   2> 1888867 INFO  (coreLoadExecutor-6578-thread-1) [    ] o.a.s.c.c.ZkStateReader Load collection config from: [/collections/collection1]
   [junit4]   2> 1888868 INFO  (coreLoadExecutor-6578-thread-1) [    ] o.a.s.c.c.ZkStateReader path=[/collections/collection1] [configName]=[conf1] specified config exists in ZooKeeper
   [junit4]   2> 1888868 INFO  (coreLoadExecutor-6578-thread-1) [    ] o.a.s.r.ManagedResourceStorage Setting up ZooKeeper-based storage for the RestManager with znodeBase: /configs/conf1
   [junit4]   2> 1888868 INFO  (coreLoadExecutor-6578-thread-1) [    ] o.a.s.r.ManagedResourceStorage Configured ZooKeeperStorageIO with znodeBase: /configs/conf1
   [junit4]   2> 1888868 INFO  (coreLoadExecutor-6578-thread-1) [    ] o.a.s.r.RestManager Initializing RestManager with initArgs: {}
   [junit4]   2> 1888868 INFO  (coreLoadExecutor-6578-thread-1) [    ] o.a.s.r.ManagedResourceStorage Reading _rest_managed.json using ZooKeeperStorageIO:path=/configs/conf1
   [junit4]   2> 1888868 INFO  (coreLoadExecutor-6578-thread-1) [    ] o.a.s.r.ManagedResourceStorage No data found for znode /configs/conf1/_rest_managed.json
   [junit4]   2> 1888868 INFO  (coreLoadExecutor-6578-thread-1) [    ] o.a.s.r.ManagedResourceStorage Loaded null at path _rest_managed.json using ZooKeeperStorageIO:path=/configs/conf1
   [junit4]   2> 1888868 INFO  (coreLoadExecutor-6578-thread-1) [    ] o.a.s.r.RestManager Initializing 0 registered ManagedResources
   [junit4]   2> 1888868 INFO  (coreLoadExecutor-6578-thread-1) [    ] o.a.s.h.ReplicationHandler Commits will be reserved for  10000
   [junit4]   2> 1888870 INFO  (searcherExecutor-6579-thread-1) [    ] o.a.s.c.SolrCore [collection1] Registered new searcher Searcher@e00d83[collection1] main{ExitableDirectoryReader(UninvertingDirectoryReader())}
   [junit4]   2> 1888870 INFO  (coreLoadExecutor-6578-thread-1) [    ] o.a.s.u.UpdateLog Looking up max value of version field to seed version buckets
   [junit4]   2> 1888870 INFO  (coreLoadExecutor-6578-thread-1) [    ] o.a.s.u.VersionInfo Refreshing highest value of _version_ for 65536 version buckets from index
   [junit4]   2> 1888870 INFO  (coreLoadExecutor-6578-thread-1) [    ] o.a.s.u.VersionInfo No terms found for _version_, cannot seed version bucket highest value from index
   [junit4]   2> 1888871 INFO  (coreLoadExecutor-6578-thread-1) [    ] o.a.s.u.UpdateLog Could not find max version in index or recent updates, using new clock 1530379345747509248
   [junit4]   2> 1888872 INFO  (coreLoadExecutor-6578-thread-1) [    ] o.a.s.u.UpdateLog Took 1.0ms to seed version buckets with highest version 1530379345747509248
   [junit4]   2> 1888872 INFO  (coreLoadExecutor-6578-thread-1) [    ] o.a.s.c.ZkController watch zkdir /configs/conf1
   [junit4]   2> 1888872 INFO  (coreLoadExecutor-6578-thread-1) [    ] o.a.s.c.CoreContainer registering core: collection1
   [junit4]   2> 1888873 INFO  (coreZkRegister-6573-thread-1) [    ] o.a.s.c.ZkController Register replica - core:collection1 address:http://127.0.0.1:34044/et_iwc collection:collection1 shard:shard2
   [junit4]   2> 1888874 INFO  (coreZkRegister-6573-thread-1) [    ] o.a.s.c.c.SolrZkClient makePath: /collections/collection1/leader_elect/shard2/election
   [junit4]   2> 1888875 INFO  (coreZkRegister-6573-thread-1) [    ] o.a.s.c.LeaderElector Joined leadership election with path: /collections/collection1/leader_elect/shard2/election/95648708843798537-core_node1-n_0000000000
   [junit4]   2> 1888876 INFO  (coreZkRegister-6573-thread-1) [    ] o.a.s.c.ShardLeaderElectionContext Running the leader process for shard=shard2 and weAreReplacement=false and leaderVoteWait=10000
   [junit4]   2> 1888876 INFO  (coreZkRegister-6573-thread-1) [    ] o.a.s.c.ShardLeaderElectionContext Enough replicas found to continue.
   [junit4]   2> 1888877 INFO  (coreZkRegister-6573-thread-1) [    ] o.a.s.c.ShardLeaderElectionContext I may be the new leader - try and sync
   [junit4]   2> 1888877 INFO  (coreZkRegister-6573-thread-1) [    ] o.a.s.c.SyncStrategy Sync replicas to http://127.0.0.1:34044/et_iwc/collection1/
   [junit4]   2> 1888877 INFO  (coreZkRegister-6573-thread-1) [    ] o.a.s.c.SyncStrategy Sync Success - now sync replicas to me
   [junit4]   

[...truncated too long message...]

seed#[5CEE40AF8B2480B9]) [    ] o.a.s.c.Overseer Overseer (id=95648708843798543-127.0.0.1:37525_et_iwc-n_0000000003) closing
   [junit4]   2> 1921075 INFO  (OverseerStateUpdate-95648708843798543-127.0.0.1:37525_et_iwc-n_0000000003) [    ] o.a.s.c.Overseer Overseer Loop exiting : 127.0.0.1:37525_et_iwc
   [junit4]   2> 1921076 INFO  (zkCallback-2448-thread-2) [    ] o.a.s.c.c.ZkStateReader A live node change: [WatchedEvent state:SyncConnected type:NodeChildrenChanged path:/live_nodes], has occurred - updating... (live nodes size: [1])
   [junit4]   2> 1921076 WARN  (zkCallback-2448-thread-2) [    ] o.a.s.c.c.ZkStateReader ZooKeeper watch triggered, but Solr cannot talk to ZK: [KeeperErrorCode = Session expired for /live_nodes]
   [junit4]   2> 1921077 INFO  (TEST-TestRandomRequestDistribution.test-seed#[5CEE40AF8B2480B9]) [    ] o.e.j.s.ServerConnector Stopped ServerConnector@c3d6c4{HTTP/1.1,[http/1.1]}{127.0.0.1:0}
   [junit4]   2> 1921077 INFO  (TEST-TestRandomRequestDistribution.test-seed#[5CEE40AF8B2480B9]) [    ] o.e.j.s.h.ContextHandler Stopped o.e.j.s.ServletContextHandler@154fb29{/et_iwc,null,UNAVAILABLE}
   [junit4]   2> 1921078 INFO  (TEST-TestRandomRequestDistribution.test-seed#[5CEE40AF8B2480B9]) [    ] o.a.s.c.ZkTestServer connecting to 127.0.0.1:42043 42043
   [junit4]   2> 1921127 INFO  (Thread-4293) [    ] o.a.s.c.ZkTestServer connecting to 127.0.0.1:42043 42043
   [junit4]   2> 1921128 WARN  (Thread-4293) [    ] o.a.s.c.ZkTestServer Watch limit violations: 
   [junit4]   2> Maximum concurrent create/delete watches above limit:
   [junit4]   2> 
   [junit4]   2> 	5	/solr/aliases.json
   [junit4]   2> 	4	/solr/security.json
   [junit4]   2> 	4	/solr/configs/conf1
   [junit4]   2> 
   [junit4]   2> Maximum concurrent data watches above limit:
   [junit4]   2> 
   [junit4]   2> 	5	/solr/clusterstate.json
   [junit4]   2> 	3	/solr/collections/collection1/state.json
   [junit4]   2> 	2	/solr/collections/a1x2/state.json
   [junit4]   2> 
   [junit4]   2> Maximum concurrent children watches above limit:
   [junit4]   2> 
   [junit4]   2> 	5	/solr/live_nodes
   [junit4]   2> 	5	/solr/collections
   [junit4]   2> 	4	/solr/overseer/collection-queue-work
   [junit4]   2> 	3	/solr/overseer/queue
   [junit4]   2> 
   [junit4]   2> NOTE: reproduce with: ant test  -Dtestcase=TestRandomRequestDistribution -Dtests.method=test -Dtests.seed=5CEE40AF8B2480B9 -Dtests.multiplier=3 -Dtests.slow=true -Dtests.locale=ksh -Dtests.timezone=Portugal -Dtests.asserts=true -Dtests.file.encoding=ISO-8859-1
   [junit4] FAILURE 36.3s J1 | TestRandomRequestDistribution.test <<<
   [junit4]    > Throwable #1: java.lang.AssertionError: Shard a1x2_shard1_replica1 received all 10 requests
   [junit4]    > 	at __randomizedtesting.SeedInfo.seed([5CEE40AF8B2480B9:D4BA7F7525D8ED41]:0)
   [junit4]    > 	at org.apache.solr.cloud.TestRandomRequestDistribution.testRequestTracking(TestRandomRequestDistribution.java:121)
   [junit4]    > 	at org.apache.solr.cloud.TestRandomRequestDistribution.test(TestRandomRequestDistribution.java:65)
   [junit4]    > 	at org.apache.solr.BaseDistributedSearchTestCase$ShardsRepeatRule$ShardsFixedStatement.callStatement(BaseDistributedSearchTestCase.java:992)
   [junit4]    > 	at org.apache.solr.BaseDistributedSearchTestCase$ShardsRepeatRule$ShardsStatement.evaluate(BaseDistributedSearchTestCase.java:967)
   [junit4]    > 	at java.lang.Thread.run(java.base@9-ea/Thread.java:804)
   [junit4]   2> 1921131 INFO  (SUITE-TestRandomRequestDistribution-seed#[5CEE40AF8B2480B9]-worker) [    ] o.a.s.SolrTestCaseJ4 ###deleteCore
   [junit4]   2> NOTE: leaving temporary files on disk at: /home/jenkins/workspace/Lucene-Solr-master-Linux/solr/build/solr-core/test/J1/temp/solr.cloud.TestRandomRequestDistribution_5CEE40AF8B2480B9-001
   [junit4]   2> Apr 01, 2016 4:05:08 AM com.carrotsearch.randomizedtesting.ThreadLeakControl checkThreadLeaks
   [junit4]   2> WARNING: Will linger awaiting termination of 2 leaked thread(s).
   [junit4]   2> NOTE: test params are: codec=Lucene60, sim=ClassicSimilarity, locale=ksh, timezone=Portugal
   [junit4]   2> NOTE: Linux 4.2.0-34-generic i386/Oracle Corporation 9-ea (32-bit)/cpus=12,threads=1,free=50430592,total=306683904
   [junit4]   2> NOTE: All tests run in this JVM: [TestManagedSynonymFilterFactory, TestAuthenticationFramework, TestTrieFacet, DateRangeFieldTest, BlockJoinFacetSimpleTest, ClusterStateUpdateTest, TestSurroundQueryParser, OverriddenZkACLAndCredentialsProvidersTest, TestQueryTypes, SecurityConfHandlerTest, TestUseDocValuesAsStored2, ConjunctionSolrSpellCheckerTest, TestCodecSupport, AsyncMigrateRouteKeyTest, TestBM25SimilarityFactory, SoftAutoCommitTest, HighlighterMaxOffsetTest, TestConfigOverlay, TimeZoneUtilsTest, TestSolrQueryResponse, SuggestComponentTest, UpdateRequestProcessorFactoryTest, BigEndianAscendingWordSerializerTest, SolrIndexConfigTest, FacetPivotSmallTest, LeaderFailoverAfterPartitionTest, TestDocBasedVersionConstraints, DeleteInactiveReplicaTest, DistanceUnitsTest, RulesTest, TestSolrFieldCacheMBean, TestBlobHandler, TestSchemaNameResource, DocValuesTest, ExitableDirectoryReaderTest, TestLMJelinekMercerSimilarityFactory, TestInfoStreamLogging, TestInitQParser, TermsComponentTest, MBeansHandlerTest, PKIAuthenticationIntegrationTest, SpellCheckCollatorTest, TestSimpleTrackingShardHandler, BlockCacheTest, TestPivotHelperCode, DistributedMLTComponentTest, HighlighterTest, TestFieldResource, TestDynamicFieldCollectionResource, ZkCLITest, TestQuerySenderNoQuery, ConfigSetsAPITest, ZkControllerTest, DistanceFunctionTest, MigrateRouteKeyTest, HdfsNNFailoverTest, BJQParserTest, TestHashPartitioner, UniqFieldsUpdateProcessorFactoryTest, TestConfigSetsAPIExclusivity, TestCollapseQParserPlugin, TestGeoJSONResponseWriter, DistributedQueryComponentCustomSortTest, TestFieldSortValues, CollectionsAPIAsyncDistributedZkTest, DistributedFacetPivotSmallAdvancedTest, TestMiniSolrCloudClusterBase, TestEmbeddedSolrServerConstructors, TestSolrQueryParserResource, SpatialFilterTest, FileUtilsTest, TestRandomCollapseQParserPlugin, VMParamsZkACLAndCredentialsProvidersTest, HdfsDirectoryTest, TestManagedSchema, DistributedVersionInfoTest, DocumentBuilderTest, SimpleMLTQParserTest, TestRecoveryHdfs, MoreLikeThisHandlerTest, TestSolrConfigHandlerCloud, TestUpdate, TestSolrCLIRunExample, TestDFRSimilarityFactory, SpellCheckComponentTest, CdcrReplicationHandlerTest, TestSolrDynamicMBean, CSVRequestHandlerTest, SparseHLLTest, TestSolrCoreProperties, TestPartialUpdateDeduplication, DeleteShardTest, ZkStateWriterTest, CollectionsAPIDistributedZkTest, LeaderElectionTest, TestZkChroot, ShardRoutingCustomTest, AutoCommitTest, TestDistributedGrouping, TermVectorComponentDistributedTest, TestStressReorder, HardAutoCommitTest, TestCoreContainer, SimpleFacetsTest, StatsComponentTest, BasicFunctionalityTest, TestBadConfig, TestIndexSearcher, CurrencyFieldOpenExchangeTest, CurrencyFieldXmlFileTest, SolrIndexSplitterTest, SimplePostToolTest, AnalysisAfterCoreReloadTest, TestExtendedDismaxParser, SuggesterFSTTest, SuggesterTSTTest, TestTrie, TestCSVLoader, PolyFieldTest, NoCacheHeaderTest, WordBreakSolrSpellCheckerTest, SchemaVersionSpecificBehaviorTest, SolrCoreCheckLockOnStartupTest, TestPseudoReturnFields, TestAtomicUpdateErrorCases, TestWordDelimiterFilterFactory, QueryEqualityTest, DirectUpdateHandlerOptimizeTest, StatelessScriptUpdateProcessorFactoryTest, SortByFunctionTest, TestRemoteStreaming, DocValuesMultiTest, TestSolrDeletionPolicy1, SolrInfoMBeanTest, XsltUpdateRequestHandlerTest, IndexBasedSpellCheckerTest, DisMaxRequestHandlerTest, DirectSolrSpellCheckerTest, TestOmitPositions, TestValueSourceCache, FieldAnalysisRequestHandlerTest, IndexSchemaRuntimeFieldTest, IndexSchemaTest, TestAnalyzedSuggestions, TestQuerySenderListener, TestSolrIndexConfig, BadComponentTest, TestMergePolicyConfig, TestSolrDeletionPolicy2, MultiTermTest, SampleTest, TestDocSet, TestBinaryField, TestSearchPerf, NumericFieldsTest, MinimalSchemaTest, TestElisionMultitermQuery, TestConfig, OutputWriterTest, TestFuzzyAnalyzedSuggestions, ExternalFileFieldSortTest, NotRequiredUniqueKeyTest, SpellPossibilityIteratorTest, SynonymTokenizerTest, TestXIncludeConfig, EchoParamsTest, TestPerFieldSimilarity, TestLMDirichletSimilarityFactory, TestIBSimilarityFactory, TestFastWriter, TestFastOutputStream, OpenExchangeRatesOrgProviderTest, URLClassifyProcessorTest, TestFastLRUCache, ChaosMonkeyNothingIsSafeTest, CollectionReloadTest, DistributedQueueTest, ForceLeaderTest, SolrXmlInZkTest, TestCloudPivotFacet, TestExclusionRuleCollectionAccess, TestMiniSolrCloudClusterSSL, TestRandomRequestDistribution]
   [junit4] Completed [481/584 (1!)] on J1 in 36.84s, 1 test, 1 failure <<< FAILURES!

[...truncated 366 lines...]
BUILD FAILED
/home/jenkins/workspace/Lucene-Solr-master-Linux/build.xml:740: The following error occurred while executing this line:
/home/jenkins/workspace/Lucene-Solr-master-Linux/build.xml:684: The following error occurred while executing this line:
/home/jenkins/workspace/Lucene-Solr-master-Linux/build.xml:59: The following error occurred while executing this line:
/home/jenkins/workspace/Lucene-Solr-master-Linux/solr/build.xml:233: The following error occurred while executing this line:
/home/jenkins/workspace/Lucene-Solr-master-Linux/solr/common-build.xml:529: The following error occurred while executing this line:
/home/jenkins/workspace/Lucene-Solr-master-Linux/lucene/common-build.xml:1457: The following error occurred while executing this line:
/home/jenkins/workspace/Lucene-Solr-master-Linux/lucene/common-build.xml:1014: There were test failures: 584 suites (10 ignored), 2353 tests, 1 failure, 116 ignored (70 assumptions) [seed: 5CEE40AF8B2480B9]

Total time: 99 minutes 21 seconds
Build step 'Invoke Ant' marked build as failure
Archiving artifacts
[WARNINGS] Skipping publisher since build result is FAILURE
Recording test results
Email was triggered for: Failure - Any
Sending email for trigger: Failure - Any



Mime
View raw message