lucene-dev mailing list archives

Site index · List index
Message view « Date » · « Thread »
Top « Date » · « Thread »
From "Uwe Schindler" <...@thetaphi.de>
Subject RE: [JENKINS] Lucene-Solr-master-Windows (64bit/jdk1.8.0_92) - Build # 5866 - Still Failing!
Date Wed, 25 May 2016 22:58:07 GMT
Hi,

I cleaned it up and disabled the 6.0 job for now. When back at home I will resize VM's disk.
Windows 10 takes too much space while it installed windows updates...

Uwe

-----
Uwe Schindler
H.-H.-Meier-Allee 63, D-28213 Bremen
http://www.thetaphi.de
eMail: uwe@thetaphi.de

> -----Original Message-----
> From: Uwe Schindler [mailto:uwe@thetaphi.de]
> Sent: Wednesday, May 25, 2016 9:49 PM
> To: Steve Rowe <sarowe@gmail.com>
> Cc: Lucene Dev <dev@lucene.apache.org>
> Subject: Re: [JENKINS] Lucene-Solr-master-Windows (64bit/jdk1.8.0_92) -
> Build # 5866 - Still Failing!
> 
> Sorry,
> 
> Will fix once I have computer.
> 
> Uwe
> 
> Am 25. Mai 2016 19:36:56 MESZ, schrieb Steve Rowe <sarowe@gmail.com>:
> >Uwe: "There is not enough space on the disk”
> >
> >--
> >Steve
> >www.lucidworks.com
> >
> >On May 25, 2016, at 12:31 PM, Policeman Jenkins Server
> ><jenkins@thetaphi.de> wrote:
> >>
> >> Build:
> >http://jenkins.thetaphi.de/job/Lucene-Solr-master-Windows/5866/
> >> Java: 64bit/jdk1.8.0_92 -XX:+UseCompressedOops -XX:+UseG1GC
> >>
> >> All tests passed
> >>
> >> Build Log:
> >> [...truncated 12578 lines...]
> >>   [junit4] JVM J1: stderr was not empty, see:
> >C:\Users\jenkins\workspace\Lucene-Solr-master-Windows\solr\build\solr-
> core\test\temp\junit4-J1-20160525_153447_230.syserr
> >>   [junit4] >>> JVM J1 emitted unexpected output (verbatim) ----
> >>   [junit4] WARN: Exception at main loop level. ->
> >java.lang.RuntimeException: java.io.IOException: There is not enough
> >space on the disk
> >>   [junit4] 	at
> >com.carrotsearch.ant.tasks.junit4.slave.StdInLineIterator.computeNext(Std
> InLineIterator.java:34)
> >>   [junit4] 	at
> >com.carrotsearch.ant.tasks.junit4.slave.StdInLineIterator.computeNext(Std
> InLineIterator.java:13)
> >>   [junit4] 	at
> >com.carrotsearch.ant.tasks.junit4.dependencies.com.google.common.colle
> ct.AbstractIterator.tryToComputeNext(AbstractIterator.java:143)
> >>   [junit4] 	at
> >com.carrotsearch.ant.tasks.junit4.dependencies.com.google.common.colle
> ct.AbstractIterator.hasNext(AbstractIterator.java:138)
> >>   [junit4] 	at
> >com.carrotsearch.ant.tasks.junit4.dependencies.com.google.common.colle
> ct.Iterators$5.hasNext(Iterators.java:568)
> >>   [junit4] 	at
> >com.carrotsearch.ant.tasks.junit4.slave.SlaveMain.execute(SlaveMain.java:
> 229)
> >>   [junit4] 	at
> >com.carrotsearch.ant.tasks.junit4.slave.SlaveMain.main(SlaveMain.java:354
> )
> >>   [junit4] 	at
> >com.carrotsearch.ant.tasks.junit4.slave.SlaveMainSafe.main(SlaveMainSafe
> .java:10)
> >>   [junit4] Caused by: java.io.IOException: There is not enough space
> >on the disk
> >>   [junit4] 	at java.io.FileOutputStream.writeBytes(Native Method)
> >>   [junit4] 	at
> >java.io.FileOutputStream.write(FileOutputStream.java:326)
> >>   [junit4] 	at
> >java.io.BufferedOutputStream.flushBuffer(BufferedOutputStream.java:82)
> >>   [junit4] 	at
> >java.io.BufferedOutputStream.write(BufferedOutputStream.java:126)
> >>   [junit4] 	at
> >com.carrotsearch.ant.tasks.junit4.slave.EventsOutputStream.write(Events
> OutputStream.java:28)
> >>   [junit4] 	at
> >sun.nio.cs.StreamEncoder.writeBytes(StreamEncoder.java:221)
> >>   [junit4] 	at
> >sun.nio.cs.StreamEncoder.implFlushBuffer(StreamEncoder.java:291)
> >>   [junit4] 	at
> >sun.nio.cs.StreamEncoder.implFlush(StreamEncoder.java:295)
> >>   [junit4] 	at sun.nio.cs.StreamEncoder.flush(StreamEncoder.java:141)
> >>   [junit4] 	at
> >java.io.OutputStreamWriter.flush(OutputStreamWriter.java:229)
> >>   [junit4] 	at
> >com.carrotsearch.ant.tasks.junit4.events.Serializer.flush(Serializer.java:127)
> >>   [junit4] 	at
> >com.carrotsearch.ant.tasks.junit4.slave.StdInLineIterator.computeNext(Std
> InLineIterator.java:29)
> >>   [junit4] 	... 7 more
> >>   [junit4] WARN: Exception closing serializer. ->
> >java.io.IOException: There is not enough space on the disk
> >>   [junit4] 	at java.io.FileOutpu
> >>   [junit4] tStream.writeBytes(Native Method)
> >>   [junit4] 	at
> >java.io.FileOutputStream.write(FileOutputStream.java:326)
> >>   [junit4] 	at
> >java.io.BufferedOutputStream.flushBuffer(BufferedOutputStream.java:82)
> >>   [junit4] 	at
> >java.io.BufferedOutputStream.flush(BufferedOutputStream.java:140)
> >>   [junit4] 	at
> >java.io.FilterOutputStream.close(FilterOutputStream.java:158)
> >>   [junit4] 	at
> >com.carrotsearch.ant.tasks.junit4.slave.EventsOutputStream.close(Events
> OutputStream.java:38)
> >>   [junit4] 	at
> >sun.nio.cs.StreamEncoder.implClose(StreamEncoder.java:320)
> >>   [junit4] 	at sun.nio.cs.StreamEncoder.close(StreamEncoder.java:149)
> >>   [junit4] 	at
> >java.io.OutputStreamWriter.close(OutputStreamWriter.java:233)
> >>   [junit4] 	at
> >com.carrotsearch.ant.tasks.junit4.events.Serializer.close(Serializer.java:142
> )
> >>   [junit4] 	at
> >com.carrotsearch.ant.tasks.junit4.slave.SlaveMain.main(SlaveMain.java:376
> )
> >>   [junit4] 	at
> >com.carrotsearch.ant.tasks.junit4.slave.SlaveMainSafe.main(SlaveMainSafe
> .java:10)
> >>   [junit4] <<< JVM J1: EOF ----
> >>
> >> [...truncated 105 lines...]
> >>   [junit4] ERROR: JVM J1 ended with an exception, command line:
> >C:\Users\jenkins\tools\java\64bit\jdk1.8.0_92\jre\bin\java.exe
> >-XX:+UseCompressedOops -XX:+UseG1GC -
> XX:+HeapDumpOnOutOfMemoryError
> >-XX:HeapDumpPath=C:\Users\jenkins\workspace\Lucene-Solr-master-
> Windows\heapdumps
> >-ea -esa -Dtests.prefix=tests -Dtests.seed=FB224ADEFD3A3917 -Xmx512M
> >-Dtests.iters= -Dtests.verbose=false -Dtests.infostream=false
> >-Dtests.codec=random -Dtests.postingsformat=random
> >-Dtests.docvaluesformat=random -Dtests.locale=random
> >-Dtests.timezone=random -Dtests.directory=random
> >-Dtests.linedocsfile=europarl.lines.txt.gz
> >-Dtests.luceneMatchVersion=7.0.0 -Dtests.cleanthreads=perClass
> >-Djava.util.logging.config.file=C:\Users\jenkins\workspace\Lucene-Solr-
> master-Windows\lucene\tools\junit4\logging.properties
> >-Dtests.nightly=false -Dtests.weekly=false -Dtests.monster=false
> >-Dtests.slow=true -Dtests.asserts=true -Dtests.multiplier=1
> >-DtempDir=./temp -Djava.io.tmpdir=./temp
> >-Djunit4.tempDir=C:\Users\jenkins\workspace\Lucene-Solr-master-
> Windows\solr\build\solr-core\test\temp
> >-Dcommon.dir=C:\Users\jenkins\workspace\Lucene-Solr-master-
> Windows\lucene
> >-Dclover.db.dir=C:\Users\jenkins\workspace\Lucene-Solr-master-
> Windows\lucene\build\clover\db
> >-Djava.security.policy=C:\Users\jenkins\workspace\Lucene-Solr-master-
> Windows\lucene\tools\junit4\solr-tests.policy
> >-Dtests.LUCENE_VERSION=7.0.0 -Djetty.testMode=1
> >-Djetty.insecurerandom=1
> >-Dsolr.directoryFactory=org.apache.solr.core.MockDirectoryFactory
> >-Djava.awt.headless=true -Djdk.map.althashing.threshold=0
> >-Djunit4.childvm.cwd=C:\Users\jenkins\workspace\Lucene-Solr-master-
> Windows\solr\build\solr-core\test\J1
> >-Djunit4.childvm.id=1 -Djunit4.childvm.count=2
> >-Dtests.leaveTemporary=false -Dtests.filterstacks=true
> >-Dtests.disableHdfs=true
> >-Djava.security.manager=org.apache.lucene.util.TestSecurityManager
> >-classpath
> >C:\Users\jenkins\workspace\Lucene-Solr-master-Windows\solr\build\solr-
> core\classes\test;C:\Users\jenkins\workspace\Lucene-Solr-master-
> Windows\solr\build\solr-test-
> framework\classes\java;C:\Users\jenkins\workspace\Lucene-Solr-master-
> Windows\solr\test-framework\lib\junit4-ant-
> 2.3.4.jar;C:\Users\jenkins\workspace\Lucene-Solr-master-
> Windows\solr\core\src\test-files;C:\Users\jenkins\workspace\Lucene-Solr-
> master-Windows\lucene\build\test-
> framework\classes\java;C:\Users\jenkins\workspace\Lucene-Solr-master-
> Windows\lucene\build\codecs\classes\java;C:\Users\jenkins\workspace\Lu
> cene-Solr-master-Windows\solr\build\solr-
> solrj\classes\java;C:\Users\jenkins\workspace\Lucene-Solr-master-
> Windows\solr\build\solr-
> core\classes\java;C:\Users\jenkins\workspace\Lucene-Solr-master-
> Windows\lucene\build\analysis\common\lucene-analyzers-common-7.0.0-
> SNAPSHOT.jar;C:\Users\jenkins\workspace\Lucene-Solr-master-
> Windows\lucene\build\analysis\kuromoji\lucene-analyzers-kuromoji-7.0.0-
> SNAPSHOT.jar;C:\Users\jenkins\w
> orkspace\Lucene-Solr-master-
> Windows\lucene\build\analysis\phonetic\lucene-analyzers-phonetic-7.0.0-
> SNAPSHOT.jar;C:\Users\jenkins\workspace\Lucene-Solr-master-
> Windows\lucene\build\codecs\lucene-codecs-7.0.0-
> SNAPSHOT.jar;C:\Users\jenkins\workspace\Lucene-Solr-master-
> Windows\lucene\build\backward-codecs\lucene-backward-codecs-7.0.0-
> SNAPSHOT.jar;C:\Users\jenkins\workspace\Lucene-Solr-master-
> Windows\lucene\build\highlighter\lucene-highlighter-7.0.0-
> SNAPSHOT.jar;C:\Users\jenkins\workspace\Lucene-Solr-master-
> Windows\lucene\build\memory\lucene-memory-7.0.0-
> SNAPSHOT.jar;C:\Users\jenkins\workspace\Lucene-Solr-master-
> Windows\lucene\build\misc\lucene-misc-7.0.0-
> SNAPSHOT.jar;C:\Users\jenkins\workspace\Lucene-Solr-master-
> Windows\lucene\build\spatial-extras\lucene-spatial-extras-7.0.0-
> SNAPSHOT.jar;C:\Users\jenkins\workspace\Lucene-Solr-master-
> Windows\lucene\build\expressions\lucene-expressions-7.0.0-
> SNAPSHOT.jar;C:\Users\jenkins\workspace\Lucene-Solr-master-
> Windows\lucene\build\suggest\lucene-sugge
> st-7.0.0-SNAPSHOT.jar;C:\Users\jenkins\workspace\Lucene-Solr-master-
> Windows\lucene\build\grouping\lucene-grouping-7.0.0-
> SNAPSHOT.jar;C:\Users\jenkins\workspace\Lucene-Solr-master-
> Windows\lucene\build\queries\lucene-queries-7.0.0-
> SNAPSHOT.jar;C:\Users\jenkins\workspace\Lucene-Solr-master-
> Windows\lucene\build\queryparser\lucene-queryparser-7.0.0-
> SNAPSHOT.jar;C:\Users\jenkins\workspace\Lucene-Solr-master-
> Windows\lucene\build\join\lucene-join-7.0.0-
> SNAPSHOT.jar;C:\Users\jenkins\workspace\Lucene-Solr-master-
> Windows\lucene\build\sandbox\lucene-sandbox-7.0.0-
> SNAPSHOT.jar;C:\Users\jenkins\workspace\Lucene-Solr-master-
> Windows\lucene\build\classification\lucene-classification-7.0.0-
> SNAPSHOT.jar;C:\Users\jenkins\workspace\Lucene-Solr-master-
> Windows\solr\core\lib\antlr4-runtime-4.5.1-
> 1.jar;C:\Users\jenkins\workspace\Lucene-Solr-master-
> Windows\solr\core\lib\asm-5.0.4.jar;C:\Users\jenkins\workspace\Lucene-
> Solr-master-Windows\solr\core\lib\asm-commons-
> 5.0.4.jar;C:\Users\jenkins\workspace\Lucene-Sol
> r-master-Windows\solr\core\lib\caffeine-
> 1.0.1.jar;C:\Users\jenkins\workspace\Lucene-Solr-master-
> Windows\solr\core\lib\commons-cli-
> 1.2.jar;C:\Users\jenkins\workspace\Lucene-Solr-master-
> Windows\solr\core\lib\commons-codec-
> 1.10.jar;C:\Users\jenkins\workspace\Lucene-Solr-master-
> Windows\solr\core\lib\commons-collections-
> 3.2.2.jar;C:\Users\jenkins\workspace\Lucene-Solr-master-
> Windows\solr\core\lib\commons-configuration-
> 1.6.jar;C:\Users\jenkins\workspace\Lucene-Solr-master-
> Windows\solr\core\lib\commons-exec-
> 1.3.jar;C:\Users\jenkins\workspace\Lucene-Solr-master-
> Windows\solr\core\lib\commons-fileupload-
> 1.3.1.jar;C:\Users\jenkins\workspace\Lucene-Solr-master-
> Windows\solr\core\lib\commons-io-
> 2.5.jar;C:\Users\jenkins\workspace\Lucene-Solr-master-
> Windows\solr\core\lib\commons-lang-
> 2.6.jar;C:\Users\jenkins\workspace\Lucene-Solr-master-
> Windows\solr\core\lib\dom4j-
> 1.6.1.jar;C:\Users\jenkins\workspace\Lucene-Solr-master-
> Windows\solr\core\lib\guava-
> 14.0.1.jar;C:\Users\jenkins\workspace\Lucene-Solr-mas
> ter-Windows\solr\core\lib\hadoop-annotations-
> 2.6.0.jar;C:\Users\jenkins\workspace\Lucene-Solr-master-
> Windows\solr\core\lib\hadoop-auth-
> 2.6.0.jar;C:\Users\jenkins\workspace\Lucene-Solr-master-
> Windows\solr\core\lib\hadoop-common-
> 2.6.0.jar;C:\Users\jenkins\workspace\Lucene-Solr-master-
> Windows\solr\core\lib\hadoop-hdfs-
> 2.6.0.jar;C:\Users\jenkins\workspace\Lucene-Solr-master-
> Windows\solr\core\lib\hppc-0.7.1.jar;C:\Users\jenkins\workspace\Lucene-
> Solr-master-Windows\solr\core\lib\htrace-core-
> 3.0.4.jar;C:\Users\jenkins\workspace\Lucene-Solr-master-
> Windows\solr\core\lib\jackson-core-
> 2.5.4.jar;C:\Users\jenkins\workspace\Lucene-Solr-master-
> Windows\solr\core\lib\jackson-dataformat-smile-
> 2.5.4.jar;C:\Users\jenkins\workspace\Lucene-Solr-master-
> Windows\solr\core\lib\jcl-over-slf4j-
> 1.7.7.jar;C:\Users\jenkins\workspace\Lucene-Solr-master-
> Windows\solr\core\lib\joda-time-
> 2.2.jar;C:\Users\jenkins\workspace\Lucene-Solr-master-
> Windows\solr\core\lib\log4j-1.2.17.jar;C:\Users\jenkins\workspace\Lucene-
> Solr-m
> aster-Windows\solr\core\lib\org.restlet-
> 2.3.0.jar;C:\Users\jenkins\workspace\Lucene-Solr-master-
> Windows\solr\core\lib\org.restlet.ext.servlet-
> 2.3.0.jar;C:\Users\jenkins\workspace\Lucene-Solr-master-
> Windows\solr\core\lib\presto-parser-
> 0.122.jar;C:\Users\jenkins\workspace\Lucene-Solr-master-
> Windows\solr\core\lib\protobuf-java-
> 2.5.0.jar;C:\Users\jenkins\workspace\Lucene-Solr-master-
> Windows\solr\core\lib\slf4j-log4j12-
> 1.7.7.jar;C:\Users\jenkins\workspace\Lucene-Solr-master-
> Windows\solr\core\lib\slice-0.10.jar;C:\Users\jenkins\workspace\Lucene-
> Solr-master-Windows\solr\core\lib\spatial4j-
> 0.6.jar;C:\Users\jenkins\workspace\Lucene-Solr-master-
> Windows\solr\core\lib\t-digest-3.1.jar;C:\Users\jenkins\workspace\Lucene-
> Solr-master-Windows\solr\solrj\lib\commons-io-
> 2.5.jar;C:\Users\jenkins\workspace\Lucene-Solr-master-
> Windows\solr\solrj\lib\httpclient-
> 4.4.1.jar;C:\Users\jenkins\workspace\Lucene-Solr-master-
> Windows\solr\solrj\lib\httpcore-
> 4.4.1.jar;C:\Users\jenkins\workspace\Lucene-Solr-master-Wind
> ows\solr\solrj\lib\httpmime-4.4.1.jar;C:\Users\jenkins\workspace\Lucene-
> Solr-master-Windows\solr\solrj\lib\jcl-over-slf4j-
> 1.7.7.jar;C:\Users\jenkins\workspace\Lucene-Solr-master-
> Windows\solr\solrj\lib\noggit-0.6.jar;C:\Users\jenkins\workspace\Lucene-
> Solr-master-Windows\solr\solrj\lib\slf4j-api-
> 1.7.7.jar;C:\Users\jenkins\workspace\Lucene-Solr-master-
> Windows\solr\solrj\lib\stax2-api-
> 3.1.4.jar;C:\Users\jenkins\workspace\Lucene-Solr-master-
> Windows\solr\solrj\lib\woodstox-core-asl-
> 4.4.1.jar;C:\Users\jenkins\workspace\Lucene-Solr-master-
> Windows\solr\solrj\lib\zookeeper-
> 3.4.6.jar;C:\Users\jenkins\workspace\Lucene-Solr-master-
> Windows\solr\server\lib\javax.servlet-api-
> 3.1.0.jar;C:\Users\jenkins\workspace\Lucene-Solr-master-
> Windows\solr\server\lib\jetty-continuation-
> 9.3.8.v20160314.jar;C:\Users\jenkins\workspace\Lucene-Solr-master-
> Windows\solr\server\lib\jetty-deploy-
> 9.3.8.v20160314.jar;C:\Users\jenkins\workspace\Lucene-Solr-master-
> Windows\solr\server\lib\jetty-http-9.3.8.v20160314.jar;C:\User
> s\jenkins\workspace\Lucene-Solr-master-Windows\solr\server\lib\jetty-io-
> 9.3.8.v20160314.jar;C:\Users\jenkins\workspace\Lucene-Solr-master-
> Windows\solr\server\lib\jetty-jmx-
> 9.3.8.v20160314.jar;C:\Users\jenkins\workspace\Lucene-Solr-master-
> Windows\solr\server\lib\jetty-rewrite-
> 9.3.8.v20160314.jar;C:\Users\jenkins\workspace\Lucene-Solr-master-
> Windows\solr\server\lib\jetty-security-
> 9.3.8.v20160314.jar;C:\Users\jenkins\workspace\Lucene-Solr-master-
> Windows\solr\server\lib\jetty-server-
> 9.3.8.v20160314.jar;C:\Users\jenkins\workspace\Lucene-Solr-master-
> Windows\solr\server\lib\jetty-servlet-
> 9.3.8.v20160314.jar;C:\Users\jenkins\workspace\Lucene-Solr-master-
> Windows\solr\server\lib\jetty-servlets-
> 9.3.8.v20160314.jar;C:\Users\jenkins\workspace\Lucene-Solr-master-
> Windows\solr\server\lib\jetty-util-
> 9.3.8.v20160314.jar;C:\Users\jenkins\workspace\Lucene-Solr-master-
> Windows\solr\server\lib\jetty-webapp-
> 9.3.8.v20160314.jar;C:\Users\jenkins\workspace\Lucene-Solr-master-
> Windows\solr\server\lib\jetty-xml-9
> .3.8.v20160314.jar;C:\Users\jenkins\workspace\Lucene-Solr-master-
> Windows\solr\example\example-DIH\solr\db\lib\derby-
> 10.9.1.0.jar;C:\Users\jenkins\workspace\Lucene-Solr-master-
> Windows\solr\example\example-DIH\solr\db\lib\hsqldb-
> 1.8.0.10.jar;C:\Users\jenkins\workspace\Lucene-Solr-master-
> Windows\lucene\build\core\classes\java;C:\Users\jenkins\workspace\Luce
> ne-Solr-master-Windows\lucene\test-framework\lib\junit-
> 4.10.jar;C:\Users\jenkins\workspace\Lucene-Solr-master-
> Windows\lucene\test-framework\lib\randomizedtesting-runner-
> 2.3.4.jar;C:\Users\jenkins\workspace\Lucene-Solr-master-
> Windows\solr\core\test-lib\antlr-
> 2.7.7.jar;C:\Users\jenkins\workspace\Lucene-Solr-master-
> Windows\solr\core\test-lib\antlr4-runtime-4.5.1-
> 1.jar;C:\Users\jenkins\workspace\Lucene-Solr-master-
> Windows\solr\core\test-lib\apacheds-core-2.0.0-
> M15.jar;C:\Users\jenkins\workspace\Lucene-Solr-master-
> Windows\solr\core\test-lib\apacheds-core-api-2.0.0-
> M15.jar;C:\Users\jenkins\workspace\Lucene-Solr-master-
> Windows\solr\core\test
> -lib\apacheds-core-avl-2.0.0-M15.jar;C:\Users\jenkins\workspace\Lucene-
> Solr-master-Windows\solr\core\test-lib\apacheds-core-shared-2.0.0-
> M15.jar;C:\Users\jenkins\workspace\Lucene-Solr-master-
> Windows\solr\core\test-lib\apacheds-i18n-2.0.0-
> M15.jar;C:\Users\jenkins\workspace\Lucene-Solr-master-
> Windows\solr\core\test-lib\apacheds-interceptor-kerberos-2.0.0-
> M15.jar;C:\Users\jenkins\workspace\Lucene-Solr-master-
> Windows\solr\core\test-lib\apacheds-interceptors-admin-2.0.0-
> M15.jar;C:\Users\jenkins\workspace\Lucene-Solr-master-
> Windows\solr\core\test-lib\apacheds-interceptors-authn-2.0.0-
> M15.jar;C:\Users\jenkins\workspace\Lucene-Solr-master-
> Windows\solr\core\test-lib\apacheds-interceptors-authz-2.0.0-
> M15.jar;C:\Users\jenkins\workspace\Lucene-Solr-master-
> Windows\solr\core\test-lib\apacheds-interceptors-changelog-2.0.0-
> M15.jar;C:\Users\jenkins\workspace\Lucene-Solr-master-
> Windows\solr\core\test-lib\apacheds-interceptors-collective-2.0.0-
> M15.jar;C:\Users\jenkins\workspace\Lucene-Solr-master-Windo
> ws\solr\core\test-lib\apacheds-interceptors-event-2.0.0-
> M15.jar;C:\Users\jenkins\workspace\Lucene-Solr-master-
> Windows\solr\core\test-lib\apacheds-interceptors-exception-2.0.0-
> M15.jar;C:\Users\jenkins\workspace\Lucene-Solr-master-
> Windows\solr\core\test-lib\apacheds-interceptors-journal-2.0.0-
> M15.jar;C:\Users\jenkins\workspace\Lucene-Solr-master-
> Windows\solr\core\test-lib\apacheds-interceptors-normalization-2.0.0-
> M15.jar;C:\Users\jenkins\workspace\Lucene-Solr-master-
> Windows\solr\core\test-lib\apacheds-interceptors-operational-2.0.0-
> M15.jar;C:\Users\jenkins\workspace\Lucene-Solr-master-
> Windows\solr\core\test-lib\apacheds-interceptors-referral-2.0.0-
> M15.jar;C:\Users\jenkins\workspace\Lucene-Solr-master-
> Windows\solr\core\test-lib\apacheds-interceptors-schema-2.0.0-
> M15.jar;C:\Users\jenkins\workspace\Lucene-Solr-master-
> Windows\solr\core\test-lib\apacheds-interceptors-subtree-2.0.0-
> M15.jar;C:\Users\jenkins\workspace\Lucene-Solr-master-
> Windows\solr\core\test-lib\apacheds-interceptors-trigger-
> 2.0.0-M15.jar;C:\Users\jenkins\workspace\Lucene-Solr-master-
> Windows\solr\core\test-lib\apacheds-jdbm-partition-2.0.0-
> M15.jar;C:\Users\jenkins\workspace\Lucene-Solr-master-
> Windows\solr\core\test-lib\apacheds-jdbm1-2.0.0-
> M2.jar;C:\Users\jenkins\workspace\Lucene-Solr-master-
> Windows\solr\core\test-lib\apacheds-kerberos-codec-2.0.0-
> M15.jar;C:\Users\jenkins\workspace\Lucene-Solr-master-
> Windows\solr\core\test-lib\apacheds-ldif-partition-2.0.0-
> M15.jar;C:\Users\jenkins\workspace\Lucene-Solr-master-
> Windows\solr\core\test-lib\apacheds-mavibot-partition-2.0.0-
> M15.jar;C:\Users\jenkins\workspace\Lucene-Solr-master-
> Windows\solr\core\test-lib\apacheds-protocol-kerberos-2.0.0-
> M15.jar;C:\Users\jenkins\workspace\Lucene-Solr-master-
> Windows\solr\core\test-lib\apacheds-protocol-ldap-2.0.0-
> M15.jar;C:\Users\jenkins\workspace\Lucene-Solr-master-
> Windows\solr\core\test-lib\apacheds-protocol-shared-2.0.0-
> M15.jar;C:\Users\jenkins\workspace\Lucene-Solr-master-
> Windows\solr\core\test-lib\apacheds-xdbm-partition-2.0
> .0-M15.jar;C:\Users\jenkins\workspace\Lucene-Solr-master-
> Windows\solr\core\test-lib\api-all-1.0.0-
> M20.jar;C:\Users\jenkins\workspace\Lucene-Solr-master-
> Windows\solr\core\test-lib\bcprov-jdk15-
> 1.45.jar;C:\Users\jenkins\workspace\Lucene-Solr-master-
> Windows\solr\core\test-lib\cglib-nodep-
> 2.2.jar;C:\Users\jenkins\workspace\Lucene-Solr-master-
> Windows\solr\core\test-lib\commons-collections-
> 3.2.2.jar;C:\Users\jenkins\workspace\Lucene-Solr-master-
> Windows\solr\core\test-lib\commons-math3-
> 3.4.1.jar;C:\Users\jenkins\workspace\Lucene-Solr-master-
> Windows\solr\core\test-lib\easymock-
> 3.0.jar;C:\Users\jenkins\workspace\Lucene-Solr-master-
> Windows\solr\core\test-lib\ehcache-core-
> 2.4.4.jar;C:\Users\jenkins\workspace\Lucene-Solr-master-
> Windows\solr\core\test-lib\hadoop-common-2.6.0-
> tests.jar;C:\Users\jenkins\workspace\Lucene-Solr-master-
> Windows\solr\core\test-lib\hadoop-hdfs-2.6.0-
> tests.jar;C:\Users\jenkins\workspace\Lucene-Solr-master-
> Windows\solr\core\test-lib\hadoop-minikdc-2.6.0.jar;C:\Users\jenkins
> \workspace\Lucene-Solr-master-Windows\solr\core\test-lib\jackson-
> annotations-2.5.4.jar;C:\Users\jenkins\workspace\Lucene-Solr-master-
> Windows\solr\core\test-lib\jackson-databind-
> 2.5.4.jar;C:\Users\jenkins\workspace\Lucene-Solr-master-
> Windows\solr\core\test-lib\jersey-core-
> 1.9.jar;C:\Users\jenkins\workspace\Lucene-Solr-master-
> Windows\solr\core\test-lib\jersey-server-
> 1.9.jar;C:\Users\jenkins\workspace\Lucene-Solr-master-
> Windows\solr\core\test-lib\jetty-
> 6.1.26.jar;C:\Users\jenkins\workspace\Lucene-Solr-master-
> Windows\solr\core\test-lib\jetty-util-
> 6.1.26.jar;C:\Users\jenkins\workspace\Lucene-Solr-master-
> Windows\solr\core\test-lib\mina-core-2.0.0-
> M5.jar;C:\Users\jenkins\workspace\Lucene-Solr-master-
> Windows\solr\core\test-lib\mockito-core-
> 1.9.5.jar;C:\Users\jenkins\workspace\Lucene-Solr-master-
> Windows\solr\core\test-lib\objenesis-
> 1.2.jar;C:\Users\jenkins\workspace\Lucene-Solr-master-
> Windows\solr\core\test-lib\presto-parser-
> 0.122.jar;C:\Users\jenkins\workspace\Lucene-Solr-master-Windows\solr
> \core\test-lib\slice-0.10.jar;C:\Users\jenkins\workspace\Lucene-Solr-
> master-Windows\lucene\build\analysis\icu\lucene-analyzers-icu-7.0.0-
> SNAPSHOT.jar;C:\Users\jenkins\workspace\Lucene-Solr-master-
> Windows\solr\build\contrib\solr-analysis-
> extras\classes\java;C:\Users\jenkins\workspace\Lucene-Solr-master-
> Windows\lucene\build\queryparser\classes\test;C:\Users\jenkins\workspac
> e\Lucene-Solr-master-Windows\solr\contrib\analysis-extras\lib\icu4j-
> 56.1.jar;C:\Users\jenkins\tools\hudson.tasks.Ant_AntInstallation\ANT_1.8.2
> \lib\ant-launcher.jar;C:\Users\jenkins\.ant\lib\ivy-
> 2.3.0.jar;C:\Users\jenkins\tools\hudson.tasks.Ant_AntInstallation\ANT_1.8.
> 2\lib\ant-
> antlr.jar;C:\Users\jenkins\tools\hudson.tasks.Ant_AntInstallation\ANT_1.8.2
> \lib\ant-apache-
> bcel.jar;C:\Users\jenkins\tools\hudson.tasks.Ant_AntInstallation\ANT_1.8.2
> \lib\ant-apache-
> bsf.jar;C:\Users\jenkins\tools\hudson.tasks.Ant_AntInstallation\ANT_1.8.2\l
> ib\ant-apache-
> log4j.jar;C:\Users\jenkins\tools\hudson.tasks.Ant_AntInstallation\ANT_1.8.
> 2\
> lib\ant-apache-
> oro.jar;C:\Users\jenkins\tools\hudson.tasks.Ant_AntInstallation\ANT_1.8.2\
> lib\ant-apache-
> regexp.jar;C:\Users\jenkins\tools\hudson.tasks.Ant_AntInstallation\ANT_1.
> 8.2\lib\ant-apache-
> resolver.jar;C:\Users\jenkins\tools\hudson.tasks.Ant_AntInstallation\ANT_1
> .8.2\lib\ant-apache-
> xalan2.jar;C:\Users\jenkins\tools\hudson.tasks.Ant_AntInstallation\ANT_1.8
> .2\lib\ant-commons-
> logging.jar;C:\Users\jenkins\tools\hudson.tasks.Ant_AntInstallation\ANT_1.
> 8.2\lib\ant-commons-
> net.jar;C:\Users\jenkins\tools\hudson.tasks.Ant_AntInstallation\ANT_1.8.2\
> lib\ant-
> jai.jar;C:\Users\jenkins\tools\hudson.tasks.Ant_AntInstallation\ANT_1.8.2\li
> b\ant-
> javamail.jar;C:\Users\jenkins\tools\hudson.tasks.Ant_AntInstallation\ANT_1
> .8.2\lib\ant-
> jdepend.jar;C:\Users\jenkins\tools\hudson.tasks.Ant_AntInstallation\ANT_
> 1.8.2\lib\ant-
> jmf.jar;C:\Users\jenkins\tools\hudson.tasks.Ant_AntInstallation\ANT_1.8.2\
> lib\ant-
> jsch.jar;C:\Users\jenkins\tools\hudson.tasks.Ant_AntInstallation\ANT_1.8.2
> \lib\ant-junit.jar;C:\Users\
> jenkins\tools\hudson.tasks.Ant_AntInstallation\ANT_1.8.2\lib\ant-
> junit4.jar;C:\Users\jenkins\tools\hudson.tasks.Ant_AntInstallation\ANT_1.8.
> 2\lib\ant-
> netrexx.jar;C:\Users\jenkins\tools\hudson.tasks.Ant_AntInstallation\ANT_1
> .8.2\lib\ant-
> swing.jar;C:\Users\jenkins\tools\hudson.tasks.Ant_AntInstallation\ANT_1.8.
> 2\lib\ant-
> testutil.jar;C:\Users\jenkins\tools\hudson.tasks.Ant_AntInstallation\ANT_1.
> 8.2\lib\ant.jar;C:\Users\jenkins\tools\java\64bit\jdk1.8.0_92\lib\tools.jar;C:\
> Users\jenkins\.ivy2\cache\com.carrotsearch.randomizedtesting\junit4-
> ant\jars\junit4-ant-2.3.4.jar
> >com.carrotsearch.ant.tasks.junit4.slave.SlaveMainSafe -eventsfile
> >C:\Users\jenkins\workspace\Lucene-Solr-master-Windows\solr\build\solr-
> core\test\temp\junit4-J1-20160525_153447_230.events
> >@C:\Users\jenkins\workspace\Lucene-Solr-master-
> Windows\solr\build\solr-core\test\temp\junit4-J1-
> 20160525_153447_230.suites
> >-stdin
> >>   [junit4] ERROR: JVM J1 ended with an exception: Forked process
> >returned with error code: 240. Very likely a JVM crash.  See process
> >stderr at:
> >C:\Users\jenkins\workspace\Lucene-Solr-master-Windows\solr\build\solr-
> core\test\temp\junit4-J1-20160525_153447_230.syserr
> >>   [junit4] 	at
> >com.carrotsearch.ant.tasks.junit4.JUnit4.executeSlave(JUnit4.java:1481)
> >>   [junit4] 	at
> >com.carrotsearch.ant.tasks.junit4.JUnit4.access$000(JUnit4.java:121)
> >>   [junit4] 	at
> >com.carrotsearch.ant.tasks.junit4.JUnit4$2.call(JUnit4.java:955)
> >>   [junit4] 	at
> >com.carrotsearch.ant.tasks.junit4.JUnit4$2.call(JUnit4.java:952)
> >>   [junit4] 	at
> >java.util.concurrent.FutureTask.run(FutureTask.java:266)
> >>   [junit4] 	at
> >java.util.concurrent.ThreadPoolExecutor.runWorker(ThreadPoolExecutor.ja
> va:1142)
> >>   [junit4] 	at
> >java.util.concurrent.ThreadPoolExecutor$Worker.run(ThreadPoolExecutor.j
> ava:617)
> >>   [junit4] 	at java.lang.Thread.run(Thread.java:745)
> >>
> >> BUILD FAILED
> >> C:\Users\jenkins\workspace\Lucene-Solr-master-
> Windows\build.xml:740:
> >The following error occurred while executing this line:
> >> C:\Users\jenkins\workspace\Lucene-Solr-master-
> Windows\build.xml:684:
> >The following error occurred while executing this line:
> >> C:\Users\jenkins\workspace\Lucene-Solr-master-Windows\build.xml:59:
> >The following error occurred while executing this line:
> >>
> >C:\Users\jenkins\workspace\Lucene-Solr-master-
> Windows\solr\build.xml:233:
> >The following error occurred while executing this line:
> >>
> >C:\Users\jenkins\workspace\Lucene-Solr-master-Windows\solr\common-
> build.xml:531:
> >The following error occurred while executing this line:
> >>
> >C:\Users\jenkins\workspace\Lucene-Solr-master-
> Windows\lucene\common-build.xml:1427:
> >The following error occurred while executing this line:
> >>
> >C:\Users\jenkins\workspace\Lucene-Solr-master-
> Windows\lucene\common-build.xml:984:
> >At least one slave process threw an exception, first: Forked process
> >returned with error code: 240. Very likely a JVM crash.  See process
> >stderr at:
> >C:\Users\jenkins\workspace\Lucene-Solr-master-Windows\solr\build\solr-
> core\test\temp\junit4-J1-20160525_153447_230.syserr
> >>
> >> Total time: 80 minutes 22 seconds
> >> Build step 'Invoke Ant' marked build as failure
> >> Archiving artifacts
> >> [WARNINGS] Skipping publisher since build result is FAILURE
> >> Recording test results
> >> Email was triggered for: Failure - Any
> >> Sending email for trigger: Failure - Any
> >>
> >>
> >>
> >> ---------------------------------------------------------------------
> >> To unsubscribe, e-mail: dev-unsubscribe@lucene.apache.org
> >> For additional commands, e-mail: dev-help@lucene.apache.org
> 
> --
> Uwe Schindler
> H.-H.-Meier-Allee 63, 28213 Bremen
> http://www.thetaphi.de
> 
> ---------------------------------------------------------------------
> To unsubscribe, e-mail: dev-unsubscribe@lucene.apache.org
> For additional commands, e-mail: dev-help@lucene.apache.org


---------------------------------------------------------------------
To unsubscribe, e-mail: dev-unsubscribe@lucene.apache.org
For additional commands, e-mail: dev-help@lucene.apache.org


Mime
View raw message