lucene-dev mailing list archives

Site index · List index
Message view « Date » · « Thread »
Top « Date » · « Thread »
From "Uwe Schindler" <...@thetaphi.de>
Subject RE: [JENKINS-EA] Lucene-Solr-6.x-Linux (32bit/jdk-9-ea+118) - Build # 668 - Still Failing!
Date Mon, 16 May 2016 13:54:40 GMT
Hi,

I am currently digging what causes this! The class is still part of JDK 9, but it seems that
also loading deprecated classes prints lots of warnings. It looks like the CORBA and JAXB
modules are hidden by Jigsaw.

If needed I will open a bug report @ Oracle.

Uwe

-----
Uwe Schindler
H.-H.-Meier-Allee 63, D-28213 Bremen
http://www.thetaphi.de
eMail: uwe@thetaphi.de

> -----Original Message-----
> From: Policeman Jenkins Server [mailto:jenkins@thetaphi.de]
> Sent: Monday, May 16, 2016 2:05 PM
> To: dev@lucene.apache.org
> Subject: [JENKINS-EA] Lucene-Solr-6.x-Linux (32bit/jdk-9-ea+118) - Build #
> 668 - Still Failing!
> Importance: Low
> 
> Build: http://jenkins.thetaphi.de/job/Lucene-Solr-6.x-Linux/668/
> Java: 32bit/jdk-9-ea+118 -client -XX:+UseConcMarkSweepGC
> 
> All tests passed
> 
> Build Log:
> [...truncated 38436 lines...]
> BUILD FAILED
> /home/jenkins/workspace/Lucene-Solr-6.x-Linux/build.xml:740: The
> following error occurred while executing this line:
> /home/jenkins/workspace/Lucene-Solr-6.x-Linux/build.xml:117: The
> following error occurred while executing this line:
> /home/jenkins/workspace/Lucene-Solr-6.x-Linux/solr/build.xml:347: The
> following error occurred while executing this line:
> /home/jenkins/workspace/Lucene-Solr-6.x-Linux/solr/common-
> build.xml:509: Check for forbidden API calls failed:
> java.lang.ClassNotFoundException: javax.xml.bind.DatatypeConverter
> 	at
> de.thetaphi.forbiddenapis.Checker.getClassFromClassLoader(Checker.java:2
> 64)
> 	at
> de.thetaphi.forbiddenapis.Checker.lookupRelatedClass(Checker.java:277)
> 	at
> de.thetaphi.forbiddenapis.ClassScanner$2.checkMethodAccess(ClassScanne
> r.java:349)
> 	at
> de.thetaphi.forbiddenapis.ClassScanner$2.visitMethodInsn(ClassScanner.jav
> a:469)
> 	at de.thetaphi.forbiddenapis.asm.ClassReader.a(Unknown Source)
> 	at de.thetaphi.forbiddenapis.asm.ClassReader.b(Unknown Source)
> 	at de.thetaphi.forbiddenapis.asm.ClassReader.accept(Unknown
> Source)
> 	at de.thetaphi.forbiddenapis.asm.ClassReader.accept(Unknown
> Source)
> 	at de.thetaphi.forbiddenapis.Checker.checkClass(Checker.java:528)
> 	at de.thetaphi.forbiddenapis.Checker.run(Checker.java:545)
> 	at de.thetaphi.forbiddenapis.ant.AntTask.execute(AntTask.java:189)
> 	at
> org.apache.tools.ant.UnknownElement.execute(UnknownElement.java:291)
> 	at
> jdk.internal.reflect.GeneratedMethodAccessor561.invoke(Unknown Source)
> 	at
> jdk.internal.reflect.DelegatingMethodAccessorImpl.invoke(java.base@9-
> ea/DelegatingMethodAccessorImpl.java:43)
> 	at java.lang.reflect.Method.invoke(java.base@9-
> ea/Method.java:531)
> 	at
> org.apache.tools.ant.dispatch.DispatchUtils.execute(DispatchUtils.java:106)
> 	at org.apache.tools.ant.Task.perform(Task.java:348)
> 	at org.apache.tools.ant.Target.execute(Target.java:390)
> 	at org.apache.tools.ant.Target.performTasks(Target.java:411)
> 	at
> org.apache.tools.ant.Project.executeSortedTargets(Project.java:1399)
> 	at
> org.apache.tools.ant.helper.SingleCheckExecutor.executeTargets(SingleChe
> ckExecutor.java:38)
> 	at org.apache.tools.ant.Project.executeTargets(Project.java:1251)
> 	at org.apache.tools.ant.taskdefs.Ant.execute(Ant.java:442)
> 	at org.apache.tools.ant.taskdefs.SubAnt.execute(SubAnt.java:302)
> 	at org.apache.tools.ant.taskdefs.SubAnt.execute(SubAnt.java:221)
> 	at
> org.apache.tools.ant.UnknownElement.execute(UnknownElement.java:291)
> 	at
> jdk.internal.reflect.GeneratedMethodAccessor561.invoke(Unknown Source)
> 	at
> jdk.internal.reflect.DelegatingMethodAccessorImpl.invoke(java.base@9-
> ea/DelegatingMethodAccessorImpl.java:43)
> 	at java.lang.reflect.Method.invoke(java.base@9-
> ea/Method.java:531)
> 	at
> org.apache.tools.ant.dispatch.DispatchUtils.execute(DispatchUtils.java:106)
> 	at org.apache.tools.ant.Task.perform(Task.java:348)
> 	at org.apache.tools.ant.Target.execute(Target.java:390)
> 	at org.apache.tools.ant.Target.performTasks(Target.java:411)
> 	at
> org.apache.tools.ant.Project.executeSortedTargets(Project.java:1399)
> 	at
> org.apache.tools.ant.helper.SingleCheckExecutor.executeTargets(SingleChe
> ckExecutor.java:38)
> 	at org.apache.tools.ant.Project.executeTargets(Project.java:1251)
> 	at org.apache.tools.ant.taskdefs.Ant.execute(Ant.java:442)
> 	at org.apache.tools.ant.taskdefs.SubAnt.execute(SubAnt.java:302)
> 	at org.apache.tools.ant.taskdefs.SubAnt.execute(SubAnt.java:221)
> 	at
> org.apache.tools.ant.UnknownElement.execute(UnknownElement.java:291)
> 	at
> jdk.internal.reflect.GeneratedMethodAccessor561.invoke(Unknown Source)
> 	at
> jdk.internal.reflect.DelegatingMethodAccessorImpl.invoke(java.base@9-
> ea/DelegatingMethodAccessorImpl.java:43)
> 	at java.lang.reflect.Method.invoke(java.base@9-
> ea/Method.java:531)
> 	at
> org.apache.tools.ant.dispatch.DispatchUtils.execute(DispatchUtils.java:106)
> 	at org.apache.tools.ant.Task.perform(Task.java:348)
> 	at org.apache.tools.ant.Target.execute(Target.java:390)
> 	at org.apache.tools.ant.Target.performTasks(Target.java:411)
> 	at
> org.apache.tools.ant.Project.executeSortedTargets(Project.java:1399)
> 	at
> org.apache.tools.ant.helper.SingleCheckExecutor.executeTargets(SingleChe
> ckExecutor.java:38)
> 	at org.apache.tools.ant.Project.executeTargets(Project.java:1251)
> 	at org.apache.tools.ant.taskdefs.Ant.execute(Ant.java:442)
> 	at
> org.apache.tools.ant.taskdefs.CallTarget.execute(CallTarget.java:105)
> 	at
> org.apache.tools.ant.UnknownElement.execute(UnknownElement.java:291)
> 	at jdk.internal.reflect.GeneratedMethodAccessor4.invoke(Unknown
> Source)
> 	at
> jdk.internal.reflect.DelegatingMethodAccessorImpl.invoke(java.base@9-
> ea/DelegatingMethodAccessorImpl.java:43)
> 	at java.lang.reflect.Method.invoke(java.base@9-
> ea/Method.java:531)
> 	at
> org.apache.tools.ant.dispatch.DispatchUtils.execute(DispatchUtils.java:106)
> 	at org.apache.tools.ant.Task.perform(Task.java:348)
> 	at org.apache.tools.ant.Target.execute(Target.java:390)
> 	at org.apache.tools.ant.Target.performTasks(Target.java:411)
> 	at
> org.apache.tools.ant.Project.executeSortedTargets(Project.java:1399)
> 	at org.apache.tools.ant.Project.executeTarget(Project.java:1368)
> 	at
> org.apache.tools.ant.helper.DefaultExecutor.executeTargets(DefaultExecut
> or.java:41)
> 	at org.apache.tools.ant.Project.executeTargets(Project.java:1251)
> 	at org.apache.tools.ant.Main.runBuild(Main.java:809)
> 	at org.apache.tools.ant.Main.startAnt(Main.java:217)
> 	at org.apache.tools.ant.launch.Launcher.run(Launcher.java:280)
> 	at org.apache.tools.ant.launch.Launcher.main(Launcher.java:109)
> 
> Total time: 73 minutes 43 seconds
> Build step 'Invoke Ant' marked build as failure
> Archiving artifacts
> [WARNINGS] Skipping publisher since build result is FAILURE
> Recording test results
> Email was triggered for: Failure - Any
> Sending email for trigger: Failure - Any
> 



---------------------------------------------------------------------
To unsubscribe, e-mail: dev-unsubscribe@lucene.apache.org
For additional commands, e-mail: dev-help@lucene.apache.org


Mime
View raw message