lucene-dev mailing list archives

Site index · List index
Message view « Date » · « Thread »
Top « Date » · « Thread »
From Policeman Jenkins Server <jenk...@thetaphi.de>
Subject [JENKINS] Lucene-Solr-6.x-Windows (32bit/jdk1.8.0_92) - Build # 185 - Still Failing!
Date Mon, 16 May 2016 22:10:40 GMT
Build: http://jenkins.thetaphi.de/job/Lucene-Solr-6.x-Windows/185/
Java: 32bit/jdk1.8.0_92 -client -XX:+UseSerialGC

No tests ran.

Build Log:
[...truncated 33 lines...]
BUILD FAILED
C:\Users\jenkins\workspace\Lucene-Solr-6.x-Windows\build.xml:740: The following error occurred
while executing this line:
C:\Users\jenkins\workspace\Lucene-Solr-6.x-Windows\lucene\common-build.xml:426: impossible
to configure ivy:settings with given file: C:\Users\jenkins\workspace\Lucene-Solr-6.x-Windows\lucene\top-level-ivy-settings.xml
: java.text.ParseException: failed to load settings from file:/C:/Users/jenkins/workspace/Lucene-Solr-6.x-Windows/lucene/top-level-ivy-settings.xml:
io problem while parsing config file: unknown protocol: c
	at org.apache.ivy.core.settings.XmlSettingsParser.doParse(XmlSettingsParser.java:165)
	at org.apache.ivy.core.settings.XmlSettingsParser.parse(XmlSettingsParser.java:150)
	at org.apache.ivy.core.settings.IvySettings.load(IvySettings.java:391)
	at org.apache.ivy.Ivy.configure(Ivy.java:416)
	at org.apache.ivy.ant.IvyAntSettings.createIvyEngine(IvyAntSettings.java:287)
	at org.apache.ivy.ant.IvyConfigure.execute(IvyConfigure.java:150)
	at org.apache.tools.ant.UnknownElement.execute(UnknownElement.java:291)
	at sun.reflect.GeneratedMethodAccessor4.invoke(Unknown Source)
	at sun.reflect.DelegatingMethodAccessorImpl.invoke(DelegatingMethodAccessorImpl.java:43)
	at java.lang.reflect.Method.invoke(Method.java:498)
	at org.apache.tools.ant.dispatch.DispatchUtils.execute(DispatchUtils.java:106)
	at org.apache.tools.ant.Task.perform(Task.java:348)
	at org.apache.tools.ant.Target.execute(Target.java:390)
	at org.apache.tools.ant.Target.performTasks(Target.java:411)
	at org.apache.tools.ant.Project.executeSortedTargets(Project.java:1399)
	at org.apache.tools.ant.helper.SingleCheckExecutor.executeTargets(SingleCheckExecutor.java:38)
	at org.apache.tools.ant.Project.executeTargets(Project.java:1251)
	at org.apache.tools.ant.taskdefs.Ant.execute(Ant.java:442)
	at org.apache.tools.ant.taskdefs.CallTarget.execute(CallTarget.java:105)
	at org.apache.tools.ant.UnknownElement.execute(UnknownElement.java:291)
	at sun.reflect.GeneratedMethodAccessor4.invoke(Unknown Source)
	at sun.reflect.DelegatingMethodAccessorImpl.invoke(DelegatingMethodAccessorImpl.java:43)
	at java.lang.reflect.Method.invoke(Method.java:498)
	at org.apache.tools.ant.dispatch.DispatchUtils.execute(DispatchUtils.java:106)
	at org.apache.tools.ant.Task.perform(Task.java:348)
	at org.apache.tools.ant.Target.execute(Target.java:390)
	at org.apache.tools.ant.Target.performTasks(Target.java:411)
	at org.apache.tools.ant.Project.executeSortedTargets(Project.java:1399)
	at org.apache.tools.ant.Project.executeTarget(Project.java:1368)
	at org.apache.tools.ant.helper.DefaultExecutor.executeTargets(DefaultExecutor.java:41)
	at org.apache.tools.ant.Project.executeTargets(Project.java:1251)
	at org.apache.tools.ant.Main.runBuild(Main.java:809)
	at org.apache.tools.ant.Main.startAnt(Main.java:217)
	at org.apache.tools.ant.launch.Launcher.run(Launcher.java:280)
	at org.apache.tools.ant.launch.Launcher.main(Launcher.java:109)
Caused by: org.xml.sax.SAXException: io problem while parsing config file: unknown protocol:
c
java.net.MalformedURLException: unknown protocol: c
	at org.apache.ivy.core.settings.XmlSettingsParser.startElement(XmlSettingsParser.java:234)
	at com.sun.org.apache.xerces.internal.parsers.AbstractSAXParser.startElement(AbstractSAXParser.java:509)
	at com.sun.org.apache.xerces.internal.parsers.AbstractXMLDocumentParser.emptyElement(AbstractXMLDocumentParser.java:182)
	at com.sun.org.apache.xerces.internal.impl.XMLDocumentFragmentScannerImpl.scanStartElement(XMLDocumentFragmentScannerImpl.java:1344)
	at com.sun.org.apache.xerces.internal.impl.XMLDocumentFragmentScannerImpl$FragmentContentDriver.next(XMLDocumentFragmentScannerImpl.java:2787)
	at com.sun.org.apache.xerces.internal.impl.XMLDocumentScannerImpl.next(XMLDocumentScannerImpl.java:606)
	at com.sun.org.apache.xerces.internal.impl.XMLDocumentFragmentScannerImpl.scanDocument(XMLDocumentFragmentScannerImpl.java:510)
	at com.sun.org.apache.xerces.internal.parsers.XML11Configuration.parse(XML11Configuration.java:848)
	at com.sun.org.apache.xerces.internal.parsers.XML11Configuration.parse(XML11Configuration.java:777)
	at com.sun.org.apache.xerces.internal.parsers.XMLParser.parse(XMLParser.java:141)
	at com.sun.org.apache.xerces.internal.parsers.AbstractSAXParser.parse(AbstractSAXParser.java:1213)
	at com.sun.org.apache.xerces.internal.jaxp.SAXParserImpl$JAXPSAXParser.parse(SAXParserImpl.java:643)
	at com.sun.org.apache.xerces.internal.jaxp.SAXParserImpl.parse(SAXParserImpl.java:327)
	at javax.xml.parsers.SAXParser.parse(SAXParser.java:274)
	at org.apache.ivy.core.settings.XmlSettingsParser.doParse(XmlSettingsParser.java:160)
	... 34 more
Caused by: java.net.MalformedURLException: unknown protocol: c
	at java.net.URL.<init>(URL.java:600)
	at java.net.URL.<init>(URL.java:490)
	at org.apache.ivy.core.settings.XmlSettingsParser.includeStarted(XmlSettingsParser.java:411)
	at org.apache.ivy.core.settings.XmlSettingsParser.startElement(XmlSettingsParser.java:211)
	... 48 more

Total time: 0 seconds
Build step 'Invoke Ant' marked build as failure
Archiving artifacts
[WARNINGS] Skipping publisher since build result is FAILURE
Recording test results
ERROR: Step ‘Publish JUnit test result report’ failed: No test report files were found.
Configuration error?
Email was triggered for: Failure - Any
Sending email for trigger: Failure - Any



Mime
View raw message