lucene-dev mailing list archives

Site index · List index
Message view « Date » · « Thread »
Top « Date » · « Thread »
From Policeman Jenkins Server <jenk...@thetaphi.de>
Subject [JENKINS] Lucene-Solr-master-MacOSX (64bit/jdk1.8.0) - Build # 3274 - Failure!
Date Mon, 16 May 2016 05:33:17 GMT
Build: http://jenkins.thetaphi.de/job/Lucene-Solr-master-MacOSX/3274/
Java: 64bit/jdk1.8.0 -XX:-UseCompressedOops -XX:+UseG1GC

2 tests failed.
FAILED:  org.apache.solr.handler.TestReplicationHandler.doTestIndexAndConfigAliasReplication

Error Message:
expected:<1> but was:<0>

Stack Trace:
java.lang.AssertionError: expected:<1> but was:<0>
	at __randomizedtesting.SeedInfo.seed([29AE75003DD73189:DEDD9B58FB3F9E6F]:0)
	at org.junit.Assert.fail(Assert.java:93)
	at org.junit.Assert.failNotEquals(Assert.java:647)
	at org.junit.Assert.assertEquals(Assert.java:128)
	at org.junit.Assert.assertEquals(Assert.java:472)
	at org.junit.Assert.assertEquals(Assert.java:456)
	at org.apache.solr.handler.TestReplicationHandler.doTestIndexAndConfigAliasReplication(TestReplicationHandler.java:1327)
	at sun.reflect.NativeMethodAccessorImpl.invoke0(Native Method)
	at sun.reflect.NativeMethodAccessorImpl.invoke(NativeMethodAccessorImpl.java:62)
	at sun.reflect.DelegatingMethodAccessorImpl.invoke(DelegatingMethodAccessorImpl.java:43)
	at java.lang.reflect.Method.invoke(Method.java:498)
	at com.carrotsearch.randomizedtesting.RandomizedRunner.invoke(RandomizedRunner.java:1764)
	at com.carrotsearch.randomizedtesting.RandomizedRunner$8.evaluate(RandomizedRunner.java:871)
	at com.carrotsearch.randomizedtesting.RandomizedRunner$9.evaluate(RandomizedRunner.java:907)
	at com.carrotsearch.randomizedtesting.RandomizedRunner$10.evaluate(RandomizedRunner.java:921)
	at com.carrotsearch.randomizedtesting.rules.SystemPropertiesRestoreRule$1.evaluate(SystemPropertiesRestoreRule.java:57)
	at org.apache.lucene.util.TestRuleSetupTeardownChained$1.evaluate(TestRuleSetupTeardownChained.java:49)
	at org.apache.lucene.util.AbstractBeforeAfterRule$1.evaluate(AbstractBeforeAfterRule.java:45)
	at org.apache.lucene.util.TestRuleThreadAndTestName$1.evaluate(TestRuleThreadAndTestName.java:48)
	at org.apache.lucene.util.TestRuleIgnoreAfterMaxFailures$1.evaluate(TestRuleIgnoreAfterMaxFailures.java:64)
	at org.apache.lucene.util.TestRuleMarkFailure$1.evaluate(TestRuleMarkFailure.java:47)
	at com.carrotsearch.randomizedtesting.rules.StatementAdapter.evaluate(StatementAdapter.java:36)
	at com.carrotsearch.randomizedtesting.ThreadLeakControl$StatementRunner.run(ThreadLeakControl.java:367)
	at com.carrotsearch.randomizedtesting.ThreadLeakControl.forkTimeoutingTask(ThreadLeakControl.java:809)
	at com.carrotsearch.randomizedtesting.ThreadLeakControl$3.evaluate(ThreadLeakControl.java:460)
	at com.carrotsearch.randomizedtesting.RandomizedRunner.runSingleTest(RandomizedRunner.java:880)
	at com.carrotsearch.randomizedtesting.RandomizedRunner$5.evaluate(RandomizedRunner.java:781)
	at com.carrotsearch.randomizedtesting.RandomizedRunner$6.evaluate(RandomizedRunner.java:816)
	at com.carrotsearch.randomizedtesting.RandomizedRunner$7.evaluate(RandomizedRunner.java:827)
	at com.carrotsearch.randomizedtesting.rules.StatementAdapter.evaluate(StatementAdapter.java:36)
	at com.carrotsearch.randomizedtesting.rules.SystemPropertiesRestoreRule$1.evaluate(SystemPropertiesRestoreRule.java:57)
	at org.apache.lucene.util.AbstractBeforeAfterRule$1.evaluate(AbstractBeforeAfterRule.java:45)
	at com.carrotsearch.randomizedtesting.rules.StatementAdapter.evaluate(StatementAdapter.java:36)
	at org.apache.lucene.util.TestRuleStoreClassName$1.evaluate(TestRuleStoreClassName.java:41)
	at com.carrotsearch.randomizedtesting.rules.NoShadowingOrOverridesOnMethodsRule$1.evaluate(NoShadowingOrOverridesOnMethodsRule.java:40)
	at com.carrotsearch.randomizedtesting.rules.NoShadowingOrOverridesOnMethodsRule$1.evaluate(NoShadowingOrOverridesOnMethodsRule.java:40)
	at com.carrotsearch.randomizedtesting.rules.StatementAdapter.evaluate(StatementAdapter.java:36)
	at com.carrotsearch.randomizedtesting.rules.StatementAdapter.evaluate(StatementAdapter.java:36)
	at com.carrotsearch.randomizedtesting.rules.StatementAdapter.evaluate(StatementAdapter.java:36)
	at org.apache.lucene.util.TestRuleAssertionsRequired$1.evaluate(TestRuleAssertionsRequired.java:53)
	at org.apache.lucene.util.TestRuleMarkFailure$1.evaluate(TestRuleMarkFailure.java:47)
	at org.apache.lucene.util.TestRuleIgnoreAfterMaxFailures$1.evaluate(TestRuleIgnoreAfterMaxFailures.java:64)
	at org.apache.lucene.util.TestRuleIgnoreTestSuites$1.evaluate(TestRuleIgnoreTestSuites.java:54)
	at com.carrotsearch.randomizedtesting.rules.StatementAdapter.evaluate(StatementAdapter.java:36)
	at com.carrotsearch.randomizedtesting.ThreadLeakControl$StatementRunner.run(ThreadLeakControl.java:367)
	at java.lang.Thread.run(Thread.java:745)


FAILED:  org.apache.solr.update.SoftAutoCommitTest.testSoftAndHardCommitMaxTimeMixedAdds

Error Message:
soft529 wasn't fast enough

Stack Trace:
java.lang.AssertionError: soft529 wasn't fast enough
	at __randomizedtesting.SeedInfo.seed([29AE75003DD73189:787A8C808CA4012E]:0)
	at org.junit.Assert.fail(Assert.java:93)
	at org.junit.Assert.assertTrue(Assert.java:43)
	at org.junit.Assert.assertNotNull(Assert.java:526)
	at org.apache.solr.update.SoftAutoCommitTest.testSoftAndHardCommitMaxTimeMixedAdds(SoftAutoCommitTest.java:111)
	at sun.reflect.NativeMethodAccessorImpl.invoke0(Native Method)
	at sun.reflect.NativeMethodAccessorImpl.invoke(NativeMethodAccessorImpl.java:62)
	at sun.reflect.DelegatingMethodAccessorImpl.invoke(DelegatingMethodAccessorImpl.java:43)
	at java.lang.reflect.Method.invoke(Method.java:498)
	at com.carrotsearch.randomizedtesting.RandomizedRunner.invoke(RandomizedRunner.java:1764)
	at com.carrotsearch.randomizedtesting.RandomizedRunner$8.evaluate(RandomizedRunner.java:871)
	at com.carrotsearch.randomizedtesting.RandomizedRunner$9.evaluate(RandomizedRunner.java:907)
	at com.carrotsearch.randomizedtesting.RandomizedRunner$10.evaluate(RandomizedRunner.java:921)
	at com.carrotsearch.randomizedtesting.rules.SystemPropertiesRestoreRule$1.evaluate(SystemPropertiesRestoreRule.java:57)
	at org.apache.lucene.util.TestRuleSetupTeardownChained$1.evaluate(TestRuleSetupTeardownChained.java:49)
	at org.apache.lucene.util.AbstractBeforeAfterRule$1.evaluate(AbstractBeforeAfterRule.java:45)
	at org.apache.lucene.util.TestRuleThreadAndTestName$1.evaluate(TestRuleThreadAndTestName.java:48)
	at org.apache.lucene.util.TestRuleIgnoreAfterMaxFailures$1.evaluate(TestRuleIgnoreAfterMaxFailures.java:64)
	at org.apache.lucene.util.TestRuleMarkFailure$1.evaluate(TestRuleMarkFailure.java:47)
	at com.carrotsearch.randomizedtesting.rules.StatementAdapter.evaluate(StatementAdapter.java:36)
	at com.carrotsearch.randomizedtesting.ThreadLeakControl$StatementRunner.run(ThreadLeakControl.java:367)
	at com.carrotsearch.randomizedtesting.ThreadLeakControl.forkTimeoutingTask(ThreadLeakControl.java:809)
	at com.carrotsearch.randomizedtesting.ThreadLeakControl$3.evaluate(ThreadLeakControl.java:460)
	at com.carrotsearch.randomizedtesting.RandomizedRunner.runSingleTest(RandomizedRunner.java:880)
	at com.carrotsearch.randomizedtesting.RandomizedRunner$5.evaluate(RandomizedRunner.java:781)
	at com.carrotsearch.randomizedtesting.RandomizedRunner$6.evaluate(RandomizedRunner.java:816)
	at com.carrotsearch.randomizedtesting.RandomizedRunner$7.evaluate(RandomizedRunner.java:827)
	at com.carrotsearch.randomizedtesting.rules.StatementAdapter.evaluate(StatementAdapter.java:36)
	at com.carrotsearch.randomizedtesting.rules.SystemPropertiesRestoreRule$1.evaluate(SystemPropertiesRestoreRule.java:57)
	at org.apache.lucene.util.AbstractBeforeAfterRule$1.evaluate(AbstractBeforeAfterRule.java:45)
	at com.carrotsearch.randomizedtesting.rules.StatementAdapter.evaluate(StatementAdapter.java:36)
	at org.apache.lucene.util.TestRuleStoreClassName$1.evaluate(TestRuleStoreClassName.java:41)
	at com.carrotsearch.randomizedtesting.rules.NoShadowingOrOverridesOnMethodsRule$1.evaluate(NoShadowingOrOverridesOnMethodsRule.java:40)
	at com.carrotsearch.randomizedtesting.rules.NoShadowingOrOverridesOnMethodsRule$1.evaluate(NoShadowingOrOverridesOnMethodsRule.java:40)
	at com.carrotsearch.randomizedtesting.rules.StatementAdapter.evaluate(StatementAdapter.java:36)
	at com.carrotsearch.randomizedtesting.rules.StatementAdapter.evaluate(StatementAdapter.java:36)
	at com.carrotsearch.randomizedtesting.rules.StatementAdapter.evaluate(StatementAdapter.java:36)
	at org.apache.lucene.util.TestRuleAssertionsRequired$1.evaluate(TestRuleAssertionsRequired.java:53)
	at org.apache.lucene.util.TestRuleMarkFailure$1.evaluate(TestRuleMarkFailure.java:47)
	at org.apache.lucene.util.TestRuleIgnoreAfterMaxFailures$1.evaluate(TestRuleIgnoreAfterMaxFailures.java:64)
	at org.apache.lucene.util.TestRuleIgnoreTestSuites$1.evaluate(TestRuleIgnoreTestSuites.java:54)
	at com.carrotsearch.randomizedtesting.rules.StatementAdapter.evaluate(StatementAdapter.java:36)
	at com.carrotsearch.randomizedtesting.ThreadLeakControl$StatementRunner.run(ThreadLeakControl.java:367)
	at java.lang.Thread.run(Thread.java:745)




Build Log:
[...truncated 10450 lines...]
   [junit4] Suite: org.apache.solr.update.SoftAutoCommitTest
   [junit4]   2> Creating dataDir: /Users/jenkins/workspace/Lucene-Solr-master-MacOSX/solr/build/solr-core/test/J0/temp/solr.update.SoftAutoCommitTest_29AE75003DD73189-001/init-core-data-001
   [junit4]   2> 8924 INFO  (SUITE-SoftAutoCommitTest-seed#[29AE75003DD73189]-worker) [    ] o.a.s.SolrTestCaseJ4 Randomized ssl (false) and clientAuth (false)
   [junit4]   2> 8934 INFO  (SUITE-SoftAutoCommitTest-seed#[29AE75003DD73189]-worker) [    ] o.a.s.SolrTestCaseJ4 ####initCore
   [junit4]   2> 8934 INFO  (SUITE-SoftAutoCommitTest-seed#[29AE75003DD73189]-worker) [    ] o.a.s.c.SolrResourceLoader new SolrResourceLoader for directory: '/Users/jenkins/workspace/Lucene-Solr-master-MacOSX/solr/core/src/test-files/solr/collection1'
   [junit4]   2> 8934 INFO  (SUITE-SoftAutoCommitTest-seed#[29AE75003DD73189]-worker) [    ] o.a.s.c.SolrResourceLoader JNDI not configured for solr (NoInitialContextEx)
   [junit4]   2> 8934 INFO  (SUITE-SoftAutoCommitTest-seed#[29AE75003DD73189]-worker) [    ] o.a.s.c.SolrResourceLoader using system property solr.solr.home: /Users/jenkins/workspace/Lucene-Solr-master-MacOSX/solr/core/src/test-files/solr
   [junit4]   2> 8935 INFO  (SUITE-SoftAutoCommitTest-seed#[29AE75003DD73189]-worker) [    ] o.a.s.c.SolrResourceLoader Adding 'file:/Users/jenkins/workspace/Lucene-Solr-master-MacOSX/solr/core/src/test-files/solr/collection1/lib/classes/' to classloader
   [junit4]   2> 8935 INFO  (SUITE-SoftAutoCommitTest-seed#[29AE75003DD73189]-worker) [    ] o.a.s.c.SolrResourceLoader Adding 'file:/Users/jenkins/workspace/Lucene-Solr-master-MacOSX/solr/core/src/test-files/solr/collection1/lib/README' to classloader
   [junit4]   2> 8998 INFO  (SUITE-SoftAutoCommitTest-seed#[29AE75003DD73189]-worker) [    ] o.a.s.c.SolrConfig current version of requestparams : -1
   [junit4]   2> 9014 INFO  (SUITE-SoftAutoCommitTest-seed#[29AE75003DD73189]-worker) [    ] o.a.s.c.SolrConfig Using Lucene MatchVersion: 7.0.0
   [junit4]   2> 9038 INFO  (SUITE-SoftAutoCommitTest-seed#[29AE75003DD73189]-worker) [    ] o.a.s.c.SolrConfig Loaded SolrConfig: solrconfig.xml
   [junit4]   2> 9054 INFO  (SUITE-SoftAutoCommitTest-seed#[29AE75003DD73189]-worker) [    ] o.a.s.s.IndexSchema [null] Schema name=test
   [junit4]   2> 10474 INFO  (SUITE-SoftAutoCommitTest-seed#[29AE75003DD73189]-worker) [    ] o.a.s.s.OpenExchangeRatesOrgProvider Initialized with rates=open-exchange-rates.json, refreshInterval=1440.
   [junit4]   2> 10517 INFO  (SUITE-SoftAutoCommitTest-seed#[29AE75003DD73189]-worker) [    ] o.a.s.s.IndexSchema default search field in schema is text
   [junit4]   2> 10521 INFO  (SUITE-SoftAutoCommitTest-seed#[29AE75003DD73189]-worker) [    ] o.a.s.s.IndexSchema unique key field: id
   [junit4]   2> 11135 INFO  (SUITE-SoftAutoCommitTest-seed#[29AE75003DD73189]-worker) [    ] o.a.s.s.FileExchangeRateProvider Reloading exchange rates from file currency.xml
   [junit4]   2> 11147 INFO  (SUITE-SoftAutoCommitTest-seed#[29AE75003DD73189]-worker) [    ] o.a.s.s.FileExchangeRateProvider Reloading exchange rates from file currency.xml
   [junit4]   2> 11149 INFO  (SUITE-SoftAutoCommitTest-seed#[29AE75003DD73189]-worker) [    ] o.a.s.s.OpenExchangeRatesOrgProvider Reloading exchange rates from open-exchange-rates.json
   [junit4]   2> 11156 INFO  (SUITE-SoftAutoCommitTest-seed#[29AE75003DD73189]-worker) [    ] o.a.s.s.OpenExchangeRatesOrgProvider Reloading exchange rates from open-exchange-rates.json
   [junit4]   2> 11181 INFO  (SUITE-SoftAutoCommitTest-seed#[29AE75003DD73189]-worker) [    ] o.a.s.c.SolrResourceLoader JNDI not configured for solr (NoInitialContextEx)
   [junit4]   2> 11181 INFO  (SUITE-SoftAutoCommitTest-seed#[29AE75003DD73189]-worker) [    ] o.a.s.c.SolrResourceLoader using system property solr.solr.home: /Users/jenkins/workspace/Lucene-Solr-master-MacOSX/solr/core/src/test-files/solr
   [junit4]   2> 11181 INFO  (SUITE-SoftAutoCommitTest-seed#[29AE75003DD73189]-worker) [    ] o.a.s.c.SolrResourceLoader new SolrResourceLoader for directory: '/Users/jenkins/workspace/Lucene-Solr-master-MacOSX/solr/core/src/test-files/solr'
   [junit4]   2> 11182 INFO  (SUITE-SoftAutoCommitTest-seed#[29AE75003DD73189]-worker) [    ] o.a.s.c.SolrResourceLoader JNDI not configured for solr (NoInitialContextEx)
   [junit4]   2> 11182 INFO  (SUITE-SoftAutoCommitTest-seed#[29AE75003DD73189]-worker) [    ] o.a.s.c.SolrResourceLoader using system property solr.solr.home: /Users/jenkins/workspace/Lucene-Solr-master-MacOSX/solr/core/src/test-files/solr
   [junit4]   2> 11193 INFO  (SUITE-SoftAutoCommitTest-seed#[29AE75003DD73189]-worker) [    ] o.a.s.c.CoreContainer New CoreContainer 1801299068
   [junit4]   2> 11193 INFO  (SUITE-SoftAutoCommitTest-seed#[29AE75003DD73189]-worker) [    ] o.a.s.c.CoreContainer Loading cores into CoreContainer [instanceDir=/Users/jenkins/workspace/Lucene-Solr-master-MacOSX/solr/core/src/test-files/solr]
   [junit4]   2> 11193 WARN  (SUITE-SoftAutoCommitTest-seed#[29AE75003DD73189]-worker) [    ] o.a.s.c.CoreContainer Couldn't add files from /Users/jenkins/workspace/Lucene-Solr-master-MacOSX/solr/core/src/test-files/solr/lib to classpath: /Users/jenkins/workspace/Lucene-Solr-master-MacOSX/solr/core/src/test-files/solr/lib
   [junit4]   2> 11194 INFO  (SUITE-SoftAutoCommitTest-seed#[29AE75003DD73189]-worker) [    ] o.a.s.h.c.HttpShardHandlerFactory created with socketTimeout : 600000,connTimeout : 60000,maxConnectionsPerHost : 20,maxConnections : 10000,corePoolSize : 0,maximumPoolSize : 2147483647,maxThreadIdleTime : 5,sizeOfQueue : -1,fairnessPolicy : false,
   [junit4]   2> 11214 INFO  (SUITE-SoftAutoCommitTest-seed#[29AE75003DD73189]-worker) [    ] o.a.s.u.UpdateShardHandler Creating UpdateShardHandler HTTP client with params: 
   [junit4]   2> 11215 INFO  (SUITE-SoftAutoCommitTest-seed#[29AE75003DD73189]-worker) [    ] o.a.s.l.LogWatcher SLF4J impl is org.slf4j.impl.Log4jLoggerFactory
   [junit4]   2> 11216 INFO  (SUITE-SoftAutoCommitTest-seed#[29AE75003DD73189]-worker) [    ] o.a.s.l.LogWatcher Registering Log Listener [Log4j (org.slf4j.impl.Log4jLoggerFactory)]
   [junit4]   2> 11216 INFO  (SUITE-SoftAutoCommitTest-seed#[29AE75003DD73189]-worker) [    ] o.a.s.c.CoreContainer Security conf doesn't exist. Skipping setup for authorization module.
   [junit4]   2> 11216 INFO  (SUITE-SoftAutoCommitTest-seed#[29AE75003DD73189]-worker) [    ] o.a.s.c.CoreContainer No authentication plugin used.
   [junit4]   2> 11221 INFO  (SUITE-SoftAutoCommitTest-seed#[29AE75003DD73189]-worker) [    ] o.a.s.c.CoreDescriptor Created CoreDescriptor: {name=collection1, config=solrconfig.xml, transient=false, schema=schema.xml, loadOnStartup=true, configSetProperties=configsetprops.json, collection=collection1, dataDir=/Users/jenkins/workspace/Lucene-Solr-master-MacOSX/solr/build/solr-core/test/J0/temp/solr.update.SoftAutoCommitTest_29AE75003DD73189-001/init-core-data-001, shard=shard1}
   [junit4]   2> 11222 INFO  (coreLoadExecutor-19-thread-1) [    ] o.a.s.c.SolrResourceLoader new SolrResourceLoader for directory: '/Users/jenkins/workspace/Lucene-Solr-master-MacOSX/solr/core/src/test-files/solr/collection1'
   [junit4]   2> 11223 INFO  (coreLoadExecutor-19-thread-1) [    ] o.a.s.c.SolrResourceLoader JNDI not configured for solr (NoInitialContextEx)
   [junit4]   2> 11223 INFO  (coreLoadExecutor-19-thread-1) [    ] o.a.s.c.SolrResourceLoader using system property solr.solr.home: /Users/jenkins/workspace/Lucene-Solr-master-MacOSX/solr/core/src/test-files/solr
   [junit4]   2> 11224 INFO  (coreLoadExecutor-19-thread-1) [    ] o.a.s.c.SolrResourceLoader Adding 'file:/Users/jenkins/workspace/Lucene-Solr-master-MacOSX/solr/core/src/test-files/solr/collection1/lib/classes/' to classloader
   [junit4]   2> 11224 INFO  (coreLoadExecutor-19-thread-1) [    ] o.a.s.c.SolrResourceLoader Adding 'file:/Users/jenkins/workspace/Lucene-Solr-master-MacOSX/solr/core/src/test-files/solr/collection1/lib/README' to classloader
   [junit4]   2> 11274 INFO  (coreLoadExecutor-19-thread-1) [    ] o.a.s.c.SolrConfig current version of requestparams : -1
   [junit4]   2> 11287 INFO  (coreLoadExecutor-19-thread-1) [    ] o.a.s.c.SolrConfig Using Lucene MatchVersion: 7.0.0
   [junit4]   2> 11331 INFO  (coreLoadExecutor-19-thread-1) [    ] o.a.s.c.SolrConfig Loaded SolrConfig: solrconfig.xml
   [junit4]   2> 11343 INFO  (coreLoadExecutor-19-thread-1) [    ] o.a.s.s.IndexSchema [collection1] Schema name=test
   [junit4]   2> 11561 INFO  (coreLoadExecutor-19-thread-1) [    ] o.a.s.s.OpenExchangeRatesOrgProvider Initialized with rates=open-exchange-rates.json, refreshInterval=1440.
   [junit4]   2> 11576 INFO  (coreLoadExecutor-19-thread-1) [    ] o.a.s.s.IndexSchema default search field in schema is text
   [junit4]   2> 11577 INFO  (coreLoadExecutor-19-thread-1) [    ] o.a.s.s.IndexSchema unique key field: id
   [junit4]   2> 11591 INFO  (coreLoadExecutor-19-thread-1) [    ] o.a.s.s.FileExchangeRateProvider Reloading exchange rates from file currency.xml
   [junit4]   2> 11601 INFO  (coreLoadExecutor-19-thread-1) [    ] o.a.s.s.FileExchangeRateProvider Reloading exchange rates from file currency.xml
   [junit4]   2> 11603 INFO  (coreLoadExecutor-19-thread-1) [    ] o.a.s.s.OpenExchangeRatesOrgProvider Reloading exchange rates from open-exchange-rates.json
   [junit4]   2> 11603 INFO  (coreLoadExecutor-19-thread-1) [    ] o.a.s.s.OpenExchangeRatesOrgProvider Reloading exchange rates from open-exchange-rates.json
   [junit4]   2> 11611 INFO  (coreLoadExecutor-19-thread-1) [    ] o.a.s.c.ConfigSetProperties Did not find ConfigSet properties, assuming default properties: Can't find resource 'configsetprops.json' in classpath or '/Users/jenkins/workspace/Lucene-Solr-master-MacOSX/solr/core/src/test-files/solr/collection1'
   [junit4]   2> 11612 INFO  (coreLoadExecutor-19-thread-1) [    ] o.a.s.c.CoreContainer Creating SolrCore 'collection1' using configuration from instancedir /Users/jenkins/workspace/Lucene-Solr-master-MacOSX/solr/core/src/test-files/solr/collection1
   [junit4]   2> 11612 INFO  (coreLoadExecutor-19-thread-1) [    x:collection1] o.a.s.c.SolrCore org.apache.solr.core.MockDirectoryFactory
   [junit4]   2> 11612 INFO  (coreLoadExecutor-19-thread-1) [    x:collection1] o.a.s.c.SolrCore [[collection1] ] Opening new SolrCore at [/Users/jenkins/workspace/Lucene-Solr-master-MacOSX/solr/core/src/test-files/solr/collection1], dataDir=[/Users/jenkins/workspace/Lucene-Solr-master-MacOSX/solr/build/solr-core/test/J0/temp/solr.update.SoftAutoCommitTest_29AE75003DD73189-001/init-core-data-001/]
   [junit4]   2> 11613 INFO  (coreLoadExecutor-19-thread-1) [    x:collection1] o.a.s.c.JmxMonitoredMap No JMX servers found, not exposing Solr information with JMX.
   [junit4]   2> 11616 INFO  (coreLoadExecutor-19-thread-1) [    x:collection1] o.a.s.c.CachingDirectoryFactory return new directory for /Users/jenkins/workspace/Lucene-Solr-master-MacOSX/solr/build/solr-core/test/J0/temp/solr.update.SoftAutoCommitTest_29AE75003DD73189-001/init-core-data-001
   [junit4]   2> 11620 INFO  (coreLoadExecutor-19-thread-1) [    x:collection1] o.a.s.c.SolrCore New index directory detected: old=null new=/Users/jenkins/workspace/Lucene-Solr-master-MacOSX/solr/build/solr-core/test/J0/temp/solr.update.SoftAutoCommitTest_29AE75003DD73189-001/init-core-data-001/index/
   [junit4]   2> 11620 WARN  (coreLoadExecutor-19-thread-1) [    x:collection1] o.a.s.c.SolrCore [collection1] Solr index directory '/Users/jenkins/workspace/Lucene-Solr-master-MacOSX/solr/build/solr-core/test/J0/temp/solr.update.SoftAutoCommitTest_29AE75003DD73189-001/init-core-data-001/index' doesn't exist. Creating new index...
   [junit4]   2> 11620 INFO  (coreLoadExecutor-19-thread-1) [    x:collection1] o.a.s.c.CachingDirectoryFactory return new directory for /Users/jenkins/workspace/Lucene-Solr-master-MacOSX/solr/build/solr-core/test/J0/temp/solr.update.SoftAutoCommitTest_29AE75003DD73189-001/init-core-data-001/index
   [junit4]   2> 11623 INFO  (coreLoadExecutor-19-thread-1) [    x:collection1] o.a.s.u.RandomMergePolicy RandomMergePolicy wrapping class org.apache.lucene.index.AlcoholicMergePolicy: [AlcoholicMergePolicy: minMergeSize=0, mergeFactor=10, maxMergeSize=716301577, maxMergeSizeForForcedMerge=9223372036854775807, calibrateSizeByDeletes=true, maxMergeDocs=2147483647, maxCFSSegmentSizeMB=8.796093022207999E12, noCFSRatio=0.1]
   [junit4]   2> 11627 INFO  (coreLoadExecutor-19-thread-1) [    x:collection1] o.a.s.c.SolrDeletionPolicy SolrDeletionPolicy.onCommit: commits: num=1
   [junit4]   2> 	commit{dir=MockDirectoryWrapper(RAMDirectory@3f67c6a5 lockFactory=org.apache.lucene.store.SingleInstanceLockFactory@78c02bb9),segFN=segments_1,generation=1}
   [junit4]   2> 11628 INFO  (coreLoadExecutor-19-thread-1) [    x:collection1] o.a.s.c.SolrDeletionPolicy newest commit generation = 1
   [junit4]   2> 11628 INFO  (OldIndexDirectoryCleanupThreadForCore-collection1) [    x:collection1] o.a.s.c.SolrCore Looking for old index directories to cleanup for core collection1 in /Users/jenkins/workspace/Lucene-Solr-master-MacOSX/solr/build/solr-core/test/J0/temp/solr.update.SoftAutoCommitTest_29AE75003DD73189-001/init-core-data-001/
   [junit4]   2> 11637 INFO  (coreLoadExecutor-19-thread-1) [    x:collection1] o.a.s.u.p.UpdateRequestProcessorChain creating updateRequestProcessorChain "dedupe"
   [junit4]   2> 11637 INFO  (coreLoadExecutor-19-thread-1) [    x:collection1] o.a.s.u.p.UpdateRequestProcessorChain inserting DistributedUpdateProcessorFactory into updateRequestProcessorChain "dedupe"
   [junit4]   2> 11638 INFO  (coreLoadExecutor-19-thread-1) [    x:collection1] o.a.s.u.p.UpdateRequestProcessorChain creating updateRequestProcessorChain "dedupe-allfields"
   [junit4]   2> 11638 INFO  (coreLoadExecutor-19-thread-1) [    x:collection1] o.a.s.u.p.UpdateRequestProcessorChain inserting DistributedUpdateProcessorFactory into updateRequestProcessorChain "dedupe-allfields"
   [junit4]   2> 11638 INFO  (coreLoadExecutor-19-thread-1) [    x:collection1] o.a.s.u.p.UpdateRequestProcessorChain creating updateRequestProcessorChain "stored_sig"
   [junit4]   2> 11638 INFO  (coreLoadExecutor-19-thread-1) [    x:collection1] o.a.s.u.p.UpdateRequestProcessorChain inserting DistributedUpdateProcessorFactory into updateRequestProcessorChain "stored_sig"
   [junit4]   2> 11638 INFO  (coreLoadExecutor-19-thread-1) [    x:collection1] o.a.s.u.p.UpdateRequestProcessorChain creating updateRequestProcessorChain "uniq-fields"
   [junit4]   2> 11639 INFO  (coreLoadExecutor-19-thread-1) [    x:collection1] o.a.s.u.p.UpdateRequestProcessorChain inserting DistributedUpdateProcessorFactory into updateRequestProcessorChain "uniq-fields"
   [junit4]   2> 11639 INFO  (coreLoadExecutor-19-thread-1) [    x:collection1] o.a.s.u.p.UpdateRequestProcessorChain creating updateRequestProcessorChain "distrib-dup-test-chain-explicit"
   [junit4]   2> 11639 INFO  (coreLoadExecutor-19-thread-1) [    x:collection1] o.a.s.u.p.UpdateRequestProcessorChain creating updateRequestProcessorChain "distrib-dup-test-chain-implicit"
   [junit4]   2> 11640 INFO  (coreLoadExecutor-19-thread-1) [    x:collection1] o.a.s.u.p.UpdateRequestProcessorChain inserting DistributedUpdateProcessorFactory into updateRequestProcessorChain "distrib-dup-test-chain-implicit"
   [junit4]   2> 11640 INFO  (coreLoadExecutor-19-thread-1) [    x:collection1] o.a.s.c.SolrCore no updateRequestProcessorChain defined as default, creating implicit default
   [junit4]   2> 11652 INFO  (coreLoadExecutor-19-thread-1) [    x:collection1] o.a.s.h.l.XMLLoader xsltCacheLifetimeSeconds=60
   [junit4]   2> 11654 INFO  (coreLoadExecutor-19-thread-1) [    x:collection1] o.a.s.h.l.XMLLoader xsltCacheLifetimeSeconds=60
   [junit4]   2> 11655 INFO  (coreLoadExecutor-19-thread-1) [    x:collection1] o.a.s.h.l.XMLLoader xsltCacheLifetimeSeconds=60
   [junit4]   2> 11657 INFO  (coreLoadExecutor-19-thread-1) [    x:collection1] o.a.s.h.l.XMLLoader xsltCacheLifetimeSeconds=60
   [junit4]   2> 11661 INFO  (coreLoadExecutor-19-thread-1) [    x:collection1] o.a.s.c.PluginBag requestHandler : 'lazy' created with startup=lazy 
   [junit4]   2> 11663 INFO  (coreLoadExecutor-19-thread-1) [    x:collection1] o.a.s.c.RequestHandlers Registered paths: /admin/mbeans,standard,spellCheckCompRH,lazy,/update/json/docs,/admin/luke,/export,spellCheckWithWordbreak_Direct,tvrh,/get,/admin/properties,/update/json,mltrh,/admin/threads,/search-facet-def,/update/csv,/sql,/graph,/search-facet-invariants,/admin/segments,spellCheckCompRH1,/mlt,/admin/system,/replication,dismax,defaults,/config,/stream,/schema,/admin/plugins,/admin/logging,spellCheckWithWordbreak,mock,/admin/ping,/update,/admin/file,/terms,spellCheckCompRH_Direct,/debug/dump
   [junit4]   2> 11664 INFO  (coreLoadExecutor-19-thread-1) [    x:collection1] o.a.s.c.SolrCore Using default statsCache cache: org.apache.solr.search.stats.LocalStatsCache
   [junit4]   2> 11665 INFO  (coreLoadExecutor-19-thread-1) [    x:collection1] o.a.s.u.UpdateHandler Using UpdateLog implementation: org.apache.solr.update.UpdateLog
   [junit4]   2> 11665 INFO  (coreLoadExecutor-19-thread-1) [    x:collection1] o.a.s.u.UpdateLog Initializing UpdateLog: dataDir= defaultSyncLevel=FLUSH numRecordsToKeep=100 maxNumLogsToKeep=10 numVersionBuckets=65536
   [junit4]   2> 11669 INFO  (coreLoadExecutor-19-thread-1) [    x:collection1] o.a.s.u.CommitTracker Hard AutoCommit: disabled
   [junit4]   2> 11669 INFO  (coreLoadExecutor-19-thread-1) [    x:collection1] o.a.s.u.CommitTracker Soft AutoCommit: disabled
   [junit4]   2> 11670 INFO  (coreLoadExecutor-19-thread-1) [    x:collection1] o.a.s.u.RandomMergePolicy RandomMergePolicy wrapping class org.apache.lucene.index.TieredMergePolicy: [TieredMergePolicy: maxMergeAtOnce=38, maxMergeAtOnceExplicit=22, maxMergedSegmentMB=64.404296875, floorSegmentMB=0.5595703125, forceMergeDeletesPctAllowed=14.343488634868976, segmentsPerTier=6.0, maxCFSSegmentSizeMB=8.796093022207999E12, noCFSRatio=1.0
   [junit4]   2> 11672 INFO  (coreLoadExecutor-19-thread-1) [    x:collection1] o.a.s.c.SolrDeletionPolicy SolrDeletionPolicy.onInit: commits: num=1
   [junit4]   2> 	commit{dir=MockDirectoryWrapper(RAMDirectory@3f67c6a5 lockFactory=org.apache.lucene.store.SingleInstanceLockFactory@78c02bb9),segFN=segments_1,generation=1}
   [junit4]   2> 11672 INFO  (coreLoadExecutor-19-thread-1) [    x:collection1] o.a.s.c.SolrDeletionPolicy newest commit generation = 1
   [junit4]   2> 11672 INFO  (coreLoadExecutor-19-thread-1) [    x:collection1] o.a.s.s.SolrIndexSearcher Opening [Searcher@21c418f8[collection1] main]
   [junit4]   2> 11673 INFO  (coreLoadExecutor-19-thread-1) [    x:collection1] o.a.s.r.RestManager Initializing RestManager with initArgs: {storageIO=org.apache.solr.rest.ManagedResourceStorage$InMemoryStorageIO}
   [junit4]   2> 11673 INFO  (coreLoadExecutor-19-thread-1) [    x:collection1] o.a.s.r.ManagedResourceStorage Reading _rest_managed.json using InMemoryStorage
   [junit4]   2> 11673 INFO  (coreLoadExecutor-19-thread-1) [    x:collection1] o.a.s.r.RestManager Initializing 0 registered ManagedResources
   [junit4]   2> 11673 INFO  (coreLoadExecutor-19-thread-1) [    x:collection1] o.a.s.h.c.SpellCheckComponent Initializing spell checkers
   [junit4]   2> 11684 INFO  (coreLoadExecutor-19-thread-1) [    x:collection1] o.a.s.s.DirectSolrSpellChecker init: {name=direct,classname=DirectSolrSpellChecker,field=lowerfilt,minQueryLength=3}
   [junit4]   2> 11722 INFO  (coreLoadExecutor-19-thread-1) [    x:collection1] o.a.s.h.ReplicationHandler Commits will be reserved for  10000
   [junit4]   2> 11723 INFO  (searcherExecutor-20-thread-1-processing-x:collection1) [    x:collection1] o.a.s.h.c.SpellCheckComponent Loading spell index for spellchecker: default
   [junit4]   2> 11723 INFO  (coreLoadExecutor-19-thread-1) [    x:collection1] o.a.s.u.UpdateLog Looking up max value of version field to seed version buckets
   [junit4]   2> 11723 INFO  (coreLoadExecutor-19-thread-1) [    x:collection1] o.a.s.u.VersionInfo Refreshing highest value of _version_ for 65536 version buckets from index
   [junit4]   2> 11724 INFO  (coreLoadExecutor-19-thread-1) [    x:collection1] o.a.s.u.VersionInfo No terms found for _version_, cannot seed version bucket highest value from index
   [junit4]   2> 11724 INFO  (coreLoadExecutor-19-thread-1) [    x:collection1] o.a.s.u.UpdateLog Could not find max version in index or recent updates, using new clock 1534457783347314688
   [junit4]   2> 11724 INFO  (searcherExecutor-20-thread-1-processing-x:collection1) [    x:collection1] o.a.s.h.c.SpellCheckComponent Loading spell index for spellchecker: direct
   [junit4]   2> 11724 INFO  (searcherExecutor-20-thread-1-processing-x:collection1) [    x:collection1] o.a.s.h.c.SpellCheckComponent Loading spell index for spellchecker: wordbreak
   [junit4]   2> 11724 INFO  (searcherExecutor-20-thread-1-processing-x:collection1) [    x:collection1] o.a.s.h.c.SpellCheckComponent Loading spell index for spellchecker: multipleFields
   [junit4]   2> 11725 INFO  (searcherExecutor-20-thread-1-processing-x:collection1) [    x:collection1] o.a.s.h.c.SpellCheckComponent Loading spell index for spellchecker: jarowinkler
   [junit4]   2> 11725 INFO  (searcherExecutor-20-thread-1-processing-x:collection1) [    x:collection1] o.a.s.h.c.SpellCheckComponent Loading spell index for spellchecker: external
   [junit4]   2> 11726 INFO  (searcherExecutor-20-thread-1-processing-x:collection1) [    x:collection1] o.a.s.h.c.SpellCheckComponent Loading spell index for spellchecker: freq
   [junit4]   2> 11727 INFO  (searcherExecutor-20-thread-1-processing-x:collection1) [    x:collection1] o.a.s.h.c.SpellCheckComponent Loading spell index for spellchecker: fqcn
   [junit4]   2> 11727 INFO  (searcherExecutor-20-thread-1-processing-x:collection1) [    x:collection1] o.a.s.h.c.SpellCheckComponent Loading spell index for spellchecker: perDict
   [junit4]   2> 11728 INFO  (searcherExecutor-20-thread-1-processing-x:collection1) [    x:collection1] o.a.s.c.SolrCore [collection1] Registered new searcher Searcher@21c418f8[collection1] main{ExitableDirectoryReader(UninvertingDirectoryReader())}
   [junit4]   2> 11730 INFO  (coreLoadExecutor-19-thread-1) [    x:collection1] o.a.s.u.UpdateLog Took 6.0ms to seed version buckets with highest version 1534457783347314688
   [junit4]   2> 11731 INFO  (coreLoadExecutor-19-thread-1) [    x:collection1] o.a.s.c.CoreContainer registering core: collection1
   [junit4]   2> 11733 INFO  (SUITE-SoftAutoCommitTest-seed#[29AE75003DD73189]-worker) [    ] o.a.s.SolrTestCaseJ4 ####initCore end
   [junit4]   2> 11737 INFO  (TEST-SoftAutoCommitTest.testSoftAndHardCommitMaxTimeMixedAdds-seed#[29AE75003DD73189]) [    ] o.a.s.SolrTestCaseJ4 ###Starting testSoftAndHardCommitMaxTimeMixedAdds
   [junit4]   2> 11737 INFO  (TEST-SoftAutoCommitTest.testSoftAndHardCommitMaxTimeMixedAdds-seed#[29AE75003DD73189]) [    ] o.a.s.c.SolrResourceLoader new SolrResourceLoader for directory: '/Users/jenkins/workspace/Lucene-Solr-master-MacOSX/solr/core/src/test-files/solr/collection1'
   [junit4]   2> 11737 INFO  (TEST-SoftAutoCommitTest.testSoftAndHardCommitMaxTimeMixedAdds-seed#[29AE75003DD73189]) [    ] o.a.s.c.SolrResourceLoader JNDI not configured for solr (NoInitialContextEx)
   [junit4]   2> 11738 INFO  (TEST-SoftAutoCommitTest.testSoftAndHardCommitMaxTimeMixedAdds-seed#[29AE75003DD73189]) [    ] o.a.s.c.SolrResourceLoader using system property solr.solr.home: /Users/jenkins/workspace/Lucene-Solr-master-MacOSX/solr/core/src/test-files/solr
   [junit4]   2> 11738 INFO  (TEST-SoftAutoCommitTest.testSoftAndHardCommitMaxTimeMixedAdds-seed#[29AE75003DD73189]) [    ] o.a.s.c.SolrResourceLoader Adding 'file:/Users/jenkins/workspace/Lucene-Solr-master-MacOSX/solr/core/src/test-files/solr/collection1/lib/classes/' to classloader
   [junit4]   2> 11738 INFO  (TEST-SoftAutoCommitTest.testSoftAndHardCommitMaxTimeMixedAdds-seed#[29AE75003DD73189]) [    ] o.a.s.c.SolrResourceLoader Adding 'file:/Users/jenkins/workspace/Lucene-Solr-master-MacOSX/solr/core/src/test-files/solr/collection1/lib/README' to classloader
   [junit4]   2> 11824 INFO  (TEST-SoftAutoCommitTest.testSoftAndHardCommitMaxTimeMixedAdds-seed#[29AE75003DD73189]) [    ] o.a.s.c.SolrConfig current version of requestparams : -1
   [junit4]   2> 11849 INFO  (TEST-SoftAutoCommitTest.testSoftAndHardCommitMaxTimeMixedAdds-seed#[29AE75003DD73189]) [    ] o.a.s.c.SolrConfig Using Lucene MatchVersion: 7.0.0
   [junit4]   2> 11905 INFO  (TEST-SoftAutoCommitTest.testSoftAndHardCommitMaxTimeMixedAdds-seed#[29AE75003DD73189]) [    ] o.a.s.c.SolrConfig Loaded SolrConfig: solrconfig.xml
   [junit4]   2> 11924 INFO  (TEST-SoftAutoCommitTest.testSoftAndHardCommitMaxTimeMixedAdds-seed#[29AE75003DD73189]) [    ] o.a.s.s.IndexSchema [collection1] Schema name=test
   [junit4]   2> 12132 INFO  (TEST-SoftAutoCommitTest.testSoftAndHardCommitMaxTimeMixedAdds-seed#[29AE75003DD73189]) [    ] o.a.s.s.OpenExchangeRatesOrgProvider Initialized with rates=open-exchange-rates.json, refreshInterval=1440.
   [junit4]   2> 12151 INFO  (TEST-SoftAutoCommitTest.testSoftAndHardCommitMaxTimeMixedAdds-seed#[29AE75003DD73189]) [    ] o.a.s.s.IndexSchema default search field in schema is text
   [junit4]   2> 12152 INFO  (TEST-SoftAutoCommitTest.testSoftAndHardCommitMaxTimeMixedAdds-seed#[29AE75003DD73189]) [    ] o.a.s.s.IndexSchema unique key field: id
   [junit4]   2> 12163 INFO  (TEST-SoftAutoCommitTest.testSoftAndHardCommitMaxTimeMixedAdds-seed#[29AE75003DD73189]) [    ] o.a.s.s.FileExchangeRateProvider Reloading exchange rates from file currency.xml
   [junit4]   2> 12173 INFO  (TEST-SoftAutoCommitTest.testSoftAndHardCommitMaxTimeMixedAdds-seed#[29AE75003DD73189]) [    ] o.a.s.s.FileExchangeRateProvider Reloading exchange rates from file currency.xml
   [junit4]   2> 12182 INFO  (TEST-SoftAutoCommitTest.testSoftAndHardCommitMaxTimeMixedAdds-seed#[29AE75003DD73189]) [    ] o.a.s.s.OpenExchangeRatesOrgProvider Reloading exchange rates from open-exchange-rates.json
   [junit4]   2> 12184 INFO  (TEST-SoftAutoCommitTest.testSoftAndHardCommitMaxTimeMixedAdds-seed#[29AE75003DD73189]) [    ] o.a.s.s.OpenExchangeRatesOrgProvider Reloading exchange rates from open-exchange-rates.json
   [junit4]   2> 12196 INFO  (TEST-SoftAutoCommitTest.testSoftAndHardCommitMaxTimeMixedAdds-seed#[29AE75003DD73189]) [    ] o.a.s.c.ConfigSetProperties Did not find ConfigSet properties, assuming default properties: Can't find resource 'configsetprops.json' in classpath or '/Users/jenkins/workspace/Lucene-Solr-master-MacOSX/solr/core/src/test-files/solr/collection1'
   [junit4]   2> 12199 INFO  (TEST-SoftAutoCommitTest.testSoftAndHardCommitMaxTimeMixedAdds-seed#[29AE75003DD73189]) [    ] o.a.s.c.CoreContainer Reloading SolrCore 'collection1' using configuration from instancedir /Users/jenkins/workspace/Lucene-Solr-master-MacOSX/solr/core/src/test-files/solr/collection1
   [junit4]   2> 12221 INFO  (TEST-SoftAutoCommitTest.testSoftAndHardCommitMaxTimeMixedAdds-seed#[29AE75003DD73189]) [    x:collection1] o.a.s.c.SolrCore [[collection1] ] Opening new SolrCore at [/Users/jenkins/workspace/Lucene-Solr-master-MacOSX/solr/core/src/test-files/solr/collection1], dataDir=[/Users/jenkins/workspace/Lucene-Solr-master-MacOSX/solr/build/solr-core/test/J0/temp/solr.update.SoftAutoCommitTest_29AE75003DD73189-001/init-core-data-001/]
   [junit4]   2> 12221 INFO  (TEST-SoftAutoCommitTest.testSoftAndHardCommitMaxTimeMixedAdds-seed#[29AE75003DD73189]) [    x:collection1] o.a.s.c.JmxMonitoredMap No JMX servers found, not exposing Solr information with JMX.
   [junit4]   2> 12222 INFO  (TEST-SoftAutoCommitTest.testSoftAndHardCommitMaxTimeMixedAdds-seed#[29AE75003DD73189]) [    x:collection1] o.a.s.c.SolrCore New index directory detected: old=null new=/Users/jenkins/workspace/Lucene-Solr-master-MacOSX/solr/build/solr-core/test/J0/temp/solr.update.SoftAutoCommitTest_29AE75003DD73189-001/init-core-data-001/index/
   [junit4]   2> 12235 INFO  (OldIndexDirectoryCleanupThreadForCore-collection1) [    x:collection1] o.a.s.c.SolrCore Looking for old index directories to cleanup for core collection1 in /Users/jenkins/workspace/Lucene-Solr-master-MacOSX/solr/build/solr-core/test/J0/temp/solr.update.SoftAutoCommitTest_29AE75003DD73189-001/init-core-data-001/
   [junit4]   2> 12241 INFO  (TEST-SoftAutoCommitTest.testSoftAndHardCommitMaxTimeMixedAdds-seed#[29AE75003DD73189]) [    x:collection1] o.a.s.u.p.UpdateRequestProcessorChain creating updateRequestProcessorChain "dedupe"
   [junit4]   2> 12241 INFO  (TEST-SoftAutoCommitTest.testSoftAndHardCommitMaxTimeMixedAdds-seed#[29AE75003DD73189]) [    x:collection1] o.a.s.u.p.UpdateRequestProcessorChain inserting DistributedUpdateProcessorFactory into updateRequestProcessorChain "dedupe"
   [junit4]   2> 12241 INFO  (TEST-SoftAutoCommitTest.testSoftAndHardCommitMaxTimeMixedAdds-seed#[29AE75003DD73189]) [    x:collection1] o.a.s.u.p.UpdateRequestProcessorChain creating updateRequestProcessorChain "dedupe-allfields"
   [junit4]   2> 12241 INFO  (TEST-SoftAutoCommitTest.testSoftAndHardCommitMaxTimeMixedAdds-seed#[29AE75003DD73189]) [    x:collection1] o.a.s.u.p.UpdateRequestProcessorChain inserting DistributedUpdateProcessorFactory into updateRequestProcessorChain "dedupe-allfields"
   [junit4]   2> 12242 INFO  (TEST-SoftAutoCommitTest.testSoftAndHardCommitMaxTimeMixedAdds-seed#[29AE75003DD73189]) [    x:collection1] o.a.s.u.p.UpdateRequestProcessorChain creating updateRequestProcessorChain "stored_sig"
   [junit4]   2> 12242 INFO  (TEST-SoftAutoCommitTest.testSoftAndHardCommitMaxTimeMixedAdds-seed#[29AE75003DD73189]) [    x:collection1] o.a.s.u.p.UpdateRequestProcessorChain inserting DistributedUpdateProcessorFactory into updateRequestProcessorChain "stored_sig"
   [junit4]   2> 12242 INFO  (TEST-SoftAutoCommitTest.testSoftAndHardCommitMaxTimeMixedAdds-seed#[29AE75003DD73189]) [    x:collection1] o.a.s.u.p.UpdateRequestProcessorChain creating updateRequestProcessorChain "uniq-fields"
   [junit4]   2> 12243 INFO  (TEST-SoftAutoCommitTest.testSoftAndHardCommitMaxTimeMixedAdds-seed#[29AE75003DD73189]) [    x:collection1] o.a.s.u.p.UpdateRequestProcessorChain inserting DistributedUpdateProcessorFactory into updateRequestProcessorChain "uniq-fields"
   [junit4]   2> 12244 INFO  (TEST-SoftAutoCommitTest.testSoftAndHardCommitMaxTimeMixedAdds-seed#[29AE75003DD73189]) [    x:collection1] o.a.s.u.p.UpdateRequestProcessorChain creating updateRequestProcessorChain "distrib-dup-test-chain-explicit"
   [junit4]   2> 12244 INFO  (TEST-SoftAutoCommitTest.testSoftAndHardCommitMaxTimeMixedAdds-seed#[29AE75003DD73189]) [    x:collection1] o.a.s.u.p.UpdateRequestProcessorChain creating updateRequestProcessorChain "distrib-dup-test-chain-implicit"
   [junit4]   2> 12244 INFO  (TEST-SoftAutoCommitTest.testSoftAndHardCommitMaxTimeMixedAdds-seed#[29AE75003DD73189]) [    x:collection1] o.a.s.u.p.UpdateRequestProcessorChain inserting DistributedUpdateProcessorFactory into updateRequestProcessorChain "distrib-dup-test-chain-implicit"
   [junit4]   2> 12245 INFO  (TEST-SoftAutoCommitTest.testSoftAndHardCommitMaxTimeMixedAdds-seed#[29AE75003DD73189]) [    x:collection1] o.a.s.c.SolrCore no updateRequestProcessorChain defined as default, creating implicit default
   [junit4]   2> 12268 INFO  (TEST-SoftAutoCommitTest.testSoftAndHardCommitMaxTimeMixedAdds-seed#[29AE75003DD73189]) [    x:collection1] o.a.s.h.l.XMLLoader xsltCacheLifetimeSeconds=60
   [junit4]   2> 12272 INFO  (TEST-SoftAutoCommitTest.testSoftAndHardCommitMaxTimeMixedAdds-seed#[29AE75003DD73189]) [    x:collection1] o.a.s.h.l.XMLLoader xsltCacheLifetimeSeconds=60
   [junit4]   2> 12275 INFO  (TEST-SoftAutoCommitTest.testSoftAndHardCommitMaxTimeMixedAdds-seed#[29AE75003DD73189]) [    x:collection1] o.a.s.h.l.XMLLoader xsltCacheLifetimeSeconds=60
   [junit4]   2> 12276 INFO  (TEST-SoftAutoCommitTest.testSoftAndHardCommitMaxTimeMixedAdds-seed#[29AE75003DD73189]) [    x:collection1] o.a.s.h.l.XMLLoader xsltCacheLifetimeSeconds=60
   [junit4]   2> 12292 INFO  (TEST-SoftAutoCommitTest.testSoftAndHardCommitMaxTimeMixedAdds-seed#[29AE75003DD73189]) [    x:collection1] o.a.s.c.PluginBag requestHandler : 'lazy' created with startup=lazy 
   [junit4]   2> 12293 INFO  (TEST-SoftAutoCommitTest.testSoftAndHardCommitMaxTimeMixedAdds-seed#[29AE75003DD73189]) [    x:collection1] o.a.s.c.RequestHandlers Registered paths: /admin/mbeans,standard,spellCheckCompRH,lazy,/update/json/docs,/admin/luke,/export,spellCheckWithWordbreak_Direct,tvrh,/get,/admin/properties,/update/json,mltrh,/admin/threads,/search-facet-def,/update/csv,/sql,/graph,/search-facet-invariants,/admin/segments,spellCheckCompRH1,/mlt,/admin/system,/replication,dismax,defaults,/config,/stream,/schema,/admin/plugins,/admin/logging,spellCheckWithWordbreak,mock,/admin/ping,/update,/admin/file,/terms,spellCheckCompRH_Direct,/debug/dump
   [junit4]   2> 12294 INFO  (TEST-SoftAutoCommitTest.testSoftAndHardCommitMaxTimeMixedAdds-seed#[29AE75003DD73189]) [    x:collection1] o.a.s.c.SolrCore Using default statsCache cache: org.apache.solr.search.stats.LocalStatsCache
   [junit4]   2> 12294 INFO  (TEST-SoftAutoCommitTest.testSoftAndHardCommitMaxTimeMixedAdds-seed#[29AE75003DD73189]) [    x:collection1] o.a.s.u.CommitTracker Hard AutoCommit: disabled
   [junit4]   2> 12295 INFO  (TEST-SoftAutoCommitTest.testSoftAndHardCommitMaxTimeMixedAdds-seed#[29AE75003DD73189]) [    x:collection1] o.a.s.u.CommitTracker Soft AutoCommit: disabled
   [junit4]   2> 12297 INFO  (TEST-SoftAutoCommitTest.testSoftAndHardCommitMaxTimeMixedAdds-seed#[29AE75003DD73189]) [    x:collection1] o.a.s.s.SolrIndexSearcher Opening [Searcher@5b42f49e[collection1] main]
   [junit4]   2> 12298 INFO  (TEST-SoftAutoCommitTest.testSoftAndHardCommitMaxTimeMixedAdds-seed#[29AE75003DD73189]) [    x:collection1] o.a.s.r.RestManager Initializing RestManager with initArgs: {storageIO=org.apache.solr.rest.ManagedResourceStorage$InMemoryStorageIO}
   [junit4]   2> 12298 INFO  (TEST-SoftAutoCommitTest.testSoftAndHardCommitMaxTimeMixedAdds-seed#[29AE75003DD73189]) [    x:collection1] o.a.s.r.ManagedResourceStorage Reading _rest_managed.json using InMemoryStorage
   [junit4]   2> 12298 INFO  (TEST-SoftAutoCommitTest.testSoftAndHardCommitMaxTimeMixedAdds-seed#[29AE75003DD73189]) [    x:collection1] o.a.s.r.RestManager Initializing 0 registered ManagedResources
   [junit4]   2> 12298 INFO  (TEST-SoftAutoCommitTest.testSoftAndHardCommitMaxTimeMixedAdds-seed#[29AE75003DD73189]) [    x:collection1] o.a.s.h.c.SpellCheckComponent Initializing spell checkers
   [junit4]   2> 12300 INFO  (TEST-SoftAutoCommitTest.testSoftAndHardCommitMaxTimeMixedAdds-seed#[29AE75003DD73189]) [    x:collection1] o.a.s.s.DirectSolrSpellChecker init: {name=direct,classname=DirectSolrSpellChecker,field=lowerfilt,minQueryLength=3}
   [junit4]   2> 12306 INFO  (TEST-SoftAutoCommitTest.testSoftAndHardCommitMaxTimeMixedAdds-seed#[29AE75003DD73189]) [    x:collection1] o.a.s.h.ReplicationHandler Commits will be reserved for  10000
   [junit4]   2> 12307 INFO  (searcherExecutor-25-thread-1-processing-x:collection1) [    x:collection1] o.a.s.h.c.SpellCheckComponent Loading spell index for spellchecker: default
   [junit4]   2> 12307 INFO  (TEST-SoftAutoCommitTest.testSoftAndHardCommitMaxTimeMixedAdds-seed#[29AE75003DD73189]) [    x:collection1] o.a.s.u.UpdateLog Looking up max value of version field to seed version buckets
   [junit4]   2> 12308 INFO  (TEST-SoftAutoCommitTest.testSoftAndHardCommitMaxTimeMixedAdds-seed#[29AE75003DD73189]) [    x:collection1] o.a.s.u.VersionInfo Refreshing highest value of _version_ for 65536 version buckets from index
   [junit4]   2> 12309 INFO  (TEST-SoftAutoCommitTest.testSoftAndHardCommitMaxTimeMixedAdds-seed#[29AE75003DD73189]) [    x:collection1] o.a.s.u.VersionInfo No terms found for _version_, cannot seed version bucket highest value from index
   [junit4]   2> 12309 INFO  (TEST-SoftAutoCommitTest.testSoftAndHardCommitMaxTimeMixedAdds-seed#[29AE75003DD73189]) [    x:collection1] o.a.s.u.UpdateLog Could not find max version in index or recent updates, using new clock 1534457783960731648
   [junit4]   2> 12309 INFO  (searcherExecutor-25-thread-1-processing-x:collection1) [    x:collection1] o.a.s.h.c.SpellCheckComponent Loading spell index for spellchecker: direct
   [junit4]   2> 12309 INFO  (searcherExecutor-25-thread-1-processing-x:collection1) [    x:collection1] o.a.s.h.c.SpellCheckComponent Loading spell index for spellchecker: wordbreak
   [junit4]   2> 12309 INFO  (searcherExecutor-25-thread-1-processing-x:collection1) [    x:collection1] o.a.s.h.c.SpellCheckComponent Loading spell index for spellchecker: multipleFields
   [junit4]   2> 12311 INFO  (searcherExecutor-25-thread-1-processing-x:collection1) [    x:collection1] o.a.s.h.c.SpellCheckComponent Loading spell index for spellchecker: jarowinkler
   [junit4]   2> 12311 INFO  (searcherExecutor-25-thread-1-processing-x:collection1) [    x:collection1] o.a.s.h.c.SpellCheckComponent Loading spell index for spellchecker: external
   [junit4]   2> 12313 INFO  (searcherExecutor-25-thread-1-processing-x:collection1) [    x:collection1] o.a.s.h.c.SpellCheckComponent Loading spell index for spellchecker: freq
   [junit4]   2> 12313 INFO  (searcherExecutor-25-thread-1-processing-x:collection1) [    x:collection1] o.a.s.h.c.SpellCheckComponent Loading spell index for spellchecker: fqcn
   [junit4]   2> 12314 INFO  (searcherExecutor-25-thread-1-processing-x:collection1) [    x:collection1] o.a.s.h.c.SpellCheckComponent Loading spell index for spellchecker: perDict
   [junit4]   2> 12314 INFO  (searcherExecutor-25-thread-1-processing-x:collection1) [    x:collection1] o.a.s.c.SolrCore [collection1] Registered new searcher Searcher@5b42f49e[collection1] main{ExitableDirectoryReader(UninvertingDirectoryReader())}
   [junit4]   2> 12318 INFO  (TEST-SoftAutoCommitTest.testSoftAndHardCommitMaxTimeMixedAdds-seed#[29AE75003DD73189]) [    x:collection1] o.a.s.u.UpdateLog Took 10.0ms to seed version buckets with highest version 1534457783960731648
   [junit4]   2> 12318 INFO  (TEST-SoftAutoCommitTest.testSoftAndHardCommitMaxTimeMixedAdds-seed#[29AE75003DD73189]) [    x:collection1] o.a.s.u.DefaultSolrCoreState Closing old IndexWriter... core=collection1
   [junit4]   2> 12319 INFO  (TEST-SoftAutoCommitTest.testSoftAndHardCommitMaxTimeMixedAdds-seed#[29AE75003DD73189]) [    x:collection1] o.a.s.u.RandomMergePolicy RandomMergePolicy wrapping class org.apache.lucene.index.TieredMergePolicy: [TieredMergePolicy: maxMergeAtOnce=18, maxMergeAtOnceExplicit=38, maxMergedSegmentMB=17.197265625, floorSegmentMB=0.5009765625, forceMergeDeletesPctAllowed=14.634688705351213, segmentsPerTier=41.0, maxCFSSegmentSizeMB=8.796093022207999E12, noCFSRatio=0.24074338318224245
   [junit4]   2> 12335 INFO  (TEST-SoftAutoCommitTest.testSoftAndHardCommitMaxTimeMixedAdds-seed#[29AE75003DD73189]) [    x:collection1] o.a.s.c.SolrDeletionPolicy SolrDeletionPolicy.onInit: commits: num=1
   [junit4]   2> 	commit{dir=MockDirectoryWrapper(RAMDirectory@3f67c6a5 lockFactory=org.apache.lucene.store.SingleInstanceLockFactory@78c02bb9),segFN=segments_1,generation=1}
   [junit4]   2> 12335 INFO  (TEST-SoftAutoCommitTest.testSoftAndHardCommitMaxTimeMixedAdds-seed#[29AE75003DD73189]) [    x:collection1] o.a.s.c.SolrDeletionPolicy newest commit generation = 1
   [junit4]   2> 12335 INFO  (TEST-SoftAutoCommitTest.testSoftAndHardCommitMaxTimeMixedAdds-seed#[29AE75003DD73189]) [    x:collection1] o.a.s.u.DefaultSolrCoreState New IndexWriter is ready to be used.
   [junit4]   2> 12335 INFO  (TEST-SoftAutoCommitTest.testSoftAndHardCommitMaxTimeMixedAdds-seed#[29AE75003DD73189]) [    x:collection1] o.a.s.s.SolrIndexSearcher Opening [Searcher@14c82128[collection1] main]
   [junit4]   2> 12337 INFO  (TEST-SoftAutoCommitTest.testSoftAndHardCommitMaxTimeMixedAdds-seed#[29AE75003DD73189]) [    x:collection1] o.a.s.c.CoreContainer replacing core: collection1
   [junit4]   2> 12337 INFO  (TEST-SoftAutoCommitTest.testSoftAndHardCommitMaxTimeMixedAdds-seed#[29AE75003DD73189]) [    x:collection1] o.a.s.c.SolrCore [collection1]  CLOSING SolrCore org.apache.solr.core.SolrCore@3675b5cc
   [junit4]   2> 12337 INFO  (TEST-SoftAutoCommitTest.testSoftAndHardCommitMaxTimeMixedAdds-seed#[29AE75003DD73189]) [    x:collection1] o.a.s.u.DirectUpdateHandler2 closing DirectUpdateHandler2{commits=0,autocommits=0,soft autocommits=0,optimizes=0,rollbacks=0,expungeDeletes=0,docsPending=0,adds=0,deletesById=0,deletesByQuery=0,errors=0,cumulative_adds=0,cumulative_deletesById=0,cumulative_deletesByQuery=0,cumulative_errors=0,transaction_logs_total_size=0,transaction_logs_total_number=0}
   [junit4]   2> 12338 INFO  (TEST-SoftAutoCommitTest.testSoftAndHardCommitMaxTimeMixedAdds-seed#[29AE75003DD73189]) [    x:collection1] o.a.s.c.SolrCore [collection1] Closing main searcher on request.
   [junit4]   2> 12339 INFO  (searcherExecutor-25-thread-1-processing-x:collection1) [    x:collection1] o.a.s.c.SolrCore [collection1] Registered new searcher Searcher@14c82128[collection1] main{ExitableDirectoryReader(UninvertingDirectoryReader())}
   [junit4]   2> 13253 INFO  (TEST-SoftAutoCommitTest.testSoftAndHardCommitMaxTimeMixedAdds-seed#[29AE75003DD73189]) [    x:collection1] o.a.s.u.p.LogUpdateProcessorFactory [collection1]  webapp=null path=null params={}{add=[529 (1534457784477679616)]} 0 905
   [junit4]   2> 13748 INFO  (commitScheduler-28-thread-1) [    x:collection1] o.a.s.u.DirectUpdateHandler2 start commit{,optimize=false,openSearcher=true,waitSearcher=true,expungeDeletes=false,softCommit=true,prepareCommit=false}
   [junit4]   2> 14274 INFO  (TEST-SoftAutoCommitTest.testSoftAndHardCommitMaxTimeMixedAdds-seed#[29AE75003DD73189]) [    x:collection1] o.a.s.SolrTestCaseJ4 ###Ending testSoftAndHardCommitMaxTimeMixedAdds
   [junit4]   2> NOTE: reproduce with: ant test  -Dtestcase=SoftAutoCommitTest -Dtests.method=testSoftAndHardCommitMaxTimeMixedAdds -Dtests.seed=29AE75003DD73189 -Dtests.slow=true -Dtests.locale=fr-LU -Dtests.timezone=AST -Dtests.asserts=true -Dtests.file.encoding=ISO-8859-1
   [junit4] FAILURE 2.55s J0 | SoftAutoCommitTest.testSoftAndHardCommitMaxTimeMixedAdds <<<
   [junit4]    > Throwable #1: java.lang.AssertionError: soft529 wasn't fast enough
   [junit4]    > 	at __randomizedtesting.SeedInfo.seed([29AE75003DD73189:787A8C808CA4012E]:0)
   [junit4]    > 	at org.apache.solr.update.SoftAutoCommitTest.testSoftAndHardCommitMaxTimeMixedAdds(SoftAutoCommitTest.java:111)
   [junit4]    > 	at java.lang.Thread.run(Thread.java:745)
   [junit4]   2> 14285 INFO  (TEST-SoftAutoCommitTest.testSoftAndHardCommitMaxTimeDelete-seed#[29AE75003DD73189]) [    x:collection1] o.a.s.SolrTestCaseJ4 ###Starting testSoftAndHardCommitMaxTimeDelete
   [junit4]   2> 14285 INFO  (TEST-SoftAutoCommitTest.testSoftAndHardCommitMaxTimeDelete-seed#[29AE75003DD73189]) [    x:collection1] o.a.s.c.SolrResourceLoader new SolrResourceLoader for directory: '/Users/jenkins/workspace/Lucene-Solr-master-MacOSX/solr/core/src/test-files/solr/collection1'
   [junit4]   2> 14285 INFO  (TEST-SoftAutoCommitTest.testSoftAndHardCommitMaxTimeDelete-seed#[29AE75003DD73189]) [    x:collection1] o.a.s.c.SolrResourceLoader JNDI not configured for solr (NoInitialContextEx)
   [junit4]   2> 14285 INFO  (TEST-SoftAutoCommitTest.testSoftAndHardCommitMaxTimeDelete-seed#[29AE75003DD73189]) [    x:collection1] o.a.s.c.SolrResourceLoader using system property solr.solr.home: /Users/jenkins/workspace/Lucene-Solr-master-MacOSX/solr/core/src/test-files/solr
   [junit4]   2> 14286 INFO  (TEST-SoftAutoCommitTest.testSoftAndHardCommitMaxTimeDelete-seed#[29AE75003DD73189]) [    x:collection1] o.a.s.c.SolrResourceLoader Adding 'file:/Users/jenkins/workspace/Lucene-Solr-master-MacOSX/solr/core/src/test-files/solr/collection1/lib/classes/' to classloader
   [junit4]   2> 14286 INFO  (TEST-SoftAutoCommitTest.testSoftAndHardCommitMaxTimeDelete-seed#[29AE75003DD73189]) [    x:collection1] o.a.s.c.SolrResourceLoader Adding 'file:/Users/jenkins/workspace/Lucene-Solr-master-MacOSX/solr/core/src/test-files/solr/collection1/lib/README' to classloader
   [junit4]   2> 14331 INFO  (TEST-SoftAutoCommitTest.testSoftAndHardCommitMaxTimeDelete-seed#[29AE75003DD73189]) [    x:collection1] o.a.s.c.SolrConfig current version of requestparams : -1
   [junit4]   2> 14343 INFO  (TEST-SoftAutoCommitTest.testSoftAndHardCommitMaxTimeDelete-seed#[29AE75003DD73189]) [    x:collection1] o.a.s.c.SolrConfig Using Lucene MatchVersion: 7.0.0
   [junit4]   2> 14361 INFO  (TEST-SoftAutoCommitTest.testSoftAndHardCommitMaxTimeDelete-seed#[29AE75003DD73189]) [    x:collection1] o.a.s.c.SolrConfig Loaded SolrConfig: solrconfig.xml
   [junit4]   2> 14373 INFO  (TEST-SoftAutoCommitTest.testSoftAndHardCommitMaxTimeDelete-seed#[29AE75003DD73189]) [    x:collection1] o.a.s.s.IndexSchema [collection1] Schema name=test
   [junit4]   2> 14453 INFO  (commitScheduler-27-thread-1) [    x:collection1] o.a.s.u.DirectUpdateHandler2 start commit{,optimize=false,openSearcher=true,waitSearcher=true,expungeDeletes=false,softCommit=false,prepareCommit=false}
   [junit4]   2> 14510 INFO  (TEST-SoftAutoCommitTest.testSoftAndHardCommitMaxTimeDelete-seed#[29AE75003DD73189]) [    x:collection1] o.a.s.s.OpenExchangeRatesOrgProvider Initialized with rates=open-exchange-rates.json, refreshInterval=1440.
   [junit4]   2> 14520 INFO  (TEST-SoftAutoCommitTest.testSoftAndHardCommitMaxTimeDelete-seed#[29AE75003DD73189]) [    x:collection1] o.a.s.s.IndexSchema default search field in schema is text
   [junit4]   2> 14521 INFO  (TEST-SoftAutoCommitTest.testSoftAndHardCommitMaxTimeDelete-seed#[29AE75003DD73189]) [    x:collection1] o.a.s.s.IndexSchema unique key field: id
   [junit4]   2> 14534 INFO  (TEST-SoftAutoCommitTest.testSoftAndHardCommitMaxTimeDelete-seed#[29AE75003DD73189]) [    x:collection1] o.a.s.s.FileExchangeRateProvider Reloading exchange rates from file currency.xml
   [junit4]   2> 14538 INFO  (TEST-SoftAutoCommitTest.testSoftAndHardCommitMaxTimeDelete-seed#[29AE75003DD73189]) [    x:collection1] o.a.s.s.FileExchangeRateProvider Reloading exchange rates from file currency.xml
   [junit4]   2> 14540 INFO  (TEST-SoftAutoCommitTest.testSoftAndHardCommitMaxTimeDelete-seed#[29AE75003DD73189]) [    x:collection1] o.a.s.s.OpenExchangeRatesOrgProvider Reloading exchange rates from open-exchange-rates.json
   [junit4]   2> 14541 INFO  (TEST-SoftAutoCommitTest.testSoftAndHardCommitMaxTimeDelete-seed#[29AE75003DD73189]) [    x:collection1] o.a.s.s.OpenExchangeRatesOrgProvider Reloading exchange rates from open-exchange-rates.json
   [junit4]   2> 14545 INFO  (TEST-SoftAutoCommitTest.testSoftAndHardCommitMaxTimeDelete-seed#[29AE75003DD73189]) [    x:collection1] o.a.s.c.ConfigSetProperties Did not find ConfigSet properties, assuming default properties: Can't find resource 'configsetprops.json' in classpath or '/Users/jenkins/workspace/Lucene-Solr-master-MacOSX/solr/core/src/test-files/solr/collection1'
   [junit4]   2> 14545 INFO  (TEST-SoftAutoCommitTest.testSoftAndHardCommitMaxTimeDelete-seed#[29AE75003DD73189]) [    x:collection1] o.a.s.c.CoreContainer Reloading SolrCore 'collection1' using configuration from instancedir /Users/jenkins/workspace/Lucene-Solr-master-MacOSX/solr/core/src/test-files/solr/collection1
   [junit4]   2> 14546 INFO  (TEST-SoftAutoCommitTest.testSoftAndHardCommitMaxTimeDelete-seed#[29AE75003DD73189]) [    x:collection1] o.a.s.c.SolrCore [[collection1] ] Opening new SolrCore at [/Users/jenkins/workspace/Lucene-Solr-master-MacOSX/solr/core/src/test-files/solr/collection1], dataDir=[/Users/jenkins/workspace/Lucene-Solr-master-MacOSX/solr/build/solr-core/test/J0/temp/solr.update.SoftAutoCommitTest_29AE75003DD73189-001/init-core-data-001/]
   [junit4]   2> 14546 INFO  (TEST-SoftAutoCommitTest.testSoftAndHardCommitMaxTimeDelete-seed#[29AE75003DD73189]) [    x:collection1] o.a.s.c.JmxMonitoredMap No JMX servers found, not exposing Solr information with JMX.
   [junit4]   2> 14546 INFO  (TEST-SoftAutoCommitTest.testSoftAndHardCommitMaxTimeDelete-seed#[29AE75003DD73189]) [    x:collection1] o.a.s.c.SolrCore New index directory detected: old=null new=/Users/jenkins/workspace/Lucene-Solr-master-MacOSX/solr/build/solr-core/test/J0/temp/solr.update.SoftAutoCommitTest_29AE75003DD73189-001/init-core-data-001/index/
   [junit4]   2> 14547 INFO  (OldIndexDirectoryCleanupThreadForCore-collection1) [    x:collection1] o.a.s.c.SolrCore Looking for old index directories to cleanup for core collection1 in /Users/jenkins/workspace/Lucene-Solr-master-MacOSX/solr/build/solr-core/test/J0/temp/solr.update.SoftAutoCommitTest_29AE75003DD73189-001/init-core-data-001/
   [junit4]   2> 14549 INFO  (TEST-SoftAutoCommitTest.testSoftAndHardCommitMaxTimeDelete-seed#[29AE75003DD73189]) [    x:collection1] o.a.s.u.p.UpdateRequestProcessorChain creating updateRequestProcessorChain "dedupe"
   [junit4]   2> 14549 INFO  (TEST-SoftAutoCommitTest.testSoftAndHardCommitMaxTimeDelete-seed#[29AE75003DD73189]) [    x:collection1] o.a.s.u.p.UpdateRequestProcessorChain inserting DistributedUpdateProcessorFactory into updateRequestProcessorChain "dedupe"
   [junit4]   2> 14550 INFO  (TEST-SoftAutoCommitTest.testSoftAndHardCommitMaxTimeDelete-seed#[29AE75003DD73189]) [    x:collection1] o.a.s.u.p.UpdateRequestProcessorChain creating updateRequestProcessorChain "dedupe-allfields"
   [junit4]   2> 14550 INFO  (TEST-SoftAutoCommitTest.testSoftAndHardCommitMaxTimeDelete-seed#[29AE75003DD73189]) [    x:collection1] o.a.s.u.p.UpdateRequestProcessorChain inserting DistributedUpdateProcessorFactory into updateRequestProcessorChain "dedupe-allfields"
   [junit4]   2> 14550 INFO  (TEST-SoftAutoCommitTest.testSoftAndHardCommitMaxTimeDelete-seed#[29AE75003DD73189]) [    x:collection1] o.a.s.u.p.UpdateRequestProcessorChain creating updateRequestProcessorChain "stored_sig"
   [junit4]   2> 14550 INFO  (TEST-SoftAutoCommitTest.testSoftAndHardCommitMaxTimeDelete-seed#[29AE75003DD73189]) [    x:collection1] o.a.s.u.p.UpdateRequestProcessorChain inserting DistributedUpdateProcessorFactory into updateRequestProcessorChain "stored_sig"
   [junit4]   2> 14550 INFO  (TEST-SoftAutoCommitTest.testSoftAndHardCommitMaxTimeDelete-seed#[29AE75003DD73189]) [    x:collection1] o.a.s.u.p.UpdateRequestProcessorChain creating updateRequestProcessorChain "uniq-fields"
   [junit4]   2> 14550 INFO  (TEST-SoftAutoCommitTest.testSoftAndHardCommitMaxTimeDelete-seed#[29AE75003DD73189]) [    x:collection1] o.a.s.u.p.UpdateRequestProcessorChain inserting DistributedUpdateProcessorFactory into updateRequestProcessorChain "uniq-fields"
   [junit4]   2> 14550 INFO  (TEST-SoftAutoCommitTest.testSoftAndHardCommitMaxTimeDelete-seed#[29AE75003DD73189]) [    x:collection1] o.a.s.u.p.UpdateRequestProcessorChain creating updateRequestProcessorChain "distrib-dup-test-chain-explicit"
   [junit4]   2> 14551 INFO  (TEST-SoftAutoCommitTest.testSoftAndHardCommitMaxTimeDelete-seed#[29AE75003DD73189]) [    x:collection1] o.a.s.u.p.UpdateRequestProcessorChain creating updateRequestProcessorChain "distrib-dup-test-chain-implicit"
   [junit4]   2> 14551 INFO  (TEST-SoftAutoCommitTest.testSoftAndHardCommitMaxTimeDelete-seed#[29AE75003DD73189]) [    x:collection1] o.a.s.u.p.UpdateRequestProcessorChain inserting DistributedUpdateProcessorFactory into updateRequestProcessorChain "distrib-dup-test-chain-implicit"
   [junit4]   2> 14551 INFO  (TEST-SoftAutoCommitTest.testSoftAndHardCommitMaxTimeDelete-seed#[29AE75003DD73189]) [    x:collection1] o.a.s.c.SolrCore no updateRequestProcessorChain defined as default, creating implicit default
   [junit4]   2> 14555 INFO  (TEST-SoftAutoCommitTest.testSoftAndHardCommitMaxTimeDelete-seed#[29AE75003DD73189]) [    x:collection1] o.a.s.h.l.XMLLoader xsltCacheLifetimeSeconds=60
   [junit4]   2> 14557 INFO  (TEST-SoftAutoCommitTest.testSoftAndHardCommitMaxTimeDelete-seed#[29AE75003DD73189]) [    x:collection1] o.a.s.h.l.XMLLoader xsltCacheLifetimeSeconds=60
   [junit4]   2> 14558 INFO  (TEST-SoftAutoCommitTest.testSoftAndHardCommitMaxTimeDelete-seed#[29AE75003DD73189]) [    x:collection1] o.a.s.h.l.XMLLoader xsltCacheLifetimeSeconds=60
   [junit4]   2> 14561 INFO  (TEST-SoftAutoCommitTest.testSoftAndHardCommitMaxTimeDelete-seed#[29AE75003DD73189]) [    x:collection1] o.a.s.h.l.XMLLoader xsltCacheLifetimeSeconds=60
   [junit4]   2> 14568 INFO  (TEST-SoftAutoCommitTest.testSoftAndHardCommitMaxTimeDelete-seed#[29AE75003DD73189]) [    x:collection1] o.a.s.c.PluginBag requestHandler : 'lazy' created with startup=lazy 
   [junit4]   2> 14569 INFO  (TEST-SoftAutoCommitTest.testSoftAndHardCommitMaxTimeDelete-seed#[29AE75003DD73189]) [    x:collection1] o.a.s.c.RequestHandlers Registered paths: /admin/mbeans,standard,spellCheckCompRH,lazy,/update/json/docs,/admin/luke,/export,spellCheckWithWordbreak_Direct,tvrh,/get,/admin/properties,/update/json,mltrh,/admin/threads,/search-facet-def,/update/csv,/sql,/graph,/search-facet-invariants,/admin/segments,spellCheckCompRH1,/mlt,/admin/system,/replication,dismax,defaults,/config,/stream,/schema,/admin/plugins,/admin/logging,spellCheckWithWordbreak,mock,/admin/ping,/update,/admin/file,/terms,spellCheckCompRH_Direct,/debug/dump
   [junit4]   2> 14569 INFO  (TEST-SoftAutoCommitTest.testSoftAndHardCommitMaxTimeDelete-seed#[29AE75003DD73189]) [    x:collection1] o.a.s.c.SolrCore Using default statsCache cache: org.apache.solr.search.stats.LocalStatsCache
   [junit4]   2> 14571 INFO  (TEST-SoftAutoCommitTest.testSoftAndHardCommitMaxTimeDelete-seed#[29AE75003DD73189]) [    x:collection1] o.a.s.u.CommitTracker Hard AutoCommit: disabled
   [junit4]   2> 14571 INFO  (TEST-SoftAutoCommitTest.testSoftAndHardCommitMaxTimeDelete-seed#[29AE75003DD73189]) [    x:collection1] o.a.s.u.CommitTracker Soft AutoCommit: disabled
   [junit4]   2> 14578 INFO  (commitScheduler-28-thread-1) [    x:collection1] o.a.s.s.SolrIndexSearcher Opening [Searcher@645a7faa[collection1] main]
   [junit4]   2> 14578 INFO  (TEST-SoftAutoCommitTest.testSoftAndHardCommitMaxTimeDelete-seed#[29AE75003DD73189]) [    x:collection1] o.a.s.s.SolrIndexSearcher Opening [Searcher@545bda54[collection1] main]
   [junit4]   2> 14580 INFO  (searcherExecutor-25-thread-1-processing-x:collection1) [    x:collection1] o.a.s.c.SolrCore [collection1] Registered new searcher Searcher@645a7faa[collection1] main{ExitableDirectoryReader(UninvertingDirectoryReader(Uninverting(_0(7.0.0):c1)))}
   [junit4]   2> 14580 INFO  (TEST-SoftAutoCommitTest.testSoftAndHardCommitMaxTimeDelete-seed#[29AE75003DD73189]) [    x:collection1] o.a.s.r.RestManager Initializing RestManager with initArgs: {storageIO=org.apache.solr.rest.ManagedResourceStorage$InMemoryStorageIO}
   [junit4]   2> 14581 INFO  (TEST-SoftAutoCommitTest.testSoftAndHardCommitMaxTimeDelete-seed#[29AE75003DD73189]) [    x:collection1] o.a.s.r.ManagedResourceStorage Reading _rest_managed.json using InMemoryStorage
   [junit4]   2> 14581 INFO  (TEST-SoftAutoCommitTest.testSoftAndHardCommitMaxTimeDelete-seed#[29AE75003DD73189]) [    x:collection1] o.a.s.r.RestManager Initializing 0 registered ManagedResources
   [junit4]   2> 14581 INFO  (TEST-SoftAutoCommitTest.testSoftAndHardCommitMaxTimeDelete-seed#[29AE75003DD73189]) [    x:collection1] o.a.s.h.c.SpellCheckComponent Initializing spell checkers
   [junit4]   2> 14582 INFO  (commitScheduler-28-thread-1) [    x:collection1] o.a.s.u.DirectUpdateHandler2 end_commit_flush
   [junit4]   2> 14583 INFO  (TEST-SoftAutoCommitTest.testSoftAndHardCommitMaxTimeDelete-seed#[29AE75003DD73189]) [    x:collection1] o.a.s.s.DirectSolrSpellChecker init: {name=direct,classname=DirectSolrSpellChecker,field=lowerfilt,minQueryLength=3}
   [junit4]   2> 14588 INFO  (TEST-SoftAutoCommitTest.testSoftAndHardCommitMaxTimeDelete-seed#[29AE75003DD73189]) [    x:collection1] o.a.s.h.ReplicationHandler Commits will be reserved for  10000
   [junit4]   2> 14589 INFO  (searcherExecutor-29-thread-1-processing-x:collection1) [    x:collection1] o.a.s.h.c.SpellCheckComponent Loading spell index for spellchecker: default
   [junit4]   2> 14590 INFO  (searcherExecutor-29-thread-1-processing-x:collection1) [    x:collection1] o.a.s.h.c.SpellCheckComponent Loading spell index for spellchecker: direct
   [junit4]   2> 14590 INFO  (searcherExecutor-29-thread-1-processing-x:collection1) [    x:collection1] o.a.s.h.c.SpellCheckComponent Loading spell index for spellchecker: wordbreak
   [junit4]   2> 14590 INFO  (searcherExecutor-29-thread-1-processing-x:collection1) [    x:collection1] o.a.s.h.c.SpellCheckComponent Loading spell index for spellchecker: multipleFields
   [junit4]   2> 14592 INFO  (TEST-SoftAutoCommitTest.testSoftAndHardCommitMaxTimeDelete-seed#[29AE75003DD73189]) [    x:collection1] o.a.s.u.UpdateLog Looking up max value of version field to seed version buckets
   [junit4]   2> 14592 INFO  (searcherExecutor-29-thread-1-processing-x:collection1) [    x:collection1] o.a.s.h.c.SpellCheckComponent Loading spell index for spellchecker: jarowinkler
   [junit4]   2> 14592 INFO  (searcherExecutor-29-thread-1-processing-x:collection1) [    x:collection1] o.a.s.h.c.SpellCheckComponent Loading spell index for spellchecker: external
   [junit4]   2> 14593 INFO  (searcherExecutor-29-thread-1-processing-x:collection1) [    x:collection1] o.a.s.h.c.SpellCheckComponent Loading spell index for spellchecker: freq
   [junit4]   2> 14594 INFO  (searcherExecutor-29-thread-1-processing-x:collection1) [    x:collection1] o.a.s.h.c.SpellCheckComponent Loading spell index for spellchecker: fqcn
   [junit4]   2> 14594 INFO  (searcherExecutor-29-thread-1-processing-x:collection1) [    x:collection1] o.a.s.h.c.SpellCheckComponent Loading spell index for spellchecker: perDict
   [junit4]   2> 14594 INFO  (searcherExecutor-29-thread-1-processing-x:collection1) [    x:collection1] o.a.s.c.SolrCore [collection1] Registered new searcher Searcher@545bda54[collection1] main{ExitableDirectoryReader(UninvertingDirectoryReader(Uninverting(_0(7.0.0):c1)))}
   [junit4]   2> 14604 INFO  (TEST-SoftAutoCommitTest.testSoftAndHardCommitMaxTimeDelete-seed#[29AE75003DD73189]) [    x:collection1] o.a.s.u.VersionInfo Refreshing highest value of _version_ for 65536 version buckets from index
   [junit4]   2> 14612 INFO  (commitScheduler-27-thread-1) [    x:collection1] o.a.s.c.SolrDeletionPolicy SolrDeletionPolicy.onCommit: commits: num=2
   [junit4]   2> 	commit{dir=MockDirectoryWrapper(RAMDirectory@3f67c6a5 lockFactory=org.apache.lucene.store.SingleInstanceLockFactory@78c02bb9),segFN=segments_1,generation=1}
   [junit4]   2> 	commit{dir=MockDirectoryWrapper(RAMDirectory@3f67c6a5 lockFactory=org.apache.lucene.store.SingleInstanceLockFactory@78c02bb9),segFN=segments_2,generation=2}
   [junit4]   2> 14612 INFO  (commitScheduler-27-thread-1) [    x:collection1] o.a.s.c.SolrDeletionPolicy newest commit generation = 2
   [junit4]   2> 14614 INFO  (commitScheduler-27-thread-1) [    x:collection1] o.a.s.s.SolrIndexSearcher Opening [Searcher@5faa953[collection1] main]
   [junit4]   2> 14615 INFO  (commitScheduler-27-thread-1) [    x:collection1] o.a.s.u.DirectUpdateHandler2 end_commit_flush
   [junit4]   2> 14615 INFO  (searcherExecutor-25-thread-1-processing-x:collection1) [    x:collection1] o.a.s.c.SolrCore [collection1] Registered new searcher Searcher@5faa953[collection1] main{ExitableDirectoryReader(UninvertingDirectoryReader(Uninverting(_0(7.0.0):c1)))}
   [junit4]   2> 14672 INFO  (TEST-SoftAutoCommitTest.testSoftAndHardCommitMaxTimeDelete-seed#[29AE75003DD73189]) [    x:collection1] o.a.s.u.VersionInfo Found MAX value 1534457784477679616 from Terms for _version_ in index
   [junit4]   2> 14673 INFO  (TEST-SoftAutoCommitTest.testSoftAndHardCommitMaxTimeDelete-seed#[29AE75003DD73189]) [    x:collection1] o.a.s.u.UpdateLog Took 81.0ms to seed version buckets with highest version 1534457784477679616
   [junit4]   2> 14673 INFO  (TEST-SoftAutoCommitTest.testSoftAndHardCommitMaxTimeDelete-seed#[29AE75003DD73189]) [    x:collection1] o.a.s.u.DefaultSolrCoreState Closing old IndexWriter... core=collection1
   [junit4]   2> 14684 INFO  (TEST-SoftAutoCommitTest.testSoftAndHardCommitMaxTimeDelete-seed#[29AE75003DD73189]) [    x:collection1] o.a.s.u.RandomMergePolicy RandomMergePolicy wrapping class org.apache.lucene.index.TieredMergePolicy: [TieredMergePolicy: maxMergeAtOnce=47, maxMergeAtOnceExplicit=41, maxMergedSegmentMB=5.5546875, floorSegmentMB=2.0048828125, forceMergeDeletesPctAllowed=23.427709165581103, segmentsPerTier=14.0, maxCFSSegmentSizeMB=8.796093022207999E12, noCFSRatio=0.8718141398741318
   [junit4]   2> 14697 INFO  (TEST-SoftAutoCommitTest.testSoftAndHardCommitMaxTimeDelete-seed#[29AE75003DD73189]) [    x:collection1] o.a.s.c.SolrDeletionPolicy SolrDeletionPolicy.onInit: commits: num=1
   [junit4]   2> 	commit{dir=MockDirectoryWrapper(RAMDirectory@3f67c6a5 lockFactory=org.apache.lucene.store.SingleInstanceLockFactory@78c02bb9),segFN=segments_2,generation=2}
   [junit4]   2> 14697 INFO  (TEST-SoftAutoCommitTest.testSoftAndHardCommitMaxTimeDelete-seed#[29AE75003DD73189]) [    x:collection1] o.a.s.c.SolrDeletionPolicy newest commit generation = 2
   [junit4]   2> 14697 INFO  (TEST-SoftAutoCommitTest.testSoftAndHardCommitMaxTimeDelete-seed#[29AE75003DD73189]) [    x:collection1] o.a.s.u.DefaultSolrCoreState New IndexWriter is ready to be used.
   [junit4]   2> 14700 INFO  (TEST-SoftAutoCommitTest.testSoftAndHardCommitMaxTimeDelete-seed#[29AE75003DD73189]) [    x:collection1] o.a.s.s.SolrIndexSearcher Opening [Searcher@5ab3aa10[collection1] main]
   [junit4]   2> 14701 INFO  (searcherExecutor-29-thread-1-processing-x:collection1) [    x:collection1] o.a.s.c.SolrCore [collection1] Registered new searcher Searcher@5ab3aa10[collection1] main{ExitableDirectoryReader(UninvertingDirectoryReader(Uninverting(_0(7.0.0):c1)))}
   [junit4]   2> 14701 INFO  (TEST-SoftAutoCommitTest.testSoftAndHardCommitMaxTimeDelete-seed#[29AE75003DD73189]) [    x:collection1] o.a.s.c.CoreContainer replacing core: collection1
   [junit4]   2> 14701 INFO  (TEST-SoftAutoCommitTest.testSoftAndHardCommitMaxTimeDelete-seed#[29AE75003DD73189]) [    x:collection1] o.a.s.c.SolrCore [collection1]  CLOSING SolrCore org.apache.solr.core.SolrCore@685f2d53
   [junit4]   2> 14703 INFO  (TEST-SoftAutoCommitTest.testSoftAndHardCommitMaxTimeDelete-seed#[29AE75003DD73189]) [    x:collection1] o.a.s.u.DirectUpdateHandler2 closing DirectUpdateHandler2{commits=2,autocommit maxTime=1200ms,autocommits=1,soft autocommit maxTime=500ms,soft autocommits=1,optimizes=0,rollbacks=0,expungeDeletes=0,docsPending=0,adds=0,deletesById=0,deletesByQuery=0,errors=0,cumulative_adds=1,cumulative_deletesById=0,cumulative_deletesByQuery=0,cumulative_errors=0,transaction_logs_total_size=143,transaction_logs_total_number=1}
   [junit4]   2> 14703 INFO  (TEST-SoftAutoCommitTest.testSoftAndHardCommitMaxTimeDelete-seed#[29AE75003DD73189]) [    x:collection1] o.a.s.c.SolrCore [collection1] Closing main searcher on request.
   [junit4]   2> 14720 INFO  (TEST-SoftAutoCommitTest.testSoftAndHardCommitMaxTimeDelete-seed#[29AE75003DD73189]) [    x:collection1] o.a.s.u.p.LogUpdateProcessorFactory [collection1]  webapp=null path=null params={}{add=[529 (1534457786475216896)]} 0 13
   [junit4]   2> 14721 INFO  (TEST-SoftAutoCommitTest.testSoftAndHardCommitMaxTimeDelete-seed#[29AE75003DD73189]) [    x:collection1] o.a.s.u.DirectUpdateHandler2 start commit{,optimize=false,openSearcher=true,waitSearcher=true,expungeDeletes=false,softCommit=false,prepareCommit=false}
   [junit4]   2> 14821 INFO  (TEST-SoftAutoCommitTest.testSoftAndHardCommitMaxTimeDelete-seed#[29AE75003DD73189]) [    x:collection1] o.a.s.c.SolrDeletionPolicy SolrDeletionPolicy.onCommit: commits: num=2
   [junit4]   2> 	commit{dir=MockDirectoryWrapper(RAMDirectory@3f67c6a5 lockFactory=org.apache.lucene.store.SingleInstanceLockFactory@78c02bb9),segFN=segments_2,generation=2}
   [junit4]   2> 	commit{dir=MockDirectoryWrapper(RAMDirectory@3f67c6a5 lockFactory=org.apache.lucene.store.SingleInstanceLockFactory@78c02bb9),segFN=segments_3,generation=3}
   [junit4]   2> 14821 INFO  (TEST-SoftAutoCommitTest.testSoftAndHardCommitMaxTimeDelete-seed#[29AE75003DD73189]) [    x:collection1] o.a.s.c.SolrDeletionPolicy newest commit generation = 3
   [junit4]   2> 14822 INFO  (TEST-SoftAutoCommitTest.testSoftAndHardCommitMaxTimeDelete-seed#[29AE75003DD73189]) [    x:collection1] o.a.s.s.SolrIndexSearcher Opening [Searcher@4ae66808[collection1] main]
   [junit4]   2> 14822 INFO  (TEST-SoftAutoCommitTest.testSoftAndHardCommitMaxTimeDelete-seed#[29AE75003DD73189]) [    x:collection1] o.a.s.u.DirectUpdateHandler2 end_commit_flush
   [junit4]   2> 14822 INFO  (searcherExecutor-29-thread-1-processing-x:collection1) [    x:collection1] o.a.s.c.SolrCore [collection1] Registered new searcher Searcher@4ae66808[collection1] main{ExitableDirectoryReader(UninvertingDirectoryReader(Uninverting(_1(7.0.0):c1)))}
   [junit4]   2> 14825 INFO  (TEST-SoftAutoCommitTest.testSoftAndHardCommitMaxTimeDelete-seed#[29AE75003DD73189]) [    x:collection1] o.a.s.u.p.LogUpdateProcessorFactory [collection1]  webapp=null path=null params={}{commit=} 0 103
   [junit4]   2> 14827 INFO  (TEST-SoftAutoCommitTest.testSoftAndHardCommitMaxTimeDelete-seed#[29AE75003DD73189]) [    x:collection1] o.a.s.u.p.LogUpdateProcessorFactory [collection1]  webapp=null path=null params={}{delete=[529 (-1534457786599997440)]} 0 1
   [junit4]   2> 15330 INFO  (commitScheduler-32-thread-1) [    x:collection1] o.a.s.u.DirectUpdateHandler2 start commit{,optimize=false,openSearcher=true,waitSearcher=true,expungeDeletes=false,softCommit=true,prepareCommit=false}
   [junit4]   2> 15336 INFO  (commitScheduler-32-thread-1) [    x:collection1] o.a.s.s.SolrIndexSearcher Opening [Searcher@24d39a47[collection1] main]
   [junit4]   2> 15337 INFO  (commitScheduler-32-thread-1) [    x:collection1] o.a.s.u.DirectUpdateHandler2 end_commit_flush
   [junit4]   2> 15337 INFO  (searcherExecutor-29-thread-1-processing-x:collection1) [    x:collection1] o.a.s.c.SolrCore [collection1] Registered new searcher Searcher@24d39a47[collection1] main{ExitableDirectoryReader(UninvertingDirectoryReader())}
   [junit4]   2> 15342 INFO  (TEST-SoftAutoCommitTest.testSoftAndHardCommitMaxTimeDelete-seed#[29AE75003DD73189]) [    x:collection1] o.a.s.u.p.LogUpdateProcessorFactory [collection1]  webapp=null path=null params={}{add=[550 (1534457787138965504)]} 0 2
   [junit4]   2> 15843 INFO  (commitScheduler-32-thread-1) [    x:collection1] o.a.s.u.DirectUpdateHandler2 start commit{,optimize=false,openSearcher=true,waitSearcher=true,expungeDeletes=false,softCommit=true,prepareCommit=false}
   [junit4]   2> 15899 INFO  (commitScheduler-32-thread-1) [    x:collection1] o.a.s.s.SolrIndexSearcher Opening [Searcher@557bf2a2[collection1] main]
   [junit4]   2> 15899 INFO  (commitScheduler-32-thread-1) [    x:collection1] o.a.s.u.DirectUpdateHandler2 end_commit_flush
   [junit4]   2> 15900 INFO  (searcherExecutor-29-thread-1-processing-x:collection1) [    x:collection1] o.a.s.c.SolrCore [collection1] Registered new searcher Searcher@557bf2a2[collection1] main{ExitableDirectoryReader(UninvertingDirectoryReader(Uninverting(_2(7.0.0):c1)))}
   [junit4]   2> 16028 INFO  (commitScheduler-31-thread-1) [    x:collection1] o.a.s.u.DirectUpdateHandler2 start commit{,optimize=false,openSearcher=true,waitSearcher=true,expungeDeletes=false,softCommit=false,prepareCommit=false}
   [junit4]   2> 16030 INFO  (commitScheduler-31-thread-1) [    x:collection1] o.a.s.c.SolrDeletionPolicy SolrDeletionPolicy.onCommit: commits: num=2
   [junit4]   2> 	commit{dir=MockDirectoryWrapper(RAMDirectory@3f67c6a5 lockFactory=org.apache.lucene.store.SingleInstanceLockFactory@78c02bb9),segFN=segments_3,generation=3}
   [junit4]   2> 	commit{dir=MockDirectoryWrapper(RAMDirectory@3f67c6a5 lockFactory=org.apache.lucene.store.SingleInstanceLockFactory@78c02bb9),segFN=segments_4,generation=4}
   [junit4]   2> 16030 INFO  (commitScheduler-31-thread-1) [    x:collection1] o.a.s.c.SolrDeletionPolicy newest commit generation = 4
   [junit4]   2> 16031 INFO  (commitScheduler-31-thread-1) [    x:collection1] o.a.s.s.SolrIndexSearcher Opening [Searcher@54b587ea[collection1] main]
   [junit4]   2> 16032 INFO  (searcherExecutor-29-thread-1-processing-x:collection1) [    x:collection1] o.a.s.c.SolrCore [collection1] Registered new searcher Searcher@54b587ea[collection1] main{ExitableDirectoryReader(UninvertingDirectoryReader(Uninverting(_2(7.0.0):c1)))}
   [junit4]   2> 16033 INFO  (commitScheduler-31-thread-1) [    x:collection1] o.a.s.u.DirectUpdateHandler2 end_commit_flush
   [junit4]   2> 18034 INFO  (TEST-SoftAutoCommitTest.testSoftAndHardCommitMaxTimeDelete-seed#[29AE75003DD73189]) [    x:collection1] o.a.s.SolrTestCaseJ4 ###Ending testSoftAndHardCommitMaxTimeDelete
   [junit4]   2> 18038 INFO  (TEST-SoftAutoCommitTest.testSoftAndHardCommitMaxTimeRapidAdds-seed#[29AE75003DD73189]) [    x:collection1] o.a.s.SolrTestCaseJ4 ###Starting testSoftAndHardCommitMaxTimeRapidAdds
   [junit4]   2> 18038 INFO  (TEST-SoftAutoCommitTest.testSoftAndHardCommitMaxTimeRapidAdds-seed#[29AE75003DD73189]) [    x:collection1] o.a.s.c.SolrResourceLoader new SolrResourceLoader for directory: '/Users/jenkins/workspace/Lucene-Solr-master-MacOSX/solr/core/src/test-files/solr/collection1'
   [junit4]   2> 18038 INFO  (TEST-SoftAutoCommitTest.testSoftAndHardCommitMaxTimeRapidAdds-seed#[29AE75003DD73189]) [    x:collection1] o.a.s.c.SolrResourceLoader JNDI not configured for solr (NoInitialContextEx)
   [junit4]   2> 18038 INFO  (TEST-SoftAutoCommitTest.testSoftAndHardCommitMaxTimeRapidAdds-seed#[29AE75003DD73189]) [    x:collection1] o.a.s.c.SolrResourceLoader using system property solr.solr.home: /Users/jenkins/workspace/Lucene-Solr-master-MacOSX/solr/core/src/test-files/solr
   [junit4]   2> 18039 INFO  (TEST-SoftAutoCommitTest.testSoftAndHardCommitMaxTimeRapidAdds-seed#[29AE75003DD73189]) [    x:collection1] o.a.s.c.SolrResourceLoader Adding 'file:/Users/jenkins/workspace/Lucene-Solr-master-MacOSX/solr/core/src/test-files/solr/collection1/lib/classes/' to classloader
   [junit4]   2> 18039 INFO  (TEST-SoftAutoCommitTest.testSoftAndHardCommitMaxTimeRapidAdds-seed#[29AE75003DD73189]) [    x:collection1] o.a.s.c.SolrResourceLoader Adding 'file:/Users/jenkins/workspace/Lucene-Solr-master-MacOSX/solr/core/src/test-files/solr/collection1/lib/README' to classloader
   [junit4]   2> 18100 INFO  (TEST-SoftAutoCommitTest.testSoftAndHardCommitMaxTimeRapidAdds-seed#[29AE75003DD73189]) [    x:collection1] o.a.s.c.SolrConfig current version of requestparams : -1
   [junit4]   2> 18108 INFO  (TEST-SoftAutoCommitTest.testSoftAndHardCommitMaxTimeRapidAdds-seed#[29AE75003DD73189]) [    x:collection1] o.a.s.c.SolrConfig Using Lucene MatchVersion: 7.0.0
   [junit4]   2> 18136 INFO  (TEST-SoftAutoCommitTest.testSoftAndHardCommitMaxTimeRapidAdds-seed#[29AE75003DD73189]) [    x:collection1] o.a.s.c.SolrConfig Loaded SolrConfig: solrconfig.xml
   [junit4]   2> 18148 INFO  (TEST-SoftAutoCommitTest.testSoftAndHardCommitMaxTimeRapidAdds-seed#[29AE75003DD73189]) [    x:collection1] o.a.s.s.IndexSchema [collection1] Schema name=test
   [junit4]   2> 18287 INFO  (TEST-SoftAutoCommitTest.testSoftAndHardCommitMaxTimeRapidAdds-seed#[29AE75003DD73189]) [    x:collection1] o.a.s.s.OpenExchangeRatesOrgProvider Initialized with rates=open-exchange-rates.json, refreshInterval=1440.
   [junit4]   2> 18315 INFO  (TEST-SoftAutoCommitTest.testSoftAndHardCommitMaxTimeRapidAdds-seed#[29AE75003DD73189]) [    x:collection1] o.a.s.s.IndexSchema default search field in schema is text
   [junit4]   2> 18316 INFO  (TEST-SoftAutoCommitTest.testSoftAndHardCommitMaxTimeRapidAdds-seed#[29AE75003DD73189]) [    x:collection1] o.a.s.s.IndexSchema unique key field: id
   [junit4]   2> 18328 INFO  (TEST-SoftAutoCommitTest.testSoftAndHardCommitMaxTimeRapidAdds-seed#[29AE75003DD73189]) [    x:collection1] o.a.s.s.FileExchangeRateProvider Reloading exchange rates from file currency.xml
   [junit4]   2> 18337 INFO  (TEST-SoftAutoCommitTest.testSoftAndHardCommitMaxTimeRapidAdds-seed#[29AE75003DD73189]) [    x:collection1] o.a.s.s.FileExchangeRateProvider Reloading exchange rates from file currency.xml
   [junit4]   2> 18339 INFO  (TEST-SoftAutoCommitTest.testSoftAndHardCommitMaxTimeRapidAdds-seed#[29AE75003DD73189]) [    x:collection1] o.a.s.s.OpenExchangeRatesOrgProvider Reloading exchange rates from open-exchange-rates.json
   [junit4]   2> 18340 INFO  (TEST-SoftAutoCommitTest.testSoftAndHardCommitMaxTimeRapidAdds-seed#[29AE75003DD73189]) [    x:collection1] o.a.s.s.OpenExchangeRatesOrgProvider Reloading exchange rates from open-exchange-rates.json
   [junit4]   2> 18345 INFO  (TEST-SoftAutoCommitTest.testSoftAndHardCommitMaxTimeRapidAdds-seed#[29AE75003DD73189]) [    x:collection1] o.a.s.c.ConfigSetProperties Did not find ConfigSet properties, assuming default properties: Can't find resource 'configsetprops.json' in classpath or '/Users/jenkins/workspace/Lucene-Solr-master-MacOSX/solr/core/src/test-files/solr/collection1'
   [junit4]   2> 18345 INFO  (TEST-SoftAutoCommitTest.testSoftAndHardCommitMaxTimeRapidAdds-seed#[29AE75003DD73189]) [    x:collection1] o.a.s.c.CoreContainer Reloading SolrCore 'collection1' using configuration from instancedir /Users/jenkins/workspace/Lucene-Solr-master-MacOSX/solr/core/src/test-files/solr/collection1
   [junit4]   2> 18352 INFO  (TEST-SoftAutoCommitTest.testSoftAndHardCommitMaxTimeRapidAdds-seed#[29AE75003DD73189]) [    x:collection1] o.a.s.c.SolrCore [[collection1] ] Opening new SolrCore at [/Users/jenkins/workspace/Lucene-Solr-master-MacOSX/solr/core/src/test-files/solr/collection1], dataDir=[/Users/jenkins/workspace/Lucene-Solr-master-MacOSX/solr/build/solr-core/test/J0/temp/solr.update.SoftAutoCommitTest_29AE75003DD73189-001/init-core-data-001/]
   [junit4]   2> 18352 INFO  (TEST-SoftAutoCommitTest.testSoftAndHardCommitMaxTimeRapidAdds-seed#[29AE75003DD73189]) [    x:collection1] o.a.s.c.JmxMonitoredMap No JMX servers found, not exposing Solr information with JMX.
   [junit4]   2> 18352 INFO  (TEST-SoftAutoCommitTest.testSoftAndHardCommitMaxTimeRapidAdds-seed#[29AE75003DD73189]) [    x:collection1] o.a.s.c.SolrCore New index directory detected: old=null new=/Users/jenkins/workspace/Lucene-Solr-master-MacOSX/solr/build/solr-core/test/J0/temp/solr.update.SoftAutoCommitTest_29AE75003DD73189-001/init-core-data-001/index/
   [junit4]   2> 18365 INFO  (OldIndexDirectoryCleanupThreadForCore-collection1) [    x:collection1] o.a.s.c.SolrCore Looking for old index directories to cleanup for core collection1 in /Users/jenkins/workspace/Lucene-Solr-master-MacOSX/solr/build/solr-core/test/J0/temp/solr.update.SoftAutoCommitTest_29AE75003DD73189-001/init-core-data-001/
   [junit4]   2> 18368 INFO  (TEST-SoftAutoCommitTest.testSoftAndHardCommitMaxTimeRapidAdds-seed#[29AE75003DD73189]) [    x:collection1] o.a.s.u.p.UpdateRequestProcessorChain creating updateRequestProcessorChain "dedupe"
   [junit4]   2> 18368 INFO  (TEST-SoftAutoCommitTest.testSoftAndHardCommitMaxTimeRapidAdds-seed#[29AE75003DD73189]) [    x:collection1] o.a.s.u.p.UpdateRequestProcessorChain inserting DistributedUpdateProcessorFactory into updateRequestProcessorChain "dedupe"
   [junit4]   2> 18368 INFO  (TEST-SoftAutoCommitTest.testSoftAndHardCommitMaxTimeRapidAdds-seed#[29AE75003DD73189]) [    x:collection1] o.a.s.u.p.UpdateRequestProcessorChain creating updateRequestProcessorChain "dedupe-allfields"
   [junit4]   2> 18368 INFO  (TEST-SoftAutoCommitTest.testSoftAndHardCommitMaxTimeRapidAdds-seed#[29AE75003DD73189]) [    x:collection1] o.a.s.u.p.UpdateRequestProcessorChain inserting DistributedUpdateProcessorFactory into updateRequestProcessorChain "dedupe-allfields"
   [junit4]   2> 18368 INFO  (TEST-SoftAutoCommitTest.testSoftAndHardCommitMaxTimeRapidAdds-seed#[29AE75003DD73189]) [    x:collection1] o.a.s.u.p.UpdateRequestProcessorChain creating updateRequestProcessorChain "stored_sig"
   [junit4]   2> 18368 INFO  (TEST-SoftAutoCommitTest.testSoftAndHardCommitMaxTimeRapidAdds-seed#[29AE75003DD73189]) [    x:collection1] o.a.s.u.p.UpdateRequestProcessorChain inserting DistributedUpdateProcessorFactory into updateRequestProcessorChain "stored_sig"
   [junit4]   2> 18368 INFO  (TEST-SoftAutoCommitTest.testSoftAndHardCommitMaxTimeRapidAdds-seed#[29AE75003DD73189]) [    x:collection1] o.a.s.u.p.UpdateRequestProcessorChain creating updateRequestProcessorChain "uniq-fields"
   [junit4]   2> 18368 INFO  (TEST-SoftAutoCommitTest.testSoftAndHardCommitMaxTimeRapidAdds-seed#[29AE75003DD73189]) [    x:collection1] o.a.s.u.p.UpdateRequestProcessorChain inserting DistributedUpdateProcessorFactory into updateRequestProcessorChain "uniq-fields"
   [junit4]   2> 18368 INFO  (TEST-SoftAutoCommitTest.testSoftAndHardCommitMaxTimeRapidAdds-seed#[29AE75003DD73189]) [    x:collection1] o.a.s.u.p.UpdateRequestProcessorChain creating updateRequestProcessorChain "distrib-dup-test-chain-explicit"
   [junit4]   2> 18369 INFO  (TEST-SoftAutoCommitTest.testSoftAndHardCommitMaxTimeRapidAdds-seed#[29AE75003DD73189]) [    x:collection1] o.a.s.u.p.UpdateRequestProcessorChain creating updateRequestProcessorChain "distrib-dup-test-chain-implicit"
   [junit4]   2> 18369 INFO  (TEST-SoftAutoCommitTest.testSoftAndHardCommitMaxTimeRapidAdds-seed#[29AE75003DD73189]) [    x:collection1] o.a.s.u.p.UpdateRequestProcessorChain inserting DistributedUpdateProcessorFactory into updateRequestProcessorChain "distrib-dup-test-chain-implicit"
   [junit4]   2> 18369 INFO  (TEST-SoftAutoCommitTest.testSoftAndHardCommitMaxTimeRapidAdds-seed#[29AE75003DD73189]) [    x:collection1] o.a.s.c.SolrCore no updateRequestProcessorChain defined as default, creating implicit default
   [junit4]   2> 18374 INFO  (TEST-SoftAutoCommitTest.testSoftAndHardCommitMaxTimeRapidAdds-seed#[29AE75003DD73189]) [    x:collection1] o.a.s.h.l.XMLLoader xsltCacheLifetimeSeconds=60
   [junit4]   2> 18375 INFO  (TEST-SoftAutoCommitTest.testSoftAndHardCommitMaxTimeRapidAdds-seed#[29AE75003DD73189]) [    x:collection1] o.a.s.h.l.XMLLoader xsltCacheLifetimeSeconds=60
   [junit4]   2> 18376 INFO  (TEST-SoftAutoCommitTest.testSoftAndHardCommitMaxTimeRapidAdds-seed#[29AE75003DD73189]) [    x:collection1] o.a.s.h.l.XMLLoader xsltCacheLifetimeSeconds=60
   [junit4]   2> 18377 INFO  (TEST-SoftAutoCommitTest.testSoftAndHardCommitMaxTimeRapidAdds-seed#[29AE75003DD73189]) [    x:collection1] o.a.s.h.l.XMLLoader xsltCacheLifetimeSeconds=60
   [junit4]   2> 18386 INFO  (TEST-SoftAutoCommitTest.testSoftAndHardCommitMaxTimeRapidAdds-seed#[29AE75003DD73189]) [    x:collection1] o.a.s.c.PluginBag requestHandler : 'lazy' created with startup=lazy 
   [junit4]   2> 18387 INFO  (TEST-SoftAutoCommitTest.testSoftAndHardCommitMaxTimeRapidAdds-seed#[29AE75003DD73189]) [    x:collection1] o.a.s.c.RequestHandlers Registered paths: /admin/mbeans,standard,spellCheckCompRH,lazy,/update/json/docs,/admin/luke,/export,spellCheckWithWordbreak_Direct,tvrh,/get,/admin/properties,/update/json,mltrh,/admin/threads,/search-facet-def,/update/csv,/sql,/graph,/search-facet-invariants,/admin/segments,spellCheckCompRH1,/mlt,/admin/system,/replication,dismax,defaults,/config,/stream,/schema,/admin/plugins,/admin/logging,spellCheckWithWordbreak,mock,/admin/ping,/update,/admin/file,/terms,spellCheckCompRH_Direct,/debug/dump
   [junit4]   2> 18387 INFO  (TEST-SoftAutoCommitTest.testSoftAndHardCommitMaxTimeRapidAdds-seed#[29AE75003DD73189]) [    x:collection1] o.a.s.c.SolrCore Using default statsCache cache: org.apache.solr.search.stats.LocalStatsCache
   [junit4]   2> 18387 INFO  (TEST-SoftAutoCommitTest.testSoftAndHardCommitMaxTimeRapidAdds-seed#[29AE75003DD73189]) [    x:collection1] o.a.s.u.CommitTracker Hard AutoCommit: disabled
   [junit4]   2> 18387 INFO  (TEST-SoftAutoCommitTest.testSoftAndHardCommitMaxTimeRapidAdds-seed#[29AE75003DD73189]) [    x:collection1] o.a.s.u.CommitTracker Soft AutoCommit: disabled
   [junit4]   2> 18388 INFO  (TEST-SoftAutoCommitTest.testSoftAndHardCommitMaxTimeRapidAdds-seed#[29AE75003DD73189]) [    x:collection1] o.a.s.s.SolrIndexSearcher Opening [Searcher@3b477d97[collection1] main]
   [junit4]   2> 18389 INFO  (TEST-SoftAutoCommitTest.testSoftAndHardCommitMaxTimeRapidAdds-seed#[29AE75003DD73189]) [    x:collection1] o.a.s.r.RestManager Initializing RestManager with initArgs: {storageIO=org.apache.solr.rest.ManagedResourceStorage$InMemoryStorageIO}
   [junit4]   2> 18389 INFO  (TEST-SoftAutoCommitTest.testSoftAndHardCommitMaxTimeRapidAdds-seed#[29AE75003DD73189]) [    x:collection1] o.a.s.r.ManagedResourceStorage Reading _rest_managed.json using InMemoryStorage
   [junit4]   2> 18389 INFO  (TEST-SoftAutoCommitTest.testSoftAndHardCommitMaxTimeRapidAdds-seed#[29AE75003DD73189]) [    x:collection1] o.a.s.r.RestManager Initializing 0 registered ManagedResources
   [junit4]   2> 18389 INFO  (TEST-SoftAutoCommitTest.testSoftAndHardCommitMaxTimeRapidAdds-seed#[29AE75003

[...truncated too long message...]

ltSolrCoreState SolrCoreState ref count has reached 0 - closing IndexWriter
   [junit4]   2> 423136 INFO  (coreCloseExecutor-1894-thread-1) [    x:collection1] o.a.s.u.DefaultSolrCoreState closing IndexWriter with IndexWriterCloser
   [junit4]   2> 423137 INFO  (coreCloseExecutor-1894-thread-1) [    x:collection1] o.a.s.c.SolrCore [collection1] Closing main searcher on request.
   [junit4]   2> 423137 INFO  (coreCloseExecutor-1894-thread-1) [    x:collection1] o.a.s.c.CachingDirectoryFactory Closing MockDirectoryFactory - 2 directories currently being tracked
   [junit4]   2> 423137 INFO  (coreCloseExecutor-1894-thread-1) [    x:collection1] o.a.s.c.CachingDirectoryFactory looking to close /Users/jenkins/workspace/Lucene-Solr-master-MacOSX/solr/build/solr-core/test/J0/temp/solr.handler.TestReplicationHandler_29AE75003DD73189-001/solr-instance-029/./collection1/data/index.20160515213628932 [CachedDir<<refCount=0;path=/Users/jenkins/workspace/Lucene-Solr-master-MacOSX/solr/build/solr-core/test/J0/temp/solr.handler.TestReplicationHandler_29AE75003DD73189-001/solr-instance-029/./collection1/data/index.20160515213628932;done=false>>]
   [junit4]   2> 423137 INFO  (coreCloseExecutor-1894-thread-1) [    x:collection1] o.a.s.c.CachingDirectoryFactory Closing directory, CoreContainer#isShutdown=true
   [junit4]   2> 423137 INFO  (coreCloseExecutor-1894-thread-1) [    x:collection1] o.a.s.c.CachingDirectoryFactory Closing directory: /Users/jenkins/workspace/Lucene-Solr-master-MacOSX/solr/build/solr-core/test/J0/temp/solr.handler.TestReplicationHandler_29AE75003DD73189-001/solr-instance-029/./collection1/data/index.20160515213628932
   [junit4]   2> 423138 INFO  (coreCloseExecutor-1894-thread-1) [    x:collection1] o.a.s.c.CachingDirectoryFactory looking to close /Users/jenkins/workspace/Lucene-Solr-master-MacOSX/solr/build/solr-core/test/J0/temp/solr.handler.TestReplicationHandler_29AE75003DD73189-001/solr-instance-029/./collection1/data [CachedDir<<refCount=0;path=/Users/jenkins/workspace/Lucene-Solr-master-MacOSX/solr/build/solr-core/test/J0/temp/solr.handler.TestReplicationHandler_29AE75003DD73189-001/solr-instance-029/./collection1/data;done=false>>]
   [junit4]   2> 423138 INFO  (coreCloseExecutor-1894-thread-1) [    x:collection1] o.a.s.c.CachingDirectoryFactory Closing directory, CoreContainer#isShutdown=true
   [junit4]   2> 423138 INFO  (coreCloseExecutor-1894-thread-1) [    x:collection1] o.a.s.c.CachingDirectoryFactory Closing directory: /Users/jenkins/workspace/Lucene-Solr-master-MacOSX/solr/build/solr-core/test/J0/temp/solr.handler.TestReplicationHandler_29AE75003DD73189-001/solr-instance-029/./collection1/data
   [junit4]   2> 423139 INFO  (TEST-TestReplicationHandler.doTestIndexFetchWithMasterUrl-seed#[29AE75003DD73189]) [    ] o.e.j.s.h.ContextHandler Stopped o.e.j.s.ServletContextHandler@f002b71{/solr,null,UNAVAILABLE}
   [junit4]   2> 423141 INFO  (TEST-TestReplicationHandler.doTestIndexFetchWithMasterUrl-seed#[29AE75003DD73189]) [    ] o.e.j.s.ServerConnector Stopped ServerConnector@528cffab{HTTP/1.1,[http/1.1]}{127.0.0.1:0}
   [junit4]   2> 423141 INFO  (TEST-TestReplicationHandler.doTestIndexFetchWithMasterUrl-seed#[29AE75003DD73189]) [    ] o.a.s.c.CoreContainer Shutting down CoreContainer instance=396248970
   [junit4]   2> 423142 INFO  (coreCloseExecutor-1896-thread-1) [    x:collection1] o.a.s.c.SolrCore [collection1]  CLOSING SolrCore org.apache.solr.core.SolrCore@7d5625e9
   [junit4]   2> 423142 INFO  (coreCloseExecutor-1896-thread-1) [    x:collection1] o.a.s.u.DirectUpdateHandler2 closing DirectUpdateHandler2{commits=2,autocommits=0,soft autocommits=0,optimizes=0,rollbacks=0,expungeDeletes=0,docsPending=0,adds=0,deletesById=0,deletesByQuery=0,errors=0,cumulative_adds=3,cumulative_deletesById=0,cumulative_deletesByQuery=1,cumulative_errors=0}
   [junit4]   2> 423142 INFO  (coreCloseExecutor-1896-thread-1) [    x:collection1] o.a.s.u.SolrCoreState Closing SolrCoreState
   [junit4]   2> 423142 INFO  (coreCloseExecutor-1896-thread-1) [    x:collection1] o.a.s.u.DefaultSolrCoreState SolrCoreState ref count has reached 0 - closing IndexWriter
   [junit4]   2> 423142 INFO  (coreCloseExecutor-1896-thread-1) [    x:collection1] o.a.s.u.DefaultSolrCoreState closing IndexWriter with IndexWriterCloser
   [junit4]   2> 423143 INFO  (coreCloseExecutor-1896-thread-1) [    x:collection1] o.a.s.c.SolrCore [collection1] Closing main searcher on request.
   [junit4]   2> 423143 INFO  (coreCloseExecutor-1896-thread-1) [    x:collection1] o.a.s.c.CachingDirectoryFactory Closing MockDirectoryFactory - 2 directories currently being tracked
   [junit4]   2> 423143 INFO  (coreCloseExecutor-1896-thread-1) [    x:collection1] o.a.s.c.CachingDirectoryFactory looking to close /Users/jenkins/workspace/Lucene-Solr-master-MacOSX/solr/build/solr-core/test/J0/temp/solr.handler.TestReplicationHandler_29AE75003DD73189-001/solr-instance-030/./collection1/data [CachedDir<<refCount=0;path=/Users/jenkins/workspace/Lucene-Solr-master-MacOSX/solr/build/solr-core/test/J0/temp/solr.handler.TestReplicationHandler_29AE75003DD73189-001/solr-instance-030/./collection1/data;done=false>>]
   [junit4]   2> 423143 INFO  (coreCloseExecutor-1896-thread-1) [    x:collection1] o.a.s.c.CachingDirectoryFactory Closing directory, CoreContainer#isShutdown=true
   [junit4]   2> 423143 INFO  (coreCloseExecutor-1896-thread-1) [    x:collection1] o.a.s.c.CachingDirectoryFactory Closing directory: /Users/jenkins/workspace/Lucene-Solr-master-MacOSX/solr/build/solr-core/test/J0/temp/solr.handler.TestReplicationHandler_29AE75003DD73189-001/solr-instance-030/./collection1/data
   [junit4]   2> 423143 INFO  (coreCloseExecutor-1896-thread-1) [    x:collection1] o.a.s.c.CachingDirectoryFactory looking to close /Users/jenkins/workspace/Lucene-Solr-master-MacOSX/solr/build/solr-core/test/J0/temp/solr.handler.TestReplicationHandler_29AE75003DD73189-001/solr-instance-030/./collection1/data/index.20160515213619372 [CachedDir<<refCount=0;path=/Users/jenkins/workspace/Lucene-Solr-master-MacOSX/solr/build/solr-core/test/J0/temp/solr.handler.TestReplicationHandler_29AE75003DD73189-001/solr-instance-030/./collection1/data/index.20160515213619372;done=false>>]
   [junit4]   2> 423143 INFO  (coreCloseExecutor-1896-thread-1) [    x:collection1] o.a.s.c.CachingDirectoryFactory Closing directory, CoreContainer#isShutdown=true
   [junit4]   2> 423143 INFO  (coreCloseExecutor-1896-thread-1) [    x:collection1] o.a.s.c.CachingDirectoryFactory Closing directory: /Users/jenkins/workspace/Lucene-Solr-master-MacOSX/solr/build/solr-core/test/J0/temp/solr.handler.TestReplicationHandler_29AE75003DD73189-001/solr-instance-030/./collection1/data/index.20160515213619372
   [junit4]   2> 423144 INFO  (TEST-TestReplicationHandler.doTestIndexFetchWithMasterUrl-seed#[29AE75003DD73189]) [    ] o.e.j.s.h.ContextHandler Stopped o.e.j.s.ServletContextHandler@6f60b0e7{/solr,null,UNAVAILABLE}
   [junit4]   2> 423147 INFO  (SUITE-TestReplicationHandler-seed#[29AE75003DD73189]-worker) [    ] o.a.s.SolrTestCaseJ4 ###deleteCore
   [junit4]   2> NOTE: leaving temporary files on disk at: /Users/jenkins/workspace/Lucene-Solr-master-MacOSX/solr/build/solr-core/test/J0/temp/solr.handler.TestReplicationHandler_29AE75003DD73189-001
   [junit4]   2> NOTE: test params are: codec=FastCompressingStoredFields(storedFieldsFormat=CompressingStoredFieldsFormat(compressionMode=FAST, chunkSize=23325, maxDocsPerChunk=592, blockSize=142), termVectorsFormat=CompressingTermVectorsFormat(compressionMode=FAST, chunkSize=23325, blockSize=142)), sim=ClassicSimilarity, locale=nl, timezone=US/Arizona
   [junit4]   2> NOTE: Mac OS X 10.11.4 x86_64/Oracle Corporation 1.8.0_72 (64-bit)/cpus=3,threads=1,free=202276136,total=536870912
   [junit4]   2> NOTE: All tests run in this JVM: [TestLuceneMatchVersion, TestSolrQueryResponse, SoftAutoCommitTest, TestLMDirichletSimilarityFactory, DistributedExpandComponentTest, BitVectorTest, TestExtendedDismaxParser, CursorPagingTest, DirectSolrSpellCheckerTest, TestNamedUpdateProcessors, TestSSLRandomization, SOLR749Test, FastVectorHighlighterTest, TestCloudManagedSchema, UUIDUpdateProcessorFallbackTest, SpatialRPTFieldTypeTest, DocExpirationUpdateProcessorFactoryTest, TestDocBasedVersionConstraints, TestJsonFacets, OverseerStatusTest, SliceStateTest, TestUpdate, TestConfigOverlay, TestFunctionQuery, PrimitiveFieldTypeTest, CloudExitableDirectoryReaderTest, AsyncMigrateRouteKeyTest, TestMergePolicyConfig, TestSolrConfigHandlerConcurrent, TestSchemaManager, TestGeoJSONResponseWriter, TestManagedSynonymFilterFactory, TestReplicationHandler]
   [junit4] Completed [73/597 (2!)] on J0 in 102.64s, 15 tests, 1 failure, 1 skipped <<< FAILURES!

[...truncated 1713 lines...]
BUILD FAILED
/Users/jenkins/workspace/Lucene-Solr-master-MacOSX/build.xml:740: The following error occurred while executing this line:
/Users/jenkins/workspace/Lucene-Solr-master-MacOSX/build.xml:684: The following error occurred while executing this line:
/Users/jenkins/workspace/Lucene-Solr-master-MacOSX/build.xml:59: The following error occurred while executing this line:
/Users/jenkins/workspace/Lucene-Solr-master-MacOSX/solr/build.xml:233: The following error occurred while executing this line:
/Users/jenkins/workspace/Lucene-Solr-master-MacOSX/solr/common-build.xml:529: The following error occurred while executing this line:
/Users/jenkins/workspace/Lucene-Solr-master-MacOSX/lucene/common-build.xml:1457: The following error occurred while executing this line:
/Users/jenkins/workspace/Lucene-Solr-master-MacOSX/lucene/common-build.xml:1014: There were test failures: 597 suites (10 ignored), 2413 tests, 2 failures, 121 ignored (71 assumptions) [seed: 29AE75003DD73189]

Total time: 84 minutes 13 seconds
Build step 'Invoke Ant' marked build as failure
Archiving artifacts
[WARNINGS] Skipping publisher since build result is FAILURE
Recording test results
Email was triggered for: Failure - Any
Sending email for trigger: Failure - Any



Mime
View raw message