lucene-dev mailing list archives

Site index · List index
Message view « Date » · « Thread »
Top « Date » · « Thread »
From Policeman Jenkins Server <jenk...@thetaphi.de>
Subject [JENKINS] Lucene-Solr-master-Solaris (64bit/jdk1.8.0) - Build # 580 - Still Failing!
Date Sat, 14 May 2016 17:54:51 GMT
Build: http://jenkins.thetaphi.de/job/Lucene-Solr-master-Solaris/580/
Java: 64bit/jdk1.8.0 -XX:+UseCompressedOops -XX:+UseG1GC

3 tests failed.
FAILED:  org.apache.solr.cloud.TestCollectionAPI.test

Error Message:
No live SolrServers available to handle this request:[http://127.0.0.1:32769, http://127.0.0.1:51173, http://127.0.0.1:49724]

Stack Trace:
org.apache.solr.client.solrj.SolrServerException: No live SolrServers available to handle this request:[http://127.0.0.1:32769, http://127.0.0.1:51173, http://127.0.0.1:49724]
	at __randomizedtesting.SeedInfo.seed([8B88B7C9DDC179A1:3DC8813733D1459]:0)
	at org.apache.solr.client.solrj.impl.LBHttpSolrClient.request(LBHttpSolrClient.java:393)
	at org.apache.solr.client.solrj.impl.CloudSolrClient.sendRequest(CloudSolrClient.java:1228)
	at org.apache.solr.client.solrj.impl.CloudSolrClient.requestWithRetryOnStaleState(CloudSolrClient.java:998)
	at org.apache.solr.client.solrj.impl.CloudSolrClient.request(CloudSolrClient.java:934)
	at org.apache.solr.client.solrj.SolrRequest.process(SolrRequest.java:149)
	at org.apache.solr.client.solrj.SolrRequest.process(SolrRequest.java:166)
	at org.apache.solr.cloud.TestCollectionAPI.testClusterStateMigration(TestCollectionAPI.java:645)
	at org.apache.solr.cloud.TestCollectionAPI.test(TestCollectionAPI.java:83)
	at sun.reflect.NativeMethodAccessorImpl.invoke0(Native Method)
	at sun.reflect.NativeMethodAccessorImpl.invoke(NativeMethodAccessorImpl.java:62)
	at sun.reflect.DelegatingMethodAccessorImpl.invoke(DelegatingMethodAccessorImpl.java:43)
	at java.lang.reflect.Method.invoke(Method.java:498)
	at com.carrotsearch.randomizedtesting.RandomizedRunner.invoke(RandomizedRunner.java:1764)
	at com.carrotsearch.randomizedtesting.RandomizedRunner$8.evaluate(RandomizedRunner.java:871)
	at com.carrotsearch.randomizedtesting.RandomizedRunner$9.evaluate(RandomizedRunner.java:907)
	at com.carrotsearch.randomizedtesting.RandomizedRunner$10.evaluate(RandomizedRunner.java:921)
	at org.apache.solr.BaseDistributedSearchTestCase$ShardsRepeatRule$ShardsFixedStatement.callStatement(BaseDistributedSearchTestCase.java:985)
	at org.apache.solr.BaseDistributedSearchTestCase$ShardsRepeatRule$ShardsStatement.evaluate(BaseDistributedSearchTestCase.java:960)
	at com.carrotsearch.randomizedtesting.rules.SystemPropertiesRestoreRule$1.evaluate(SystemPropertiesRestoreRule.java:57)
	at org.apache.lucene.util.TestRuleSetupTeardownChained$1.evaluate(TestRuleSetupTeardownChained.java:49)
	at org.apache.lucene.util.AbstractBeforeAfterRule$1.evaluate(AbstractBeforeAfterRule.java:45)
	at org.apache.lucene.util.TestRuleThreadAndTestName$1.evaluate(TestRuleThreadAndTestName.java:48)
	at org.apache.lucene.util.TestRuleIgnoreAfterMaxFailures$1.evaluate(TestRuleIgnoreAfterMaxFailures.java:64)
	at org.apache.lucene.util.TestRuleMarkFailure$1.evaluate(TestRuleMarkFailure.java:47)
	at com.carrotsearch.randomizedtesting.rules.StatementAdapter.evaluate(StatementAdapter.java:36)
	at com.carrotsearch.randomizedtesting.ThreadLeakControl$StatementRunner.run(ThreadLeakControl.java:367)
	at com.carrotsearch.randomizedtesting.ThreadLeakControl.forkTimeoutingTask(ThreadLeakControl.java:809)
	at com.carrotsearch.randomizedtesting.ThreadLeakControl$3.evaluate(ThreadLeakControl.java:460)
	at com.carrotsearch.randomizedtesting.RandomizedRunner.runSingleTest(RandomizedRunner.java:880)
	at com.carrotsearch.randomizedtesting.RandomizedRunner$5.evaluate(RandomizedRunner.java:781)
	at com.carrotsearch.randomizedtesting.RandomizedRunner$6.evaluate(RandomizedRunner.java:816)
	at com.carrotsearch.randomizedtesting.RandomizedRunner$7.evaluate(RandomizedRunner.java:827)
	at com.carrotsearch.randomizedtesting.rules.StatementAdapter.evaluate(StatementAdapter.java:36)
	at com.carrotsearch.randomizedtesting.rules.SystemPropertiesRestoreRule$1.evaluate(SystemPropertiesRestoreRule.java:57)
	at org.apache.lucene.util.AbstractBeforeAfterRule$1.evaluate(AbstractBeforeAfterRule.java:45)
	at com.carrotsearch.randomizedtesting.rules.StatementAdapter.evaluate(StatementAdapter.java:36)
	at org.apache.lucene.util.TestRuleStoreClassName$1.evaluate(TestRuleStoreClassName.java:41)
	at com.carrotsearch.randomizedtesting.rules.NoShadowingOrOverridesOnMethodsRule$1.evaluate(NoShadowingOrOverridesOnMethodsRule.java:40)
	at com.carrotsearch.randomizedtesting.rules.NoShadowingOrOverridesOnMethodsRule$1.evaluate(NoShadowingOrOverridesOnMethodsRule.java:40)
	at com.carrotsearch.randomizedtesting.rules.StatementAdapter.evaluate(StatementAdapter.java:36)
	at com.carrotsearch.randomizedtesting.rules.StatementAdapter.evaluate(StatementAdapter.java:36)
	at com.carrotsearch.randomizedtesting.rules.StatementAdapter.evaluate(StatementAdapter.java:36)
	at org.apache.lucene.util.TestRuleAssertionsRequired$1.evaluate(TestRuleAssertionsRequired.java:53)
	at org.apache.lucene.util.TestRuleMarkFailure$1.evaluate(TestRuleMarkFailure.java:47)
	at org.apache.lucene.util.TestRuleIgnoreAfterMaxFailures$1.evaluate(TestRuleIgnoreAfterMaxFailures.java:64)
	at org.apache.lucene.util.TestRuleIgnoreTestSuites$1.evaluate(TestRuleIgnoreTestSuites.java:54)
	at com.carrotsearch.randomizedtesting.rules.StatementAdapter.evaluate(StatementAdapter.java:36)
	at com.carrotsearch.randomizedtesting.ThreadLeakControl$StatementRunner.run(ThreadLeakControl.java:367)
	at java.lang.Thread.run(Thread.java:745)
Caused by: org.apache.solr.client.solrj.impl.HttpSolrClient$RemoteSolrException: Error from server at http://127.0.0.1:49724: Could not migrate state format for collection: testClusterStateMigration
	at org.apache.solr.client.solrj.impl.HttpSolrClient.executeMethod(HttpSolrClient.java:606)
	at org.apache.solr.client.solrj.impl.HttpSolrClient.request(HttpSolrClient.java:259)
	at org.apache.solr.client.solrj.impl.HttpSolrClient.request(HttpSolrClient.java:248)
	at org.apache.solr.client.solrj.impl.LBHttpSolrClient.doRequest(LBHttpSolrClient.java:413)
	at org.apache.solr.client.solrj.impl.LBHttpSolrClient.request(LBHttpSolrClient.java:366)
	... 48 more


FAILED:  org.apache.solr.cloud.overseer.ZkStateReaderTest.testStateFormatUpdateWithExplicitRefresh

Error Message:


Stack Trace:
java.lang.NullPointerException
	at __randomizedtesting.SeedInfo.seed([8B88B7C9DDC179A1:9432C63E0DA1BF64]:0)
	at org.apache.solr.common.cloud.ZkStateReader.refreshLegacyClusterState(ZkStateReader.java:522)
	at org.apache.solr.common.cloud.ZkStateReader.forceUpdateCollection(ZkStateReader.java:296)
	at org.apache.solr.cloud.overseer.ZkStateReaderTest.testStateFormatUpdate(ZkStateReaderTest.java:126)
	at org.apache.solr.cloud.overseer.ZkStateReaderTest.testStateFormatUpdateWithExplicitRefresh(ZkStateReaderTest.java:41)
	at sun.reflect.NativeMethodAccessorImpl.invoke0(Native Method)
	at sun.reflect.NativeMethodAccessorImpl.invoke(NativeMethodAccessorImpl.java:62)
	at sun.reflect.DelegatingMethodAccessorImpl.invoke(DelegatingMethodAccessorImpl.java:43)
	at java.lang.reflect.Method.invoke(Method.java:498)
	at com.carrotsearch.randomizedtesting.RandomizedRunner.invoke(RandomizedRunner.java:1764)
	at com.carrotsearch.randomizedtesting.RandomizedRunner$8.evaluate(RandomizedRunner.java:871)
	at com.carrotsearch.randomizedtesting.RandomizedRunner$9.evaluate(RandomizedRunner.java:907)
	at com.carrotsearch.randomizedtesting.RandomizedRunner$10.evaluate(RandomizedRunner.java:921)
	at com.carrotsearch.randomizedtesting.rules.SystemPropertiesRestoreRule$1.evaluate(SystemPropertiesRestoreRule.java:57)
	at org.apache.lucene.util.TestRuleSetupTeardownChained$1.evaluate(TestRuleSetupTeardownChained.java:49)
	at org.apache.lucene.util.AbstractBeforeAfterRule$1.evaluate(AbstractBeforeAfterRule.java:45)
	at org.apache.lucene.util.TestRuleThreadAndTestName$1.evaluate(TestRuleThreadAndTestName.java:48)
	at org.apache.lucene.util.TestRuleIgnoreAfterMaxFailures$1.evaluate(TestRuleIgnoreAfterMaxFailures.java:64)
	at org.apache.lucene.util.TestRuleMarkFailure$1.evaluate(TestRuleMarkFailure.java:47)
	at com.carrotsearch.randomizedtesting.rules.StatementAdapter.evaluate(StatementAdapter.java:36)
	at com.carrotsearch.randomizedtesting.ThreadLeakControl$StatementRunner.run(ThreadLeakControl.java:367)
	at com.carrotsearch.randomizedtesting.ThreadLeakControl.forkTimeoutingTask(ThreadLeakControl.java:809)
	at com.carrotsearch.randomizedtesting.ThreadLeakControl$3.evaluate(ThreadLeakControl.java:460)
	at com.carrotsearch.randomizedtesting.RandomizedRunner.runSingleTest(RandomizedRunner.java:880)
	at com.carrotsearch.randomizedtesting.RandomizedRunner$5.evaluate(RandomizedRunner.java:781)
	at com.carrotsearch.randomizedtesting.RandomizedRunner$6.evaluate(RandomizedRunner.java:816)
	at com.carrotsearch.randomizedtesting.RandomizedRunner$7.evaluate(RandomizedRunner.java:827)
	at com.carrotsearch.randomizedtesting.rules.StatementAdapter.evaluate(StatementAdapter.java:36)
	at com.carrotsearch.randomizedtesting.rules.SystemPropertiesRestoreRule$1.evaluate(SystemPropertiesRestoreRule.java:57)
	at org.apache.lucene.util.AbstractBeforeAfterRule$1.evaluate(AbstractBeforeAfterRule.java:45)
	at com.carrotsearch.randomizedtesting.rules.StatementAdapter.evaluate(StatementAdapter.java:36)
	at org.apache.lucene.util.TestRuleStoreClassName$1.evaluate(TestRuleStoreClassName.java:41)
	at com.carrotsearch.randomizedtesting.rules.NoShadowingOrOverridesOnMethodsRule$1.evaluate(NoShadowingOrOverridesOnMethodsRule.java:40)
	at com.carrotsearch.randomizedtesting.rules.NoShadowingOrOverridesOnMethodsRule$1.evaluate(NoShadowingOrOverridesOnMethodsRule.java:40)
	at com.carrotsearch.randomizedtesting.rules.StatementAdapter.evaluate(StatementAdapter.java:36)
	at com.carrotsearch.randomizedtesting.rules.StatementAdapter.evaluate(StatementAdapter.java:36)
	at com.carrotsearch.randomizedtesting.rules.StatementAdapter.evaluate(StatementAdapter.java:36)
	at org.apache.lucene.util.TestRuleAssertionsRequired$1.evaluate(TestRuleAssertionsRequired.java:53)
	at org.apache.lucene.util.TestRuleMarkFailure$1.evaluate(TestRuleMarkFailure.java:47)
	at org.apache.lucene.util.TestRuleIgnoreAfterMaxFailures$1.evaluate(TestRuleIgnoreAfterMaxFailures.java:64)
	at org.apache.lucene.util.TestRuleIgnoreTestSuites$1.evaluate(TestRuleIgnoreTestSuites.java:54)
	at com.carrotsearch.randomizedtesting.rules.StatementAdapter.evaluate(StatementAdapter.java:36)
	at com.carrotsearch.randomizedtesting.ThreadLeakControl$StatementRunner.run(ThreadLeakControl.java:367)
	at java.lang.Thread.run(Thread.java:745)


FAILED:  org.apache.solr.cloud.overseer.ZkStateReaderTest.testStateFormatUpdateWithTimeDelay

Error Message:
expected:<2> but was:<1>

Stack Trace:
java.lang.AssertionError: expected:<2> but was:<1>
	at __randomizedtesting.SeedInfo.seed([8B88B7C9DDC179A1:F416004CB4A3542B]:0)
	at org.junit.Assert.fail(Assert.java:93)
	at org.junit.Assert.failNotEquals(Assert.java:647)
	at org.junit.Assert.assertEquals(Assert.java:128)
	at org.junit.Assert.assertEquals(Assert.java:472)
	at org.junit.Assert.assertEquals(Assert.java:456)
	at org.apache.solr.cloud.overseer.ZkStateReaderTest.testStateFormatUpdate(ZkStateReaderTest.java:137)
	at org.apache.solr.cloud.overseer.ZkStateReaderTest.testStateFormatUpdateWithTimeDelay(ZkStateReaderTest.java:51)
	at sun.reflect.NativeMethodAccessorImpl.invoke0(Native Method)
	at sun.reflect.NativeMethodAccessorImpl.invoke(NativeMethodAccessorImpl.java:62)
	at sun.reflect.DelegatingMethodAccessorImpl.invoke(DelegatingMethodAccessorImpl.java:43)
	at java.lang.reflect.Method.invoke(Method.java:498)
	at com.carrotsearch.randomizedtesting.RandomizedRunner.invoke(RandomizedRunner.java:1764)
	at com.carrotsearch.randomizedtesting.RandomizedRunner$8.evaluate(RandomizedRunner.java:871)
	at com.carrotsearch.randomizedtesting.RandomizedRunner$9.evaluate(RandomizedRunner.java:907)
	at com.carrotsearch.randomizedtesting.RandomizedRunner$10.evaluate(RandomizedRunner.java:921)
	at com.carrotsearch.randomizedtesting.rules.SystemPropertiesRestoreRule$1.evaluate(SystemPropertiesRestoreRule.java:57)
	at org.apache.lucene.util.TestRuleSetupTeardownChained$1.evaluate(TestRuleSetupTeardownChained.java:49)
	at org.apache.lucene.util.AbstractBeforeAfterRule$1.evaluate(AbstractBeforeAfterRule.java:45)
	at org.apache.lucene.util.TestRuleThreadAndTestName$1.evaluate(TestRuleThreadAndTestName.java:48)
	at org.apache.lucene.util.TestRuleIgnoreAfterMaxFailures$1.evaluate(TestRuleIgnoreAfterMaxFailures.java:64)
	at org.apache.lucene.util.TestRuleMarkFailure$1.evaluate(TestRuleMarkFailure.java:47)
	at com.carrotsearch.randomizedtesting.rules.StatementAdapter.evaluate(StatementAdapter.java:36)
	at com.carrotsearch.randomizedtesting.ThreadLeakControl$StatementRunner.run(ThreadLeakControl.java:367)
	at com.carrotsearch.randomizedtesting.ThreadLeakControl.forkTimeoutingTask(ThreadLeakControl.java:809)
	at com.carrotsearch.randomizedtesting.ThreadLeakControl$3.evaluate(ThreadLeakControl.java:460)
	at com.carrotsearch.randomizedtesting.RandomizedRunner.runSingleTest(RandomizedRunner.java:880)
	at com.carrotsearch.randomizedtesting.RandomizedRunner$5.evaluate(RandomizedRunner.java:781)
	at com.carrotsearch.randomizedtesting.RandomizedRunner$6.evaluate(RandomizedRunner.java:816)
	at com.carrotsearch.randomizedtesting.RandomizedRunner$7.evaluate(RandomizedRunner.java:827)
	at com.carrotsearch.randomizedtesting.rules.StatementAdapter.evaluate(StatementAdapter.java:36)
	at com.carrotsearch.randomizedtesting.rules.SystemPropertiesRestoreRule$1.evaluate(SystemPropertiesRestoreRule.java:57)
	at org.apache.lucene.util.AbstractBeforeAfterRule$1.evaluate(AbstractBeforeAfterRule.java:45)
	at com.carrotsearch.randomizedtesting.rules.StatementAdapter.evaluate(StatementAdapter.java:36)
	at org.apache.lucene.util.TestRuleStoreClassName$1.evaluate(TestRuleStoreClassName.java:41)
	at com.carrotsearch.randomizedtesting.rules.NoShadowingOrOverridesOnMethodsRule$1.evaluate(NoShadowingOrOverridesOnMethodsRule.java:40)
	at com.carrotsearch.randomizedtesting.rules.NoShadowingOrOverridesOnMethodsRule$1.evaluate(NoShadowingOrOverridesOnMethodsRule.java:40)
	at com.carrotsearch.randomizedtesting.rules.StatementAdapter.evaluate(StatementAdapter.java:36)
	at com.carrotsearch.randomizedtesting.rules.StatementAdapter.evaluate(StatementAdapter.java:36)
	at com.carrotsearch.randomizedtesting.rules.StatementAdapter.evaluate(StatementAdapter.java:36)
	at org.apache.lucene.util.TestRuleAssertionsRequired$1.evaluate(TestRuleAssertionsRequired.java:53)
	at org.apache.lucene.util.TestRuleMarkFailure$1.evaluate(TestRuleMarkFailure.java:47)
	at org.apache.lucene.util.TestRuleIgnoreAfterMaxFailures$1.evaluate(TestRuleIgnoreAfterMaxFailures.java:64)
	at org.apache.lucene.util.TestRuleIgnoreTestSuites$1.evaluate(TestRuleIgnoreTestSuites.java:54)
	at com.carrotsearch.randomizedtesting.rules.StatementAdapter.evaluate(StatementAdapter.java:36)
	at com.carrotsearch.randomizedtesting.ThreadLeakControl$StatementRunner.run(ThreadLeakControl.java:367)
	at java.lang.Thread.run(Thread.java:745)




Build Log:
[...truncated 10947 lines...]
   [junit4] Suite: org.apache.solr.cloud.overseer.ZkStateReaderTest
   [junit4]   2> Creating dataDir: /export/home/jenkins/workspace/Lucene-Solr-master-Solaris/solr/build/solr-core/test/J0/temp/solr.cloud.overseer.ZkStateReaderTest_8B88B7C9DDC179A1-001/init-core-data-001
   [junit4]   2> 878955 INFO  (SUITE-ZkStateReaderTest-seed#[8B88B7C9DDC179A1]-worker) [    ] o.a.s.SolrTestCaseJ4 Randomized ssl (false) and clientAuth (false)
   [junit4]   2> 878957 INFO  (TEST-ZkStateReaderTest.testExternalCollectionWatchedNotWatched-seed#[8B88B7C9DDC179A1]) [    ] o.a.s.SolrTestCaseJ4 ###Starting testExternalCollectionWatchedNotWatched
   [junit4]   2> 878957 INFO  (TEST-ZkStateReaderTest.testExternalCollectionWatchedNotWatched-seed#[8B88B7C9DDC179A1]) [    ] o.a.s.c.ZkTestServer STARTING ZK TEST SERVER
   [junit4]   2> 878958 INFO  (Thread-3137) [    ] o.a.s.c.ZkTestServer client port:0.0.0.0/0.0.0.0:0
   [junit4]   2> 878958 INFO  (Thread-3137) [    ] o.a.s.c.ZkTestServer Starting server
   [junit4]   2> 879058 INFO  (TEST-ZkStateReaderTest.testExternalCollectionWatchedNotWatched-seed#[8B88B7C9DDC179A1]) [    ] o.a.s.c.ZkTestServer start zk server on port:60361
   [junit4]   2> 879058 INFO  (TEST-ZkStateReaderTest.testExternalCollectionWatchedNotWatched-seed#[8B88B7C9DDC179A1]) [    ] o.a.s.c.c.SolrZkClient Using default ZkCredentialsProvider
   [junit4]   2> 879088 INFO  (TEST-ZkStateReaderTest.testExternalCollectionWatchedNotWatched-seed#[8B88B7C9DDC179A1]) [    ] o.a.s.c.c.ConnectionManager Waiting for client to connect to ZooKeeper
   [junit4]   2> 879091 INFO  (zkCallback-821-thread-1) [    ] o.a.s.c.c.ConnectionManager Watcher org.apache.solr.common.cloud.ConnectionManager@423d44fc name:ZooKeeperConnection Watcher:127.0.0.1:60361 got event WatchedEvent state:SyncConnected type:None path:null path:null type:None
   [junit4]   2> 879091 INFO  (TEST-ZkStateReaderTest.testExternalCollectionWatchedNotWatched-seed#[8B88B7C9DDC179A1]) [    ] o.a.s.c.c.ConnectionManager Client is connected to ZooKeeper
   [junit4]   2> 879091 INFO  (TEST-ZkStateReaderTest.testExternalCollectionWatchedNotWatched-seed#[8B88B7C9DDC179A1]) [    ] o.a.s.c.c.SolrZkClient Using default ZkACLProvider
   [junit4]   2> 879093 INFO  (TEST-ZkStateReaderTest.testExternalCollectionWatchedNotWatched-seed#[8B88B7C9DDC179A1]) [    ] o.a.s.c.c.SolrZkClient Using default ZkCredentialsProvider
   [junit4]   2> 879093 INFO  (TEST-ZkStateReaderTest.testExternalCollectionWatchedNotWatched-seed#[8B88B7C9DDC179A1]) [    ] o.a.s.c.c.ConnectionManager Waiting for client to connect to ZooKeeper
   [junit4]   2> 879095 INFO  (zkCallback-822-thread-1) [    ] o.a.s.c.c.ConnectionManager Watcher org.apache.solr.common.cloud.ConnectionManager@e62d7d1 name:ZooKeeperConnection Watcher:127.0.0.1:60361 got event WatchedEvent state:SyncConnected type:None path:null path:null type:None
   [junit4]   2> 879095 INFO  (TEST-ZkStateReaderTest.testExternalCollectionWatchedNotWatched-seed#[8B88B7C9DDC179A1]) [    ] o.a.s.c.c.ConnectionManager Client is connected to ZooKeeper
   [junit4]   2> 879095 INFO  (TEST-ZkStateReaderTest.testExternalCollectionWatchedNotWatched-seed#[8B88B7C9DDC179A1]) [    ] o.a.s.c.c.SolrZkClient Using default ZkACLProvider
   [junit4]   2> 879095 INFO  (TEST-ZkStateReaderTest.testExternalCollectionWatchedNotWatched-seed#[8B88B7C9DDC179A1]) [    ] o.a.s.c.c.SolrZkClient makePath: /solr
   [junit4]   2> 879103 INFO  (TEST-ZkStateReaderTest.testExternalCollectionWatchedNotWatched-seed#[8B88B7C9DDC179A1]) [    ] o.a.s.c.c.SolrZkClient Using default ZkCredentialsProvider
   [junit4]   2> 879104 INFO  (TEST-ZkStateReaderTest.testExternalCollectionWatchedNotWatched-seed#[8B88B7C9DDC179A1]) [    ] o.a.s.c.c.ConnectionManager Waiting for client to connect to ZooKeeper
   [junit4]   2> 879106 INFO  (zkCallback-823-thread-1) [    ] o.a.s.c.c.ConnectionManager Watcher org.apache.solr.common.cloud.ConnectionManager@20e5be7e name:ZooKeeperConnection Watcher:127.0.0.1:60361/solr got event WatchedEvent state:SyncConnected type:None path:null path:null type:None
   [junit4]   2> 879106 INFO  (TEST-ZkStateReaderTest.testExternalCollectionWatchedNotWatched-seed#[8B88B7C9DDC179A1]) [    ] o.a.s.c.c.ConnectionManager Client is connected to ZooKeeper
   [junit4]   2> 879106 INFO  (TEST-ZkStateReaderTest.testExternalCollectionWatchedNotWatched-seed#[8B88B7C9DDC179A1]) [    ] o.a.s.c.c.SolrZkClient Using default ZkACLProvider
   [junit4]   2> 879107 INFO  (TEST-ZkStateReaderTest.testExternalCollectionWatchedNotWatched-seed#[8B88B7C9DDC179A1]) [    ] o.a.s.c.c.SolrZkClient makePath: /live_nodes
   [junit4]   2> 879108 INFO  (TEST-ZkStateReaderTest.testExternalCollectionWatchedNotWatched-seed#[8B88B7C9DDC179A1]) [    ] o.a.s.c.c.SolrZkClient makePath: /collections
   [junit4]   2> 879109 INFO  (TEST-ZkStateReaderTest.testExternalCollectionWatchedNotWatched-seed#[8B88B7C9DDC179A1]) [    ] o.a.s.c.c.SolrZkClient makePath: /aliases.json
   [junit4]   2> 879111 INFO  (TEST-ZkStateReaderTest.testExternalCollectionWatchedNotWatched-seed#[8B88B7C9DDC179A1]) [    ] o.a.s.c.c.SolrZkClient makePath: /clusterstate.json
   [junit4]   2> 879113 INFO  (TEST-ZkStateReaderTest.testExternalCollectionWatchedNotWatched-seed#[8B88B7C9DDC179A1]) [    ] o.a.s.c.c.SolrZkClient makePath: /security.json
   [junit4]   2> 879114 INFO  (TEST-ZkStateReaderTest.testExternalCollectionWatchedNotWatched-seed#[8B88B7C9DDC179A1]) [    ] o.a.s.c.c.ZkStateReader Updating cluster state from ZooKeeper... 
   [junit4]   2> 879114 INFO  (TEST-ZkStateReaderTest.testExternalCollectionWatchedNotWatched-seed#[8B88B7C9DDC179A1]) [    ] o.a.s.c.c.ZkStateReader Loaded empty cluster properties
   [junit4]   2> 879115 INFO  (TEST-ZkStateReaderTest.testExternalCollectionWatchedNotWatched-seed#[8B88B7C9DDC179A1]) [    ] o.a.s.c.c.ZkStateReader Updated live nodes from ZooKeeper... (0) -> (0)
   [junit4]   2> 879117 INFO  (TEST-ZkStateReaderTest.testExternalCollectionWatchedNotWatched-seed#[8B88B7C9DDC179A1]) [    ] o.a.s.c.c.SolrZkClient makePath: /collections/c1
   [junit4]   2> 879119 INFO  (TEST-ZkStateReaderTest.testExternalCollectionWatchedNotWatched-seed#[8B88B7C9DDC179A1]) [    ] o.a.s.c.o.ZkStateWriter going to create_collection /collections/c1/state.json
   [junit4]   2> 879121 INFO  (TEST-ZkStateReaderTest.testExternalCollectionWatchedNotWatched-seed#[8B88B7C9DDC179A1]) [    ] o.a.s.c.c.ZkStateReader Add data for [c1] ver [0]
   [junit4]   2> 879131 ERROR (TEST-ZkStateReaderTest.testExternalCollectionWatchedNotWatched-seed#[8B88B7C9DDC179A1]-EventThread) [    ] o.a.z.ClientCnxn Error while calling watcher 
   [junit4]   2> java.util.concurrent.RejectedExecutionException: Task org.apache.solr.common.util.ExecutorUtil$MDCAwareThreadPoolExecutor$$Lambda$8/698860839@57a17e39 rejected from org.apache.solr.common.util.ExecutorUtil$MDCAwareThreadPoolExecutor@539ee015[Shutting down, pool size = 1, active threads = 0, queued tasks = 0, completed tasks = 1]
   [junit4]   2> 	at java.util.concurrent.ThreadPoolExecutor$AbortPolicy.rejectedExecution(ThreadPoolExecutor.java:2047)
   [junit4]   2> 	at java.util.concurrent.ThreadPoolExecutor.reject(ThreadPoolExecutor.java:823)
   [junit4]   2> 	at java.util.concurrent.ThreadPoolExecutor.execute(ThreadPoolExecutor.java:1369)
   [junit4]   2> 	at org.apache.solr.common.util.ExecutorUtil$MDCAwareThreadPoolExecutor.execute(ExecutorUtil.java:214)
   [junit4]   2> 	at java.util.concurrent.AbstractExecutorService.submit(AbstractExecutorService.java:112)
   [junit4]   2> 	at org.apache.solr.common.cloud.SolrZkClient$3.process(SolrZkClient.java:266)
   [junit4]   2> 	at org.apache.zookeeper.ClientCnxn$EventThread.processEvent(ClientCnxn.java:522)
   [junit4]   2> 	at org.apache.zookeeper.ClientCnxn$EventThread.run(ClientCnxn.java:498)
   [junit4]   2> 879132 INFO  (TEST-ZkStateReaderTest.testExternalCollectionWatchedNotWatched-seed#[8B88B7C9DDC179A1]) [    ] o.a.s.c.ZkTestServer connecting to 127.0.0.1:60361 60361
   [junit4]   2> 889164 INFO  (Thread-3137) [    ] o.a.s.c.ZkTestServer connecting to 127.0.0.1:60361 60361
   [junit4]   2> 889165 INFO  (TEST-ZkStateReaderTest.testExternalCollectionWatchedNotWatched-seed#[8B88B7C9DDC179A1]) [    ] o.a.s.SolrTestCaseJ4 ###Ending testExternalCollectionWatchedNotWatched
   [junit4]   2> 889169 INFO  (TEST-ZkStateReaderTest.testStateFormatUpdateWithExplicitRefresh-seed#[8B88B7C9DDC179A1]) [    ] o.a.s.SolrTestCaseJ4 ###Starting testStateFormatUpdateWithExplicitRefresh
   [junit4]   2> 889169 INFO  (TEST-ZkStateReaderTest.testStateFormatUpdateWithExplicitRefresh-seed#[8B88B7C9DDC179A1]) [    ] o.a.s.c.ZkTestServer STARTING ZK TEST SERVER
   [junit4]   2> 889170 INFO  (Thread-3138) [    ] o.a.s.c.ZkTestServer client port:0.0.0.0/0.0.0.0:0
   [junit4]   2> 889170 INFO  (Thread-3138) [    ] o.a.s.c.ZkTestServer Starting server
   [junit4]   2> 889270 INFO  (TEST-ZkStateReaderTest.testStateFormatUpdateWithExplicitRefresh-seed#[8B88B7C9DDC179A1]) [    ] o.a.s.c.ZkTestServer start zk server on port:58303
   [junit4]   2> 889270 INFO  (TEST-ZkStateReaderTest.testStateFormatUpdateWithExplicitRefresh-seed#[8B88B7C9DDC179A1]) [    ] o.a.s.c.c.SolrZkClient Using default ZkCredentialsProvider
   [junit4]   2> 889271 INFO  (TEST-ZkStateReaderTest.testStateFormatUpdateWithExplicitRefresh-seed#[8B88B7C9DDC179A1]) [    ] o.a.s.c.c.ConnectionManager Waiting for client to connect to ZooKeeper
   [junit4]   2> 889281 INFO  (zkCallback-825-thread-1) [    ] o.a.s.c.c.ConnectionManager Watcher org.apache.solr.common.cloud.ConnectionManager@2007af25 name:ZooKeeperConnection Watcher:127.0.0.1:58303 got event WatchedEvent state:SyncConnected type:None path:null path:null type:None
   [junit4]   2> 889281 INFO  (TEST-ZkStateReaderTest.testStateFormatUpdateWithExplicitRefresh-seed#[8B88B7C9DDC179A1]) [    ] o.a.s.c.c.ConnectionManager Client is connected to ZooKeeper
   [junit4]   2> 889281 INFO  (TEST-ZkStateReaderTest.testStateFormatUpdateWithExplicitRefresh-seed#[8B88B7C9DDC179A1]) [    ] o.a.s.c.c.SolrZkClient Using default ZkACLProvider
   [junit4]   2> 889284 INFO  (TEST-ZkStateReaderTest.testStateFormatUpdateWithExplicitRefresh-seed#[8B88B7C9DDC179A1]) [    ] o.a.s.c.c.SolrZkClient Using default ZkCredentialsProvider
   [junit4]   2> 889284 INFO  (TEST-ZkStateReaderTest.testStateFormatUpdateWithExplicitRefresh-seed#[8B88B7C9DDC179A1]) [    ] o.a.s.c.c.ConnectionManager Waiting for client to connect to ZooKeeper
   [junit4]   2> 889288 INFO  (zkCallback-826-thread-1) [    ] o.a.s.c.c.ConnectionManager Watcher org.apache.solr.common.cloud.ConnectionManager@52f73bb2 name:ZooKeeperConnection Watcher:127.0.0.1:58303 got event WatchedEvent state:SyncConnected type:None path:null path:null type:None
   [junit4]   2> 889288 INFO  (TEST-ZkStateReaderTest.testStateFormatUpdateWithExplicitRefresh-seed#[8B88B7C9DDC179A1]) [    ] o.a.s.c.c.ConnectionManager Client is connected to ZooKeeper
   [junit4]   2> 889288 INFO  (TEST-ZkStateReaderTest.testStateFormatUpdateWithExplicitRefresh-seed#[8B88B7C9DDC179A1]) [    ] o.a.s.c.c.SolrZkClient Using default ZkACLProvider
   [junit4]   2> 889288 INFO  (TEST-ZkStateReaderTest.testStateFormatUpdateWithExplicitRefresh-seed#[8B88B7C9DDC179A1]) [    ] o.a.s.c.c.SolrZkClient makePath: /solr
   [junit4]   2> 889293 INFO  (TEST-ZkStateReaderTest.testStateFormatUpdateWithExplicitRefresh-seed#[8B88B7C9DDC179A1]) [    ] o.a.s.c.c.SolrZkClient Using default ZkCredentialsProvider
   [junit4]   2> 889294 INFO  (TEST-ZkStateReaderTest.testStateFormatUpdateWithExplicitRefresh-seed#[8B88B7C9DDC179A1]) [    ] o.a.s.c.c.ConnectionManager Waiting for client to connect to ZooKeeper
   [junit4]   2> 889295 INFO  (zkCallback-827-thread-1) [    ] o.a.s.c.c.ConnectionManager Watcher org.apache.solr.common.cloud.ConnectionManager@1efaac98 name:ZooKeeperConnection Watcher:127.0.0.1:58303/solr got event WatchedEvent state:SyncConnected type:None path:null path:null type:None
   [junit4]   2> 889295 INFO  (TEST-ZkStateReaderTest.testStateFormatUpdateWithExplicitRefresh-seed#[8B88B7C9DDC179A1]) [    ] o.a.s.c.c.ConnectionManager Client is connected to ZooKeeper
   [junit4]   2> 889295 INFO  (TEST-ZkStateReaderTest.testStateFormatUpdateWithExplicitRefresh-seed#[8B88B7C9DDC179A1]) [    ] o.a.s.c.c.SolrZkClient Using default ZkACLProvider
   [junit4]   2> 889296 INFO  (TEST-ZkStateReaderTest.testStateFormatUpdateWithExplicitRefresh-seed#[8B88B7C9DDC179A1]) [    ] o.a.s.c.c.SolrZkClient makePath: /live_nodes
   [junit4]   2> 889298 INFO  (TEST-ZkStateReaderTest.testStateFormatUpdateWithExplicitRefresh-seed#[8B88B7C9DDC179A1]) [    ] o.a.s.c.c.SolrZkClient makePath: /collections
   [junit4]   2> 889300 INFO  (TEST-ZkStateReaderTest.testStateFormatUpdateWithExplicitRefresh-seed#[8B88B7C9DDC179A1]) [    ] o.a.s.c.c.SolrZkClient makePath: /aliases.json
   [junit4]   2> 889302 INFO  (TEST-ZkStateReaderTest.testStateFormatUpdateWithExplicitRefresh-seed#[8B88B7C9DDC179A1]) [    ] o.a.s.c.c.SolrZkClient makePath: /clusterstate.json
   [junit4]   2> 889304 INFO  (TEST-ZkStateReaderTest.testStateFormatUpdateWithExplicitRefresh-seed#[8B88B7C9DDC179A1]) [    ] o.a.s.c.c.SolrZkClient makePath: /security.json
   [junit4]   2> 889305 INFO  (TEST-ZkStateReaderTest.testStateFormatUpdateWithExplicitRefresh-seed#[8B88B7C9DDC179A1]) [    ] o.a.s.c.c.ZkStateReader Updating cluster state from ZooKeeper... 
   [junit4]   2> 889306 INFO  (TEST-ZkStateReaderTest.testStateFormatUpdateWithExplicitRefresh-seed#[8B88B7C9DDC179A1]) [    ] o.a.s.c.c.ZkStateReader Loaded empty cluster properties
   [junit4]   2> 889307 INFO  (TEST-ZkStateReaderTest.testStateFormatUpdateWithExplicitRefresh-seed#[8B88B7C9DDC179A1]) [    ] o.a.s.c.c.ZkStateReader Updated live nodes from ZooKeeper... (0) -> (0)
   [junit4]   2> 889310 INFO  (TEST-ZkStateReaderTest.testStateFormatUpdateWithExplicitRefresh-seed#[8B88B7C9DDC179A1]) [    ] o.a.s.c.c.ZkStateReader Deleting data for [c1]
   [junit4]   2> 889311 INFO  (TEST-ZkStateReaderTest.testStateFormatUpdateWithExplicitRefresh-seed#[8B88B7C9DDC179A1]) [    ] o.a.s.c.c.SolrZkClient makePath: /collections/c1
   [junit4]   2> 889312 INFO  (zkCallback-827-thread-1) [    ] o.a.s.c.c.ZkStateReader A collections change: [WatchedEvent state:SyncConnected type:NodeChildrenChanged path:/collections], has occurred - updating...
   [junit4]   2> 889314 INFO  (zkCallback-827-thread-1) [    ] o.a.s.c.c.ZkStateReader A cluster state change: [WatchedEvent state:SyncConnected type:NodeDataChanged path:/clusterstate.json], has occurred - updating... (live nodes size: [0])
   [junit4]   2> 889316 INFO  (TEST-ZkStateReaderTest.testStateFormatUpdateWithExplicitRefresh-seed#[8B88B7C9DDC179A1]) [    ] o.a.s.c.o.ZkStateWriter going to create_collection /collections/c1/state.json
   [junit4]   2> 889316 INFO  (zkCallback-827-thread-1) [    ] o.a.s.c.c.ZkStateReader A cluster state change: [WatchedEvent state:SyncConnected type:NodeCreated path:/collections/c1/state.json] for collection [c1] has occurred - updating... (live nodes size: [0])
   [junit4]   2> 889317 INFO  (zkCallback-827-thread-1) [    ] o.a.s.c.c.ZkStateReader Add data for [c1] ver [0]
   [junit4]   2> 889317 INFO  (zkCallback-827-thread-2) [    ] o.a.s.c.c.ZkStateReader A cluster state change: [WatchedEvent state:SyncConnected type:NodeDataChanged path:/clusterstate.json], has occurred - updating... (live nodes size: [0])
   [junit4]   2> 889320 INFO  (TEST-ZkStateReaderTest.testStateFormatUpdateWithExplicitRefresh-seed#[8B88B7C9DDC179A1]) [    ] o.a.s.c.ZkTestServer connecting to 127.0.0.1:58303 58303
   [junit4]   2> 894426 INFO  (Thread-3138) [    ] o.a.s.c.ZkTestServer connecting to 127.0.0.1:58303 58303
   [junit4]   2> 894427 INFO  (TEST-ZkStateReaderTest.testStateFormatUpdateWithExplicitRefresh-seed#[8B88B7C9DDC179A1]) [    ] o.a.s.SolrTestCaseJ4 ###Ending testStateFormatUpdateWithExplicitRefresh
   [junit4]   2> NOTE: reproduce with: ant test  -Dtestcase=ZkStateReaderTest -Dtests.method=testStateFormatUpdateWithExplicitRefresh -Dtests.seed=8B88B7C9DDC179A1 -Dtests.slow=true -Dtests.locale=es-AR -Dtests.timezone=Europe/Vatican -Dtests.asserts=true -Dtests.file.encoding=UTF-8
   [junit4] ERROR   5.27s J0 | ZkStateReaderTest.testStateFormatUpdateWithExplicitRefresh <<<
   [junit4]    > Throwable #1: java.lang.NullPointerException
   [junit4]    > 	at __randomizedtesting.SeedInfo.seed([8B88B7C9DDC179A1:9432C63E0DA1BF64]:0)
   [junit4]    > 	at org.apache.solr.common.cloud.ZkStateReader.refreshLegacyClusterState(ZkStateReader.java:522)
   [junit4]    > 	at org.apache.solr.common.cloud.ZkStateReader.forceUpdateCollection(ZkStateReader.java:296)
   [junit4]    > 	at org.apache.solr.cloud.overseer.ZkStateReaderTest.testStateFormatUpdate(ZkStateReaderTest.java:126)
   [junit4]    > 	at org.apache.solr.cloud.overseer.ZkStateReaderTest.testStateFormatUpdateWithExplicitRefresh(ZkStateReaderTest.java:41)
   [junit4]    > 	at java.lang.Thread.run(Thread.java:745)
   [junit4]   2> 894435 INFO  (TEST-ZkStateReaderTest.testStateFormatUpdateWithExplicitRefreshLazy-seed#[8B88B7C9DDC179A1]) [    ] o.a.s.SolrTestCaseJ4 ###Starting testStateFormatUpdateWithExplicitRefreshLazy
   [junit4]   2> 894436 INFO  (TEST-ZkStateReaderTest.testStateFormatUpdateWithExplicitRefreshLazy-seed#[8B88B7C9DDC179A1]) [    ] o.a.s.c.ZkTestServer STARTING ZK TEST SERVER
   [junit4]   2> 894436 INFO  (Thread-3139) [    ] o.a.s.c.ZkTestServer client port:0.0.0.0/0.0.0.0:0
   [junit4]   2> 894436 INFO  (Thread-3139) [    ] o.a.s.c.ZkTestServer Starting server
   [junit4]   2> 894536 INFO  (TEST-ZkStateReaderTest.testStateFormatUpdateWithExplicitRefreshLazy-seed#[8B88B7C9DDC179A1]) [    ] o.a.s.c.ZkTestServer start zk server on port:44252
   [junit4]   2> 894536 INFO  (TEST-ZkStateReaderTest.testStateFormatUpdateWithExplicitRefreshLazy-seed#[8B88B7C9DDC179A1]) [    ] o.a.s.c.c.SolrZkClient Using default ZkCredentialsProvider
   [junit4]   2> 894537 INFO  (TEST-ZkStateReaderTest.testStateFormatUpdateWithExplicitRefreshLazy-seed#[8B88B7C9DDC179A1]) [    ] o.a.s.c.c.ConnectionManager Waiting for client to connect to ZooKeeper
   [junit4]   2> 894539 INFO  (zkCallback-829-thread-1) [    ] o.a.s.c.c.ConnectionManager Watcher org.apache.solr.common.cloud.ConnectionManager@714d7cbd name:ZooKeeperConnection Watcher:127.0.0.1:44252 got event WatchedEvent state:SyncConnected type:None path:null path:null type:None
   [junit4]   2> 894539 INFO  (TEST-ZkStateReaderTest.testStateFormatUpdateWithExplicitRefreshLazy-seed#[8B88B7C9DDC179A1]) [    ] o.a.s.c.c.ConnectionManager Client is connected to ZooKeeper
   [junit4]   2> 894539 INFO  (TEST-ZkStateReaderTest.testStateFormatUpdateWithExplicitRefreshLazy-seed#[8B88B7C9DDC179A1]) [    ] o.a.s.c.c.SolrZkClient Using default ZkACLProvider
   [junit4]   2> 894541 INFO  (TEST-ZkStateReaderTest.testStateFormatUpdateWithExplicitRefreshLazy-seed#[8B88B7C9DDC179A1]) [    ] o.a.s.c.c.SolrZkClient Using default ZkCredentialsProvider
   [junit4]   2> 894541 INFO  (TEST-ZkStateReaderTest.testStateFormatUpdateWithExplicitRefreshLazy-seed#[8B88B7C9DDC179A1]) [    ] o.a.s.c.c.ConnectionManager Waiting for client to connect to ZooKeeper
   [junit4]   2> 894542 INFO  (zkCallback-830-thread-1) [    ] o.a.s.c.c.ConnectionManager Watcher org.apache.solr.common.cloud.ConnectionManager@16b8eb6d name:ZooKeeperConnection Watcher:127.0.0.1:44252 got event WatchedEvent state:SyncConnected type:None path:null path:null type:None
   [junit4]   2> 894542 INFO  (TEST-ZkStateReaderTest.testStateFormatUpdateWithExplicitRefreshLazy-seed#[8B88B7C9DDC179A1]) [    ] o.a.s.c.c.ConnectionManager Client is connected to ZooKeeper
   [junit4]   2> 894542 INFO  (TEST-ZkStateReaderTest.testStateFormatUpdateWithExplicitRefreshLazy-seed#[8B88B7C9DDC179A1]) [    ] o.a.s.c.c.SolrZkClient Using default ZkACLProvider
   [junit4]   2> 894542 INFO  (TEST-ZkStateReaderTest.testStateFormatUpdateWithExplicitRefreshLazy-seed#[8B88B7C9DDC179A1]) [    ] o.a.s.c.c.SolrZkClient makePath: /solr
   [junit4]   2> 894546 INFO  (TEST-ZkStateReaderTest.testStateFormatUpdateWithExplicitRefreshLazy-seed#[8B88B7C9DDC179A1]) [    ] o.a.s.c.c.SolrZkClient Using default ZkCredentialsProvider
   [junit4]   2> 894546 INFO  (TEST-ZkStateReaderTest.testStateFormatUpdateWithExplicitRefreshLazy-seed#[8B88B7C9DDC179A1]) [    ] o.a.s.c.c.ConnectionManager Waiting for client to connect to ZooKeeper
   [junit4]   2> 894547 INFO  (zkCallback-831-thread-1) [    ] o.a.s.c.c.ConnectionManager Watcher org.apache.solr.common.cloud.ConnectionManager@3a9e4cd2 name:ZooKeeperConnection Watcher:127.0.0.1:44252/solr got event WatchedEvent state:SyncConnected type:None path:null path:null type:None
   [junit4]   2> 894548 INFO  (TEST-ZkStateReaderTest.testStateFormatUpdateWithExplicitRefreshLazy-seed#[8B88B7C9DDC179A1]) [    ] o.a.s.c.c.ConnectionManager Client is connected to ZooKeeper
   [junit4]   2> 894548 INFO  (TEST-ZkStateReaderTest.testStateFormatUpdateWithExplicitRefreshLazy-seed#[8B88B7C9DDC179A1]) [    ] o.a.s.c.c.SolrZkClient Using default ZkACLProvider
   [junit4]   2> 894549 INFO  (TEST-ZkStateReaderTest.testStateFormatUpdateWithExplicitRefreshLazy-seed#[8B88B7C9DDC179A1]) [    ] o.a.s.c.c.SolrZkClient makePath: /live_nodes
   [junit4]   2> 894551 INFO  (TEST-ZkStateReaderTest.testStateFormatUpdateWithExplicitRefreshLazy-seed#[8B88B7C9DDC179A1]) [    ] o.a.s.c.c.SolrZkClient makePath: /collections
   [junit4]   2> 894553 INFO  (TEST-ZkStateReaderTest.testStateFormatUpdateWithExplicitRefreshLazy-seed#[8B88B7C9DDC179A1]) [    ] o.a.s.c.c.SolrZkClient makePath: /aliases.json
   [junit4]   2> 894554 INFO  (TEST-ZkStateReaderTest.testStateFormatUpdateWithExplicitRefreshLazy-seed#[8B88B7C9DDC179A1]) [    ] o.a.s.c.c.SolrZkClient makePath: /clusterstate.json
   [junit4]   2> 894556 INFO  (TEST-ZkStateReaderTest.testStateFormatUpdateWithExplicitRefreshLazy-seed#[8B88B7C9DDC179A1]) [    ] o.a.s.c.c.SolrZkClient makePath: /security.json
   [junit4]   2> 894558 INFO  (TEST-ZkStateReaderTest.testStateFormatUpdateWithExplicitRefreshLazy-seed#[8B88B7C9DDC179A1]) [    ] o.a.s.c.c.ZkStateReader Updating cluster state from ZooKeeper... 
   [junit4]   2> 894559 INFO  (TEST-ZkStateReaderTest.testStateFormatUpdateWithExplicitRefreshLazy-seed#[8B88B7C9DDC179A1]) [    ] o.a.s.c.c.ZkStateReader Loaded empty cluster properties
   [junit4]   2> 894560 INFO  (TEST-ZkStateReaderTest.testStateFormatUpdateWithExplicitRefreshLazy-seed#[8B88B7C9DDC179A1]) [    ] o.a.s.c.c.ZkStateReader Updated live nodes from ZooKeeper... (0) -> (0)
   [junit4]   2> 894561 INFO  (TEST-ZkStateReaderTest.testStateFormatUpdateWithExplicitRefreshLazy-seed#[8B88B7C9DDC179A1]) [    ] o.a.s.c.c.SolrZkClient makePath: /collections/c1
   [junit4]   2> 894563 INFO  (zkCallback-831-thread-1) [    ] o.a.s.c.c.ZkStateReader A collections change: [WatchedEvent state:SyncConnected type:NodeChildrenChanged path:/collections], has occurred - updating...
   [junit4]   2> 894565 INFO  (zkCallback-831-thread-1) [    ] o.a.s.c.c.ZkStateReader A cluster state change: [WatchedEvent state:SyncConnected type:NodeDataChanged path:/clusterstate.json], has occurred - updating... (live nodes size: [0])
   [junit4]   2> 894567 INFO  (TEST-ZkStateReaderTest.testStateFormatUpdateWithExplicitRefreshLazy-seed#[8B88B7C9DDC179A1]) [    ] o.a.s.c.o.ZkStateWriter going to create_collection /collections/c1/state.json
   [junit4]   2> 894568 INFO  (zkCallback-831-thread-1) [    ] o.a.s.c.c.ZkStateReader A cluster state change: [WatchedEvent state:SyncConnected type:NodeDataChanged path:/clusterstate.json], has occurred - updating... (live nodes size: [0])
   [junit4]   2> 894572 INFO  (TEST-ZkStateReaderTest.testStateFormatUpdateWithExplicitRefreshLazy-seed#[8B88B7C9DDC179A1]) [    ] o.a.s.c.ZkTestServer connecting to 127.0.0.1:44252 44252
   [junit4]   2> 894604 INFO  (Thread-3139) [    ] o.a.s.c.ZkTestServer connecting to 127.0.0.1:44252 44252
   [junit4]   2> 894606 INFO  (TEST-ZkStateReaderTest.testStateFormatUpdateWithExplicitRefreshLazy-seed#[8B88B7C9DDC179A1]) [    ] o.a.s.SolrTestCaseJ4 ###Ending testStateFormatUpdateWithExplicitRefreshLazy
   [junit4]   2> 894609 INFO  (TEST-ZkStateReaderTest.testStateFormatUpdateWithTimeDelayLazy-seed#[8B88B7C9DDC179A1]) [    ] o.a.s.SolrTestCaseJ4 ###Starting testStateFormatUpdateWithTimeDelayLazy
   [junit4]   2> 894609 INFO  (TEST-ZkStateReaderTest.testStateFormatUpdateWithTimeDelayLazy-seed#[8B88B7C9DDC179A1]) [    ] o.a.s.c.ZkTestServer STARTING ZK TEST SERVER
   [junit4]   2> 894609 INFO  (Thread-3140) [    ] o.a.s.c.ZkTestServer client port:0.0.0.0/0.0.0.0:0
   [junit4]   2> 894609 INFO  (Thread-3140) [    ] o.a.s.c.ZkTestServer Starting server
   [junit4]   2> 894712 INFO  (TEST-ZkStateReaderTest.testStateFormatUpdateWithTimeDelayLazy-seed#[8B88B7C9DDC179A1]) [    ] o.a.s.c.ZkTestServer start zk server on port:41028
   [junit4]   2> 894712 INFO  (TEST-ZkStateReaderTest.testStateFormatUpdateWithTimeDelayLazy-seed#[8B88B7C9DDC179A1]) [    ] o.a.s.c.c.SolrZkClient Using default ZkCredentialsProvider
   [junit4]   2> 894712 INFO  (TEST-ZkStateReaderTest.testStateFormatUpdateWithTimeDelayLazy-seed#[8B88B7C9DDC179A1]) [    ] o.a.s.c.c.ConnectionManager Waiting for client to connect to ZooKeeper
   [junit4]   2> 894715 INFO  (zkCallback-833-thread-1) [    ] o.a.s.c.c.ConnectionManager Watcher org.apache.solr.common.cloud.ConnectionManager@7442d93c name:ZooKeeperConnection Watcher:127.0.0.1:41028 got event WatchedEvent state:SyncConnected type:None path:null path:null type:None
   [junit4]   2> 894715 INFO  (TEST-ZkStateReaderTest.testStateFormatUpdateWithTimeDelayLazy-seed#[8B88B7C9DDC179A1]) [    ] o.a.s.c.c.ConnectionManager Client is connected to ZooKeeper
   [junit4]   2> 894715 INFO  (TEST-ZkStateReaderTest.testStateFormatUpdateWithTimeDelayLazy-seed#[8B88B7C9DDC179A1]) [    ] o.a.s.c.c.SolrZkClient Using default ZkACLProvider
   [junit4]   2> 894717 INFO  (TEST-ZkStateReaderTest.testStateFormatUpdateWithTimeDelayLazy-seed#[8B88B7C9DDC179A1]) [    ] o.a.s.c.c.SolrZkClient Using default ZkCredentialsProvider
   [junit4]   2> 894717 INFO  (TEST-ZkStateReaderTest.testStateFormatUpdateWithTimeDelayLazy-seed#[8B88B7C9DDC179A1]) [    ] o.a.s.c.c.ConnectionManager Waiting for client to connect to ZooKeeper
   [junit4]   2> 894719 INFO  (zkCallback-834-thread-1) [    ] o.a.s.c.c.ConnectionManager Watcher org.apache.solr.common.cloud.ConnectionManager@4d8c653c name:ZooKeeperConnection Watcher:127.0.0.1:41028 got event WatchedEvent state:SyncConnected type:None path:null path:null type:None
   [junit4]   2> 894719 INFO  (TEST-ZkStateReaderTest.testStateFormatUpdateWithTimeDelayLazy-seed#[8B88B7C9DDC179A1]) [    ] o.a.s.c.c.ConnectionManager Client is connected to ZooKeeper
   [junit4]   2> 894719 INFO  (TEST-ZkStateReaderTest.testStateFormatUpdateWithTimeDelayLazy-seed#[8B88B7C9DDC179A1]) [    ] o.a.s.c.c.SolrZkClient Using default ZkACLProvider
   [junit4]   2> 894719 INFO  (TEST-ZkStateReaderTest.testStateFormatUpdateWithTimeDelayLazy-seed#[8B88B7C9DDC179A1]) [    ] o.a.s.c.c.SolrZkClient makePath: /solr
   [junit4]   2> 894722 INFO  (TEST-ZkStateReaderTest.testStateFormatUpdateWithTimeDelayLazy-seed#[8B88B7C9DDC179A1]) [    ] o.a.s.c.c.SolrZkClient Using default ZkCredentialsProvider
   [junit4]   2> 894722 INFO  (TEST-ZkStateReaderTest.testStateFormatUpdateWithTimeDelayLazy-seed#[8B88B7C9DDC179A1]) [    ] o.a.s.c.c.ConnectionManager Waiting for client to connect to ZooKeeper
   [junit4]   2> 894724 INFO  (zkCallback-835-thread-1) [    ] o.a.s.c.c.ConnectionManager Watcher org.apache.solr.common.cloud.ConnectionManager@79e45ae9 name:ZooKeeperConnection Watcher:127.0.0.1:41028/solr got event WatchedEvent state:SyncConnected type:None path:null path:null type:None
   [junit4]   2> 894725 INFO  (TEST-ZkStateReaderTest.testStateFormatUpdateWithTimeDelayLazy-seed#[8B88B7C9DDC179A1]) [    ] o.a.s.c.c.ConnectionManager Client is connected to ZooKeeper
   [junit4]   2> 894725 INFO  (TEST-ZkStateReaderTest.testStateFormatUpdateWithTimeDelayLazy-seed#[8B88B7C9DDC179A1]) [    ] o.a.s.c.c.SolrZkClient Using default ZkACLProvider
   [junit4]   2> 894725 INFO  (TEST-ZkStateReaderTest.testStateFormatUpdateWithTimeDelayLazy-seed#[8B88B7C9DDC179A1]) [    ] o.a.s.c.c.SolrZkClient makePath: /live_nodes
   [junit4]   2> 894727 INFO  (TEST-ZkStateReaderTest.testStateFormatUpdateWithTimeDelayLazy-seed#[8B88B7C9DDC179A1]) [    ] o.a.s.c.c.SolrZkClient makePath: /collections
   [junit4]   2> 894729 INFO  (TEST-ZkStateReaderTest.testStateFormatUpdateWithTimeDelayLazy-seed#[8B88B7C9DDC179A1]) [    ] o.a.s.c.c.SolrZkClient makePath: /aliases.json
   [junit4]   2> 894731 INFO  (TEST-ZkStateReaderTest.testStateFormatUpdateWithTimeDelayLazy-seed#[8B88B7C9DDC179A1]) [    ] o.a.s.c.c.SolrZkClient makePath: /clusterstate.json
   [junit4]   2> 894732 INFO  (TEST-ZkStateReaderTest.testStateFormatUpdateWithTimeDelayLazy-seed#[8B88B7C9DDC179A1]) [    ] o.a.s.c.c.SolrZkClient makePath: /security.json
   [junit4]   2> 894734 INFO  (TEST-ZkStateReaderTest.testStateFormatUpdateWithTimeDelayLazy-seed#[8B88B7C9DDC179A1]) [    ] o.a.s.c.c.ZkStateReader Updating cluster state from ZooKeeper... 
   [junit4]   2> 894735 INFO  (TEST-ZkStateReaderTest.testStateFormatUpdateWithTimeDelayLazy-seed#[8B88B7C9DDC179A1]) [    ] o.a.s.c.c.ZkStateReader Loaded empty cluster properties
   [junit4]   2> 894736 INFO  (TEST-ZkStateReaderTest.testStateFormatUpdateWithTimeDelayLazy-seed#[8B88B7C9DDC179A1]) [    ] o.a.s.c.c.ZkStateReader Updated live nodes from ZooKeeper... (0) -> (0)
   [junit4]   2> 894738 INFO  (TEST-ZkStateReaderTest.testStateFormatUpdateWithTimeDelayLazy-seed#[8B88B7C9DDC179A1]) [    ] o.a.s.c.c.SolrZkClient makePath: /collections/c1
   [junit4]   2> 894739 INFO  (zkCallback-835-thread-1) [    ] o.a.s.c.c.ZkStateReader A collections change: [WatchedEvent state:SyncConnected type:NodeChildrenChanged path:/collections], has occurred - updating...
   [junit4]   2> 894741 INFO  (zkCallback-835-thread-1) [    ] o.a.s.c.c.ZkStateReader A cluster state change: [WatchedEvent state:SyncConnected type:NodeDataChanged path:/clusterstate.json], has occurred - updating... (live nodes size: [0])
   [junit4]   2> 894742 INFO  (TEST-ZkStateReaderTest.testStateFormatUpdateWithTimeDelayLazy-seed#[8B88B7C9DDC179A1]) [    ] o.a.s.c.o.ZkStateWriter going to create_collection /collections/c1/state.json
   [junit4]   2> 894743 INFO  (zkCallback-835-thread-1) [    ] o.a.s.c.c.ZkStateReader A cluster state change: [WatchedEvent state:SyncConnected type:NodeDataChanged path:/clusterstate.json], has occurred - updating... (live nodes size: [0])
   [junit4]   2> 894747 INFO  (TEST-ZkStateReaderTest.testStateFormatUpdateWithTimeDelayLazy-seed#[8B88B7C9DDC179A1]) [    ] o.a.s.c.ZkTestServer connecting to 127.0.0.1:41028 41028
   [junit4]   2> 894858 INFO  (Thread-3140) [    ] o.a.s.c.ZkTestServer connecting to 127.0.0.1:41028 41028
   [junit4]   2> 894859 INFO  (TEST-ZkStateReaderTest.testStateFormatUpdateWithTimeDelayLazy-seed#[8B88B7C9DDC179A1]) [    ] o.a.s.SolrTestCaseJ4 ###Ending testStateFormatUpdateWithTimeDelayLazy
   [junit4]   2> 894861 INFO  (TEST-ZkStateReaderTest.testStateFormatUpdateWithTimeDelay-seed#[8B88B7C9DDC179A1]) [    ] o.a.s.SolrTestCaseJ4 ###Starting testStateFormatUpdateWithTimeDelay
   [junit4]   2> 894862 INFO  (TEST-ZkStateReaderTest.testStateFormatUpdateWithTimeDelay-seed#[8B88B7C9DDC179A1]) [    ] o.a.s.c.ZkTestServer STARTING ZK TEST SERVER
   [junit4]   2> 894862 INFO  (Thread-3141) [    ] o.a.s.c.ZkTestServer client port:0.0.0.0/0.0.0.0:0
   [junit4]   2> 894862 INFO  (Thread-3141) [    ] o.a.s.c.ZkTestServer Starting server
   [junit4]   2> 894962 INFO  (TEST-ZkStateReaderTest.testStateFormatUpdateWithTimeDelay-seed#[8B88B7C9DDC179A1]) [    ] o.a.s.c.ZkTestServer start zk server on port:58255
   [junit4]   2> 894962 INFO  (TEST-ZkStateReaderTest.testStateFormatUpdateWithTimeDelay-seed#[8B88B7C9DDC179A1]) [    ] o.a.s.c.c.SolrZkClient Using default ZkCredentialsProvider
   [junit4]   2> 894963 INFO  (TEST-ZkStateReaderTest.testStateFormatUpdateWithTimeDelay-seed#[8B88B7C9DDC179A1]) [    ] o.a.s.c.c.ConnectionManager Waiting for client to connect to ZooKeeper
   [junit4]   2> 894965 INFO  (zkCallback-837-thread-1) [    ] o.a.s.c.c.ConnectionManager Watcher org.apache.solr.common.cloud.ConnectionManager@28e182c6 name:ZooKeeperConnection Watcher:127.0.0.1:58255 got event WatchedEvent state:SyncConnected type:None path:null path:null type:None
   [junit4]   2> 894965 INFO  (TEST-ZkStateReaderTest.testStateFormatUpdateWithTimeDelay-seed#[8B88B7C9DDC179A1]) [    ] o.a.s.c.c.ConnectionManager Client is connected to ZooKeeper
   [junit4]   2> 894965 INFO  (TEST-ZkStateReaderTest.testStateFormatUpdateWithTimeDelay-seed#[8B88B7C9DDC179A1]) [    ] o.a.s.c.c.SolrZkClient Using default ZkACLProvider
   [junit4]   2> 894967 INFO  (TEST-ZkStateReaderTest.testStateFormatUpdateWithTimeDelay-seed#[8B88B7C9DDC179A1]) [    ] o.a.s.c.c.SolrZkClient Using default ZkCredentialsProvider
   [junit4]   2> 894967 INFO  (TEST-ZkStateReaderTest.testStateFormatUpdateWithTimeDelay-seed#[8B88B7C9DDC179A1]) [    ] o.a.s.c.c.ConnectionManager Waiting for client to connect to ZooKeeper
   [junit4]   2> 894968 INFO  (zkCallback-838-thread-1) [    ] o.a.s.c.c.ConnectionManager Watcher org.apache.solr.common.cloud.ConnectionManager@5abaedce name:ZooKeeperConnection Watcher:127.0.0.1:58255 got event WatchedEvent state:SyncConnected type:None path:null path:null type:None
   [junit4]   2> 894968 INFO  (TEST-ZkStateReaderTest.testStateFormatUpdateWithTimeDelay-seed#[8B88B7C9DDC179A1]) [    ] o.a.s.c.c.ConnectionManager Client is connected to ZooKeeper
   [junit4]   2> 894968 INFO  (TEST-ZkStateReaderTest.testStateFormatUpdateWithTimeDelay-seed#[8B88B7C9DDC179A1]) [    ] o.a.s.c.c.SolrZkClient Using default ZkACLProvider
   [junit4]   2> 894968 INFO  (TEST-ZkStateReaderTest.testStateFormatUpdateWithTimeDelay-seed#[8B88B7C9DDC179A1]) [    ] o.a.s.c.c.SolrZkClient makePath: /solr
   [junit4]   2> 894972 INFO  (TEST-ZkStateReaderTest.testStateFormatUpdateWithTimeDelay-seed#[8B88B7C9DDC179A1]) [    ] o.a.s.c.c.SolrZkClient Using default ZkCredentialsProvider
   [junit4]   2> 894972 INFO  (TEST-ZkStateReaderTest.testStateFormatUpdateWithTimeDelay-seed#[8B88B7C9DDC179A1]) [    ] o.a.s.c.c.ConnectionManager Waiting for client to connect to ZooKeeper
   [junit4]   2> 894974 INFO  (zkCallback-839-thread-1) [    ] o.a.s.c.c.ConnectionManager Watcher org.apache.solr.common.cloud.ConnectionManager@3093e03c name:ZooKeeperConnection Watcher:127.0.0.1:58255/solr got event WatchedEvent state:SyncConnected type:None path:null path:null type:None
   [junit4]   2> 894974 INFO  (TEST-ZkStateReaderTest.testStateFormatUpdateWithTimeDelay-seed#[8B88B7C9DDC179A1]) [    ] o.a.s.c.c.ConnectionManager Client is connected to ZooKeeper
   [junit4]   2> 894974 INFO  (TEST-ZkStateReaderTest.testStateFormatUpdateWithTimeDelay-seed#[8B88B7C9DDC179A1]) [    ] o.a.s.c.c.SolrZkClient Using default ZkACLProvider
   [junit4]   2> 894975 INFO  (TEST-ZkStateReaderTest.testStateFormatUpdateWithTimeDelay-seed#[8B88B7C9DDC179A1]) [    ] o.a.s.c.c.SolrZkClient makePath: /live_nodes
   [junit4]   2> 894977 INFO  (TEST-ZkStateReaderTest.testStateFormatUpdateWithTimeDelay-seed#[8B88B7C9DDC179A1]) [    ] o.a.s.c.c.SolrZkClient makePath: /collections
   [junit4]   2> 894979 INFO  (TEST-ZkStateReaderTest.testStateFormatUpdateWithTimeDelay-seed#[8B88B7C9DDC179A1]) [    ] o.a.s.c.c.SolrZkClient makePath: /aliases.json
   [junit4]   2> 894981 INFO  (TEST-ZkStateReaderTest.testStateFormatUpdateWithTimeDelay-seed#[8B88B7C9DDC179A1]) [    ] o.a.s.c.c.SolrZkClient makePath: /clusterstate.json
   [junit4]   2> 894983 INFO  (TEST-ZkStateReaderTest.testStateFormatUpdateWithTimeDelay-seed#[8B88B7C9DDC179A1]) [    ] o.a.s.c.c.SolrZkClient makePath: /security.json
   [junit4]   2> 894984 INFO  (TEST-ZkStateReaderTest.testStateFormatUpdateWithTimeDelay-seed#[8B88B7C9DDC179A1]) [    ] o.a.s.c.c.ZkStateReader Updating cluster state from ZooKeeper... 
   [junit4]   2> 894985 INFO  (TEST-ZkStateReaderTest.testStateFormatUpdateWithTimeDelay-seed#[8B88B7C9DDC179A1]) [    ] o.a.s.c.c.ZkStateReader Loaded empty cluster properties
   [junit4]   2> 894986 INFO  (TEST-ZkStateReaderTest.testStateFormatUpdateWithTimeDelay-seed#[8B88B7C9DDC179A1]) [    ] o.a.s.c.c.ZkStateReader Updated live nodes from ZooKeeper... (0) -> (0)
   [junit4]   2> 894989 INFO  (TEST-ZkStateReaderTest.testStateFormatUpdateWithTimeDelay-seed#[8B88B7C9DDC179A1]) [    ] o.a.s.c.c.ZkStateReader Deleting data for [c1]
   [junit4]   2> 894989 INFO  (TEST-ZkStateReaderTest.testStateFormatUpdateWithTimeDelay-seed#[8B88B7C9DDC179A1]) [    ] o.a.s.c.c.SolrZkClient makePath: /collections/c1
   [junit4]   2> 894991 INFO  (zkCallback-839-thread-1) [    ] o.a.s.c.c.ZkStateReader A collections change: [WatchedEvent state:SyncConnected type:NodeChildrenChanged path:/collections], has occurred - updating...
   [junit4]   2> 894992 INFO  (zkCallback-839-thread-1) [    ] o.a.s.c.c.ZkStateReader A cluster state change: [WatchedEvent state:SyncConnected type:NodeDataChanged path:/clusterstate.json], has occurred - updating... (live nodes size: [0])
   [junit4]   2> 894994 INFO  (TEST-ZkStateReaderTest.testStateFormatUpdateWithTimeDelay-seed#[8B88B7C9DDC179A1]) [    ] o.a.s.c.o.ZkStateWriter going to create_collection /collections/c1/state.json
   [junit4]   2> 894994 INFO  (zkCallback-839-thread-1) [    ] o.a.s.c.c.ZkStateReader A cluster state change: [WatchedEvent state:SyncConnected type:NodeCreated path:/collections/c1/state.json] for collection [c1] has occurred - updating... (live nodes size: [0])
   [junit4]   2> 894995 INFO  (zkCallback-839-thread-1) [    ] o.a.s.c.c.ZkStateReader Add data for [c1] ver [0]
   [junit4]   2> 894995 INFO  (zkCallback-839-thread-2) [    ] o.a.s.c.c.ZkStateReader A cluster state change: [WatchedEvent state:SyncConnected type:NodeDataChanged path:/clusterstate.json], has occurred - updating... (live nodes size: [0])
   [junit4]   2> 945382 INFO  (TEST-ZkStateReaderTest.testStateFormatUpdateWithTimeDelay-seed#[8B88B7C9DDC179A1]) [    ] o.a.s.c.ZkTestServer connecting to 127.0.0.1:58255 58255
   [junit4]   2> 945450 INFO  (Thread-3141) [    ] o.a.s.c.ZkTestServer connecting to 127.0.0.1:58255 58255
   [junit4]   2> 945453 INFO  (TEST-ZkStateReaderTest.testStateFormatUpdateWithTimeDelay-seed#[8B88B7C9DDC179A1]) [    ] o.a.s.SolrTestCaseJ4 ###Ending testStateFormatUpdateWithTimeDelay
   [junit4]   2> NOTE: reproduce with: ant test  -Dtestcase=ZkStateReaderTest -Dtests.method=testStateFormatUpdateWithTimeDelay -Dtests.seed=8B88B7C9DDC179A1 -Dtests.slow=true -Dtests.locale=es-AR -Dtests.timezone=Europe/Vatican -Dtests.asserts=true -Dtests.file.encoding=UTF-8
   [junit4] FAILURE 50.6s J0 | ZkStateReaderTest.testStateFormatUpdateWithTimeDelay <<<
   [junit4]    > Throwable #1: java.lang.AssertionError: expected:<2> but was:<1>
   [junit4]    > 	at __randomizedtesting.SeedInfo.seed([8B88B7C9DDC179A1:F416004CB4A3542B]:0)
   [junit4]    > 	at org.apache.solr.cloud.overseer.ZkStateReaderTest.testStateFormatUpdate(ZkStateReaderTest.java:137)
   [junit4]    > 	at org.apache.solr.cloud.overseer.ZkStateReaderTest.testStateFormatUpdateWithTimeDelay(ZkStateReaderTest.java:51)
   [junit4]    > 	at java.lang.Thread.run(Thread.java:745)
   [junit4]   2> 945457 INFO  (TEST-ZkStateReaderTest.testWatchedCollectionCreation-seed#[8B88B7C9DDC179A1]) [    ] o.a.s.SolrTestCaseJ4 ###Starting testWatchedCollectionCreation
   [junit4]   2> 945458 INFO  (TEST-ZkStateReaderTest.testWatchedCollectionCreation-seed#[8B88B7C9DDC179A1]) [    ] o.a.s.c.ZkTestServer STARTING ZK TEST SERVER
   [junit4]   2> 945458 INFO  (Thread-3142) [    ] o.a.s.c.ZkTestServer client port:0.0.0.0/0.0.0.0:0
   [junit4]   2> 945458 INFO  (Thread-3142) [    ] o.a.s.c.ZkTestServer Starting server
   [junit4]   2> 945558 INFO  (TEST-ZkStateReaderTest.testWatchedCollectionCreation-seed#[8B88B7C9DDC179A1]) [    ] o.a.s.c.ZkTestServer start zk server on port:35204
   [junit4]   2> 945558 INFO  (TEST-ZkStateReaderTest.testWatchedCollectionCreation-seed#[8B88B7C9DDC179A1]) [    ] o.a.s.c.c.SolrZkClient Using default ZkCredentialsProvider
   [junit4]   2> 945558 INFO  (TEST-ZkStateReaderTest.testWatchedCollectionCreation-seed#[8B88B7C9DDC179A1]) [    ] o.a.s.c.c.ConnectionManager Waiting for client to connect to ZooKeeper
   [junit4]   2> 945561 INFO  (zkCallback-841-thread-1) [    ] o.a.s.c.c.ConnectionManager Watcher org.apache.solr.common.cloud.ConnectionManager@1ab4d696 name:ZooKeeperConnection Watcher:127.0.0.1:35204 got event WatchedEvent state:SyncConnected type:None path:null path:null type:None
   [junit4]   2> 945561 INFO  (TEST-ZkStateReaderTest.testWatchedCollectionCreation-seed#[8B88B7C9DDC179A1]) [    ] o.a.s.c.c.ConnectionManager Client is connected to ZooKeeper
   [junit4]   2> 945562 INFO  (TEST-ZkStateReaderTest.testWatchedCollectionCreation-seed#[8B88B7C9DDC179A1]) [    ] o.a.s.c.c.SolrZkClient Using default ZkACLProvider
   [junit4]   2> 945564 INFO  (TEST-ZkStateReaderTest.testWatchedCollectionCreation-seed#[8B88B7C9DDC179A1]) [    ] o.a.s.c.c.SolrZkClient Using default ZkCredentialsProvider
   [junit4]   2> 945564 INFO  (TEST-ZkStateReaderTest.testWatchedCollectionCreation-seed#[8B88B7C9DDC179A1]) [    ] o.a.s.c.c.ConnectionManager Waiting for client to connect to ZooKeeper
   [junit4]   2> 945565 INFO  (zkCallback-842-thread-1) [    ] o.a.s.c.c.ConnectionManager Watcher org.apache.solr.common.cloud.ConnectionManager@d0c5227 name:ZooKeeperConnection Watcher:127.0.0.1:35204 got event WatchedEvent state:SyncConnected type:None path:null path:null type:None
   [junit4]   2> 945566 INFO  (TEST-ZkStateReaderTest.testWatchedCollectionCreation-seed#[8B88B7C9DDC179A1]) [    ] o.a.s.c.c.ConnectionManager Client is connected to ZooKeeper
   [junit4]   2> 945566 INFO  (TEST-ZkStateReaderTest.testWatchedCollectionCreation-seed#[8B88B7C9DDC179A1]) [    ] o.a.s.c.c.SolrZkClient Using default ZkACLProvider
   [junit4]   2> 945566 INFO  (TEST-ZkStateReaderTest.testWatchedCollectionCreation-seed#[8B88B7C9DDC179A1]) [    ] o.a.s.c.c.SolrZkClient makePath: /solr
   [junit4]   2> 945570 INFO  (TEST-ZkStateReaderTest.testWatchedCollectionCreation-seed#[8B88B7C9DDC179A1]) [    ] o.a.s.c.c.SolrZkClient Using default ZkCredentialsProvider
   [junit4]   2> 945570 INFO  (TEST-ZkStateReaderTest.testWatchedCollectionCreation-seed#[8B88B7C9DDC179A1]) [    ] o.a.s.c.c.ConnectionManager Waiting for client to connect to ZooKeeper
   [junit4]   2> 945572 INFO  (zkCallback-843-thread-1) [    ] o.a.s.c.c.ConnectionManager Watcher org.apache.solr.common.cloud.ConnectionManager@66b953d6 name:ZooKeeperConnection Watcher:127.0.0.1:35204/solr got event WatchedEvent state:SyncConnected type:None path:null path:null type:None
   [junit4]   2> 945572 INFO  (TEST-ZkStateReaderTest.testWatchedCollectionCreation-seed#[8B88B7C9DDC179A1]) [    ] o.a.s.c.c.ConnectionManager Client is connected to ZooKeeper
   [junit4]   2> 945572 INFO  (TEST-ZkStateReaderTest.testWatchedCollectionCreation-seed#[8B88B7C9DDC179A1]) [    ] o.a.s.c.c.SolrZkClient Using default ZkACLProvider
   [junit4]   2> 945574 INFO  (TEST-ZkStateReaderTest.testWatchedCollectionCreation-seed#[8B88B7C9DDC179A1]) [    ] o.a.s.c.c.SolrZkClient makePath: /live_nodes
   [junit4]   2> 945576 INFO  (TEST-ZkStateReaderTest.testWatchedCollectionCreation-seed#[8B88B7C9DDC179A1]) [    ] o.a.s.c.c.SolrZkClient makePath: /collections
   [junit4]   2> 945578 INFO  (TEST-ZkStateReaderTest.testWatchedCollectionCreation-seed#[8B88B7C9DDC179A1]) [    ] o.a.s.c.c.SolrZkClient makePath: /aliases.json
   [junit4]   2> 945580 INFO  (TEST-ZkStateReaderTest.testWatchedCollectionCreation-seed#[8B88B7C9DDC179A1]) [    ] o.a.s.c.c.SolrZkClient makePath: /clusterstate.json
   [junit4]   2> 945581 INFO  (TEST-ZkStateReaderTest.testWatchedCollectionCreation-seed#[8B88B7C9DDC179A1]) [    ] o.a.s.c.c.SolrZkClient makePath: /security.json
   [junit4]   2> 945583 INFO  (TEST-ZkStateReaderTest.testWatchedCollectionCreation-seed#[8B88B7C9DDC179A1]) [    ] o.a.s.c.c.ZkStateReader Updating cluster state from ZooKeeper... 
   [junit4]   2> 945584 INFO  (TEST-ZkStateReaderTest.testWatchedCollectionCreation-seed#[8B88B7C9DDC179A1]) [    ] o.a.s.c.c.ZkStateReader Loaded empty cluster properties
   [junit4]   2> 945585 INFO  (TEST-ZkStateReaderTest.testWatchedCollectionCreation-seed#[8B88B7C9DDC179A1]) [    ] o.a.s.c.c.ZkStateReader Updated live nodes from ZooKeeper... (0) -> (0)
   [junit4]   2> 945588 INFO  (TEST-ZkStateReaderTest.testWatchedCollectionCreation-seed#[8B88B7C9DDC179A1]) [    ] o.a.s.c.c.ZkStateReader Deleting data for [c1]
   [junit4]   2> 945588 INFO  (TEST-ZkStateReaderTest.testWatchedCollectionCreation-seed#[8B88B7C9DDC179A1]) [    ] o.a.s.c.c.SolrZkClient makePath: /collections/c1
   [junit4]   2> 945589 INFO  (zkCallback-843-thread-1) [    ] o.a.s.c.c.ZkStateReader A collections change: [WatchedEvent state:SyncConnected type:NodeChildrenChanged path:/collections], has occurred - updating...
   [junit4]   2> 945592 INFO  (TEST-ZkStateReaderTest.testWatchedCollectionCreation-seed#[8B88B7C9DDC179A1]) [    ] o.a.s.c.o.ZkStateWriter going to create_collection /collections/c1/state.json
   [junit4]   2> 945592 INFO  (zkCallback-843-thread-1) [    ] o.a.s.c.c.ZkStateReader A cluster state change: [WatchedEvent state:SyncConnected type:NodeCreated path:/collections/c1/state.json] for collection [c1] has occurred - updating... (live nodes size: [0])
   [junit4]   2> 945593 INFO  (zkCallback-843-thread-1) [    ] o.a.s.c.c.ZkStateReader Add data for [c1] ver [0]
   [junit4]   2> 945644 INFO  (TEST-ZkStateReaderTest.testWatchedCollectionCreation-seed#[8B88B7C9DDC179A1]) [    ] o.a.s.c.ZkTestServer connecting to 127.0.0.1:35204 35204
   [junit4]   2> 950703 INFO  (Thread-3142) [    ] o.a.s.c.ZkTestServer connecting to 127.0.0.1:35204 35204
   [junit4]   2> 950705 INFO  (TEST-ZkStateReaderTest.testWatchedCollectionCreation-seed#[8B88B7C9DDC179A1]) [    ] o.a.s.SolrTestCaseJ4 ###Ending testWatchedCollectionCreation
   [junit4]   2> 950706 INFO  (SUITE-ZkStateReaderTest-seed#[8B88B7C9DDC179A1]-worker) [    ] o.a.s.SolrTestCaseJ4 ###deleteCore
   [junit4]   2> NOTE: leaving temporary files on disk at: /export/home/jenkins/workspace/Lucene-Solr-master-Solaris/solr/build/solr-core/test/J0/temp/solr.cloud.overseer.ZkStateReaderTest_8B88B7C9DDC179A1-001
   [junit4]   2> NOTE: test params are: codec=CheapBastard, sim=ClassicSimilarity, locale=es-AR, timezone=Europe/Vatican
   [junit4]   2> NOTE: SunOS 5.11 amd64/Oracle Corporation 1.8.0_92 (64-bit)/cpus=3,threads=1,free=261488112,total=536870912
   [junit4]   2> NOTE: All tests run in this JVM: [PreAnalyzedFieldTest, TestHdfsUpdateLog, TestRandomCollapseQParserPlugin, TestReplicationHandler, TestRemoteStreaming, HdfsDirectoryTest, CursorPagingTest, SliceStateTest, TestCloudBackupRestore, SimpleCollectionCreateDeleteTest, TestEmbeddedSolrServerConstructors, TestRandomDVFaceting, TestXIncludeConfig, TestStandardQParsers, HdfsRecoverLeaseTest, TestJmxIntegration, TestSSLRandomization, ChangedSchemaMergeTest, CustomCollectionTest, SimplePostToolTest, TriLevelCompositeIdRoutingTest, CloudExitableDirectoryReaderTest, TestRawResponseWriter, TestDynamicFieldResource, TestConfigSetProperties, TestTolerantUpdateProcessorRandomCloud, AddSchemaFieldsUpdateProcessorFactoryTest, HdfsThreadLeakTest, TestWordDelimiterFilterFactory, HdfsBasicDistributedZk2Test, SystemInfoHandlerTest, TestTolerantSearch, TestSweetSpotSimilarityFactory, SOLR749Test, TestFastLRUCache, TestMergePolicyConfig, DistributedSpellCheckComponentTest, TestDownShardTolerantSearch, TestCSVLoader, TestStressVersions, CdcrUpdateLogTest, TestPseudoReturnFields, HdfsChaosMonkeyNothingIsSafeTest, ResponseHeaderTest, TestRuleBasedAuthorizationPlugin, AlternateDirectoryTest, TestSchemaResource, TestDocumentBuilder, OverseerStatusTest, HdfsCollectionsAPIDistributedZkTest, TestFieldResource, TestDocBasedVersionConstraints, StandardRequestHandlerTest, ClusterStateUpdateTest, TestDynamicLoading, TestElisionMultitermQuery, TestDFRSimilarityFactory, SpatialFilterTest, TestJmxMonitoredMap, ReplicationFactorTest, DistribCursorPagingTest, BasicAuthIntegrationTest, DocumentAnalysisRequestHandlerTest, DistributedQueryComponentCustomSortTest, TestSurroundQueryParser, BlockJoinFacetRandomTest, HttpPartitionTest, QueryEqualityTest, TestConfigOverlay, XmlUpdateRequestHandlerTest, SolrRequestParserTest, SolrTestCaseJ4Test, ZkStateReaderTest]
   [junit4] Completed [150/597 (1!)] on J0 in 71.76s, 6 tests, 1 failure, 1 error <<< FAILURES!

[...truncated 1014 lines...]
   [junit4] Suite: org.apache.solr.cloud.TestCollectionAPI
   [junit4]   2> Creating dataDir: /export/home/jenkins/workspace/Lucene-Solr-master-Solaris/solr/build/solr-core/test/J0/temp/solr.cloud.TestCollectionAPI_8B88B7C9DDC179A1-001/init-core-data-001
   [junit4]   2> 2736244 INFO  (SUITE-TestCollectionAPI-seed#[8B88B7C9DDC179A1]-worker) [    ] o.a.s.SolrTestCaseJ4 Randomized ssl (false) and clientAuth (false)
   [junit4]   2> 2736245 INFO  (SUITE-TestCollectionAPI-seed#[8B88B7C9DDC179A1]-worker) [    ] o.a.s.BaseDistributedSearchTestCase Setting hostContext system property: /
   [junit4]   2> 2736248 INFO  (TEST-TestCollectionAPI.test-seed#[8B88B7C9DDC179A1]) [    ] o.a.s.c.ZkTestServer STARTING ZK TEST SERVER
   [junit4]   2> 2736248 INFO  (Thread-6761) [    ] o.a.s.c.ZkTestServer client port:0.0.0.0/0.0.0.0:0
   [junit4]   2> 2736248 INFO  (Thread-6761) [    ] o.a.s.c.ZkTestServer Starting server
   [junit4]   2> 2736348 INFO  (TEST-TestCollectionAPI.test-seed#[8B88B7C9DDC179A1]) [    ] o.a.s.c.ZkTestServer start zk server on port:39233
   [junit4]   2> 2736350 INFO  (TEST-TestCollectionAPI.test-seed#[8B88B7C9DDC179A1]) [    ] o.a.s.c.c.SolrZkClient Using default ZkCredentialsProvider
   [junit4]   2> 2736351 INFO  (TEST-TestCollectionAPI.test-seed#[8B88B7C9DDC179A1]) [    ] o.a.s.c.c.ConnectionManager Waiting for client to connect to ZooKeeper
   [junit4]   2> 2736355 INFO  (zkCallback-2781-thread-1) [    ] o.a.s.c.c.ConnectionManager Watcher org.apache.solr.common.cloud.ConnectionManager@3f0576d5 name:ZooKeeperConnection Watcher:127.0.0.1:39233 got event WatchedEvent state:SyncConnected type:None path:null path:null type:None
   [junit4]   2> 2736356 INFO  (TEST-TestCollectionAPI.test-seed#[8B88B7C9DDC179A1]) [    ] o.a.s.c.c.ConnectionManager Client is connected to ZooKeeper
   [junit4]   2> 2736356 INFO  (TEST-TestCollectionAPI.test-seed#[8B88B7C9DDC179A1]) [    ] o.a.s.c.c.SolrZkClient Using default ZkACLProvider
   [junit4]   2> 2736356 INFO  (TEST-TestCollectionAPI.test-seed#[8B88B7C9DDC179A1]) [    ] o.a.s.c.c.SolrZkClient makePath: /solr
   [junit4]   2> 2736360 INFO  (TEST-TestCollectionAPI.test-seed#[8B88B7C9DDC179A1]) [    ] o.a.s.c.c.SolrZkClient Using default ZkCredentialsProvider
   [junit4]   2> 2736360 INFO  (TEST-TestCollectionAPI.test-seed#[8B88B7C9DDC179A1]) [    ] o.a.s.c.c.ConnectionManager Waiting for client to connect to ZooKeeper
   [junit4]   2> 2736384 INFO  (zkCallback-2782-thread-1) [    ] o.a.s.c.c.ConnectionManager Watcher org.apache.solr.common.cloud.ConnectionManager@3be2cc35 name:ZooKeeperConnection Watcher:127.0.0.1:39233/solr got event WatchedEvent state:SyncConnected type:None path:null path:null type:None
   [junit4]   2> 2736384 INFO  (TEST-TestCollectionAPI.test-seed#[8B88B7C9DDC179A1]) [    ] o.a.s.c.c.ConnectionManager Client is connected to ZooKeeper
   [junit4]   2> 2736385 INFO  (TEST-TestCollectionAPI.test-seed#[8B88B7C9DDC179A1]) [    ] o.a.s.c.c.SolrZkClient Using default ZkACLProvider
   [junit4]   2> 2736385 INFO  (TEST-TestCollectionAPI.test-seed#[8B88B7C9DDC179A1]) [    ] o.a.s.c.c.SolrZkClient makePath: /collections/collection1
   [junit4]   2> 2736389 INFO  (TEST-TestCollectionAPI.test-seed#[8B88B7C9DDC179A1]) [    ] o.a.s.c.c.SolrZkClient makePath: /collections/collection1/shards
   [junit4]   2> 2736391 INFO  (TEST-TestCollectionAPI.test-seed#[8B88B7C9DDC179A1]) [    ] o.a.s.c.c.SolrZkClient makePath: /collections/control_collection
   [junit4]   2> 2736394 INFO  (TEST-TestCollectionAPI.test-seed#[8B88B7C9DDC179A1]) [    ] o.a.s.c.c.SolrZkClient makePath: /collections/control_collection/shards
   [junit4]   2> 2736396 INFO  (TEST-TestCollectionAPI.test-seed#[8B88B7C9DDC179A1]) [    ] o.a.s.c.AbstractZkTestCase put /export/home/jenkins/workspace/Lucene-Solr-master-Solaris/solr/core/src/test-files/solr/collection1/conf/solrconfig-tlog.xml to /configs/conf1/solrconfig.xml
   [junit4]   2> 2736396 INFO  (TEST-TestCollectionAPI.test-seed#[8B88B7C9DDC179A1]) [    ] o.a.s.c.c.SolrZkClient makePath: /configs/conf1/solrconfig.xml
   [junit4]   2> 2736400 INFO  (TEST-TestCollectionAPI.test-seed#[8B88B7C9DDC179A1]) [    ] o.a.s.c.AbstractZkTestCase put /export/home/jenkins/workspace/Lucene-Solr-master-Solaris/solr/core/src/test-files/solr/collection1/conf/schema15.xml to /configs/conf1/schema.xml
   [junit4]   2> 2736400 INFO  (TEST-TestCollectionAPI.test-seed#[8B88B7C9DDC179A1]) [    ] o.a.s.c.c.SolrZkClient makePath: /configs/conf1/schema.xml
   [junit4]   2> 2736404 INFO  (TEST-TestCollectionAPI.test-seed#[8B88B7C9DDC179A1]) [    ] o.a.s.c.AbstractZkTestCase put /export/home/jenkins/workspace/Lucene-Solr-master-Solaris/solr/core/src/test-files/solr/collection1/conf/solrconfig.snippet.randomindexconfig.xml to /configs/conf1/solrconfig.snippet.randomindexconfig.xml
   [junit4]   2> 2736404 INFO  (TEST-TestCollectionAPI.test-seed#[8B88B7C9DDC179A1]) [    ] o.a.s.c.c.SolrZkClient makePath: /configs/conf1/solrconfig.snippet.randomindexconfig.xml
   [junit4]   2> 2736407 INFO  (TEST-TestCollectionAPI.test-seed#[8B88B7C9DDC179A1]) [    ] o.a.s.c.AbstractZkTestCase put /export/home/jenkins/workspace/Lucene-Solr-master-Solaris/solr/core/src/test-files/solr/collection1/conf/stopwords.txt to /configs/conf1/stopwords.txt
   [junit4]   2> 2736407 INFO  (TEST-TestCollectionAPI.test-seed#[8B88B7C9DDC179A1]) [    ] o.a.s.c.c.SolrZkClient makePath: /configs/conf1/stopwords.txt
   [junit4]   2> 2736412 INFO  (TEST-TestCollectionAPI.test-seed#[8B88B7C9DDC179A1]) [    ] o.a.s.c.AbstractZkTestCase put /export/home/jenkins/workspace/Lucene-Solr-master-Solaris/solr/core/src/test-files/solr/collection1/conf/protwords.txt to /configs/conf1/protwords.txt
   [junit4]   2> 2736412 INFO  (TEST-TestCollectionAPI.test-seed#[8B88B7C9DDC179A1]) [    ] o.a.s.c.c.SolrZkClient makePath: /configs/conf1/protwords.txt
   [junit4]   2> 2736415 INFO  (TEST-TestCollectionAPI.test-seed#[8B88B7C9DDC179A1]) [    ] o.a.s.c.AbstractZkTestCase put /export/home/jenkins/workspace/Lucene-Solr-master-Solaris/solr/core/src/test-files/solr/collection1/conf/currency.xml to /configs/conf1/currency.xml
   [junit4]   2> 2736415 INFO  (TEST-TestCollectionAPI.test-seed#[8B88B7C9DDC179A1]) [    ] o.a.s.c.c.SolrZkClient makePath: /configs/conf1/currency.xml
   [junit4]   2> 2736418 INFO  (TEST-TestCollectionAPI.test-seed#[8B88B7C9DDC179A1]) [    ] o.a.s.c.AbstractZkTestCase put /export/home/jenkins/workspace/Lucene-Solr-master-Solaris/solr/core/src/test-files/solr/collection1/conf/enumsConfig.xml to /configs/conf1/enumsConfig.xml
   [junit4]   2> 2736419 INFO  (TEST-TestCollectionAPI.test-seed#[8B88B7C9DDC179A1]) [    ] o.a.s.c.c.SolrZkClient makePath: /configs/conf1/enumsConfig.xml
   [junit4]   2> 2736422 INFO  (TEST-TestCollectionAPI.test-seed#[8B88B7C9DDC179A1]) [    ] o.a.s.c.AbstractZkTestCase put /export/home/jenkins/workspace/Lucene-Solr-master-Solaris/solr/core/src/test-files/solr/collection1/conf/open-exchange-rates.json to /configs/conf1/open-exchange-rates.json
   [junit4]   2> 2736423 INFO  (TEST-TestCollectionAPI.test-seed#[8B88B7C9DDC179A1]) [    ] o.a.s.c.c.SolrZkClient makePath: /configs/conf1/open-exchange-rates.json
   [junit4]   2> 2736425 INFO  (TEST-TestCollectionAPI.test-seed#[8B88B7C9DDC179A1]) [    ] o.a.s.c.AbstractZkTestCase put /export/home/jenkins/workspace/Lucene-Solr-master-Solaris/solr/core/src/test-files/solr/collection1/conf/mapping-ISOLatin1Accent.txt to /configs/conf1/mapping-ISOLatin1Accent.txt
   [junit4]   2> 2736426 INFO  (TEST-TestCollectionAPI.test-seed#[8B88B7C9DDC179A1]) [    ] o.a.s.c.c.SolrZkClient makePath: /configs/conf1/mapping-ISOLatin1Accent.txt
   [junit4]   2> 2736428 INFO  (TEST-TestCollectionAPI.test-seed#[8B88B7C9DDC179A1]) [    ] o.a.s.c.AbstractZkTestCase put /export/home/jenkins/workspace/Lucene-Solr-master-Solaris/solr/core/src/test-files/solr/collection1/conf/old_synonyms.txt to /configs/conf1/old_synonyms.txt
   [junit4]   2> 2736429 INFO  (TEST-TestCollectionAPI.test-seed#[8B88B7C9DDC179A1]) [    ] o.a.s.c.c.SolrZkClient makePath: /configs/conf1/old_synonyms.txt
   [junit4]   2> 2736432 INFO  (TEST-TestCollectionAPI.test-seed#[8B88B7C9DDC179A1]) [    ] o.a.s.c.AbstractZkTestCase put /export/home/jenkins/workspace/Lucene-Solr-master-Solaris/solr/core/src/test-files/solr/collection1/conf/synonyms.txt to /configs/conf1/synonyms.txt
   [junit4]   2> 2736432 INFO  (TEST-TestCollectionAPI.test-seed#[8B88B7C9DDC179A1]) [    ] o.a.s.c.c.SolrZkClient makePath: /configs/conf1/synonyms.txt
   [junit4]   2> 2736677 INFO  (TEST-TestCollectionAPI.test-seed#[8B88B7C9DDC179A1]) [    ] o.a.s.SolrTestCaseJ4 Writing core.properties file to /export/home/jenkins/workspace/Lucene-Solr-master-Solaris/solr/build/solr-core/test/J0/temp/solr.cloud.TestCollectionAPI_8B88B7C9DDC179A1-001/control-001/cores/collection1
   [junit4]   2> 2736679 INFO  (TEST-TestCollectionAPI.test-seed#[8B88B7C9DDC179A1]) [    ] o.e.j.s.Server jetty-9.3.8.v20160314
   [junit4]   2> 2736681 INFO  (TEST-TestCollectionAPI.test-seed#[8B88B7C9DDC179A1]) [    ] o.e.j.s.h.ContextHandler Started o.e.j.s.ServletContextHandler@681812f0{/,null,AVAILABLE}
   [junit4]   2> 2736681 INFO  (TEST-TestCollectionAPI.test-seed#[8B88B7C9DDC179A1]) [    ] o.e.j.s.ServerConnector Started ServerConnector@12cc4105{HTTP/1.1,[http/1.1]}{127.0.0.1:32769}
   [junit4]   2> 2736695 INFO  (TEST-TestCollectionAPI.test-seed#[8B88B7C9DDC179A1]) [    ] o.e.j.s.Server Started @2741724ms
   [junit4]   2> 2736695 INFO  (TEST-TestCollectionAPI.test-seed#[8B88B7C9DDC179A1]) [    ] o.a.s.c.s.e.JettySolrRunner Jetty properties: {solr.data.dir=/export/home/jenkins/workspace/Lucene-Solr-master-Solaris/solr/build/solr-core/test/J0/temp/solr.cloud.TestCollectionAPI_8B88B7C9DDC179A1-001/tempDir-001/control/data, hostContext=/, hostPort=32769, coreRootDirectory=/export/home/jenkins/workspace/Lucene-Solr-master-Solaris/solr/build/solr-core/test/J0/temp/solr.cloud.TestCollectionAPI_8B88B7C9DDC179A1-001/control-001/cores}
   [junit4]   2> 2736696 INFO  (TEST-TestCollectionAPI.test-seed#[8B88B7C9DDC179A1]) [    ] o.a.s.s.SolrDispatchFilter SolrDispatchFilter.init(): sun.misc.Launcher$AppClassLoader@6d06d69c
   [junit4]   2> 2736696 INFO  (TEST-TestCollectionAPI.test-seed#[8B88B7C9DDC179A1]) [    ] o.a.s.c.SolrResourceLoader new SolrResourceLoader for directory: '/export/home/jenkins/workspace/Lucene-Solr-master-Solaris/solr/build/solr-core/test/J0/temp/solr.cloud.TestCollectionAPI_8B88B7C9DDC179A1-001/control-001'
   [junit4]   2> 2736696 INFO  (TEST-TestCollectionAPI.test-seed#[8B88B7C9DDC179A1]) [    ] o.a.s.c.SolrResourceLoader JNDI not configured for solr (NoInitialContextEx)
   [junit4]   2> 2736696 INFO  (TEST-TestCollectionAPI.test-seed#[8B88B7C9DDC179A1]) [    ] o.a.s.c.SolrResourceLoader solr home defaulted to 'solr/' (could not find system property or JNDI)
   [junit4]   2> 2736696 INFO  (TEST-TestCollectionAPI.test-seed#[8B88B7C9DDC179A1]) [    ] o.a.s.c.c.SolrZkClient Using default ZkCredentialsProvider
   [junit4]   2> 2736697 INFO  (TEST-TestCollectionAPI.test-seed#[8B88B7C9DDC179A1]) [    ] o.a.s.c.c.ConnectionManager Waiting for client to connect to ZooKeeper
   [junit4]   2> 2736701 INFO  (zkCallback-2783-thread-1) [    ] o.a.s.c.c.ConnectionManager Watcher org.apache.solr.common.cloud.ConnectionManager@5023383f name:ZooKeeperConnection Watcher:127.0.0.1:39233/solr got event WatchedEvent state:SyncConnected type:None path:null path:null type:None
   [junit4]   2> 2736703 INFO  (TEST-TestCollectionAPI.test-seed#[8B88B7C9DDC179A1]) [    ] o.a.s.c.c.ConnectionManager Client is connected to ZooKeeper
   [junit4]   2> 2736703 INFO  (TEST-TestCollectionAPI.test-seed#[8B88B7C9DDC179A1]) [    ] o.a.s.c.c.SolrZkClient Using default ZkACLProvider
   [junit4]   2> 2736705 INFO  (TEST-TestCollectionAPI.test-seed#[8B88B7C9DDC179A1]) [    ] o.a.s.s.SolrDispatchFilter Loading solr.xml from SolrHome (not found in ZooKeeper)
   [junit4]   2> 2736705 INFO  (TEST-TestCollectionAPI.test-seed#[8B88B7C9DDC179A1]) [    ] o.a.s.c.SolrXmlConfig Loading container configuration from /export/home/jenkins/workspace/Lucene-Solr-master-Solaris/solr/build/solr-core/test/J0/temp/solr.cloud.TestCollectionAPI_8B88B7C9DDC179A1-001/control-001/solr.xml
   [junit4]   2> 2736712 INFO  (TEST-TestCollectionAPI.test-seed#[8B88B7C9DDC179A1]) [    ] o.a.s.c.CorePropertiesLocator Config-defined core root directory: /export/home/jenkins/workspace/Lucene-Solr-master-Solaris/solr/build/solr-core/test/J0/temp/solr.cloud.TestCollectionAPI_8B88B7C9DDC179A1-001/control-001/cores
   [junit4]   2> 2736712 INFO  (TEST-TestCollectionAPI.test-seed#[8B88B7C9DDC179A1]) [    ] o.a.s.c.CoreContainer New CoreContainer 520797015
   [junit4]   2> 2736712 INFO  (TEST-TestCollectionAPI.test-seed#[8B88B7C9DDC179A1]) [    ] o.a.s.c.CoreContainer Loading cores into CoreContainer [instanceDir=/export/home/jenkins/workspace/Lucene-Solr-master-Solaris/solr/build/solr-core/test/J0/temp/solr.cloud.TestCollectionAPI_8B88B7C9DDC179A1-001/control-001]
   [junit4]   2> 2736712 WARN  (TEST-TestCollectionAPI.test-seed#[8B88B7C9DDC179A1]) [    ] o.a.s.c.CoreContainer Couldn't add files from /export/home/jenkins/workspace/Lucene-Solr-master-Solaris/solr/build/solr-core/test/J0/temp/solr.cloud.TestCollectionAPI_8B88B7C9DDC179A1-001/control-001/lib to classpath: /export/home/jenkins/workspace/Lucene-Solr-master-Solaris/solr/build/solr-core/test/J0/temp/solr.cloud.TestCollectionAPI_8B88B7C9DDC179A1-001/control-001/lib
   [junit4]   2> 2736712 INFO  (TEST-TestCollectionAPI.test-seed#[8B88B7C9DDC179A1]) [    ] o.a.s.h.c.HttpShardHandlerFactory created with socketTimeout : 90000,urlScheme : ,connTimeout : 15000,maxConnectionsPerHost : 20,maxConnections : 10000,corePoolSize : 0,maximumPoolSize : 2147483647,maxThreadIdleTime : 5,sizeOfQueue : -1,fairnessPolicy : false,
   [junit4]   2> 2736719 INFO  (TEST-TestCollectionAPI.test-seed#[8B88B7C9DDC179A1]) [    ] o.a.s.u.UpdateShardHandler Creating UpdateShardHandler HTTP client with params: 
   [junit4]   2> 2736721 INFO  (TEST-TestCollectionAPI.test-seed#[8B88B7C9DDC179A1]) [    ] o.a.s.l.LogWatcher SLF4J impl is org.slf4j.impl.Log4jLoggerFactory
   [junit4]   2> 2736721 INFO  (TEST-TestCollectionAPI.test-seed#[8B88B7C9DDC179A1]) [    ] o.a.s.l.LogWatcher Registering Log Listener [Log4j (org.slf4j.impl.Log4jLoggerFactory)]
   [junit4]   2> 2736721 INFO  (TEST-TestCollectionAPI.test-seed#[8B88B7C9DDC179A1]) [    ] o.a.s.c.ZkContainer Zookeeper client=127.0.0.1:39233/solr
   [junit4]   2> 2736721 INFO  (TEST-TestCollectionAPI.test-seed#[8B88B7C9DDC179A1]) [    ] o.a.s.c.ZkController zkHost includes chroot
   [junit4]   2> 2736722 INFO  (TEST-TestCollectionAPI.test-seed#[8B88B7C9DDC179A1]) [    ] o.a.s.c.c.SolrZkClient Using default ZkCredentialsProvider
   [junit4]   2> 2736723 INFO  (TEST-TestCollectionAPI.test-seed#[8B88B7C9DDC179A1]) [    ] o.a.s.c.c.ConnectionManager Waiting for client to connect to ZooKeeper
   [junit4]   2> 2736726 INFO  (zkCallback-2786-thread-1) [    ] o.a.s.c.c.ConnectionManager Watcher org.apache.solr.common.cloud.ConnectionManager@523a8334 name:ZooKeeperConnection Watcher:127.0.0.1:39233 got event WatchedEvent state:SyncConnected type:None path:null path:null type:None
   [junit4]   2> 2736726 INFO  (TEST-TestCollectionAPI.test-seed#[8B88B7C9DDC179A1]) [    ] o.a.s.c.c.ConnectionManager Client is connected to ZooKeeper
   [junit4]   2> 2736727 INFO  (TEST-TestCollectionAPI.test-seed#[8B88B7C9DDC179A1]) [    ] o.a.s.c.c.SolrZkClient Using default ZkACLProvider
   [junit4]   2> 2736729 INFO  (TEST-TestCollectionAPI.test-seed#[8B88B7C9DDC179A1]) [n:127.0.0.1:32769_    ] o.a.s.c.ZkController Added new OnReconnect listener org.apache.solr.cloud.ZkController$$Lambda$65/1616633936@46c67a5a
   [junit4]   2> 2736730 INFO  (TEST-TestCollectionAPI.test-seed#[8B88B7C9DDC179A1]) [n:127.0.0.1:32769_    ] o.a.s.c.c.ConnectionManager Waiting for client to connect to ZooKeeper
   [junit4]   2> 2736733 INFO  (zkCallback-2787-thread-1-processing-n:127.0.0.1:32769_) [n:127.0.0.1:32769_    ] o.a.s.c.c.ConnectionManager Watcher org.apache.solr.common.cloud.ConnectionManager@13e8c472 name:ZooKeeperConnection Watcher:127.0.0.1:39233/solr got event WatchedEvent state:SyncConnected type:None path:null path:null type:None
   [junit4]   2> 2736733 INFO  (TEST-TestCollectionAPI.test-seed#[8B88B7C9DDC179A1]) [n:127.0.0.1:32769_    ] o.a.s.c.c.ConnectionManager Client is connected to ZooKeeper
   [junit4]   2> 2736736 INFO  (TEST-TestCollectionAPI.test-seed#[8B88B7C9DDC179A1]) [n:127.0.0.1:32769_    ] o.a.s.c.c.SolrZkClient makePath: /overseer/queue
   [junit4]   2> 2736740 INFO  (TEST-TestCollectionAPI.test-seed#[8B88B7C9DDC179A1]) [n:127.0.0.1:32769_    ] o.a.s.c.c.SolrZkClient makePath: /overseer/collection-queue-work
   [junit4]   2> 2736747 INFO  (TEST-TestCollectionAPI.test-seed#[8B88B7C9DDC179A1]) [n:127.0.0.1:32769_    ] o.a.s.c.c.SolrZkClient makePath: /overseer/collection-map-running
   [junit4]   2> 2736752 INFO  (TEST-TestCollectionAPI.test-seed#[8B88B7C9DDC179A1]) [n:127.0.0.1:32769_    ] o.a.s.c.c.SolrZkClient makePath: /overseer/collection-map-completed
   [junit4]   2> 2736756 INFO  (TEST-TestCollectionAPI.test-seed#[8B88B7C9DDC179A1]) [n:127.0.0.1:32769_    ] o.a.s.c.c.SolrZkClient makePath: /overseer/collection-map-failure
   [junit4]   2> 2736760 INFO  (TEST-TestCollectionAPI.test-seed#[8B88B7C9DDC179A1]) [n:127.0.0.1:32769_    ] o.a.s.c.c.SolrZkClient makePath: /live_nodes
   [junit4]   2> 2736763 INFO  (TEST-TestCollectionAPI.test-seed#[8B88B7C9DDC179A1]) [n:127.0.0.1:32769_    ] o.a.s.c.c.SolrZkClient makePath: /aliases.json
   [junit4]   2> 2736766 INFO  (TEST-TestCollectionAPI.test-seed#[8B88B7C9DDC179A1]) [n:127.0.0.1:32769_    ] o.a.s.c.c.SolrZkClient makePath: /clusterstate.json
   [junit4]   2> 2736769 INFO  (TEST-TestCollectionAPI.test-seed#[8B88B7C9DDC179A1]) [n:127.0.0.1:32769_    ] o.a.s.c.c.SolrZkClient makePath: /security.json
   [junit4]   2> 2736772 INFO  (TEST-TestCollectionAPI.test-seed#[8B88B7C9DDC179A1]) [n:127.0.0.1:32769_    ] o.a.s.c.c.ZkStateReader Updating cluster state from ZooKeeper... 
   [junit4]   2> 2736773 INFO  (TEST-TestCollectionAPI.test-seed#[8B88B7C9DDC179A1]) [n:127.0.0.1:32769_    ] o.a.s.c.c.ZkStateReader Loaded empty cluster properties
   [junit4]   2> 2736775 INFO  (TEST-TestCollectionAPI.test-seed#[8B88B7C9DDC179A1]) [n:127.0.0.1:32769_    ] o.a.s.c.c.ZkStateReader Updated live nodes from ZooKeeper... (0) -> (0)
   [junit4]   2> 2736781 INFO  (TEST-TestCollectionAPI.test-seed#[8B88B7C9DDC179A1]) [n:127.0.0.1:32769_    ] o.a.s.c.c.SolrZkClient makePath: /overseer_elect
   [junit4]   2> 2736785 INFO  (TEST-TestCollectionAPI.test-seed#[8B88B7C9DDC179A1]) [n:127.0.0.1:32769_    ] o.a.s.c.c.SolrZkClient makePath: /overseer_elect/election
   [junit4]   2> 2736790 INFO  (TEST-TestCollectionAPI.test-seed#[8B88B7C9DDC179A1]) [n:127.0.0.1:32769_    ] o.a.s.c.Overseer Overseer (id=null) closing
   [junit4]   2> 2736792 INFO  (TEST-TestCollectionAPI.test-seed#[8B88B7C9DDC179A1]) [n:127.0.0.1:32769_    ] o.a.s.c.LeaderElector Joined leadership election with path: /overseer_elect/election/95895388862611460-127.0.0.1:32769_-n_0000000000
   [junit4]   2> 2736794 INFO  (TEST-TestCollectionAPI.test-seed#[8B88B7C9DDC179A1]) [n:127.0.0.1:32769_    ] o.a.s.c.OverseerElectionContext I am going to be the leader 127.0.0.1:32769_
   [junit4]   2> 2736795 INFO  (TEST-TestCollectionAPI.test-seed#[8B88B7C9DDC179A1]) [n:127.0.0.1:32769_    ] o.a.s.c.c.SolrZkClient makePath: /overseer_elect/leader
   [junit4]   2> 2736800 INFO  (TEST-TestCollectionAPI.test-seed#[8B88B7C9DDC179A1]) [n:127.0.0.1:32769_    ] o.a.s.c.Overseer Overseer (id=95895388862611460-127.0.0.1:32769_-n_0000000000) starting
   [junit4]   2> 2736804 INFO  (TEST-TestCollectionAPI.test-seed#[8B88B7C9DDC179A1]) [n:127.0.0.1:32769_    ] o.a.s.c.c.SolrZkClient makePath: /overseer/queue-work
   [junit4]   2> 2736818 INFO  (TEST-TestCollectionAPI.test-seed#[8B88B7C9DDC179A1]) [n:127.0.0.1:32769_    ] o.a.s.c.OverseerAutoReplicaFailoverThread Starting OverseerAutoReplicaFailoverThread autoReplicaFailoverWorkLoopDelay=10000 autoReplicaFailoverWaitAfterExpiration=30000 autoReplicaFailoverBadNodeExpiration=60000
   [junit4]   2> 2736820 INFO  (OverseerStateUpdate-95895388862611460-127.0.0.1:32769_-n_0000000000) [n:127.0.0.1:32769_    ] o.a.s.c.Overseer Starting to work on the main queue
   [junit4]   2> 2736821 INFO  (OverseerCollectionConfigSetProcessor-95895388862611460-127.0.0.1:32769_-n_0000000000) [n:127.0.0.1:32769_    ] o.a.s.c.OverseerTaskProcessor Process current queue of overseer operations
   [junit4]   2> 2736824 INFO  (TEST-TestCollectionAPI.test-seed#[8B88B7C9DDC179A1]) [n:127.0.0.1:32769_    ] o.a.s.c.ZkController Register node as live in ZooKeeper:/live_nodes/127.0.0.1:32769_
   [junit4]   2> 2736828 INFO  (TEST-TestCollectionAPI.test-seed#[8B88B7C9DDC179A1]) [n:127.0.0.1:32769_    ] o.a.s.c.c.SolrZkClient makePath: /live_nodes/127.0.0.1:32769_
   [junit4]   2> 2736833 INFO  (zkCallback-2787-thread-1-processing-n:127.0.0.1:32769_) [n:127.0.0.1:32769_    ] o.a.s.c.c.ZkStateReader A live node change: [WatchedEvent state:SyncConnected type:NodeChildrenChanged path:/live_nodes], has occurred - updating... (live nodes size: [0])
   [junit4]   2> 2736839 INFO  (OverseerStateUpdate-95895388862611460-127.0.0.1:32769_-n_0000000000) [n:127.0.0.1:32769_    ] o.a.s.c.c.ZkStateReader Updated live nodes from ZooKeeper... (0) -> (1)
   [junit4]   2> 2736893 INFO  (zkCallback-2787-thread-1-processing-n:127.0.0.1:32769_) [n:127.0.0.1:32769_    ] o.a.s.c.c.ZkStateReader Updated live nodes from ZooKeeper... (1) -> (1)
   [junit4]   2> 2736938 INFO  (TEST-TestCollectionAPI.test-seed#[8B88B7C9DDC179A1]) [n:127.0.0.1:32769_    ] o.a.s.c.CoreContainer Security conf doesn't exist. Skipping setup for authorization module.
   [junit4]   2> 2736938 INFO  (TEST-TestCollectionAPI.test-seed#[8B88B7C9DDC179A1]) [n:127.0.0.1:32769_    ] o.a.s.c.CoreContainer No authentication plugin used.
   [junit4]   2> 2736939 INFO  (TEST-TestCollectionAPI.test-seed#[8B88B7C9DDC179A1]) [n:127.0.0.1:32769_    ] o.a.s.c.CorePropertiesLocator Looking for core definitions underneath /export/home/jenkins/workspace/Lucene-Solr-master-Solaris/solr/build/solr-core/test/J0/temp/solr.cloud.TestCollectionAPI_8B88B7C9DDC179A1-001/control-001/cores
   [junit4]   2> 2736940 INFO  (TEST-TestCollectionAPI.test-seed#[8B88B7C9DDC179A1]) [n:127.0.0.1:32769_    ] o.a.s.c.CoreDescriptor Created CoreDescriptor: {name=collection1, config=solrconfig.xml, transient=false, schema=schema.xml, loadOnStartup=true, configSetProperties=configsetprops.json, collection=control_collection, coreNodeName=, dataDir=data/, shard=}
   [junit4]   2> 2736941 INFO  (TEST-TestCollectionAPI.test-seed#[8B88B7C9DDC179A1]) [n:127.0.0.1:32769_    ] o.a.s.c.CorePropertiesLocator Found core collection1 in /export/home/jenkins/workspace/Lucene-Solr-master-Solaris/solr/build/solr-core/test/J0/temp/solr.cloud.TestCollectionAPI_8B88B7C9DDC179A1-001/control-001/cores/collection1
   [junit4]   2> 2736941 INFO  (TEST-TestCollectionAPI.test-seed#[8B88B7C9DDC179A1]) [n:127.0.0.1:32769_    ] o.a.s.c.CorePropertiesLocator Found 1 core definitions
   [junit4]   2> 2736943 INFO  (TEST-TestCollectionAPI.test-seed#[8B88B7C9DDC179A1]) [n:127.0.0.1:32769_    ] o.a.s.s.SolrDispatchFilter user.dir=/export/home/jenkins/workspace/Lucene-Solr-master-Solaris/solr/build/solr-core/test/J0
   [junit4]   2> 2736943 INFO  (TEST-TestCollectionAPI.test-seed#[8B88B7C9DDC179A1]) [n:127.0.0.1:32769_    ] o.a.s.s.SolrDispatchFilter SolrDispatchFilter.init() done
   [junit4]   2> 2736944 INFO  (coreLoadExecutor-7805-thread-1-processing-n:127.0.0.1:32769_) [n:127.0.0.1:32769_ c:control_collection   x:collection1] o.a.s.c.ZkController publishing state=down
   [junit4]   2> 2736944 INFO  (coreLoadExecutor-7805-thread-1-processing-n:127.0.0.1:32769_) [n:127.0.0.1:32769_ c:control_collection   x:collection1] o.a.s.c.ZkController numShards not found on descriptor - reading it from system property
   [junit4]   2> 2736946 INFO  (coreLoadExecutor-7805-thread-1-processing-n:127.0.0.1:32769_) [n:127.0.0.1:32769_ c:control_collection   x:collection1] o.a.s.c.ZkController Collection control_collection not visible yet, but flagging it so a watch is registered when it becomes visible
   [junit4]   2> 2736947 INFO  (OverseerStateUpdate-95895388862611460-127.0.0.1:32769_-n_0000000000) [n:127.0.0.1:32769_    ] o.a.s.c.Overseer processMessage: queueSize: 1, message = {
   [junit4]   2>   "core":"collection1",
   [junit4]   2>   "roles":null,
   [junit4]   2>   "base_url":"http://127.0.0.1:32769",
   [junit4]   2>   "node_name":"127.0.0.1:32769_",
   [junit4]   2>   "numShards":"1",
   [junit4]   2>   "state":"down",
   [junit4]   2>   "shard":null,
   [junit4]   2>   "collection":"control_collection",
   [junit4]   2>   "operation":"state"} current state version: 0
   [junit4]   2> 2736948 INFO  (OverseerStateUpdate-95895388862611460-127.0.0.1:32769_-n_0000000000) [n:127.0.0.1:32769_    ] o.a.s.c.o.ReplicaMutator Update state numShards=1 message={
   [junit4]   2>   "core":"collection1",
   [junit4]   2>   "roles":null,
   [junit4]   2>   "base_url":"http://127.0.0.1:32769",
   [junit4]   2>   "node_name":"127.0.0.1:32769_",
   [junit4]   2>   "numShards":"1",
   [junit4]   2>   "state":"down",
   [junit4]   2>   "shard":null,
   [junit4]   2>   "collection":"control_collection",
   [junit4]   2>   "operation":"state"}
   [junit4]   2> 2736949 INFO  (coreLoadExecutor-7805-thread-1-processing-n:127.0.0.1:32769_) [n:127.0.0.1:32769_ c:control_collection   x:collection1] o.a.s.c.c.ZkStateReader Deleting data for [control_collection]
   [junit4]   2> 2736949 INFO  (OverseerStateUpdate-95895388862611460-127.0.0.1:32769_-n_0000000000) [n:127.0.0.1:32769_    ] o.a.s.c.o.ClusterStateMutator building a new cName: control_collection
   [junit4]   2> 2736952 INFO  (OverseerStateUpdate-95895388862611460-127.0.0.1:32769_-n_0000000000) [n:127.0.0.1:32769_    ] o.a.s.c.o.ReplicaMutator Assigning new node to shard shard=shard1
   [junit4]   2> 2736954 INFO  (coreLoadExecutor-7805-thread-1-processing-n:127.0.0.1:32769_) [n:127.0.0.1:32769_ c:control_collection   x:collection1] o.a.s.c.ZkController look for our core node name
   [junit4]

[...truncated too long message...]

4]   2> 
   [junit4]   2> NOTE: reproduce with: ant test  -Dtestcase=TestCollectionAPI -Dtests.method=test -Dtests.seed=8B88B7C9DDC179A1 -Dtests.slow=true -Dtests.locale=es-PR -Dtests.timezone=America/Knox_IN -Dtests.asserts=true -Dtests.file.encoding=UTF-8
   [junit4] ERROR    134s J0 | TestCollectionAPI.test <<<
   [junit4]    > Throwable #1: org.apache.solr.client.solrj.SolrServerException: No live SolrServers available to handle this request:[http://127.0.0.1:32769, http://127.0.0.1:51173, http://127.0.0.1:49724]
   [junit4]    > 	at __randomizedtesting.SeedInfo.seed([8B88B7C9DDC179A1:3DC8813733D1459]:0)
   [junit4]    > 	at org.apache.solr.client.solrj.impl.LBHttpSolrClient.request(LBHttpSolrClient.java:393)
   [junit4]    > 	at org.apache.solr.client.solrj.impl.CloudSolrClient.sendRequest(CloudSolrClient.java:1228)
   [junit4]    > 	at org.apache.solr.client.solrj.impl.CloudSolrClient.requestWithRetryOnStaleState(CloudSolrClient.java:998)
   [junit4]    > 	at org.apache.solr.client.solrj.impl.CloudSolrClient.request(CloudSolrClient.java:934)
   [junit4]    > 	at org.apache.solr.client.solrj.SolrRequest.process(SolrRequest.java:149)
   [junit4]    > 	at org.apache.solr.client.solrj.SolrRequest.process(SolrRequest.java:166)
   [junit4]    > 	at org.apache.solr.cloud.TestCollectionAPI.testClusterStateMigration(TestCollectionAPI.java:645)
   [junit4]    > 	at org.apache.solr.cloud.TestCollectionAPI.test(TestCollectionAPI.java:83)
   [junit4]    > 	at org.apache.solr.BaseDistributedSearchTestCase$ShardsRepeatRule$ShardsFixedStatement.callStatement(BaseDistributedSearchTestCase.java:985)
   [junit4]    > 	at org.apache.solr.BaseDistributedSearchTestCase$ShardsRepeatRule$ShardsStatement.evaluate(BaseDistributedSearchTestCase.java:960)
   [junit4]    > 	at java.lang.Thread.run(Thread.java:745)
   [junit4]    > Caused by: org.apache.solr.client.solrj.impl.HttpSolrClient$RemoteSolrException: Error from server at http://127.0.0.1:49724: Could not migrate state format for collection: testClusterStateMigration
   [junit4]    > 	at org.apache.solr.client.solrj.impl.HttpSolrClient.executeMethod(HttpSolrClient.java:606)
   [junit4]    > 	at org.apache.solr.client.solrj.impl.HttpSolrClient.request(HttpSolrClient.java:259)
   [junit4]    > 	at org.apache.solr.client.solrj.impl.HttpSolrClient.request(HttpSolrClient.java:248)
   [junit4]    > 	at org.apache.solr.client.solrj.impl.LBHttpSolrClient.doRequest(LBHttpSolrClient.java:413)
   [junit4]    > 	at org.apache.solr.client.solrj.impl.LBHttpSolrClient.request(LBHttpSolrClient.java:366)
   [junit4]    > 	... 48 more
   [junit4]   2> 2870313 INFO  (SUITE-TestCollectionAPI-seed#[8B88B7C9DDC179A1]-worker) [    ] o.a.s.SolrTestCaseJ4 ###deleteCore
   [junit4]   2> NOTE: leaving temporary files on disk at: /export/home/jenkins/workspace/Lucene-Solr-master-Solaris/solr/build/solr-core/test/J0/temp/solr.cloud.TestCollectionAPI_8B88B7C9DDC179A1-001
   [junit4]   2> May 14, 2016 5:40:44 PM com.carrotsearch.randomizedtesting.ThreadLeakControl checkThreadLeaks
   [junit4]   2> WARNING: Will linger awaiting termination of 1 leaked thread(s).
   [junit4]   2> NOTE: test params are: codec=Lucene62, sim=ClassicSimilarity, locale=es-PR, timezone=America/Knox_IN
   [junit4]   2> NOTE: SunOS 5.11 amd64/Oracle Corporation 1.8.0_92 (64-bit)/cpus=3,threads=1,free=178770128,total=536870912
   [junit4]   2> NOTE: All tests run in this JVM: [PreAnalyzedFieldTest, TestHdfsUpdateLog, TestRandomCollapseQParserPlugin, TestReplicationHandler, TestRemoteStreaming, HdfsDirectoryTest, CursorPagingTest, SliceStateTest, TestCloudBackupRestore, SimpleCollectionCreateDeleteTest, TestEmbeddedSolrServerConstructors, TestRandomDVFaceting, TestXIncludeConfig, TestStandardQParsers, HdfsRecoverLeaseTest, TestJmxIntegration, TestSSLRandomization, ChangedSchemaMergeTest, CustomCollectionTest, SimplePostToolTest, TriLevelCompositeIdRoutingTest, CloudExitableDirectoryReaderTest, TestRawResponseWriter, TestDynamicFieldResource, TestConfigSetProperties, TestTolerantUpdateProcessorRandomCloud, AddSchemaFieldsUpdateProcessorFactoryTest, HdfsThreadLeakTest, TestWordDelimiterFilterFactory, HdfsBasicDistributedZk2Test, SystemInfoHandlerTest, TestTolerantSearch, TestSweetSpotSimilarityFactory, SOLR749Test, TestFastLRUCache, TestMergePolicyConfig, DistributedSpellCheckComponentTest, TestDownShardTolerantSearch, TestCSVLoader, TestStressVersions, CdcrUpdateLogTest, TestPseudoReturnFields, HdfsChaosMonkeyNothingIsSafeTest, ResponseHeaderTest, TestRuleBasedAuthorizationPlugin, AlternateDirectoryTest, TestSchemaResource, TestDocumentBuilder, OverseerStatusTest, HdfsCollectionsAPIDistributedZkTest, TestFieldResource, TestDocBasedVersionConstraints, StandardRequestHandlerTest, ClusterStateUpdateTest, TestDynamicLoading, TestElisionMultitermQuery, TestDFRSimilarityFactory, SpatialFilterTest, TestJmxMonitoredMap, ReplicationFactorTest, DistribCursorPagingTest, BasicAuthIntegrationTest, DocumentAnalysisRequestHandlerTest, DistributedQueryComponentCustomSortTest, TestSurroundQueryParser, BlockJoinFacetRandomTest, HttpPartitionTest, QueryEqualityTest, TestConfigOverlay, XmlUpdateRequestHandlerTest, SolrRequestParserTest, SolrTestCaseJ4Test, ZkStateReaderTest, TestFieldSortValues, HLLUtilTest, ClassificationUpdateProcessorFactoryTest, TestConfigReload, DirectoryFactoryTest, BJQParserTest, PeerSyncTest, TestFieldTypeResource, RequestLoggingTest, TermsComponentTest, AssignTest, TestDistributedSearch, SolrIndexConfigTest, TestSolrConfigHandlerConcurrent, TestOrdValues, TestSolrDeletionPolicy1, TestSolr4Spatial2, TestExactStatsCache, TestExpandComponent, TestInfoStreamLogging, SortSpecParsingTest, AsyncMigrateRouteKeyTest, UUIDFieldTest, CdcrRequestHandlerTest, DocValuesMissingTest, TestAnalyzedSuggestions, ParsingFieldUpdateProcessorsTest, TestRestManager, TestGroupingSearch, TestManagedResource, TestMacros, SampleTest, TestInitQParser, RegexBoostProcessorTest, TestCloudManagedSchema, HdfsRestartWhileUpdatingTest, TestUpdate, GraphQueryTest, FastVectorHighlighterTest, FullHLLTest, MigrateRouteKeyTest, HighlighterMaxOffsetTest, QueryElevationComponentTest, UpdateParamsTest, ClusterStateTest, CollectionStateFormat2Test, DocExpirationUpdateProcessorFactoryTest, TestPostingsSolrHighlighter, DistributedExpandComponentTest, JSONWriterTest, TestChildDocTransformer, TestLFUCache, TestUseDocValuesAsStored2, HdfsDirectoryFactoryTest, TestExtendedDismaxParser, HighlighterTest, BasicDistributedZkTest, TestAnalyzeInfixSuggestions, CloudMLTQParserTest, TestComponentsName, ShardRoutingTest, BlockDirectoryTest, CdcrReplicationDistributedZkTest, TestPartialUpdateDeduplication, TestArbitraryIndexDir, TestConfigSetsAPIExclusivity, BitVectorTest, DistributedQueryElevationComponentTest, ActionThrottleTest, ExternalFileFieldSortTest, TestAuthorizationFramework, UnloadDistributedZkTest, CollectionsAPIDistributedZkTest, SyncSliceTest, OverseerTest, RecoveryZkTest, FullSolrCloudDistribCmdsTest, ZkCLITest, TestHashPartitioner, TestStressReorder, DistributedTermsComponentTest, SolrCoreTest, TestSort, BasicFunctionalityTest, DirectUpdateHandlerTest, TestBadConfig, CurrencyFieldXmlFileTest, TestCoreDiscovery, AnalysisAfterCoreReloadTest, SuggesterFSTTest, DocValuesTest, DefaultValueUpdateProcessorTest, SortByFunctionTest, DocValuesMultiTest, SolrInfoMBeanTest, XsltUpdateRequestHandlerTest, CacheHeaderTest, DisMaxRequestHandlerTest, DirectSolrSpellCheckerTest, RequestHandlersTest, PathHierarchyTokenizerFactoryTest, TestIndexingPerformance, RequiredFieldsTest, IndexSchemaRuntimeFieldTest, TestCollationField, ReturnFieldsTest, MBeansHandlerTest, TestPHPSerializedResponseWriter, PingRequestHandlerTest, TestQuerySenderNoQuery, BadComponentTest, TestSearchPerf, TestConfig, TestSolrCoreProperties, NotRequiredUniqueKeyTest, SpellPossibilityIteratorTest, TestCodecSupport, TestLMJelinekMercerSimilarityFactory, TestBM25SimilarityFactory, TimeZoneUtilsTest, TestFastOutputStream, OpenExchangeRatesOrgProviderTest, PluginInfoTest, DateMathParserTest, ChaosMonkeyNothingIsSafeTest, AsyncCallRequestStatusResponseTest, BaseCdcrDistributedZkTest, CleanupOldIndexTest, CollectionTooManyReplicasTest, DeleteLastCustomShardedReplicaTest, DeleteStatusTest, DistribDocExpirationUpdateProcessorTest, DistributedQueueTest, LeaderInitiatedRecoveryOnCommitTest, LeaderInitiatedRecoveryOnShardRestartTest, OutOfBoxZkACLAndCredentialsProvidersTest, RecoveryAfterSoftCommitTest, SharedFSAutoReplicaFailoverTest, SharedFSAutoReplicaFailoverUtilsTest, SolrCloudExampleTest, TestCloudInspectUtil, TestCollectionAPI]
   [junit4] Completed [466/597 (2!)] on J0 in 134.35s, 1 test, 1 error <<< FAILURES!

[...truncated 415 lines...]
BUILD FAILED
/export/home/jenkins/workspace/Lucene-Solr-master-Solaris/build.xml:740: The following error occurred while executing this line:
/export/home/jenkins/workspace/Lucene-Solr-master-Solaris/build.xml:684: The following error occurred while executing this line:
/export/home/jenkins/workspace/Lucene-Solr-master-Solaris/build.xml:59: The following error occurred while executing this line:
/export/home/jenkins/workspace/Lucene-Solr-master-Solaris/solr/build.xml:233: The following error occurred while executing this line:
/export/home/jenkins/workspace/Lucene-Solr-master-Solaris/solr/common-build.xml:529: The following error occurred while executing this line:
/export/home/jenkins/workspace/Lucene-Solr-master-Solaris/lucene/common-build.xml:1457: The following error occurred while executing this line:
/export/home/jenkins/workspace/Lucene-Solr-master-Solaris/lucene/common-build.xml:1014: There were test failures: 597 suites (10 ignored), 2413 tests, 2 errors, 1 failure, 87 ignored (72 assumptions) [seed: 8B88B7C9DDC179A1]

Total time: 82 minutes 12 seconds
Build step 'Invoke Ant' marked build as failure
Archiving artifacts
[WARNINGS] Skipping publisher since build result is FAILURE
Recording test results
Email was triggered for: Failure - Any
Sending email for trigger: Failure - Any



Mime
View raw message