lucene-dev mailing list archives

Site index · List index
Message view « Date » · « Thread »
Top « Date » · « Thread »
From Apache Jenkins Server <jenk...@builds.apache.org>
Subject [JENKINS] Lucene-Solr-Tests-6.0 - Build # 13 - Failure
Date Mon, 16 May 2016 08:40:30 GMT
Build: https://builds.apache.org/job/Lucene-Solr-Tests-6.0/13/

1 tests failed.
FAILED:  org.apache.solr.handler.TestReplicationHandlerBackup.doTestBackup

Error Message:
Failed to create backup

Stack Trace:
java.lang.AssertionError: Failed to create backup
	at __randomizedtesting.SeedInfo.seed([7ED0D6B9B46B6F22:3F5BF6DC93D59C6D]:0)
	at org.junit.Assert.fail(Assert.java:93)
	at org.apache.solr.handler.CheckBackupStatus.fetchStatus(CheckBackupStatus.java:50)
	at org.apache.solr.handler.TestReplicationHandlerBackup.doTestBackup(TestReplicationHandlerBackup.java:200)
	at sun.reflect.NativeMethodAccessorImpl.invoke0(Native Method)
	at sun.reflect.NativeMethodAccessorImpl.invoke(NativeMethodAccessorImpl.java:62)
	at sun.reflect.DelegatingMethodAccessorImpl.invoke(DelegatingMethodAccessorImpl.java:43)
	at java.lang.reflect.Method.invoke(Method.java:498)
	at com.carrotsearch.randomizedtesting.RandomizedRunner.invoke(RandomizedRunner.java:1764)
	at com.carrotsearch.randomizedtesting.RandomizedRunner$8.evaluate(RandomizedRunner.java:871)
	at com.carrotsearch.randomizedtesting.RandomizedRunner$9.evaluate(RandomizedRunner.java:907)
	at com.carrotsearch.randomizedtesting.RandomizedRunner$10.evaluate(RandomizedRunner.java:921)
	at com.carrotsearch.randomizedtesting.rules.SystemPropertiesRestoreRule$1.evaluate(SystemPropertiesRestoreRule.java:57)
	at org.apache.lucene.util.TestRuleSetupTeardownChained$1.evaluate(TestRuleSetupTeardownChained.java:49)
	at org.apache.lucene.util.AbstractBeforeAfterRule$1.evaluate(AbstractBeforeAfterRule.java:45)
	at org.apache.lucene.util.TestRuleThreadAndTestName$1.evaluate(TestRuleThreadAndTestName.java:48)
	at org.apache.lucene.util.TestRuleIgnoreAfterMaxFailures$1.evaluate(TestRuleIgnoreAfterMaxFailures.java:64)
	at org.apache.lucene.util.TestRuleMarkFailure$1.evaluate(TestRuleMarkFailure.java:47)
	at com.carrotsearch.randomizedtesting.rules.StatementAdapter.evaluate(StatementAdapter.java:36)
	at com.carrotsearch.randomizedtesting.ThreadLeakControl$StatementRunner.run(ThreadLeakControl.java:367)
	at com.carrotsearch.randomizedtesting.ThreadLeakControl.forkTimeoutingTask(ThreadLeakControl.java:809)
	at com.carrotsearch.randomizedtesting.ThreadLeakControl$3.evaluate(ThreadLeakControl.java:460)
	at com.carrotsearch.randomizedtesting.RandomizedRunner.runSingleTest(RandomizedRunner.java:880)
	at com.carrotsearch.randomizedtesting.RandomizedRunner$5.evaluate(RandomizedRunner.java:781)
	at com.carrotsearch.randomizedtesting.RandomizedRunner$6.evaluate(RandomizedRunner.java:816)
	at com.carrotsearch.randomizedtesting.RandomizedRunner$7.evaluate(RandomizedRunner.java:827)
	at com.carrotsearch.randomizedtesting.rules.StatementAdapter.evaluate(StatementAdapter.java:36)
	at com.carrotsearch.randomizedtesting.rules.SystemPropertiesRestoreRule$1.evaluate(SystemPropertiesRestoreRule.java:57)
	at org.apache.lucene.util.AbstractBeforeAfterRule$1.evaluate(AbstractBeforeAfterRule.java:45)
	at com.carrotsearch.randomizedtesting.rules.StatementAdapter.evaluate(StatementAdapter.java:36)
	at org.apache.lucene.util.TestRuleStoreClassName$1.evaluate(TestRuleStoreClassName.java:41)
	at com.carrotsearch.randomizedtesting.rules.NoShadowingOrOverridesOnMethodsRule$1.evaluate(NoShadowingOrOverridesOnMethodsRule.java:40)
	at com.carrotsearch.randomizedtesting.rules.NoShadowingOrOverridesOnMethodsRule$1.evaluate(NoShadowingOrOverridesOnMethodsRule.java:40)
	at com.carrotsearch.randomizedtesting.rules.StatementAdapter.evaluate(StatementAdapter.java:36)
	at com.carrotsearch.randomizedtesting.rules.StatementAdapter.evaluate(StatementAdapter.java:36)
	at com.carrotsearch.randomizedtesting.rules.StatementAdapter.evaluate(StatementAdapter.java:36)
	at org.apache.lucene.util.TestRuleAssertionsRequired$1.evaluate(TestRuleAssertionsRequired.java:53)
	at org.apache.lucene.util.TestRuleMarkFailure$1.evaluate(TestRuleMarkFailure.java:47)
	at org.apache.lucene.util.TestRuleIgnoreAfterMaxFailures$1.evaluate(TestRuleIgnoreAfterMaxFailures.java:64)
	at org.apache.lucene.util.TestRuleIgnoreTestSuites$1.evaluate(TestRuleIgnoreTestSuites.java:54)
	at com.carrotsearch.randomizedtesting.rules.StatementAdapter.evaluate(StatementAdapter.java:36)
	at com.carrotsearch.randomizedtesting.ThreadLeakControl$StatementRunner.run(ThreadLeakControl.java:367)
	at java.lang.Thread.run(Thread.java:745)




Build Log:
[...truncated 10687 lines...]
   [junit4] Suite: org.apache.solr.handler.TestReplicationHandlerBackup
   [junit4]   2> Creating dataDir: /x1/jenkins/jenkins-slave/workspace/Lucene-Solr-Tests-6.0/solr/build/solr-core/test/J2/temp/solr.handler.TestReplicationHandlerBackup_7ED0D6B9B46B6F22-001/init-core-data-001
   [junit4]   2> 180512 INFO  (TEST-TestReplicationHandlerBackup.testBackupOnCommit-seed#[7ED0D6B9B46B6F22]) [    ] o.a.s.SolrTestCaseJ4 ###Starting testBackupOnCommit
   [junit4]   2> 180512 INFO  (TEST-TestReplicationHandlerBackup.testBackupOnCommit-seed#[7ED0D6B9B46B6F22]) [    ] o.a.s.SolrTestCaseJ4 Writing core.properties file to /x1/jenkins/jenkins-slave/workspace/Lucene-Solr-Tests-6.0/solr/build/solr-core/test/J2/temp/solr.handler.TestReplicationHandlerBackup_7ED0D6B9B46B6F22-001/solr-instance-001/collection1
   [junit4]   2> 180521 INFO  (TEST-TestReplicationHandlerBackup.testBackupOnCommit-seed#[7ED0D6B9B46B6F22]) [    ] o.e.j.s.Server jetty-9.3.8.v20160314
   [junit4]   2> 180525 INFO  (TEST-TestReplicationHandlerBackup.testBackupOnCommit-seed#[7ED0D6B9B46B6F22]) [    ] o.e.j.s.h.ContextHandler Started o.e.j.s.ServletContextHandler@3668887d{/solr,null,AVAILABLE}
   [junit4]   2> 180526 INFO  (TEST-TestReplicationHandlerBackup.testBackupOnCommit-seed#[7ED0D6B9B46B6F22]) [    ] o.e.j.s.ServerConnector Started ServerConnector@62b27f93{HTTP/1.1,[http/1.1]}{127.0.0.1:49099}
   [junit4]   2> 180526 INFO  (TEST-TestReplicationHandlerBackup.testBackupOnCommit-seed#[7ED0D6B9B46B6F22]) [    ] o.e.j.s.Server Started @182447ms
   [junit4]   2> 180526 INFO  (TEST-TestReplicationHandlerBackup.testBackupOnCommit-seed#[7ED0D6B9B46B6F22]) [    ] o.a.s.c.s.e.JettySolrRunner Jetty properties: {solr.data.dir=/x1/jenkins/jenkins-slave/workspace/Lucene-Solr-Tests-6.0/solr/build/solr-core/test/J2/temp/solr.handler.TestReplicationHandlerBackup_7ED0D6B9B46B6F22-001/solr-instance-001/collection1/data, hostContext=/solr, hostPort=49099}
   [junit4]   2> 180526 INFO  (TEST-TestReplicationHandlerBackup.testBackupOnCommit-seed#[7ED0D6B9B46B6F22]) [    ] o.a.s.s.SolrDispatchFilter SolrDispatchFilter.init(): sun.misc.Launcher$AppClassLoader@73d16e93
   [junit4]   2> 180526 INFO  (TEST-TestReplicationHandlerBackup.testBackupOnCommit-seed#[7ED0D6B9B46B6F22]) [    ] o.a.s.c.SolrResourceLoader new SolrResourceLoader for directory: '/x1/jenkins/jenkins-slave/workspace/Lucene-Solr-Tests-6.0/solr/build/solr-core/test/J2/temp/solr.handler.TestReplicationHandlerBackup_7ED0D6B9B46B6F22-001/solr-instance-001'
   [junit4]   2> 180526 INFO  (TEST-TestReplicationHandlerBackup.testBackupOnCommit-seed#[7ED0D6B9B46B6F22]) [    ] o.a.s.c.SolrResourceLoader JNDI not configured for solr (NoInitialContextEx)
   [junit4]   2> 180526 INFO  (TEST-TestReplicationHandlerBackup.testBackupOnCommit-seed#[7ED0D6B9B46B6F22]) [    ] o.a.s.c.SolrResourceLoader solr home defaulted to 'solr/' (could not find system property or JNDI)
   [junit4]   2> 180526 INFO  (TEST-TestReplicationHandlerBackup.testBackupOnCommit-seed#[7ED0D6B9B46B6F22]) [    ] o.a.s.c.SolrXmlConfig Loading container configuration from /x1/jenkins/jenkins-slave/workspace/Lucene-Solr-Tests-6.0/solr/build/solr-core/test/J2/temp/solr.handler.TestReplicationHandlerBackup_7ED0D6B9B46B6F22-001/solr-instance-001/solr.xml
   [junit4]   2> 180530 INFO  (TEST-TestReplicationHandlerBackup.testBackupOnCommit-seed#[7ED0D6B9B46B6F22]) [    ] o.a.s.c.CorePropertiesLocator Config-defined core root directory: /x1/jenkins/jenkins-slave/workspace/Lucene-Solr-Tests-6.0/solr/build/solr-core/test/J2/temp/solr.handler.TestReplicationHandlerBackup_7ED0D6B9B46B6F22-001/solr-instance-001/.
   [junit4]   2> 180530 INFO  (TEST-TestReplicationHandlerBackup.testBackupOnCommit-seed#[7ED0D6B9B46B6F22]) [    ] o.a.s.c.CoreContainer New CoreContainer 1039998404
   [junit4]   2> 180530 INFO  (TEST-TestReplicationHandlerBackup.testBackupOnCommit-seed#[7ED0D6B9B46B6F22]) [    ] o.a.s.c.CoreContainer Loading cores into CoreContainer [instanceDir=/x1/jenkins/jenkins-slave/workspace/Lucene-Solr-Tests-6.0/solr/build/solr-core/test/J2/temp/solr.handler.TestReplicationHandlerBackup_7ED0D6B9B46B6F22-001/solr-instance-001]
   [junit4]   2> 180530 WARN  (TEST-TestReplicationHandlerBackup.testBackupOnCommit-seed#[7ED0D6B9B46B6F22]) [    ] o.a.s.c.CoreContainer Couldn't add files from /x1/jenkins/jenkins-slave/workspace/Lucene-Solr-Tests-6.0/solr/build/solr-core/test/J2/temp/solr.handler.TestReplicationHandlerBackup_7ED0D6B9B46B6F22-001/solr-instance-001/lib to classpath: /x1/jenkins/jenkins-slave/workspace/Lucene-Solr-Tests-6.0/solr/build/solr-core/test/J2/temp/solr.handler.TestReplicationHandlerBackup_7ED0D6B9B46B6F22-001/solr-instance-001/lib
   [junit4]   2> 180530 INFO  (TEST-TestReplicationHandlerBackup.testBackupOnCommit-seed#[7ED0D6B9B46B6F22]) [    ] o.a.s.h.c.HttpShardHandlerFactory created with socketTimeout : 90000,urlScheme : ,connTimeout : 15000,maxConnectionsPerHost : 20,maxConnections : 10000,corePoolSize : 0,maximumPoolSize : 2147483647,maxThreadIdleTime : 5,sizeOfQueue : -1,fairnessPolicy : false,useRetries : false,
   [junit4]   2> 180531 INFO  (TEST-TestReplicationHandlerBackup.testBackupOnCommit-seed#[7ED0D6B9B46B6F22]) [    ] o.a.s.u.UpdateShardHandler Creating UpdateShardHandler HTTP client with params: socketTimeout=340000&connTimeout=45000&retry=true
   [junit4]   2> 180532 INFO  (TEST-TestReplicationHandlerBackup.testBackupOnCommit-seed#[7ED0D6B9B46B6F22]) [    ] o.a.s.l.LogWatcher SLF4J impl is org.slf4j.impl.Log4jLoggerFactory
   [junit4]   2> 180532 INFO  (TEST-TestReplicationHandlerBackup.testBackupOnCommit-seed#[7ED0D6B9B46B6F22]) [    ] o.a.s.l.LogWatcher Registering Log Listener [Log4j (org.slf4j.impl.Log4jLoggerFactory)]
   [junit4]   2> 180532 INFO  (TEST-TestReplicationHandlerBackup.testBackupOnCommit-seed#[7ED0D6B9B46B6F22]) [    ] o.a.s.c.CoreContainer Security conf doesn't exist. Skipping setup for authorization module.
   [junit4]   2> 180532 INFO  (TEST-TestReplicationHandlerBackup.testBackupOnCommit-seed#[7ED0D6B9B46B6F22]) [    ] o.a.s.c.CoreContainer No authentication plugin used.
   [junit4]   2> 180532 INFO  (TEST-TestReplicationHandlerBackup.testBackupOnCommit-seed#[7ED0D6B9B46B6F22]) [    ] o.a.s.c.CorePropertiesLocator Looking for core definitions underneath /x1/jenkins/jenkins-slave/workspace/Lucene-Solr-Tests-6.0/solr/build/solr-core/test/J2/temp/solr.handler.TestReplicationHandlerBackup_7ED0D6B9B46B6F22-001/solr-instance-001/.
   [junit4]   2> 180534 INFO  (TEST-TestReplicationHandlerBackup.testBackupOnCommit-seed#[7ED0D6B9B46B6F22]) [    ] o.a.s.c.CoreDescriptor Created CoreDescriptor: {name=collection1, config=solrconfig.xml, loadOnStartup=true, schema=schema.xml, configSetProperties=configsetprops.json, transient=false, dataDir=data/}
   [junit4]   2> 180534 INFO  (TEST-TestReplicationHandlerBackup.testBackupOnCommit-seed#[7ED0D6B9B46B6F22]) [    ] o.a.s.c.CorePropertiesLocator Found core collection1 in /x1/jenkins/jenkins-slave/workspace/Lucene-Solr-Tests-6.0/solr/build/solr-core/test/J2/temp/solr.handler.TestReplicationHandlerBackup_7ED0D6B9B46B6F22-001/solr-instance-001/./collection1
   [junit4]   2> 180534 INFO  (TEST-TestReplicationHandlerBackup.testBackupOnCommit-seed#[7ED0D6B9B46B6F22]) [    ] o.a.s.c.CorePropertiesLocator Found 1 core definitions
   [junit4]   2> 180534 INFO  (coreLoadExecutor-592-thread-1) [    ] o.a.s.c.SolrResourceLoader new SolrResourceLoader for directory: '/x1/jenkins/jenkins-slave/workspace/Lucene-Solr-Tests-6.0/solr/build/solr-core/test/J2/temp/solr.handler.TestReplicationHandlerBackup_7ED0D6B9B46B6F22-001/solr-instance-001/collection1'
   [junit4]   2> 180534 INFO  (TEST-TestReplicationHandlerBackup.testBackupOnCommit-seed#[7ED0D6B9B46B6F22]) [    ] o.a.s.s.SolrDispatchFilter user.dir=/x1/jenkins/jenkins-slave/workspace/Lucene-Solr-Tests-6.0/solr/build/solr-core/test/J2
   [junit4]   2> 180540 INFO  (TEST-TestReplicationHandlerBackup.testBackupOnCommit-seed#[7ED0D6B9B46B6F22]) [    ] o.a.s.s.SolrDispatchFilter SolrDispatchFilter.init() done
   [junit4]   2> 180540 INFO  (coreLoadExecutor-592-thread-1) [    ] o.a.s.c.SolrResourceLoader JNDI not configured for solr (NoInitialContextEx)
   [junit4]   2> 180540 INFO  (coreLoadExecutor-592-thread-1) [    ] o.a.s.c.SolrResourceLoader solr home defaulted to 'solr/' (could not find system property or JNDI)
   [junit4]   2> 180545 INFO  (coreLoadExecutor-592-thread-1) [    ] o.a.s.c.SolrConfig current version of requestparams : -1
   [junit4]   2> 180547 INFO  (coreLoadExecutor-592-thread-1) [    ] o.a.s.c.SolrConfig Using Lucene MatchVersion: 6.0.1
   [junit4]   2> 180552 INFO  (coreLoadExecutor-592-thread-1) [    ] o.a.s.c.SolrConfig Loaded SolrConfig: solrconfig.xml
   [junit4]   2> 180554 INFO  (coreLoadExecutor-592-thread-1) [    ] o.a.s.s.IndexSchema [collection1] Schema name=test
   [junit4]   2> 180556 INFO  (coreLoadExecutor-592-thread-1) [    ] o.a.s.s.IndexSchema unique key field: id
   [junit4]   2> 180557 INFO  (coreLoadExecutor-592-thread-1) [    ] o.a.s.c.ConfigSetProperties Did not find ConfigSet properties, assuming default properties: Can't find resource 'configsetprops.json' in classpath or '/x1/jenkins/jenkins-slave/workspace/Lucene-Solr-Tests-6.0/solr/build/solr-core/test/J2/temp/solr.handler.TestReplicationHandlerBackup_7ED0D6B9B46B6F22-001/solr-instance-001/collection1'
   [junit4]   2> 180557 INFO  (coreLoadExecutor-592-thread-1) [    ] o.a.s.c.CoreContainer Creating SolrCore 'collection1' using configuration from instancedir /x1/jenkins/jenkins-slave/workspace/Lucene-Solr-Tests-6.0/solr/build/solr-core/test/J2/temp/solr.handler.TestReplicationHandlerBackup_7ED0D6B9B46B6F22-001/solr-instance-001/./collection1
   [junit4]   2> 180557 INFO  (coreLoadExecutor-592-thread-1) [    x:collection1] o.a.s.c.SolrCore org.apache.solr.core.MockDirectoryFactory
   [junit4]   2> 180558 INFO  (coreLoadExecutor-592-thread-1) [    x:collection1] o.a.s.c.SolrCore [[collection1] ] Opening new SolrCore at [/x1/jenkins/jenkins-slave/workspace/Lucene-Solr-Tests-6.0/solr/build/solr-core/test/J2/temp/solr.handler.TestReplicationHandlerBackup_7ED0D6B9B46B6F22-001/solr-instance-001/collection1], dataDir=[/x1/jenkins/jenkins-slave/workspace/Lucene-Solr-Tests-6.0/solr/build/solr-core/test/J2/temp/solr.handler.TestReplicationHandlerBackup_7ED0D6B9B46B6F22-001/solr-instance-001/./collection1/data/]
   [junit4]   2> 180558 INFO  (coreLoadExecutor-592-thread-1) [    x:collection1] o.a.s.c.SolrCore JMX monitoring not detected for core: collection1
   [junit4]   2> 180558 INFO  (coreLoadExecutor-592-thread-1) [    x:collection1] o.a.s.c.CachingDirectoryFactory return new directory for /x1/jenkins/jenkins-slave/workspace/Lucene-Solr-Tests-6.0/solr/build/solr-core/test/J2/temp/solr.handler.TestReplicationHandlerBackup_7ED0D6B9B46B6F22-001/solr-instance-001/./collection1/data
   [junit4]   2> 180558 INFO  (coreLoadExecutor-592-thread-1) [    x:collection1] o.a.s.c.SolrCore New index directory detected: old=null new=/x1/jenkins/jenkins-slave/workspace/Lucene-Solr-Tests-6.0/solr/build/solr-core/test/J2/temp/solr.handler.TestReplicationHandlerBackup_7ED0D6B9B46B6F22-001/solr-instance-001/./collection1/data/index/
   [junit4]   2> 180558 WARN  (coreLoadExecutor-592-thread-1) [    x:collection1] o.a.s.c.SolrCore [collection1] Solr index directory '/x1/jenkins/jenkins-slave/workspace/Lucene-Solr-Tests-6.0/solr/build/solr-core/test/J2/temp/solr.handler.TestReplicationHandlerBackup_7ED0D6B9B46B6F22-001/solr-instance-001/./collection1/data/index' doesn't exist. Creating new index...
   [junit4]   2> 180558 INFO  (coreLoadExecutor-592-thread-1) [    x:collection1] o.a.s.c.CachingDirectoryFactory return new directory for /x1/jenkins/jenkins-slave/workspace/Lucene-Solr-Tests-6.0/solr/build/solr-core/test/J2/temp/solr.handler.TestReplicationHandlerBackup_7ED0D6B9B46B6F22-001/solr-instance-001/./collection1/data/index
   [junit4]   2> 180559 INFO  (coreLoadExecutor-592-thread-1) [    x:collection1] o.a.s.u.RandomMergePolicy RandomMergePolicy wrapping class org.apache.lucene.index.LogDocMergePolicy: [LogDocMergePolicy: minMergeSize=1000, mergeFactor=34, maxMergeSize=9223372036854775807, maxMergeSizeForForcedMerge=9223372036854775807, calibrateSizeByDeletes=true, maxMergeDocs=2147483647, maxCFSSegmentSizeMB=8.796093022207999E12, noCFSRatio=0.1779809424777133]
   [junit4]   2> 180559 INFO  (coreLoadExecutor-592-thread-1) [    x:collection1] o.a.s.c.SolrDeletionPolicy SolrDeletionPolicy.onCommit: commits: num=1
   [junit4]   2> 	commit{dir=MockDirectoryWrapper(RAMDirectory@d6aa48c lockFactory=org.apache.lucene.store.SingleInstanceLockFactory@63e7f44a),segFN=segments_1,generation=1}
   [junit4]   2> 180559 INFO  (coreLoadExecutor-592-thread-1) [    x:collection1] o.a.s.c.SolrDeletionPolicy newest commit generation = 1
   [junit4]   2> 180560 INFO  (OldIndexDirectoryCleanupThreadForCore-collection1) [    x:collection1] o.a.s.c.SolrCore Looking for old index directories to cleanup for core collection1 in /x1/jenkins/jenkins-slave/workspace/Lucene-Solr-Tests-6.0/solr/build/solr-core/test/J2/temp/solr.handler.TestReplicationHandlerBackup_7ED0D6B9B46B6F22-001/solr-instance-001/./collection1/data/
   [junit4]   2> 180561 INFO  (coreLoadExecutor-592-thread-1) [    x:collection1] o.a.s.c.SolrCore no updateRequestProcessorChain defined as default, creating implicit default
   [junit4]   2> 180563 INFO  (coreLoadExecutor-592-thread-1) [    x:collection1] o.a.s.h.l.XMLLoader xsltCacheLifetimeSeconds=60
   [junit4]   2> 180563 INFO  (coreLoadExecutor-592-thread-1) [    x:collection1] o.a.s.h.l.XMLLoader xsltCacheLifetimeSeconds=60
   [junit4]   2> 180564 INFO  (coreLoadExecutor-592-thread-1) [    x:collection1] o.a.s.h.l.XMLLoader xsltCacheLifetimeSeconds=60
   [junit4]   2> 180564 INFO  (coreLoadExecutor-592-thread-1) [    x:collection1] o.a.s.h.l.XMLLoader xsltCacheLifetimeSeconds=60
   [junit4]   2> 180565 INFO  (coreLoadExecutor-592-thread-1) [    x:collection1] o.a.s.c.PluginBag requestHandler : 'lazy' created with startup=lazy 
   [junit4]   2> 180565 INFO  (coreLoadExecutor-592-thread-1) [    x:collection1] o.a.s.c.RequestHandlers Registered paths: /admin/mbeans,standard,lazy,/update/json/docs,/admin/luke,/export,/get,/admin/properties,/update/json,/admin/threads,/update/csv,/sql,/admin/segments,/admin/system,/replication,defaults,/config,/stream,/schema,/admin/plugins,/admin/logging,/admin/ping,/update,/admin/file
   [junit4]   2> 180565 INFO  (coreLoadExecutor-592-thread-1) [    x:collection1] o.a.s.c.SolrCore Using default statsCache cache: org.apache.solr.search.stats.LocalStatsCache
   [junit4]   2> 180565 INFO  (coreLoadExecutor-592-thread-1) [    x:collection1] o.a.s.u.CommitTracker Hard AutoCommit: disabled
   [junit4]   2> 180565 INFO  (coreLoadExecutor-592-thread-1) [    x:collection1] o.a.s.u.CommitTracker Soft AutoCommit: disabled
   [junit4]   2> 180565 INFO  (coreLoadExecutor-592-thread-1) [    x:collection1] o.a.s.u.RandomMergePolicy RandomMergePolicy wrapping class org.apache.lucene.index.TieredMergePolicy: [TieredMergePolicy: maxMergeAtOnce=27, maxMergeAtOnceExplicit=27, maxMergedSegmentMB=95.455078125, floorSegmentMB=1.0712890625, forceMergeDeletesPctAllowed=24.9022402328125, segmentsPerTier=47.0, maxCFSSegmentSizeMB=8.796093022207999E12, noCFSRatio=0.48216421900321715
   [junit4]   2> 180566 INFO  (coreLoadExecutor-592-thread-1) [    x:collection1] o.a.s.c.SolrDeletionPolicy SolrDeletionPolicy.onInit: commits: num=1
   [junit4]   2> 	commit{dir=MockDirectoryWrapper(RAMDirectory@d6aa48c lockFactory=org.apache.lucene.store.SingleInstanceLockFactory@63e7f44a),segFN=segments_1,generation=1}
   [junit4]   2> 180566 INFO  (coreLoadExecutor-592-thread-1) [    x:collection1] o.a.s.c.SolrDeletionPolicy newest commit generation = 1
   [junit4]   2> 180566 INFO  (coreLoadExecutor-592-thread-1) [    x:collection1] o.a.s.s.SolrIndexSearcher Opening [Searcher@227dd45b[collection1] main]
   [junit4]   2> 180566 INFO  (coreLoadExecutor-592-thread-1) [    x:collection1] o.a.s.r.ManagedResourceStorage File-based storage initialized to use dir: /x1/jenkins/jenkins-slave/workspace/Lucene-Solr-Tests-6.0/solr/build/solr-core/test/J2/temp/solr.handler.TestReplicationHandlerBackup_7ED0D6B9B46B6F22-001/solr-instance-001/collection1/conf
   [junit4]   2> 180566 INFO  (coreLoadExecutor-592-thread-1) [    x:collection1] o.a.s.r.RestManager Initializing RestManager with initArgs: {storageDir=/x1/jenkins/jenkins-slave/workspace/Lucene-Solr-Tests-6.0/solr/build/solr-core/test/J2/temp/solr.handler.TestReplicationHandlerBackup_7ED0D6B9B46B6F22-001/solr-instance-001/collection1/conf}
   [junit4]   2> 180566 INFO  (coreLoadExecutor-592-thread-1) [    x:collection1] o.a.s.r.ManagedResourceStorage Reading _rest_managed.json using file:dir=/x1/jenkins/jenkins-slave/workspace/Lucene-Solr-Tests-6.0/solr/build/solr-core/test/J2/temp/solr.handler.TestReplicationHandlerBackup_7ED0D6B9B46B6F22-001/solr-instance-001/collection1/conf
   [junit4]   2> 180566 INFO  (coreLoadExecutor-592-thread-1) [    x:collection1] o.a.s.r.RestManager Initializing 0 registered ManagedResources
   [junit4]   2> 180567 INFO  (coreLoadExecutor-592-thread-1) [    x:collection1] o.a.s.h.ReplicationHandler Replication enabled for following config files: schema-replication2.xml:schema.xml
   [junit4]   2> 180567 INFO  (coreLoadExecutor-592-thread-1) [    x:collection1] o.a.s.h.ReplicationHandler Commits will be reserved for  10000
   [junit4]   2> 180567 INFO  (searcherExecutor-593-thread-1-processing-x:collection1) [    x:collection1] o.a.s.c.SolrCore [collection1] Registered new searcher Searcher@227dd45b[collection1] main{ExitableDirectoryReader(UninvertingDirectoryReader())}
   [junit4]   2> 180567 INFO  (coreLoadExecutor-592-thread-1) [    x:collection1] o.a.s.c.CoreContainer registering core: collection1
   [junit4]   2> 181044 INFO  (qtp387856113-2698) [    x:collection1] o.a.s.u.DirectUpdateHandler2 [collection1] REMOVING ALL DOCUMENTS FROM INDEX
   [junit4]   2> 181044 INFO  (qtp387856113-2698) [    x:collection1] o.a.s.u.p.LogUpdateProcessorFactory [collection1]  webapp=/solr path=/update params={wt=javabin&version=2}{deleteByQuery=*:*} 0 1
   [junit4]   2> 181047 INFO  (qtp387856113-2699) [    x:collection1] o.a.s.u.p.LogUpdateProcessorFactory [collection1]  webapp=/solr path=/update params={wt=javabin&version=2}{add=[0]} 0 1
   [junit4]   2> 181049 INFO  (qtp387856113-2700) [    x:collection1] o.a.s.u.p.LogUpdateProcessorFactory [collection1]  webapp=/solr path=/update params={wt=javabin&version=2}{add=[1]} 0 0
   [junit4]   2> 181051 INFO  (qtp387856113-2700) [    x:collection1] o.a.s.u.p.LogUpdateProcessorFactory [collection1]  webapp=/solr path=/update params={wt=javabin&version=2}{add=[2]} 0 0
   [junit4]   2> 181053 INFO  (qtp387856113-2702) [    x:collection1] o.a.s.u.p.LogUpdateProcessorFactory [collection1]  webapp=/solr path=/update params={wt=javabin&version=2}{add=[3]} 0 0
   [junit4]   2> 181054 INFO  (qtp387856113-2695) [    x:collection1] o.a.s.u.p.LogUpdateProcessorFactory [collection1]  webapp=/solr path=/update params={wt=javabin&version=2}{add=[4]} 0 0
   [junit4]   2> 181056 INFO  (qtp387856113-2698) [    x:collection1] o.a.s.u.p.LogUpdateProcessorFactory [collection1]  webapp=/solr path=/update params={wt=javabin&version=2}{add=[5]} 0 0
   [junit4]   2> 181058 INFO  (qtp387856113-2699) [    x:collection1] o.a.s.u.p.LogUpdateProcessorFactory [collection1]  webapp=/solr path=/update params={wt=javabin&version=2}{add=[6]} 0 0
   [junit4]   2> 181059 INFO  (qtp387856113-2701) [    x:collection1] o.a.s.u.p.LogUpdateProcessorFactory [collection1]  webapp=/solr path=/update params={wt=javabin&version=2}{add=[7]} 0 0
   [junit4]   2> 181061 INFO  (qtp387856113-2700) [    x:collection1] o.a.s.u.p.LogUpdateProcessorFactory [collection1]  webapp=/solr path=/update params={wt=javabin&version=2}{add=[8]} 0 0
   [junit4]   2> 181063 INFO  (qtp387856113-2702) [    x:collection1] o.a.s.u.p.LogUpdateProcessorFactory [collection1]  webapp=/solr path=/update params={wt=javabin&version=2}{add=[9]} 0 0
   [junit4]   2> 181065 INFO  (qtp387856113-2695) [    x:collection1] o.a.s.u.p.LogUpdateProcessorFactory [collection1]  webapp=/solr path=/update params={wt=javabin&version=2}{add=[10]} 0 0
   [junit4]   2> 181066 INFO  (qtp387856113-2698) [    x:collection1] o.a.s.u.p.LogUpdateProcessorFactory [collection1]  webapp=/solr path=/update params={wt=javabin&version=2}{add=[11]} 0 0
   [junit4]   2> 181068 INFO  (qtp387856113-2698) [    x:collection1] o.a.s.u.p.LogUpdateProcessorFactory [collection1]  webapp=/solr path=/update params={wt=javabin&version=2}{add=[12]} 0 0
   [junit4]   2> 181069 INFO  (qtp387856113-2701) [    x:collection1] o.a.s.u.p.LogUpdateProcessorFactory [collection1]  webapp=/solr path=/update params={wt=javabin&version=2}{add=[13]} 0 0
   [junit4]   2> 181071 INFO  (qtp387856113-2701) [    x:collection1] o.a.s.u.p.LogUpdateProcessorFactory [collection1]  webapp=/solr path=/update params={wt=javabin&version=2}{add=[14]} 0 0
   [junit4]   2> 181073 INFO  (qtp387856113-2702) [    x:collection1] o.a.s.u.p.LogUpdateProcessorFactory [collection1]  webapp=/solr path=/update params={wt=javabin&version=2}{add=[15]} 0 0
   [junit4]   2> 181074 INFO  (qtp387856113-2695) [    x:collection1] o.a.s.u.p.LogUpdateProcessorFactory [collection1]  webapp=/solr path=/update params={wt=javabin&version=2}{add=[16]} 0 0
   [junit4]   2> 181076 INFO  (qtp387856113-2699) [    x:collection1] o.a.s.u.p.LogUpdateProcessorFactory [collection1]  webapp=/solr path=/update params={wt=javabin&version=2}{add=[17]} 0 0
   [junit4]   2> 181080 INFO  (qtp387856113-2698) [    x:collection1] o.a.s.u.p.LogUpdateProcessorFactory [collection1]  webapp=/solr path=/update params={wt=javabin&version=2}{add=[18]} 0 0
   [junit4]   2> 181082 INFO  (qtp387856113-2700) [    x:collection1] o.a.s.u.p.LogUpdateProcessorFactory [collection1]  webapp=/solr path=/update params={wt=javabin&version=2}{add=[19]} 0 0
   [junit4]   2> 181084 INFO  (qtp387856113-2701) [    x:collection1] o.a.s.u.p.LogUpdateProcessorFactory [collection1]  webapp=/solr path=/update params={wt=javabin&version=2}{add=[20]} 0 0
   [junit4]   2> 181085 INFO  (qtp387856113-2702) [    x:collection1] o.a.s.u.p.LogUpdateProcessorFactory [collection1]  webapp=/solr path=/update params={wt=javabin&version=2}{add=[21]} 0 0
   [junit4]   2> 181087 INFO  (qtp387856113-2702) [    x:collection1] o.a.s.u.p.LogUpdateProcessorFactory [collection1]  webapp=/solr path=/update params={wt=javabin&version=2}{add=[22]} 0 0
   [junit4]   2> 181089 INFO  (qtp387856113-2699) [    x:collection1] o.a.s.u.p.LogUpdateProcessorFactory [collection1]  webapp=/solr path=/update params={wt=javabin&version=2}{add=[23]} 0 0
   [junit4]   2> 181090 INFO  (qtp387856113-2699) [    x:collection1] o.a.s.u.p.LogUpdateProcessorFactory [collection1]  webapp=/solr path=/update params={wt=javabin&version=2}{add=[24]} 0 0
   [junit4]   2> 181092 INFO  (qtp387856113-2699) [    x:collection1] o.a.s.u.p.LogUpdateProcessorFactory [collection1]  webapp=/solr path=/update params={wt=javabin&version=2}{add=[25]} 0 0
   [junit4]   2> 181094 INFO  (qtp387856113-2699) [    x:collection1] o.a.s.u.p.LogUpdateProcessorFactory [collection1]  webapp=/solr path=/update params={wt=javabin&version=2}{add=[26]} 0 0
   [junit4]   2> 181095 INFO  (qtp387856113-2695) [    x:collection1] o.a.s.u.DirectUpdateHandler2 start commit{,optimize=false,openSearcher=true,waitSearcher=true,expungeDeletes=false,softCommit=false,prepareCommit=false}
   [junit4]   2> 181101 INFO  (qtp387856113-2695) [    x:collection1] o.a.s.c.SolrDeletionPolicy SolrDeletionPolicy.onCommit: commits: num=2
   [junit4]   2> 	commit{dir=MockDirectoryWrapper(RAMDirectory@d6aa48c lockFactory=org.apache.lucene.store.SingleInstanceLockFactory@63e7f44a),segFN=segments_1,generation=1}
   [junit4]   2> 	commit{dir=MockDirectoryWrapper(RAMDirectory@d6aa48c lockFactory=org.apache.lucene.store.SingleInstanceLockFactory@63e7f44a),segFN=segments_2,generation=2}
   [junit4]   2> 181101 INFO  (qtp387856113-2695) [    x:collection1] o.a.s.c.SolrDeletionPolicy newest commit generation = 2
   [junit4]   2> 181108 INFO  (qtp387856113-2695) [    x:collection1] o.a.s.s.SolrIndexSearcher Opening [Searcher@468e1646[collection1] main]
   [junit4]   2> 181108 INFO  (qtp387856113-2695) [    x:collection1] o.a.s.u.DirectUpdateHandler2 end_commit_flush
   [junit4]   2> 181108 INFO  (searcherExecutor-593-thread-1-processing-x:collection1) [    x:collection1] o.a.s.c.SolrCore [collection1] Registered new searcher Searcher@468e1646[collection1] main{ExitableDirectoryReader(UninvertingDirectoryReader(Uninverting(_0(6.0.1):C27)))}
   [junit4]   2> 181108 INFO  (Thread-2052) [    x:collection1] o.a.s.h.SnapShooter Creating backup snapshot <not named> at /x1/jenkins/jenkins-slave/workspace/Lucene-Solr-Tests-6.0/solr/build/solr-core/test/J2/temp/solr.handler.TestReplicationHandlerBackup_7ED0D6B9B46B6F22-001/solr-instance-001/./collection1/data/
   [junit4]   2> 181112 INFO  (qtp387856113-2695) [    x:collection1] o.a.s.u.p.LogUpdateProcessorFactory [collection1]  webapp=/solr path=/update params={waitSearcher=true&commit=true&softCommit=false&wt=javabin&version=2}{commit=} 0 16
   [junit4]   2> 181121 INFO  (qtp387856113-2702) [    x:collection1] o.a.s.c.S.Request [collection1]  webapp=/solr path=/replication params={command=details} status=0 QTime=4
   [junit4]   2> 181121 INFO  (Thread-2052) [    x:collection1] o.a.s.h.SnapShooter Done creating backup snapshot: <not named> at /x1/jenkins/jenkins-slave/workspace/Lucene-Solr-Tests-6.0/solr/build/solr-core/test/J2/temp/solr.handler.TestReplicationHandlerBackup_7ED0D6B9B46B6F22-001/solr-instance-001/./collection1/data/
   [junit4]   2> 182126 INFO  (qtp387856113-2698) [    x:collection1] o.a.s.c.S.Request [collection1]  webapp=/solr path=/replication params={command=details} status=0 QTime=0
   [junit4]   2> 183132 INFO  (TEST-TestReplicationHandlerBackup.testBackupOnCommit-seed#[7ED0D6B9B46B6F22]) [    ] o.a.s.SolrTestCaseJ4 ###Ending testBackupOnCommit
   [junit4]   2> 183133 INFO  (TEST-TestReplicationHandlerBackup.testBackupOnCommit-seed#[7ED0D6B9B46B6F22]) [    ] o.e.j.s.ServerConnector Stopped ServerConnector@62b27f93{HTTP/1.1,[http/1.1]}{127.0.0.1:0}
   [junit4]   2> 183133 INFO  (TEST-TestReplicationHandlerBackup.testBackupOnCommit-seed#[7ED0D6B9B46B6F22]) [    ] o.a.s.c.CoreContainer Shutting down CoreContainer instance=1039998404
   [junit4]   2> 183133 INFO  (coreCloseExecutor-597-thread-1) [    x:collection1] o.a.s.c.SolrCore [collection1]  CLOSING SolrCore org.apache.solr.core.SolrCore@7c883c15
   [junit4]   2> 183133 INFO  (coreCloseExecutor-597-thread-1) [    x:collection1] o.a.s.u.DirectUpdateHandler2 closing DirectUpdateHandler2{commits=1,autocommits=0,soft autocommits=0,optimizes=0,rollbacks=0,expungeDeletes=0,docsPending=0,adds=0,deletesById=0,deletesByQuery=0,errors=0,cumulative_adds=27,cumulative_deletesById=0,cumulative_deletesByQuery=1,cumulative_errors=0}
   [junit4]   2> 183133 INFO  (coreCloseExecutor-597-thread-1) [    x:collection1] o.a.s.u.SolrCoreState Closing SolrCoreState
   [junit4]   2> 183133 INFO  (coreCloseExecutor-597-thread-1) [    x:collection1] o.a.s.u.DefaultSolrCoreState SolrCoreState ref count has reached 0 - closing IndexWriter
   [junit4]   2> 183133 INFO  (coreCloseExecutor-597-thread-1) [    x:collection1] o.a.s.u.DefaultSolrCoreState closing IndexWriter with IndexWriterCloser
   [junit4]   2> 183134 INFO  (coreCloseExecutor-597-thread-1) [    x:collection1] o.a.s.c.SolrCore [collection1] Closing main searcher on request.
   [junit4]   2> 183134 INFO  (coreCloseExecutor-597-thread-1) [    x:collection1] o.a.s.c.CachingDirectoryFactory Closing MockDirectoryFactory - 2 directories currently being tracked
   [junit4]   2> 183134 INFO  (coreCloseExecutor-597-thread-1) [    x:collection1] o.a.s.c.CachingDirectoryFactory looking to close /x1/jenkins/jenkins-slave/workspace/Lucene-Solr-Tests-6.0/solr/build/solr-core/test/J2/temp/solr.handler.TestReplicationHandlerBackup_7ED0D6B9B46B6F22-001/solr-instance-001/./collection1/data [CachedDir<<refCount=0;path=/x1/jenkins/jenkins-slave/workspace/Lucene-Solr-Tests-6.0/solr/build/solr-core/test/J2/temp/solr.handler.TestReplicationHandlerBackup_7ED0D6B9B46B6F22-001/solr-instance-001/./collection1/data;done=false>>]
   [junit4]   2> 183134 INFO  (coreCloseExecutor-597-thread-1) [    x:collection1] o.a.s.c.CachingDirectoryFactory Closing directory: /x1/jenkins/jenkins-slave/workspace/Lucene-Solr-Tests-6.0/solr/build/solr-core/test/J2/temp/solr.handler.TestReplicationHandlerBackup_7ED0D6B9B46B6F22-001/solr-instance-001/./collection1/data
   [junit4]   2> 183134 INFO  (coreCloseExecutor-597-thread-1) [    x:collection1] o.a.s.c.CachingDirectoryFactory looking to close /x1/jenkins/jenkins-slave/workspace/Lucene-Solr-Tests-6.0/solr/build/solr-core/test/J2/temp/solr.handler.TestReplicationHandlerBackup_7ED0D6B9B46B6F22-001/solr-instance-001/./collection1/data/index [CachedDir<<refCount=0;path=/x1/jenkins/jenkins-slave/workspace/Lucene-Solr-Tests-6.0/solr/build/solr-core/test/J2/temp/solr.handler.TestReplicationHandlerBackup_7ED0D6B9B46B6F22-001/solr-instance-001/./collection1/data/index;done=false>>]
   [junit4]   2> 183134 INFO  (coreCloseExecutor-597-thread-1) [    x:collection1] o.a.s.c.CachingDirectoryFactory Closing directory: /x1/jenkins/jenkins-slave/workspace/Lucene-Solr-Tests-6.0/solr/build/solr-core/test/J2/temp/solr.handler.TestReplicationHandlerBackup_7ED0D6B9B46B6F22-001/solr-instance-001/./collection1/data/index
   [junit4]   2> 183135 INFO  (TEST-TestReplicationHandlerBackup.testBackupOnCommit-seed#[7ED0D6B9B46B6F22]) [    ] o.e.j.s.h.ContextHandler Stopped o.e.j.s.ServletContextHandler@3668887d{/solr,null,UNAVAILABLE}
   [junit4]   2> 183137 INFO  (TEST-TestReplicationHandlerBackup.doTestBackup-seed#[7ED0D6B9B46B6F22]) [    ] o.a.s.SolrTestCaseJ4 ###Starting doTestBackup
   [junit4]   2> 183137 INFO  (TEST-TestReplicationHandlerBackup.doTestBackup-seed#[7ED0D6B9B46B6F22]) [    ] o.a.s.SolrTestCaseJ4 Writing core.properties file to /x1/jenkins/jenkins-slave/workspace/Lucene-Solr-Tests-6.0/solr/build/solr-core/test/J2/temp/solr.handler.TestReplicationHandlerBackup_7ED0D6B9B46B6F22-001/solr-instance-002/collection1
   [junit4]   2> 183140 INFO  (TEST-TestReplicationHandlerBackup.doTestBackup-seed#[7ED0D6B9B46B6F22]) [    ] o.e.j.s.Server jetty-9.3.8.v20160314
   [junit4]   2> 183141 INFO  (TEST-TestReplicationHandlerBackup.doTestBackup-seed#[7ED0D6B9B46B6F22]) [    ] o.e.j.s.h.ContextHandler Started o.e.j.s.ServletContextHandler@5a3c1b2f{/solr,null,AVAILABLE}
   [junit4]   2> 183141 INFO  (TEST-TestReplicationHandlerBackup.doTestBackup-seed#[7ED0D6B9B46B6F22]) [    ] o.e.j.s.ServerConnector Started ServerConnector@6a1419b9{HTTP/1.1,[http/1.1]}{127.0.0.1:59905}
   [junit4]   2> 183141 INFO  (TEST-TestReplicationHandlerBackup.doTestBackup-seed#[7ED0D6B9B46B6F22]) [    ] o.e.j.s.Server Started @185062ms
   [junit4]   2> 183141 INFO  (TEST-TestReplicationHandlerBackup.doTestBackup-seed#[7ED0D6B9B46B6F22]) [    ] o.a.s.c.s.e.JettySolrRunner Jetty properties: {solr.data.dir=/x1/jenkins/jenkins-slave/workspace/Lucene-Solr-Tests-6.0/solr/build/solr-core/test/J2/temp/solr.handler.TestReplicationHandlerBackup_7ED0D6B9B46B6F22-001/solr-instance-002/collection1/data, hostContext=/solr, hostPort=59905}
   [junit4]   2> 183141 INFO  (TEST-TestReplicationHandlerBackup.doTestBackup-seed#[7ED0D6B9B46B6F22]) [    ] o.a.s.s.SolrDispatchFilter SolrDispatchFilter.init(): sun.misc.Launcher$AppClassLoader@73d16e93
   [junit4]   2> 183141 INFO  (TEST-TestReplicationHandlerBackup.doTestBackup-seed#[7ED0D6B9B46B6F22]) [    ] o.a.s.c.SolrResourceLoader new SolrResourceLoader for directory: '/x1/jenkins/jenkins-slave/workspace/Lucene-Solr-Tests-6.0/solr/build/solr-core/test/J2/temp/solr.handler.TestReplicationHandlerBackup_7ED0D6B9B46B6F22-001/solr-instance-002'
   [junit4]   2> 183141 INFO  (TEST-TestReplicationHandlerBackup.doTestBackup-seed#[7ED0D6B9B46B6F22]) [    ] o.a.s.c.SolrResourceLoader JNDI not configured for solr (NoInitialContextEx)
   [junit4]   2> 183141 INFO  (TEST-TestReplicationHandlerBackup.doTestBackup-seed#[7ED0D6B9B46B6F22]) [    ] o.a.s.c.SolrResourceLoader solr home defaulted to 'solr/' (could not find system property or JNDI)
   [junit4]   2> 183142 INFO  (TEST-TestReplicationHandlerBackup.doTestBackup-seed#[7ED0D6B9B46B6F22]) [    ] o.a.s.c.SolrXmlConfig Loading container configuration from /x1/jenkins/jenkins-slave/workspace/Lucene-Solr-Tests-6.0/solr/build/solr-core/test/J2/temp/solr.handler.TestReplicationHandlerBackup_7ED0D6B9B46B6F22-001/solr-instance-002/solr.xml
   [junit4]   2> 183146 INFO  (TEST-TestReplicationHandlerBackup.doTestBackup-seed#[7ED0D6B9B46B6F22]) [    ] o.a.s.c.CorePropertiesLocator Config-defined core root directory: /x1/jenkins/jenkins-slave/workspace/Lucene-Solr-Tests-6.0/solr/build/solr-core/test/J2/temp/solr.handler.TestReplicationHandlerBackup_7ED0D6B9B46B6F22-001/solr-instance-002/.
   [junit4]   2> 183146 INFO  (TEST-TestReplicationHandlerBackup.doTestBackup-seed#[7ED0D6B9B46B6F22]) [    ] o.a.s.c.CoreContainer New CoreContainer 1485222738
   [junit4]   2> 183146 INFO  (TEST-TestReplicationHandlerBackup.doTestBackup-seed#[7ED0D6B9B46B6F22]) [    ] o.a.s.c.CoreContainer Loading cores into CoreContainer [instanceDir=/x1/jenkins/jenkins-slave/workspace/Lucene-Solr-Tests-6.0/solr/build/solr-core/test/J2/temp/solr.handler.TestReplicationHandlerBackup_7ED0D6B9B46B6F22-001/solr-instance-002]
   [junit4]   2> 183146 WARN  (TEST-TestReplicationHandlerBackup.doTestBackup-seed#[7ED0D6B9B46B6F22]) [    ] o.a.s.c.CoreContainer Couldn't add files from /x1/jenkins/jenkins-slave/workspace/Lucene-Solr-Tests-6.0/solr/build/solr-core/test/J2/temp/solr.handler.TestReplicationHandlerBackup_7ED0D6B9B46B6F22-001/solr-instance-002/lib to classpath: /x1/jenkins/jenkins-slave/workspace/Lucene-Solr-Tests-6.0/solr/build/solr-core/test/J2/temp/solr.handler.TestReplicationHandlerBackup_7ED0D6B9B46B6F22-001/solr-instance-002/lib
   [junit4]   2> 183148 INFO  (TEST-TestReplicationHandlerBackup.doTestBackup-seed#[7ED0D6B9B46B6F22]) [    ] o.a.s.h.c.HttpShardHandlerFactory created with socketTimeout : 90000,urlScheme : ,connTimeout : 15000,maxConnectionsPerHost : 20,maxConnections : 10000,corePoolSize : 0,maximumPoolSize : 2147483647,maxThreadIdleTime : 5,sizeOfQueue : -1,fairnessPolicy : false,useRetries : false,
   [junit4]   2> 183149 INFO  (TEST-TestReplicationHandlerBackup.doTestBackup-seed#[7ED0D6B9B46B6F22]) [    ] o.a.s.u.UpdateShardHandler Creating UpdateShardHandler HTTP client with params: socketTimeout=340000&connTimeout=45000&retry=true
   [junit4]   2> 183150 INFO  (TEST-TestReplicationHandlerBackup.doTestBackup-seed#[7ED0D6B9B46B6F22]) [    ] o.a.s.l.LogWatcher SLF4J impl is org.slf4j.impl.Log4jLoggerFactory
   [junit4]   2> 183150 INFO  (TEST-TestReplicationHandlerBackup.doTestBackup-seed#[7ED0D6B9B46B6F22]) [    ] o.a.s.l.LogWatcher Registering Log Listener [Log4j (org.slf4j.impl.Log4jLoggerFactory)]
   [junit4]   2> 183150 INFO  (TEST-TestReplicationHandlerBackup.doTestBackup-seed#[7ED0D6B9B46B6F22]) [    ] o.a.s.c.CoreContainer Security conf doesn't exist. Skipping setup for authorization module.
   [junit4]   2> 183150 INFO  (TEST-TestReplicationHandlerBackup.doTestBackup-seed#[7ED0D6B9B46B6F22]) [    ] o.a.s.c.CoreContainer No authentication plugin used.
   [junit4]   2> 183150 INFO  (TEST-TestReplicationHandlerBackup.doTestBackup-seed#[7ED0D6B9B46B6F22]) [    ] o.a.s.c.CorePropertiesLocator Looking for core definitions underneath /x1/jenkins/jenkins-slave/workspace/Lucene-Solr-Tests-6.0/solr/build/solr-core/test/J2/temp/solr.handler.TestReplicationHandlerBackup_7ED0D6B9B46B6F22-001/solr-instance-002/.
   [junit4]   2> 183151 INFO  (TEST-TestReplicationHandlerBackup.doTestBackup-seed#[7ED0D6B9B46B6F22]) [    ] o.a.s.c.CoreDescriptor Created CoreDescriptor: {name=collection1, config=solrconfig.xml, loadOnStartup=true, schema=schema.xml, configSetProperties=configsetprops.json, transient=false, dataDir=data/}
   [junit4]   2> 183151 INFO  (TEST-TestReplicationHandlerBackup.doTestBackup-seed#[7ED0D6B9B46B6F22]) [    ] o.a.s.c.CorePropertiesLocator Found core collection1 in /x1/jenkins/jenkins-slave/workspace/Lucene-Solr-Tests-6.0/solr/build/solr-core/test/J2/temp/solr.handler.TestReplicationHandlerBackup_7ED0D6B9B46B6F22-001/solr-instance-002/./collection1
   [junit4]   2> 183151 INFO  (TEST-TestReplicationHandlerBackup.doTestBackup-seed#[7ED0D6B9B46B6F22]) [    ] o.a.s.c.CorePropertiesLocator Found 1 core definitions
   [junit4]   2> 183151 INFO  (coreLoadExecutor-604-thread-1) [    ] o.a.s.c.SolrResourceLoader new SolrResourceLoader for directory: '/x1/jenkins/jenkins-slave/workspace/Lucene-Solr-Tests-6.0/solr/build/solr-core/test/J2/temp/solr.handler.TestReplicationHandlerBackup_7ED0D6B9B46B6F22-001/solr-instance-002/collection1'
   [junit4]   2> 183153 INFO  (TEST-TestReplicationHandlerBackup.doTestBackup-seed#[7ED0D6B9B46B6F22]) [    ] o.a.s.s.SolrDispatchFilter user.dir=/x1/jenkins/jenkins-slave/workspace/Lucene-Solr-Tests-6.0/solr/build/solr-core/test/J2
   [junit4]   2> 183153 INFO  (TEST-TestReplicationHandlerBackup.doTestBackup-seed#[7ED0D6B9B46B6F22]) [    ] o.a.s.s.SolrDispatchFilter SolrDispatchFilter.init() done
   [junit4]   2> 183153 INFO  (coreLoadExecutor-604-thread-1) [    ] o.a.s.c.SolrResourceLoader JNDI not configured for solr (NoInitialContextEx)
   [junit4]   2> 183153 INFO  (coreLoadExecutor-604-thread-1) [    ] o.a.s.c.SolrResourceLoader solr home defaulted to 'solr/' (could not find system property or JNDI)
   [junit4]   2> 183157 INFO  (coreLoadExecutor-604-thread-1) [    ] o.a.s.c.SolrConfig current version of requestparams : -1
   [junit4]   2> 183159 INFO  (coreLoadExecutor-604-thread-1) [    ] o.a.s.c.SolrConfig Using Lucene MatchVersion: 6.0.1
   [junit4]   2> 183164 INFO  (coreLoadExecutor-604-thread-1) [    ] o.a.s.c.SolrConfig Loaded SolrConfig: solrconfig.xml
   [junit4]   2> 183166 INFO  (coreLoadExecutor-604-thread-1) [    ] o.a.s.s.IndexSchema [collection1] Schema name=test
   [junit4]   2> 183168 INFO  (coreLoadExecutor-604-thread-1) [    ] o.a.s.s.IndexSchema unique key field: id
   [junit4]   2> 183170 INFO  (coreLoadExecutor-604-thread-1) [    ] o.a.s.c.ConfigSetProperties Did not find ConfigSet properties, assuming default properties: Can't find resource 'configsetprops.json' in classpath or '/x1/jenkins/jenkins-slave/workspace/Lucene-Solr-Tests-6.0/solr/build/solr-core/test/J2/temp/solr.handler.TestReplicationHandlerBackup_7ED0D6B9B46B6F22-001/solr-instance-002/collection1'
   [junit4]   2> 183170 INFO  (coreLoadExecutor-604-thread-1) [    ] o.a.s.c.CoreContainer Creating SolrCore 'collection1' using configuration from instancedir /x1/jenkins/jenkins-slave/workspace/Lucene-Solr-Tests-6.0/solr/build/solr-core/test/J2/temp/solr.handler.TestReplicationHandlerBackup_7ED0D6B9B46B6F22-001/solr-instance-002/./collection1
   [junit4]   2> 183170 INFO  (coreLoadExecutor-604-thread-1) [    x:collection1] o.a.s.c.SolrCore org.apache.solr.core.MockDirectoryFactory
   [junit4]   2> 183170 INFO  (coreLoadExecutor-604-thread-1) [    x:collection1] o.a.s.c.SolrCore [[collection1] ] Opening new SolrCore at [/x1/jenkins/jenkins-slave/workspace/Lucene-Solr-Tests-6.0/solr/build/solr-core/test/J2/temp/solr.handler.TestReplicationHandlerBackup_7ED0D6B9B46B6F22-001/solr-instance-002/collection1], dataDir=[/x1/jenkins/jenkins-slave/workspace/Lucene-Solr-Tests-6.0/solr/build/solr-core/test/J2/temp/solr.handler.TestReplicationHandlerBackup_7ED0D6B9B46B6F22-001/solr-instance-002/./collection1/data/]
   [junit4]   2> 183170 INFO  (coreLoadExecutor-604-thread-1) [    x:collection1] o.a.s.c.SolrCore JMX monitoring not detected for core: collection1
   [junit4]   2> 183171 INFO  (coreLoadExecutor-604-thread-1) [    x:collection1] o.a.s.c.CachingDirectoryFactory return new directory for /x1/jenkins/jenkins-slave/workspace/Lucene-Solr-Tests-6.0/solr/build/solr-core/test/J2/temp/solr.handler.TestReplicationHandlerBackup_7ED0D6B9B46B6F22-001/solr-instance-002/./collection1/data
   [junit4]   2> 183171 INFO  (coreLoadExecutor-604-thread-1) [    x:collection1] o.a.s.c.SolrCore New index directory detected: old=null new=/x1/jenkins/jenkins-slave/workspace/Lucene-Solr-Tests-6.0/solr/build/solr-core/test/J2/temp/solr.handler.TestReplicationHandlerBackup_7ED0D6B9B46B6F22-001/solr-instance-002/./collection1/data/index/
   [junit4]   2> 183171 WARN  (coreLoadExecutor-604-thread-1) [    x:collection1] o.a.s.c.SolrCore [collection1] Solr index directory '/x1/jenkins/jenkins-slave/workspace/Lucene-Solr-Tests-6.0/solr/build/solr-core/test/J2/temp/solr.handler.TestReplicationHandlerBackup_7ED0D6B9B46B6F22-001/solr-instance-002/./collection1/data/index' doesn't exist. Creating new index...
   [junit4]   2> 183171 INFO  (coreLoadExecutor-604-thread-1) [    x:collection1] o.a.s.c.CachingDirectoryFactory return new directory for /x1/jenkins/jenkins-slave/workspace/Lucene-Solr-Tests-6.0/solr/build/solr-core/test/J2/temp/solr.handler.TestReplicationHandlerBackup_7ED0D6B9B46B6F22-001/solr-instance-002/./collection1/data/index
   [junit4]   2> 183171 INFO  (coreLoadExecutor-604-thread-1) [    x:collection1] o.a.s.u.RandomMergePolicy RandomMergePolicy wrapping class org.apache.lucene.index.LogDocMergePolicy: [LogDocMergePolicy: minMergeSize=1000, mergeFactor=34, maxMergeSize=9223372036854775807, maxMergeSizeForForcedMerge=9223372036854775807, calibrateSizeByDeletes=true, maxMergeDocs=2147483647, maxCFSSegmentSizeMB=8.796093022207999E12, noCFSRatio=0.1779809424777133]
   [junit4]   2> 183172 INFO  (coreLoadExecutor-604-thread-1) [    x:collection1] o.a.s.c.SolrDeletionPolicy SolrDeletionPolicy.onCommit: commits: num=1
   [junit4]   2> 	commit{dir=MockDirectoryWrapper(RAMDirectory@6d0d82c9 lockFactory=org.apache.lucene.store.SingleInstanceLockFactory@657d6360),segFN=segments_1,generation=1}
   [junit4]   2> 183172 INFO  (coreLoadExecutor-604-thread-1) [    x:collection1] o.a.s.c.SolrDeletionPolicy newest commit generation = 1
   [junit4]   2> 183172 INFO  (OldIndexDirectoryCleanupThreadForCore-collection1) [    x:collection1] o.a.s.c.SolrCore Looking for old index directories to cleanup for core collection1 in /x1/jenkins/jenkins-slave/workspace/Lucene-Solr-Tests-6.0/solr/build/solr-core/test/J2/temp/solr.handler.TestReplicationHandlerBackup_7ED0D6B9B46B6F22-001/solr-instance-002/./collection1/data/
   [junit4]   2> 183173 INFO  (coreLoadExecutor-604-thread-1) [    x:collection1] o.a.s.c.SolrCore no updateRequestProcessorChain defined as default, creating implicit default
   [junit4]   2> 183174 INFO  (coreLoadExecutor-604-thread-1) [    x:collection1] o.a.s.h.l.XMLLoader xsltCacheLifetimeSeconds=60
   [junit4]   2> 183175 INFO  (coreLoadExecutor-604-thread-1) [    x:collection1] o.a.s.h.l.XMLLoader xsltCacheLifetimeSeconds=60
   [junit4]   2> 183175 INFO  (coreLoadExecutor-604-thread-1) [    x:collection1] o.a.s.h.l.XMLLoader xsltCacheLifetimeSeconds=60
   [junit4]   2> 183176 INFO  (coreLoadExecutor-604-thread-1) [    x:collection1] o.a.s.h.l.XMLLoader xsltCacheLifetimeSeconds=60
   [junit4]   2> 183177 INFO  (coreLoadExecutor-604-thread-1) [    x:collection1] o.a.s.c.RequestHandlers Registered paths: /admin/mbeans,standard,/update/csv,/sql,/update/json/docs,/admin/luke,/export,/admin/segments,/get,/admin/system,/replication,/admin/properties,/config,/stream,/schema,/admin/plugins,/admin/logging,/update/json,/admin/ping,/admin/threads,/update,/admin/file
   [junit4]   2> 183177 INFO  (coreLoadExecutor-604-thread-1) [    x:collection1] o.a.s.c.SolrCore Using default statsCache cache: org.apache.solr.search.stats.LocalStatsCache
   [junit4]   2> 183177 INFO  (coreLoadExecutor-604-thread-1) [    x:collection1] o.a.s.u.CommitTracker Hard AutoCommit: disabled
   [junit4]   2> 183177 INFO  (coreLoadExecutor-604-thread-1) [    x:collection1] o.a.s.u.CommitTracker Soft AutoCommit: disabled
   [junit4]   2> 183177 INFO  (coreLoadExecutor-604-thread-1) [    x:collection1] o.a.s.u.RandomMergePolicy RandomMergePolicy wrapping class org.apache.lucene.index.TieredMergePolicy: [TieredMergePolicy: maxMergeAtOnce=27, maxMergeAtOnceExplicit=27, maxMergedSegmentMB=95.455078125, floorSegmentMB=1.0712890625, forceMergeDeletesPctAllowed=24.9022402328125, segmentsPerTier=47.0, maxCFSSegmentSizeMB=8.796093022207999E12, noCFSRatio=0.48216421900321715
   [junit4]   2> 183177 INFO  (coreLoadExecutor-604-thread-1) [    x:collection1] o.a.s.c.SolrDeletionPolicy SolrDeletionPolicy.onInit: commits: num=1
   [junit4]   2> 	commit{dir=MockDirectoryWrapper(RAMDirectory@6d0d82c9 lockFactory=org.apache.lucene.store.SingleInstanceLockFactory@657d6360),segFN=segments_1,generation=1}
   [junit4]   2> 183177 INFO  (coreLoadExecutor-604-thread-1) [    x:collection1] o.a.s.c.SolrDeletionPolicy newest commit generation = 1
   [junit4]   2> 183177 INFO  (coreLoadExecutor-604-thread-1) [    x:collection1] o.a.s.s.SolrIndexSearcher Opening [Searcher@34f5b04b[collection1] main]
   [junit4]   2> 183178 INFO  (coreLoadExecutor-604-thread-1) [    x:collection1] o.a.s.r.ManagedResourceStorage File-based storage initialized to use dir: /x1/jenkins/jenkins-slave/workspace/Lucene-Solr-Tests-6.0/solr/build/solr-core/test/J2/temp/solr.handler.TestReplicationHandlerBackup_7ED0D6B9B46B6F22-001/solr-instance-002/collection1/conf
   [junit4]   2> 183178 INFO  (coreLoadExecutor-604-thread-1) [    x:collection1] o.a.s.r.RestManager Initializing RestManager with initArgs: {storageDir=/x1/jenkins/jenkins-slave/workspace/Lucene-Solr-Tests-6.0/solr/build/solr-core/test/J2/temp/solr.handler.TestReplicationHandlerBackup_7ED0D6B9B46B6F22-001/solr-instance-002/collection1/conf}
   [junit4]   2> 183178 INFO  (coreLoadExecutor-604-thread-1) [    x:collection1] o.a.s.r.ManagedResourceStorage Reading _rest_managed.json using file:dir=/x1/jenkins/jenkins-slave/workspace/Lucene-Solr-Tests-6.0/solr/build/solr-core/test/J2/temp/solr.handler.TestReplicationHandlerBackup_7ED0D6B9B46B6F22-001/solr-instance-002/collection1/conf
   [junit4]   2> 183178 INFO  (coreLoadExecutor-604-thread-1) [    x:collection1] o.a.s.r.RestManager Initializing 0 registered ManagedResources
   [junit4]   2> 183178 INFO  (coreLoadExecutor-604-thread-1) [    x:collection1] o.a.s.h.ReplicationHandler Replication enabled for following config files: schema-replication2.xml:schema.xml
   [junit4]   2> 183178 INFO  (coreLoadExecutor-604-thread-1) [    x:collection1] o.a.s.h.ReplicationHandler Commits will be reserved for  10000
   [junit4]   2> 183178 INFO  (searcherExecutor-605-thread-1-processing-x:collection1) [    x:collection1] o.a.s.c.SolrCore [collection1] Registered new searcher Searcher@34f5b04b[collection1] main{ExitableDirectoryReader(UninvertingDirectoryReader())}
   [junit4]   2> 183178 INFO  (coreLoadExecutor-604-thread-1) [    x:collection1] o.a.s.c.CoreContainer registering core: collection1
   [junit4]   2> 183656 INFO  (qtp1762218578-2717) [    x:collection1] o.a.s.u.DirectUpdateHandler2 [collection1] REMOVING ALL DOCUMENTS FROM INDEX
   [junit4]   2> 183658 INFO  (qtp1762218578-2717) [    x:collection1] o.a.s.u.p.LogUpdateProcessorFactory [collection1]  webapp=/solr path=/update params={wt=javabin&version=2}{deleteByQuery=*:*} 0 1
   [junit4]   2> 183661 INFO  (qtp1762218578-2722) [    x:collection1] o.a.s.u.p.LogUpdateProcessorFactory [collection1]  webapp=/solr path=/update params={wt=javabin&version=2}{add=[0]} 0 0
   [junit4]   2> 183663 INFO  (qtp1762218578-2719) [    x:collection1] o.a.s.u.p.LogUpdateProcessorFactory [collection1]  webapp=/solr path=/update params={wt=javabin&version=2}{add=[1]} 0 0
   [junit4]   2> 183665 INFO  (qtp1762218578-2718) [    x:collection1] o.a.s.u.p.LogUpdateProcessorFactory [collection1]  webapp=/solr path=/update params={wt=javabin&version=2}{add=[2]} 0 0
   [junit4]   2> 183666 INFO  (qtp1762218578-2721) [    x:collection1] o.a.s.u.p.LogUpdateProcessorFactory [collection1]  webapp=/solr path=/update params={wt=javabin&version=2}{add=[3]} 0 0
   [junit4]   2> 183668 INFO  (qtp1762218578-2715) [    x:collection1] o.a.s.u.p.LogUpdateProcessorFactory [collection1]  webapp=/solr path=/update params={wt=javabin&version=2}{add=[4]} 0 0
   [junit4]   2> 183670 INFO  (qtp1762218578-2717) [    x:collection1] o.a.s.u.p.LogUpdateProcessorFactory [collection1]  webapp=/solr path=/update params={wt=javabin&version=2}{add=[5]} 0 0
   [junit4]   2> 183672 INFO  (qtp1762218578-2722) [    x:collection1] o.a.s.u.p.LogUpdateProcessorFactory [collection1]  webapp=/solr path=/update params={wt=javabin&version=2}{add=[6]} 0 0
   [junit4]   2> 183674 INFO  (qtp1762218578-2719) [    x:collection1] o.a.s.u.p.LogUpdateProcessorFactory [collection1]  webapp=/solr path=/update params={wt=javabin&version=2}{add=[7]} 0 0
   [junit4]   2> 183675 INFO  (qtp1762218578-2718) [    x:collection1] o.a.s.u.p.LogUpdateProcessorFactory [collection1]  webapp=/solr path=/update params={wt=javabin&version=2}{add=[8]} 0 0
   [junit4]   2> 183677 INFO  (qtp1762218578-2718) [    x:collection1] o.a.s.u.p.LogUpdateProcessorFactory [collection1]  webapp=/solr path=/update params={wt=javabin&version=2}{add=[9]} 0 0
   [junit4]   2> 183679 INFO  (qtp1762218578-2715) [    x:collection1] o.a.s.u.p.LogUpdateProcessorFactory [collection1]  webapp=/solr path=/update params={wt=javabin&version=2}{add=[10]} 0 0
   [junit4]   2> 183680 INFO  (qtp1762218578-2717) [    x:collection1] o.a.s.u.p.LogUpdateProcessorFactory [collection1]  webapp=/solr path=/update params={wt=javabin&version=2}{add=[11]} 0 0
   [junit4]   2> 183682 INFO  (qtp1762218578-2722) [    x:collection1] o.a.s.u.p.LogUpdateProcessorFactory [collection1]  webapp=/solr path=/update params={wt=javabin&version=2}{add=[12]} 0 0
   [junit4]   2> 183684 INFO  (qtp1762218578-2719) [    x:collection1] o.a.s.u.p.LogUpdateProcessorFactory [collection1]  webapp=/solr path=/update params={wt=javabin&version=2}{add=[13]} 0 0
   [junit4]   2> 183685 INFO  (qtp1762218578-2721) [    x:collection1] o.a.s.u.p.LogUpdateProcessorFactory [collection1]  webapp=/solr path=/update params={wt=javabin&version=2}{add=[14]} 0 0
   [junit4]   2> 183687 INFO  (qtp1762218578-2721) [    x:collection1] o.a.s.u.p.LogUpdateProcessorFactory [collection1]  webapp=/solr path=/update params={wt=javabin&version=2}{add=[15]} 0 0
   [junit4]   2> 183689 INFO  (qtp1762218578-2715) [    x:collection1] o.a.s.u.p.LogUpdateProcessorFactory [collection1]  webapp=/solr path=/update params={wt=javabin&version=2}{add=[16]} 0 0
   [junit4]   2> 183690 INFO  (qtp1762218578-2715) [    x:collection1] o.a.s.u.p.LogUpdateProcessorFactory [collection1]  webapp=/solr path=/update params={wt=javabin&version=2}{add=[17]} 0 0
   [junit4]   2> 183692 INFO  (qtp1762218578-2715) [    x:collection1] o.a.s.u.p.LogUpdateProcessorFactory [collection1]  webapp=/solr path=/update params={wt=javabin&version=2}{add=[18]} 0 0
   [junit4]   2> 183693 INFO  (qtp1762218578-2715) [    x:collection1] o.a.s.u.p.LogUpdateProcessorFactory [collection1]  webapp=/solr path=/update params={wt=javabin&version=2}{add=[19]} 0 0
   [junit4]   2> 183695 INFO  (qtp1762218578-2718) [    x:collection1] o.a.s.u.p.LogUpdateProcessorFactory [collection1]  webapp=/solr path=/update params={wt=javabin&version=2}{add=[20]} 0 0
   [junit4]   2> 183697 INFO  (qtp1762218578-2718) [    x:collection1] o.a.s.u.p.LogUpdateProcessorFactory [collection1]  webapp=/solr path=/update params={wt=javabin&version=2}{add=[21]} 0 0
   [junit4]   2> 183698 INFO  (qtp1762218578-2717) [    x:collection1] o.a.s.u.p.LogUpdateProcessorFactory [collection1]  webapp=/solr path=/update params={wt=javabin&version=2}{add=[22]} 0 0
   [junit4]   2> 183700 INFO  (qtp1762218578-2722) [    x:collection1] o.a.s.u.p.LogUpdateProcessorFactory [collection1]  webapp=/solr path=/update params={wt=javabin&version=2}{add=[23]} 0 0
   [junit4]   2> 183702 INFO  (qtp1762218578-2719) [    x:collection1] o.a.s.u.p.LogUpdateProcessorFactory [collection1]  webapp=/solr path=/update params={wt=javabin&version=2}{add=[24]} 0 0
   [junit4]   2> 183704 INFO  (qtp1762218578-2719) [    x:collection1] o.a.s.u.p.LogUpdateProcessorFactory [collection1]  webapp=/solr path=/update params={wt=javabin&version=2}{add=[25]} 0 0
   [junit4]   2> 183705 INFO  (qtp1762218578-2721) [    x:collection1] o.a.s.u.p.LogUpdateProcessorFactory [collection1]  webapp=/solr path=/update params={wt=javabin&version=2}{add=[26]} 0 0
   [junit4]   2> 183707 INFO  (qtp1762218578-2721) [    x:collection1] o.a.s.u.p.LogUpdateProcessorFactory [collection1]  webapp=/solr path=/update params={wt=javabin&version=2}{add=[27]} 0 0
   [junit4]   2> 183709 INFO  (qtp1762218578-2717) [    x:collection1] o.a.s.u.p.LogUpdateProcessorFactory [collection1]  webapp=/solr path=/update params={wt=javabin&version=2}{add=[28]} 0 0
   [junit4]   2> 183710 INFO  (qtp1762218578-2722) [    x:collection1] o.a.s.u.p.LogUpdateProcessorFactory [collection1]  webapp=/solr path=/update params={wt=javabin&version=2}{add=[29]} 0 0
   [junit4]   2> 183712 INFO  (qtp1762218578-2715) [    x:collection1] o.a.s.u.p.LogUpdateProcessorFactory [collection1]  webapp=/solr path=/update params={wt=javabin&version=2}{add=[30]} 0 0
   [junit4]   2> 183714 INFO  (qtp1762218578-2715) [    x:collection1] o.a.s.u.p.LogUpdateProcessorFactory [collection1]  webapp=/solr path=/update params={wt=javabin&version=2}{add=[31]} 0 0
   [junit4]   2> 183715 INFO  (qtp1762218578-2718) [    x:collection1] o.a.s.u.p.LogUpdateProcessorFactory [collection1]  webapp=/solr path=/update params={wt=javabin&version=2}{add=[32]} 0 0
   [junit4]   2> 183717 INFO  (qtp1762218578-2718) [    x:collection1] o.a.s.u.p.LogUpdateProcessorFactory [collection1]  webapp=/solr path=/update params={wt=javabin&version=2}{add=[33]} 0 0
   [junit4]   2> 183719 INFO  (qtp1762218578-2717) [    x:collection1] o.a.s.u.p.LogUpdateProcessorFactory [collection1]  webapp=/solr path=/update params={wt=javabin&version=2}{add=[34]} 0 0
   [junit4]   2> 183720 INFO  (qtp1762218578-2722) [    x:collection1] o.a.s.u.DirectUpdateHandler2 start commit{,optimize=false,openSearcher=true,waitSearcher=true,expungeDeletes=false,softCommit=false,prepareCommit=false}
   [junit4]   2> 183722 INFO  (qtp1762218578-2722) [    x:collection1] o.a.s.c.SolrDeletionPolicy SolrDeletionPolicy.onCommit: commits: num=2
   [junit4]   2> 	commit{dir=MockDirectoryWrapper(RAMDirectory@6d0d82c9 lockFactory=org.apache.lucene.store.SingleInstanceLockFactory@657d6360),segFN=segments_1,generation=1}
   [junit4]   2> 	commit{dir=MockDirectoryWrapper(RAMDirectory@6d0d82c9 lockFactory=org.apache.lucene.store.SingleInstanceLockFactory@657d6360),segFN=segments_2,generation=2}
   [junit4]   2> 183723 INFO  (qtp1762218578-2722) [    x:collection1] o.a.s.c.SolrDeletionPolicy newest commit generation = 2
   [junit4]   2> 183724 INFO  (qtp1762218578-2722) [    x:collection1] o.a.s.s.SolrIndexSearcher Opening [Searcher@37ac5e47[collection1] main]
   [junit4]   2> 183724 INFO  (qtp1762218578-2722) [    x:collection1] o.a.s.u.DirectUpdateHandler2 end_commit_flush
   [junit4]   2> 183724 INFO  (searcherExecutor-605-thread-1-processing-x:collection1) [    x:collection1] o.a.s.c.SolrCore [collection1] Registered new searcher Searcher@37ac5e47[collection1] main{ExitableDirectoryReader(UninvertingDirectoryReader(Uninverting(_0(6.0.1):C35)))}
   [junit4]   2> 183724 INFO  (qtp1762218578-2722) [    x:collection1] o.a.s.u.p.LogUpdateProcessorFactory [collection1]  webapp=/solr path=/update params={waitSearcher=true&commit=true&softCommit=false&wt=javabin&version=2}{commit=} 0 3
   [junit4]   2> 183735 INFO  (Thread-2065) [    x:collection1] o.a.s.h.SnapShooter Creating backup snapshot <not named> at /x1/jenkins/jenkins-slave/workspace/Lucene-Solr-Tests-6.0/solr/build/solr-core/test/J2/temp/solr.handler.TestReplicationHandlerBackup_7ED0D6B9B46B6F22-001/solr-instance-002/./collection1/data/
   [junit4]   2> 183743 INFO  (qtp1762218578-2715) [    x:collection1] o.a.s.c.S.Request [collection1]  webapp=/solr path=/replication params={command=backup} status=0 QTime=3
   [junit4]   2> 183743 INFO  (Thread-2066) [    x:collection1] o.a.s.h.SnapShooter Creating backup snapshot <not named> at /x1/jenkins/jenkins-slave/workspace/Lucene-Solr-Tests-6.0/solr/build/solr-core/test/J2/temp/solr.handler.TestReplicationHandlerBackup_7ED0D6B9B46B6F22-001/solr-instance-002/./collection1/data/
   [junit4]   2> 183744 INFO  (Thread-2066) [    x:collection1] o.a.s.h.SnapShooter Done creating backup snapshot: <not named> at /x1/jenkins/jenkins-slave/workspace/Lucene-Solr-Tests-6.0/solr/build/solr-core/test/J2/temp/solr.handler.TestReplicationHandlerBackup_7ED0D6B9B46B6F22-001/solr-instance-002/./collection1/data/
   [junit4]   2> 183748 INFO  (qtp1762218578-2719) [    x:collection1] o.a.s.c.S.Request [collection1]  webapp=/solr path=/replication params={command=details} status=0 QTime=2
   [junit4]   2> 183750 ERROR (Thread-2065) [    x:collection1] o.a.s.h.SnapShooter Exception while creating snapshot
   [junit4]   2> java.nio.file.NoSuchFileException: /x1/jenkins/jenkins-slave/workspace/Lucene-Solr-Tests-6.0/solr/build/solr-core/test/J2/temp/solr.handler.TestReplicationHandlerBackup_7ED0D6B9B46B6F22-001/solr-instance-002/collection1/data/snapshot.20160516090902366/_0.tip
   [junit4]   2> 	at sun.nio.fs.UnixException.translateToIOException(UnixException.java:86)
   [junit4]   2> 	at sun.nio.fs.UnixException.rethrowAsIOException(UnixException.java:102)
   [junit4]   2> 	at sun.nio.fs.UnixException.rethrowAsIOException(UnixException.java:107)
   [junit4]   2> 	at sun.nio.fs.UnixFileSystemProvider.newByteChannel(UnixFileSystemProvider.java:214)
   [junit4]   2> 	at java.nio.file.spi.FileSystemProvider.newOutputStream(FileSystemProvider.java:434)
   [junit4]   2> 	at java.nio.file.Files.newOutputStream(Files.java:216)
   [junit4]   2> 	at org.apache.lucene.store.FSDirectory$FSIndexOutput.<init>(FSDirectory.java:408)
   [junit4]   2> 	at org.apache.lucene.store.FSDirectory$FSIndexOutput.<init>(FSDirectory.java:404)
   [junit4]   2> 	at org.apache.lucene.store.FSDirectory.createOutput(FSDirectory.java:253)
   [junit4]   2> 	at org.apache.lucene.store.Directory.copyFrom(Directory.java:154)
   [junit4]   2> 	at org.apache.solr.handler.SnapShooter.copyFiles(SnapShooter.java:203)
   [junit4]   2> 	at org.apache.solr.handler.SnapShooter.createSnapshot(SnapShooter.java:136)
   [junit4]   2> 	at org.apache.solr.handler.SnapShooter$1.run(SnapShooter.java:85)
   [junit4]   2> 184761 INFO  (qtp1762218578-2721) [    x:collection1] o.a.s.c.S.Request [collection1]  webapp=/solr path=/replication params={command=backup} status=0 QTime=4
   [junit4]   2> 184762 INFO  (Thread-2067) [    x:collection1] o.a.s.h.SnapShooter Creating backup snapshot <not named> at /x1/jenkins/jenkins-slave/workspace/Lucene-Solr-Tests-6.0/solr/build/solr-core/test/J2/temp/solr.handler.TestReplicationHandlerBackup_7ED0D6B9B46B6F22-001/solr-instance-002/./collection1/data/
   [junit4]   2> 184773 INFO  (qtp1762218578-2718) [    x:collection1] o.a.s.c.S.Request [collection1]  webapp=/solr path=/replication params={command=details} status=0 QTime=9
   [junit4]   2> 184773 INFO  (TEST-TestReplicationHandlerBackup.doTestBackup-seed#[7ED0D6B9B46B6F22]) [    ] o.a.s.SolrTestCaseJ4 ###Ending doTestBackup
   [junit4]   2> 184775 INFO  (Thread-2067) [    x:collection1] o.a.s.h.SnapShooter Done creating backup snapshot: <not named> at /x1/jenkins/jenkins-slave/workspace/Lucene-Solr-Tests-6.0/solr/build/solr-core/test/J2/temp/solr.handler.TestReplicationHandlerBackup_7ED0D6B9B46B6F22-001/solr-instance-002/./collection1/data/
   [junit4]   2> 184778 INFO  (TEST-TestReplicationHandlerBackup.doTestBackup-seed#[7ED0D6B9B46B6F22]) [    ] o.e.j.s.ServerConnector Stopped ServerConnector@6a1419b9{HTTP/1.1,[http/1.1]}{127.0.0.1:0}
   [junit4]   2> 184778 INFO  (TEST-TestReplicationHandlerBackup.doTestBackup-seed#[7ED0D6B9B46B6F22]) [    ] o.a.s.c.CoreContainer Shutting down CoreContainer instance=1485222738
   [junit4]   2> 184782 INFO  (coreCloseExecutor-609-thread-1) [    x:collection1] o.a.s.c.SolrCore [collection1]  CLOSING SolrCore org.apache.solr.core.SolrCore@400d4471
   [junit4]   2> 184782 INFO  (coreCloseExecutor-609-thread-1) [    x:collection1] o.a.s.u.DirectUpdateHandler2 closing DirectUpdateHandler2{commits=1,autocommits=0,soft autocommits=0,optimizes=0,rollbacks=0,expungeDeletes=0,docsPending=0,adds=0,deletesById=0,deletesByQuery=0,errors=0,cumulative_adds=35,cumulative_deletesById=0,cumulative_deletesByQuery=1,cumulative_errors=0}
   [junit4]   2> 184782 INFO  (coreCloseExecutor-609-thread-1) [    x:collection1] o.a.s.u.SolrCoreState Closing SolrCoreState
   [junit4]   2> 184782 INFO  (coreCloseExecutor-609-thread-1) [    x:collection1] o.a.s.u.DefaultSolrCoreState SolrCoreState ref count has reached 0 - closing IndexWriter
   [junit4]   2> 184782 INFO  (coreCloseExecutor-609-thread-1) [    x:collection1] o.a.s.u.DefaultSolrCoreState closing IndexWriter with IndexWriterCloser
   [junit4]   2> 184790 INFO  (coreCloseExecutor-609-thread-1) [    x:collection1] o.a.s.c.SolrCore [collection1] Closing main searcher on request.
   [junit4]   2> 184790 INFO  (coreCloseExecutor-609-thread-1) [    x:collection1] o.a.s.c.CachingDirectoryFactory Closing MockDirectoryFactory - 2 directories currently being tracked
   [junit4]   2> 184790 INFO  (coreCloseExecutor-609-thread-1) [    x:collection1] o.a.s.c.CachingDirectoryFactory looking to close /x1/jenkins/jenkins-slave/workspace/Lucene-Solr-Tests-6.0/solr/build/solr-core/test/J2/temp/solr.handler.TestReplicationHandlerBackup_7ED0D6B9B46B6F22-001/solr-instance-002/./collection1/data/index [CachedDir<<refCount=0;path=/x1/jenkins/jenkins-slave/workspace/Lucene-Solr-Tests-6.0/solr/build/solr-core/test/J2/temp/solr.handler.TestReplicationHandlerBackup_7ED0D6B9B46B6F22-001/solr-instance-002/./collection1/data/index;done=false>>]
   [junit4]   2> 184790 INFO  (coreCloseExecutor-609-thread-1) [    x:collection1] o.a.s.c.CachingDirectoryFactory Closing directory: /x1/jenkins/jenkins-slave/workspace/Lucene-Solr-Tests-6.0/solr/build/solr-core/test/J2/temp/solr.handler.TestReplicationHandlerBackup_7ED0D6B9B46B6F22-001/solr-instance-002/./collection1/data/index
   [junit4]   2> 184790 INFO  (coreCloseExecutor-609-thread-1) [    x:collection1] o.a.s.c.CachingDirectoryFactory looking to close /x1/jenkins/jenkins-slave/workspace/Lucene-Solr-Tests-6.0/solr/build/solr-core/test/J2/temp/solr.handler.TestReplicationHandlerBackup_7ED0D6B9B46B6F22-001/solr-instance-002/./collection1/data [CachedDir<<refCount=0;path=/x1/jenkins/jenkins-slave/workspace/Lucene-Solr-Tests-6.0/solr/build/solr-core/test/J2/temp/solr.handler.TestReplicationHandlerBackup_7ED0D6B9B46B6F22-001/solr-instance-002/./collection1/data;done=false>>]
   [junit4]   2> 184790 INFO  (coreCloseExecutor-609-thread-1) [    x:collection1] o.a.s.c.CachingDirectoryFactory Closing directory: /x1/jenkins/jenkins-slave/workspace/Lucene-Solr-Tests-6.0/solr/build/solr-core/test/J2/temp/solr.handler.TestReplicationHandlerBackup_7ED0D6B9B46B6F22-001/solr-instance-002/./collection1/data
   [junit4]   2> 184791 INFO  (TEST-TestReplicationHandlerBackup.doTestBackup-seed#[7ED0D6B9B46B6F22]) [    ] o.e.j.s.h.ContextHandler Stopped o.e.j.s.ServletContextHandler@5a3c1b2f{/solr,null,UNAVAILABLE}
   [junit4]   2> NOTE: reproduce with: ant test  -Dtestcase=TestReplicationHandlerBackup -Dtests.method=doTestBackup -Dtests.seed=7ED0D6B9B46B6F22 -Dtests.multiplier=2 -Dtests.slow=true -Dtests.locale=ar -Dtests.timezone=Africa/Kinshasa -Dtests.asserts=true -Dtests.file.encoding=ISO-8859-1
   [junit4] FAILURE 1.66s J2 | TestReplicationHandlerBackup.doTestBackup <<<
   [junit4]    > Throwable #1: java.lang.AssertionError: Failed to create backup
   [junit4]    > 	at __randomizedtesting.SeedInfo.seed([7ED0D6B9B46B6F22:3F5BF6DC93D59C6D]:0)
   [junit4]    > 	at org.apache.solr.handler.CheckBackupStatus.fetchStatus(CheckBackupStatus.java:50)
   [junit4]    > 	at org.apache.solr.handler.TestReplicationHandlerBackup.doTestBackup(TestReplicationHandlerBackup.java:200)
   [junit4]    > 	at java.lang.Thread.run(Thread.java:745)
   [junit4]   2> 184794 INFO  (SUITE-TestReplicationHandlerBackup-seed#[7ED0D6B9B46B6F22]-worker) [    ] o.a.s.SolrTestCaseJ4 ###deleteCore
   [junit4]   2> NOTE: leaving temporary files on disk at: /x1/jenkins/jenkins-slave/workspace/Lucene-Solr-Tests-6.0/solr/build/solr-core/test/J2/temp/solr.handler.TestReplicationHandlerBackup_7ED0D6B9B46B6F22-001
   [junit4]   2> NOTE: test params are: codec=CheapBastard, sim=ClassicSimilarity, locale=ar, timezone=Africa/Kinshasa
   [junit4]   2> NOTE: Linux 3.13.0-85-generic amd64/Oracle Corporation 1.8.0_74 (64-bit)/cpus=4,threads=1,free=227466640,total=397934592
   [junit4]   2> NOTE: All tests run in this JVM: [TestStressReorder, HighlighterConfigTest, ConnectionManagerTest, TestSchemaNameResource, DistributedDebugComponentTest, GraphQueryTest, TestReversedWildcardFilterFactory, TestSimpleQParserPlugin, TestLeaderInitiatedRecoveryThread, ConjunctionSolrSpellCheckerTest, TestJettySolrRunner, HdfsCollectionsAPIDistributedZkTest, TestRecoveryHdfs, CleanupOldIndexTest, CollectionStateFormat2Test, TestConfigSetsAPIZkFailure, TestSort, CloneFieldUpdateProcessorFactoryTest, TestFuzzyAnalyzedSuggestions, ScriptEngineTest, TestReplicationHandlerBackup]
   [junit4] Completed [43/580 (1!)] on J2 in 4.30s, 2 tests, 1 failure <<< FAILURES!

[...truncated 1742 lines...]
BUILD FAILED
/x1/jenkins/jenkins-slave/workspace/Lucene-Solr-Tests-6.0/build.xml:740: The following error occurred while executing this line:
/x1/jenkins/jenkins-slave/workspace/Lucene-Solr-Tests-6.0/build.xml:684: The following error occurred while executing this line:
/x1/jenkins/jenkins-slave/workspace/Lucene-Solr-Tests-6.0/build.xml:59: The following error occurred while executing this line:
/x1/jenkins/jenkins-slave/workspace/Lucene-Solr-Tests-6.0/solr/build.xml:233: The following error occurred while executing this line:
/x1/jenkins/jenkins-slave/workspace/Lucene-Solr-Tests-6.0/solr/common-build.xml:527: The following error occurred while executing this line:
/x1/jenkins/jenkins-slave/workspace/Lucene-Solr-Tests-6.0/lucene/common-build.xml:1457: The following error occurred while executing this line:
/x1/jenkins/jenkins-slave/workspace/Lucene-Solr-Tests-6.0/lucene/common-build.xml:1014: There were test failures: 580 suites (10 ignored), 2318 tests, 1 failure, 85 ignored (70 assumptions) [seed: 7ED0D6B9B46B6F22]

Total time: 51 minutes 45 seconds
Build step 'Invoke Ant' marked build as failure
Archiving artifacts
Recording test results
Email was triggered for: Failure - Any
Sending email for trigger: Failure - Any




Mime
View raw message