lucene-dev mailing list archives

Site index · List index
Message view « Date » · « Thread »
Top « Date » · « Thread »
From Policeman Jenkins Server <jenk...@thetaphi.de>
Subject [JENKINS] Lucene-Solr-master-MacOSX (64bit/jdk1.8.0) - Build # 3240 - Failure!
Date Sun, 01 May 2016 01:31:52 GMT
Build: http://jenkins.thetaphi.de/job/Lucene-Solr-master-MacOSX/3240/
Java: 64bit/jdk1.8.0 -XX:-UseCompressedOops -XX:+UseConcMarkSweepGC

1 tests failed.
FAILED:  org.apache.solr.cloud.DistribDocExpirationUpdateProcessorTest.test

Error Message:
There are still nodes recoverying - waited for 45 seconds

Stack Trace:
java.lang.AssertionError: There are still nodes recoverying - waited for 45 seconds
	at __randomizedtesting.SeedInfo.seed([C208BCC85FD7D299:4A5C8312F12BBF61]:0)
	at org.junit.Assert.fail(Assert.java:93)
	at org.apache.solr.cloud.AbstractDistribZkTestBase.waitForRecoveriesToFinish(AbstractDistribZkTestBase.java:173)
	at org.apache.solr.cloud.AbstractFullDistribZkTestBase.waitForRecoveriesToFinish(AbstractFullDistribZkTestBase.java:858)
	at org.apache.solr.cloud.DistribDocExpirationUpdateProcessorTest.test(DistribDocExpirationUpdateProcessorTest.java:74)
	at sun.reflect.NativeMethodAccessorImpl.invoke0(Native Method)
	at sun.reflect.NativeMethodAccessorImpl.invoke(NativeMethodAccessorImpl.java:62)
	at sun.reflect.DelegatingMethodAccessorImpl.invoke(DelegatingMethodAccessorImpl.java:43)
	at java.lang.reflect.Method.invoke(Method.java:498)
	at com.carrotsearch.randomizedtesting.RandomizedRunner.invoke(RandomizedRunner.java:1764)
	at com.carrotsearch.randomizedtesting.RandomizedRunner$8.evaluate(RandomizedRunner.java:871)
	at com.carrotsearch.randomizedtesting.RandomizedRunner$9.evaluate(RandomizedRunner.java:907)
	at com.carrotsearch.randomizedtesting.RandomizedRunner$10.evaluate(RandomizedRunner.java:921)
	at org.apache.solr.BaseDistributedSearchTestCase$ShardsRepeatRule$ShardsFixedStatement.callStatement(BaseDistributedSearchTestCase.java:985)
	at org.apache.solr.BaseDistributedSearchTestCase$ShardsRepeatRule$ShardsStatement.evaluate(BaseDistributedSearchTestCase.java:960)
	at com.carrotsearch.randomizedtesting.rules.SystemPropertiesRestoreRule$1.evaluate(SystemPropertiesRestoreRule.java:57)
	at org.apache.lucene.util.TestRuleSetupTeardownChained$1.evaluate(TestRuleSetupTeardownChained.java:49)
	at org.apache.lucene.util.AbstractBeforeAfterRule$1.evaluate(AbstractBeforeAfterRule.java:45)
	at org.apache.lucene.util.TestRuleThreadAndTestName$1.evaluate(TestRuleThreadAndTestName.java:48)
	at org.apache.lucene.util.TestRuleIgnoreAfterMaxFailures$1.evaluate(TestRuleIgnoreAfterMaxFailures.java:64)
	at org.apache.lucene.util.TestRuleMarkFailure$1.evaluate(TestRuleMarkFailure.java:47)
	at com.carrotsearch.randomizedtesting.rules.StatementAdapter.evaluate(StatementAdapter.java:36)
	at com.carrotsearch.randomizedtesting.ThreadLeakControl$StatementRunner.run(ThreadLeakControl.java:367)
	at com.carrotsearch.randomizedtesting.ThreadLeakControl.forkTimeoutingTask(ThreadLeakControl.java:809)
	at com.carrotsearch.randomizedtesting.ThreadLeakControl$3.evaluate(ThreadLeakControl.java:460)
	at com.carrotsearch.randomizedtesting.RandomizedRunner.runSingleTest(RandomizedRunner.java:880)
	at com.carrotsearch.randomizedtesting.RandomizedRunner$5.evaluate(RandomizedRunner.java:781)
	at com.carrotsearch.randomizedtesting.RandomizedRunner$6.evaluate(RandomizedRunner.java:816)
	at com.carrotsearch.randomizedtesting.RandomizedRunner$7.evaluate(RandomizedRunner.java:827)
	at com.carrotsearch.randomizedtesting.rules.StatementAdapter.evaluate(StatementAdapter.java:36)
	at com.carrotsearch.randomizedtesting.rules.SystemPropertiesRestoreRule$1.evaluate(SystemPropertiesRestoreRule.java:57)
	at org.apache.lucene.util.AbstractBeforeAfterRule$1.evaluate(AbstractBeforeAfterRule.java:45)
	at com.carrotsearch.randomizedtesting.rules.StatementAdapter.evaluate(StatementAdapter.java:36)
	at org.apache.lucene.util.TestRuleStoreClassName$1.evaluate(TestRuleStoreClassName.java:41)
	at com.carrotsearch.randomizedtesting.rules.NoShadowingOrOverridesOnMethodsRule$1.evaluate(NoShadowingOrOverridesOnMethodsRule.java:40)
	at com.carrotsearch.randomizedtesting.rules.NoShadowingOrOverridesOnMethodsRule$1.evaluate(NoShadowingOrOverridesOnMethodsRule.java:40)
	at com.carrotsearch.randomizedtesting.rules.StatementAdapter.evaluate(StatementAdapter.java:36)
	at com.carrotsearch.randomizedtesting.rules.StatementAdapter.evaluate(StatementAdapter.java:36)
	at com.carrotsearch.randomizedtesting.rules.StatementAdapter.evaluate(StatementAdapter.java:36)
	at org.apache.lucene.util.TestRuleAssertionsRequired$1.evaluate(TestRuleAssertionsRequired.java:53)
	at org.apache.lucene.util.TestRuleMarkFailure$1.evaluate(TestRuleMarkFailure.java:47)
	at org.apache.lucene.util.TestRuleIgnoreAfterMaxFailures$1.evaluate(TestRuleIgnoreAfterMaxFailures.java:64)
	at org.apache.lucene.util.TestRuleIgnoreTestSuites$1.evaluate(TestRuleIgnoreTestSuites.java:54)
	at com.carrotsearch.randomizedtesting.rules.StatementAdapter.evaluate(StatementAdapter.java:36)
	at com.carrotsearch.randomizedtesting.ThreadLeakControl$StatementRunner.run(ThreadLeakControl.java:367)
	at java.lang.Thread.run(Thread.java:745)




Build Log:
[...truncated 10774 lines...]
   [junit4] Suite: org.apache.solr.cloud.DistribDocExpirationUpdateProcessorTest
   [junit4]   2> Creating dataDir: /Users/jenkins/workspace/Lucene-Solr-master-MacOSX/solr/build/solr-core/test/J1/temp/solr.cloud.DistribDocExpirationUpdateProcessorTest_C208BCC85FD7D299-001/init-core-data-001
   [junit4]   2> 588950 INFO  (SUITE-DistribDocExpirationUpdateProcessorTest-seed#[C208BCC85FD7D299]-worker) [    ] o.a.s.SolrTestCaseJ4 Randomized ssl (false) and clientAuth (false)
   [junit4]   2> 588950 INFO  (SUITE-DistribDocExpirationUpdateProcessorTest-seed#[C208BCC85FD7D299]-worker) [    ] o.a.s.BaseDistributedSearchTestCase Setting hostContext system property: /ej/
   [junit4]   2> 588953 INFO  (TEST-DistribDocExpirationUpdateProcessorTest.test-seed#[C208BCC85FD7D299]) [    ] o.a.s.c.ZkTestServer STARTING ZK TEST SERVER
   [junit4]   2> 588953 INFO  (Thread-1232) [    ] o.a.s.c.ZkTestServer client port:0.0.0.0/0.0.0.0:0
   [junit4]   2> 588953 INFO  (Thread-1232) [    ] o.a.s.c.ZkTestServer Starting server
   [junit4]   2> 589059 INFO  (TEST-DistribDocExpirationUpdateProcessorTest.test-seed#[C208BCC85FD7D299]) [    ] o.a.s.c.ZkTestServer start zk server on port:60947
   [junit4]   2> 589059 INFO  (TEST-DistribDocExpirationUpdateProcessorTest.test-seed#[C208BCC85FD7D299]) [    ] o.a.s.c.c.SolrZkClient Using default ZkCredentialsProvider
   [junit4]   2> 589060 INFO  (TEST-DistribDocExpirationUpdateProcessorTest.test-seed#[C208BCC85FD7D299]) [    ] o.a.s.c.c.ConnectionManager Waiting for client to connect to ZooKeeper
   [junit4]   2> 589073 INFO  (zkCallback-507-thread-1) [    ] o.a.s.c.c.ConnectionManager Watcher org.apache.solr.common.cloud.ConnectionManager@540d5b4b name:ZooKeeperConnection Watcher:127.0.0.1:60947 got event WatchedEvent state:SyncConnected type:None path:null path:null type:None
   [junit4]   2> 589073 INFO  (TEST-DistribDocExpirationUpdateProcessorTest.test-seed#[C208BCC85FD7D299]) [    ] o.a.s.c.c.ConnectionManager Client is connected to ZooKeeper
   [junit4]   2> 589074 INFO  (TEST-DistribDocExpirationUpdateProcessorTest.test-seed#[C208BCC85FD7D299]) [    ] o.a.s.c.c.SolrZkClient Using default ZkACLProvider
   [junit4]   2> 589074 INFO  (TEST-DistribDocExpirationUpdateProcessorTest.test-seed#[C208BCC85FD7D299]) [    ] o.a.s.c.c.SolrZkClient makePath: /solr
   [junit4]   2> 589078 INFO  (TEST-DistribDocExpirationUpdateProcessorTest.test-seed#[C208BCC85FD7D299]) [    ] o.a.s.c.c.SolrZkClient Using default ZkCredentialsProvider
   [junit4]   2> 589079 INFO  (TEST-DistribDocExpirationUpdateProcessorTest.test-seed#[C208BCC85FD7D299]) [    ] o.a.s.c.c.ConnectionManager Waiting for client to connect to ZooKeeper
   [junit4]   2> 589081 INFO  (zkCallback-508-thread-1) [    ] o.a.s.c.c.ConnectionManager Watcher org.apache.solr.common.cloud.ConnectionManager@73e9208a name:ZooKeeperConnection Watcher:127.0.0.1:60947/solr got event WatchedEvent state:SyncConnected type:None path:null path:null type:None
   [junit4]   2> 589081 INFO  (TEST-DistribDocExpirationUpdateProcessorTest.test-seed#[C208BCC85FD7D299]) [    ] o.a.s.c.c.ConnectionManager Client is connected to ZooKeeper
   [junit4]   2> 589081 INFO  (TEST-DistribDocExpirationUpdateProcessorTest.test-seed#[C208BCC85FD7D299]) [    ] o.a.s.c.c.SolrZkClient Using default ZkACLProvider
   [junit4]   2> 589081 INFO  (TEST-DistribDocExpirationUpdateProcessorTest.test-seed#[C208BCC85FD7D299]) [    ] o.a.s.c.c.SolrZkClient makePath: /collections/collection1
   [junit4]   2> 589084 INFO  (TEST-DistribDocExpirationUpdateProcessorTest.test-seed#[C208BCC85FD7D299]) [    ] o.a.s.c.c.SolrZkClient makePath: /collections/collection1/shards
   [junit4]   2> 589087 INFO  (TEST-DistribDocExpirationUpdateProcessorTest.test-seed#[C208BCC85FD7D299]) [    ] o.a.s.c.c.SolrZkClient makePath: /collections/control_collection
   [junit4]   2> 589090 INFO  (TEST-DistribDocExpirationUpdateProcessorTest.test-seed#[C208BCC85FD7D299]) [    ] o.a.s.c.c.SolrZkClient makePath: /collections/control_collection/shards
   [junit4]   2> 589093 INFO  (TEST-DistribDocExpirationUpdateProcessorTest.test-seed#[C208BCC85FD7D299]) [    ] o.a.s.c.AbstractZkTestCase put /Users/jenkins/workspace/Lucene-Solr-master-MacOSX/solr/core/src/test-files/solr/collection1/conf/solrconfig-doc-expire-update-processor.xml to /configs/conf1/solrconfig.xml
   [junit4]   2> 589094 INFO  (TEST-DistribDocExpirationUpdateProcessorTest.test-seed#[C208BCC85FD7D299]) [    ] o.a.s.c.c.SolrZkClient makePath: /configs/conf1/solrconfig.xml
   [junit4]   2> 589098 INFO  (TEST-DistribDocExpirationUpdateProcessorTest.test-seed#[C208BCC85FD7D299]) [    ] o.a.s.c.AbstractZkTestCase put /Users/jenkins/workspace/Lucene-Solr-master-MacOSX/solr/core/src/test-files/solr/collection1/conf/schema15.xml to /configs/conf1/schema.xml
   [junit4]   2> 589098 INFO  (TEST-DistribDocExpirationUpdateProcessorTest.test-seed#[C208BCC85FD7D299]) [    ] o.a.s.c.c.SolrZkClient makePath: /configs/conf1/schema.xml
   [junit4]   2> 589102 INFO  (TEST-DistribDocExpirationUpdateProcessorTest.test-seed#[C208BCC85FD7D299]) [    ] o.a.s.c.AbstractZkTestCase put /Users/jenkins/workspace/Lucene-Solr-master-MacOSX/solr/core/src/test-files/solr/collection1/conf/solrconfig.snippet.randomindexconfig.xml to /configs/conf1/solrconfig.snippet.randomindexconfig.xml
   [junit4]   2> 589102 INFO  (TEST-DistribDocExpirationUpdateProcessorTest.test-seed#[C208BCC85FD7D299]) [    ] o.a.s.c.c.SolrZkClient makePath: /configs/conf1/solrconfig.snippet.randomindexconfig.xml
   [junit4]   2> 589110 INFO  (TEST-DistribDocExpirationUpdateProcessorTest.test-seed#[C208BCC85FD7D299]) [    ] o.a.s.c.AbstractZkTestCase put /Users/jenkins/workspace/Lucene-Solr-master-MacOSX/solr/core/src/test-files/solr/collection1/conf/stopwords.txt to /configs/conf1/stopwords.txt
   [junit4]   2> 589110 INFO  (TEST-DistribDocExpirationUpdateProcessorTest.test-seed#[C208BCC85FD7D299]) [    ] o.a.s.c.c.SolrZkClient makePath: /configs/conf1/stopwords.txt
   [junit4]   2> 589113 INFO  (TEST-DistribDocExpirationUpdateProcessorTest.test-seed#[C208BCC85FD7D299]) [    ] o.a.s.c.AbstractZkTestCase put /Users/jenkins/workspace/Lucene-Solr-master-MacOSX/solr/core/src/test-files/solr/collection1/conf/protwords.txt to /configs/conf1/protwords.txt
   [junit4]   2> 589113 INFO  (TEST-DistribDocExpirationUpdateProcessorTest.test-seed#[C208BCC85FD7D299]) [    ] o.a.s.c.c.SolrZkClient makePath: /configs/conf1/protwords.txt
   [junit4]   2> 589119 INFO  (TEST-DistribDocExpirationUpdateProcessorTest.test-seed#[C208BCC85FD7D299]) [    ] o.a.s.c.AbstractZkTestCase put /Users/jenkins/workspace/Lucene-Solr-master-MacOSX/solr/core/src/test-files/solr/collection1/conf/currency.xml to /configs/conf1/currency.xml
   [junit4]   2> 589120 INFO  (TEST-DistribDocExpirationUpdateProcessorTest.test-seed#[C208BCC85FD7D299]) [    ] o.a.s.c.c.SolrZkClient makePath: /configs/conf1/currency.xml
   [junit4]   2> 589123 INFO  (TEST-DistribDocExpirationUpdateProcessorTest.test-seed#[C208BCC85FD7D299]) [    ] o.a.s.c.AbstractZkTestCase put /Users/jenkins/workspace/Lucene-Solr-master-MacOSX/solr/core/src/test-files/solr/collection1/conf/enumsConfig.xml to /configs/conf1/enumsConfig.xml
   [junit4]   2> 589123 INFO  (TEST-DistribDocExpirationUpdateProcessorTest.test-seed#[C208BCC85FD7D299]) [    ] o.a.s.c.c.SolrZkClient makePath: /configs/conf1/enumsConfig.xml
   [junit4]   2> 589128 INFO  (TEST-DistribDocExpirationUpdateProcessorTest.test-seed#[C208BCC85FD7D299]) [    ] o.a.s.c.AbstractZkTestCase put /Users/jenkins/workspace/Lucene-Solr-master-MacOSX/solr/core/src/test-files/solr/collection1/conf/open-exchange-rates.json to /configs/conf1/open-exchange-rates.json
   [junit4]   2> 589128 INFO  (TEST-DistribDocExpirationUpdateProcessorTest.test-seed#[C208BCC85FD7D299]) [    ] o.a.s.c.c.SolrZkClient makePath: /configs/conf1/open-exchange-rates.json
   [junit4]   2> 589131 INFO  (TEST-DistribDocExpirationUpdateProcessorTest.test-seed#[C208BCC85FD7D299]) [    ] o.a.s.c.AbstractZkTestCase put /Users/jenkins/workspace/Lucene-Solr-master-MacOSX/solr/core/src/test-files/solr/collection1/conf/mapping-ISOLatin1Accent.txt to /configs/conf1/mapping-ISOLatin1Accent.txt
   [junit4]   2> 589132 INFO  (TEST-DistribDocExpirationUpdateProcessorTest.test-seed#[C208BCC85FD7D299]) [    ] o.a.s.c.c.SolrZkClient makePath: /configs/conf1/mapping-ISOLatin1Accent.txt
   [junit4]   2> 589135 INFO  (TEST-DistribDocExpirationUpdateProcessorTest.test-seed#[C208BCC85FD7D299]) [    ] o.a.s.c.AbstractZkTestCase put /Users/jenkins/workspace/Lucene-Solr-master-MacOSX/solr/core/src/test-files/solr/collection1/conf/old_synonyms.txt to /configs/conf1/old_synonyms.txt
   [junit4]   2> 589135 INFO  (TEST-DistribDocExpirationUpdateProcessorTest.test-seed#[C208BCC85FD7D299]) [    ] o.a.s.c.c.SolrZkClient makePath: /configs/conf1/old_synonyms.txt
   [junit4]   2> 589139 INFO  (TEST-DistribDocExpirationUpdateProcessorTest.test-seed#[C208BCC85FD7D299]) [    ] o.a.s.c.AbstractZkTestCase put /Users/jenkins/workspace/Lucene-Solr-master-MacOSX/solr/core/src/test-files/solr/collection1/conf/synonyms.txt to /configs/conf1/synonyms.txt
   [junit4]   2> 589140 INFO  (TEST-DistribDocExpirationUpdateProcessorTest.test-seed#[C208BCC85FD7D299]) [    ] o.a.s.c.c.SolrZkClient makePath: /configs/conf1/synonyms.txt
   [junit4]   2> 589909 INFO  (TEST-DistribDocExpirationUpdateProcessorTest.test-seed#[C208BCC85FD7D299]) [    ] o.a.s.SolrTestCaseJ4 Writing core.properties file to /Users/jenkins/workspace/Lucene-Solr-master-MacOSX/solr/build/solr-core/test/J1/temp/solr.cloud.DistribDocExpirationUpdateProcessorTest_C208BCC85FD7D299-001/control-001/cores/collection1
   [junit4]   2> 589912 INFO  (TEST-DistribDocExpirationUpdateProcessorTest.test-seed#[C208BCC85FD7D299]) [    ] o.e.j.s.Server jetty-9.3.8.v20160314
   [junit4]   2> 589915 INFO  (TEST-DistribDocExpirationUpdateProcessorTest.test-seed#[C208BCC85FD7D299]) [    ] o.e.j.s.h.ContextHandler Started o.e.j.s.ServletContextHandler@e4002c1{/ej,null,AVAILABLE}
   [junit4]   2> 589916 INFO  (TEST-DistribDocExpirationUpdateProcessorTest.test-seed#[C208BCC85FD7D299]) [    ] o.e.j.s.ServerConnector Started ServerConnector@496f2d00{HTTP/1.1,[http/1.1]}{127.0.0.1:60950}
   [junit4]   2> 589916 INFO  (TEST-DistribDocExpirationUpdateProcessorTest.test-seed#[C208BCC85FD7D299]) [    ] o.e.j.s.Server Started @595836ms
   [junit4]   2> 589917 INFO  (TEST-DistribDocExpirationUpdateProcessorTest.test-seed#[C208BCC85FD7D299]) [    ] o.a.s.c.s.e.JettySolrRunner Jetty properties: {solr.data.dir=/Users/jenkins/workspace/Lucene-Solr-master-MacOSX/solr/build/solr-core/test/J1/temp/solr.cloud.DistribDocExpirationUpdateProcessorTest_C208BCC85FD7D299-001/tempDir-001/control/data, hostContext=/ej, hostPort=60950, coreRootDirectory=/Users/jenkins/workspace/Lucene-Solr-master-MacOSX/solr/build/solr-core/test/J1/temp/solr.cloud.DistribDocExpirationUpdateProcessorTest_C208BCC85FD7D299-001/control-001/cores}
   [junit4]   2> 589918 INFO  (TEST-DistribDocExpirationUpdateProcessorTest.test-seed#[C208BCC85FD7D299]) [    ] o.a.s.s.SolrDispatchFilter SolrDispatchFilter.init(): sun.misc.Launcher$AppClassLoader@4554617c
   [junit4]   2> 589918 INFO  (TEST-DistribDocExpirationUpdateProcessorTest.test-seed#[C208BCC85FD7D299]) [    ] o.a.s.c.SolrResourceLoader new SolrResourceLoader for directory: '/Users/jenkins/workspace/Lucene-Solr-master-MacOSX/solr/build/solr-core/test/J1/temp/solr.cloud.DistribDocExpirationUpdateProcessorTest_C208BCC85FD7D299-001/control-001'
   [junit4]   2> 589920 INFO  (TEST-DistribDocExpirationUpdateProcessorTest.test-seed#[C208BCC85FD7D299]) [    ] o.a.s.c.SolrResourceLoader JNDI not configured for solr (NoInitialContextEx)
   [junit4]   2> 589920 INFO  (TEST-DistribDocExpirationUpdateProcessorTest.test-seed#[C208BCC85FD7D299]) [    ] o.a.s.c.SolrResourceLoader solr home defaulted to 'solr/' (could not find system property or JNDI)
   [junit4]   2> 589920 INFO  (TEST-DistribDocExpirationUpdateProcessorTest.test-seed#[C208BCC85FD7D299]) [    ] o.a.s.c.c.SolrZkClient Using default ZkCredentialsProvider
   [junit4]   2> 589921 INFO  (TEST-DistribDocExpirationUpdateProcessorTest.test-seed#[C208BCC85FD7D299]) [    ] o.a.s.c.c.ConnectionManager Waiting for client to connect to ZooKeeper
   [junit4]   2> 589923 INFO  (zkCallback-509-thread-1) [    ] o.a.s.c.c.ConnectionManager Watcher org.apache.solr.common.cloud.ConnectionManager@7ca6091f name:ZooKeeperConnection Watcher:127.0.0.1:60947/solr got event WatchedEvent state:SyncConnected type:None path:null path:null type:None
   [junit4]   2> 589923 INFO  (TEST-DistribDocExpirationUpdateProcessorTest.test-seed#[C208BCC85FD7D299]) [    ] o.a.s.c.c.ConnectionManager Client is connected to ZooKeeper
   [junit4]   2> 589923 INFO  (TEST-DistribDocExpirationUpdateProcessorTest.test-seed#[C208BCC85FD7D299]) [    ] o.a.s.c.c.SolrZkClient Using default ZkACLProvider
   [junit4]   2> 589925 INFO  (TEST-DistribDocExpirationUpdateProcessorTest.test-seed#[C208BCC85FD7D299]) [    ] o.a.s.s.SolrDispatchFilter Loading solr.xml from SolrHome (not found in ZooKeeper)
   [junit4]   2> 589925 INFO  (TEST-DistribDocExpirationUpdateProcessorTest.test-seed#[C208BCC85FD7D299]) [    ] o.a.s.c.SolrXmlConfig Loading container configuration from /Users/jenkins/workspace/Lucene-Solr-master-MacOSX/solr/build/solr-core/test/J1/temp/solr.cloud.DistribDocExpirationUpdateProcessorTest_C208BCC85FD7D299-001/control-001/solr.xml
   [junit4]   2> 589940 INFO  (TEST-DistribDocExpirationUpdateProcessorTest.test-seed#[C208BCC85FD7D299]) [    ] o.a.s.c.CorePropertiesLocator Config-defined core root directory: /Users/jenkins/workspace/Lucene-Solr-master-MacOSX/solr/build/solr-core/test/J1/temp/solr.cloud.DistribDocExpirationUpdateProcessorTest_C208BCC85FD7D299-001/control-001/cores
   [junit4]   2> 589940 INFO  (TEST-DistribDocExpirationUpdateProcessorTest.test-seed#[C208BCC85FD7D299]) [    ] o.a.s.c.CoreContainer New CoreContainer 1292888581
   [junit4]   2> 589940 INFO  (TEST-DistribDocExpirationUpdateProcessorTest.test-seed#[C208BCC85FD7D299]) [    ] o.a.s.c.CoreContainer Loading cores into CoreContainer [instanceDir=/Users/jenkins/workspace/Lucene-Solr-master-MacOSX/solr/build/solr-core/test/J1/temp/solr.cloud.DistribDocExpirationUpdateProcessorTest_C208BCC85FD7D299-001/control-001]
   [junit4]   2> 589940 WARN  (TEST-DistribDocExpirationUpdateProcessorTest.test-seed#[C208BCC85FD7D299]) [    ] o.a.s.c.CoreContainer Couldn't add files from /Users/jenkins/workspace/Lucene-Solr-master-MacOSX/solr/build/solr-core/test/J1/temp/solr.cloud.DistribDocExpirationUpdateProcessorTest_C208BCC85FD7D299-001/control-001/lib to classpath: /Users/jenkins/workspace/Lucene-Solr-master-MacOSX/solr/build/solr-core/test/J1/temp/solr.cloud.DistribDocExpirationUpdateProcessorTest_C208BCC85FD7D299-001/control-001/lib
   [junit4]   2> 589940 INFO  (TEST-DistribDocExpirationUpdateProcessorTest.test-seed#[C208BCC85FD7D299]) [    ] o.a.s.h.c.HttpShardHandlerFactory created with socketTimeout : 90000,urlScheme : ,connTimeout : 15000,maxConnectionsPerHost : 20,maxConnections : 10000,corePoolSize : 0,maximumPoolSize : 2147483647,maxThreadIdleTime : 5,sizeOfQueue : -1,fairnessPolicy : false,
   [junit4]   2> 589944 INFO  (TEST-DistribDocExpirationUpdateProcessorTest.test-seed#[C208BCC85FD7D299]) [    ] o.a.s.u.UpdateShardHandler Creating UpdateShardHandler HTTP client with params: 
   [junit4]   2> 589944 INFO  (TEST-DistribDocExpirationUpdateProcessorTest.test-seed#[C208BCC85FD7D299]) [    ] o.a.s.l.LogWatcher SLF4J impl is org.slf4j.impl.Log4jLoggerFactory
   [junit4]   2> 589944 INFO  (TEST-DistribDocExpirationUpdateProcessorTest.test-seed#[C208BCC85FD7D299]) [    ] o.a.s.l.LogWatcher Registering Log Listener [Log4j (org.slf4j.impl.Log4jLoggerFactory)]
   [junit4]   2> 589944 INFO  (TEST-DistribDocExpirationUpdateProcessorTest.test-seed#[C208BCC85FD7D299]) [    ] o.a.s.c.ZkContainer Zookeeper client=127.0.0.1:60947/solr
   [junit4]   2> 589944 INFO  (TEST-DistribDocExpirationUpdateProcessorTest.test-seed#[C208BCC85FD7D299]) [    ] o.a.s.c.ZkController zkHost includes chroot
   [junit4]   2> 589945 INFO  (TEST-DistribDocExpirationUpdateProcessorTest.test-seed#[C208BCC85FD7D299]) [    ] o.a.s.c.c.SolrZkClient Using default ZkCredentialsProvider
   [junit4]   2> 589945 INFO  (TEST-DistribDocExpirationUpdateProcessorTest.test-seed#[C208BCC85FD7D299]) [    ] o.a.s.c.c.ConnectionManager Waiting for client to connect to ZooKeeper
   [junit4]   2> 589947 INFO  (zkCallback-512-thread-1) [    ] o.a.s.c.c.ConnectionManager Watcher org.apache.solr.common.cloud.ConnectionManager@6a914a2 name:ZooKeeperConnection Watcher:127.0.0.1:60947 got event WatchedEvent state:SyncConnected type:None path:null path:null type:None
   [junit4]   2> 589947 INFO  (TEST-DistribDocExpirationUpdateProcessorTest.test-seed#[C208BCC85FD7D299]) [    ] o.a.s.c.c.ConnectionManager Client is connected to ZooKeeper
   [junit4]   2> 589947 INFO  (TEST-DistribDocExpirationUpdateProcessorTest.test-seed#[C208BCC85FD7D299]) [    ] o.a.s.c.c.SolrZkClient Using default ZkACLProvider
   [junit4]   2> 589949 INFO  (TEST-DistribDocExpirationUpdateProcessorTest.test-seed#[C208BCC85FD7D299]) [n:127.0.0.1:60950_ej    ] o.a.s.c.ZkController Added new OnReconnect listener org.apache.solr.cloud.ZkController$$Lambda$52/209878376@5941dba2
   [junit4]   2> 589950 INFO  (TEST-DistribDocExpirationUpdateProcessorTest.test-seed#[C208BCC85FD7D299]) [n:127.0.0.1:60950_ej    ] o.a.s.c.c.ConnectionManager Waiting for client to connect to ZooKeeper
   [junit4]   2> 589951 INFO  (zkCallback-513-thread-1-processing-n:127.0.0.1:60950_ej) [n:127.0.0.1:60950_ej    ] o.a.s.c.c.ConnectionManager Watcher org.apache.solr.common.cloud.ConnectionManager@5f9f4c6d name:ZooKeeperConnection Watcher:127.0.0.1:60947/solr got event WatchedEvent state:SyncConnected type:None path:null path:null type:None
   [junit4]   2> 589951 INFO  (TEST-DistribDocExpirationUpdateProcessorTest.test-seed#[C208BCC85FD7D299]) [n:127.0.0.1:60950_ej    ] o.a.s.c.c.ConnectionManager Client is connected to ZooKeeper
   [junit4]   2> 589953 INFO  (TEST-DistribDocExpirationUpdateProcessorTest.test-seed#[C208BCC85FD7D299]) [n:127.0.0.1:60950_ej    ] o.a.s.c.c.SolrZkClient makePath: /overseer/queue
   [junit4]   2> 589957 INFO  (TEST-DistribDocExpirationUpdateProcessorTest.test-seed#[C208BCC85FD7D299]) [n:127.0.0.1:60950_ej    ] o.a.s.c.c.SolrZkClient makePath: /overseer/collection-queue-work
   [junit4]   2> 589982 INFO  (TEST-DistribDocExpirationUpdateProcessorTest.test-seed#[C208BCC85FD7D299]) [n:127.0.0.1:60950_ej    ] o.a.s.c.c.SolrZkClient makePath: /overseer/collection-map-running
   [junit4]   2> 589985 INFO  (TEST-DistribDocExpirationUpdateProcessorTest.test-seed#[C208BCC85FD7D299]) [n:127.0.0.1:60950_ej    ] o.a.s.c.c.SolrZkClient makePath: /overseer/collection-map-completed
   [junit4]   2> 589994 INFO  (TEST-DistribDocExpirationUpdateProcessorTest.test-seed#[C208BCC85FD7D299]) [n:127.0.0.1:60950_ej    ] o.a.s.c.c.SolrZkClient makePath: /overseer/collection-map-failure
   [junit4]   2> 589998 INFO  (TEST-DistribDocExpirationUpdateProcessorTest.test-seed#[C208BCC85FD7D299]) [n:127.0.0.1:60950_ej    ] o.a.s.c.c.SolrZkClient makePath: /live_nodes
   [junit4]   2> 590000 INFO  (TEST-DistribDocExpirationUpdateProcessorTest.test-seed#[C208BCC85FD7D299]) [n:127.0.0.1:60950_ej    ] o.a.s.c.c.SolrZkClient makePath: /aliases.json
   [junit4]   2> 590002 INFO  (TEST-DistribDocExpirationUpdateProcessorTest.test-seed#[C208BCC85FD7D299]) [n:127.0.0.1:60950_ej    ] o.a.s.c.c.SolrZkClient makePath: /clusterstate.json
   [junit4]   2> 590005 INFO  (TEST-DistribDocExpirationUpdateProcessorTest.test-seed#[C208BCC85FD7D299]) [n:127.0.0.1:60950_ej    ] o.a.s.c.c.SolrZkClient makePath: /security.json
   [junit4]   2> 590006 INFO  (TEST-DistribDocExpirationUpdateProcessorTest.test-seed#[C208BCC85FD7D299]) [n:127.0.0.1:60950_ej    ] o.a.s.c.c.ZkStateReader Updating cluster state from ZooKeeper... 
   [junit4]   2> 590009 INFO  (TEST-DistribDocExpirationUpdateProcessorTest.test-seed#[C208BCC85FD7D299]) [n:127.0.0.1:60950_ej    ] o.a.s.c.c.ZkStateReader Updated live nodes from ZooKeeper... (0) -> (0)
   [junit4]   2> 590012 INFO  (TEST-DistribDocExpirationUpdateProcessorTest.test-seed#[C208BCC85FD7D299]) [n:127.0.0.1:60950_ej    ] o.a.s.c.c.SolrZkClient makePath: /overseer_elect
   [junit4]   2> 590014 INFO  (TEST-DistribDocExpirationUpdateProcessorTest.test-seed#[C208BCC85FD7D299]) [n:127.0.0.1:60950_ej    ] o.a.s.c.c.SolrZkClient makePath: /overseer_elect/election
   [junit4]   2> 590017 INFO  (TEST-DistribDocExpirationUpdateProcessorTest.test-seed#[C208BCC85FD7D299]) [n:127.0.0.1:60950_ej    ] o.a.s.c.Overseer Overseer (id=null) closing
   [junit4]   2> 590018 INFO  (TEST-DistribDocExpirationUpdateProcessorTest.test-seed#[C208BCC85FD7D299]) [n:127.0.0.1:60950_ej    ] o.a.s.c.LeaderElector Joined leadership election with path: /overseer_elect/election/95817776368779268-127.0.0.1:60950_ej-n_0000000000
   [junit4]   2> 590018 INFO  (TEST-DistribDocExpirationUpdateProcessorTest.test-seed#[C208BCC85FD7D299]) [n:127.0.0.1:60950_ej    ] o.a.s.c.OverseerElectionContext I am going to be the leader 127.0.0.1:60950_ej
   [junit4]   2> 590018 INFO  (TEST-DistribDocExpirationUpdateProcessorTest.test-seed#[C208BCC85FD7D299]) [n:127.0.0.1:60950_ej    ] o.a.s.c.c.SolrZkClient makePath: /overseer_elect/leader
   [junit4]   2> 590020 INFO  (TEST-DistribDocExpirationUpdateProcessorTest.test-seed#[C208BCC85FD7D299]) [n:127.0.0.1:60950_ej    ] o.a.s.c.Overseer Overseer (id=95817776368779268-127.0.0.1:60950_ej-n_0000000000) starting
   [junit4]   2> 590023 INFO  (TEST-DistribDocExpirationUpdateProcessorTest.test-seed#[C208BCC85FD7D299]) [n:127.0.0.1:60950_ej    ] o.a.s.c.c.SolrZkClient makePath: /overseer/queue-work
   [junit4]   2> 590033 INFO  (TEST-DistribDocExpirationUpdateProcessorTest.test-seed#[C208BCC85FD7D299]) [n:127.0.0.1:60950_ej    ] o.a.s.c.OverseerAutoReplicaFailoverThread Starting OverseerAutoReplicaFailoverThread autoReplicaFailoverWorkLoopDelay=10000 autoReplicaFailoverWaitAfterExpiration=30000 autoReplicaFailoverBadNodeExpiration=60000
   [junit4]   2> 590034 INFO  (OverseerCollectionConfigSetProcessor-95817776368779268-127.0.0.1:60950_ej-n_0000000000) [n:127.0.0.1:60950_ej    ] o.a.s.c.OverseerTaskProcessor Process current queue of overseer operations
   [junit4]   2> 590034 INFO  (OverseerStateUpdate-95817776368779268-127.0.0.1:60950_ej-n_0000000000) [n:127.0.0.1:60950_ej    ] o.a.s.c.Overseer Starting to work on the main queue
   [junit4]   2> 590035 INFO  (TEST-DistribDocExpirationUpdateProcessorTest.test-seed#[C208BCC85FD7D299]) [n:127.0.0.1:60950_ej    ] o.a.s.c.ZkController Register node as live in ZooKeeper:/live_nodes/127.0.0.1:60950_ej
   [junit4]   2> 590036 INFO  (TEST-DistribDocExpirationUpdateProcessorTest.test-seed#[C208BCC85FD7D299]) [n:127.0.0.1:60950_ej    ] o.a.s.c.c.SolrZkClient makePath: /live_nodes/127.0.0.1:60950_ej
   [junit4]   2> 590038 INFO  (OverseerStateUpdate-95817776368779268-127.0.0.1:60950_ej-n_0000000000) [n:127.0.0.1:60950_ej    ] o.a.s.c.c.ZkStateReader Updated live nodes from ZooKeeper... (0) -> (0)
   [junit4]   2> 590038 INFO  (zkCallback-513-thread-1-processing-n:127.0.0.1:60950_ej) [n:127.0.0.1:60950_ej    ] o.a.s.c.c.ZkStateReader A live node change: [WatchedEvent state:SyncConnected type:NodeChildrenChanged path:/live_nodes], has occurred - updating... (live nodes size: [0])
   [junit4]   2> 590039 INFO  (zkCallback-513-thread-1-processing-n:127.0.0.1:60950_ej) [n:127.0.0.1:60950_ej    ] o.a.s.c.c.ZkStateReader Updated live nodes from ZooKeeper... (0) -> (1)
   [junit4]   2> 590048 INFO  (TEST-DistribDocExpirationUpdateProcessorTest.test-seed#[C208BCC85FD7D299]) [n:127.0.0.1:60950_ej    ] o.a.s.c.CoreContainer Security conf doesn't exist. Skipping setup for authorization module.
   [junit4]   2> 590048 INFO  (TEST-DistribDocExpirationUpdateProcessorTest.test-seed#[C208BCC85FD7D299]) [n:127.0.0.1:60950_ej    ] o.a.s.c.CoreContainer No authentication plugin used.
   [junit4]   2> 590049 INFO  (TEST-DistribDocExpirationUpdateProcessorTest.test-seed#[C208BCC85FD7D299]) [n:127.0.0.1:60950_ej    ] o.a.s.c.CorePropertiesLocator Looking for core definitions underneath /Users/jenkins/workspace/Lucene-Solr-master-MacOSX/solr/build/solr-core/test/J1/temp/solr.cloud.DistribDocExpirationUpdateProcessorTest_C208BCC85FD7D299-001/control-001/cores
   [junit4]   2> 590050 INFO  (TEST-DistribDocExpirationUpdateProcessorTest.test-seed#[C208BCC85FD7D299]) [n:127.0.0.1:60950_ej    ] o.a.s.c.CoreDescriptor Created CoreDescriptor: {name=collection1, config=solrconfig.xml, transient=false, schema=schema.xml, loadOnStartup=true, configSetProperties=configsetprops.json, collection=control_collection, coreNodeName=, dataDir=data/, shard=}
   [junit4]   2> 590050 INFO  (TEST-DistribDocExpirationUpdateProcessorTest.test-seed#[C208BCC85FD7D299]) [n:127.0.0.1:60950_ej    ] o.a.s.c.CorePropertiesLocator Found core collection1 in /Users/jenkins/workspace/Lucene-Solr-master-MacOSX/solr/build/solr-core/test/J1/temp/solr.cloud.DistribDocExpirationUpdateProcessorTest_C208BCC85FD7D299-001/control-001/cores/collection1
   [junit4]   2> 590050 INFO  (TEST-DistribDocExpirationUpdateProcessorTest.test-seed#[C208BCC85FD7D299]) [n:127.0.0.1:60950_ej    ] o.a.s.c.CorePropertiesLocator Found 1 core definitions
   [junit4]   2> 590053 INFO  (TEST-DistribDocExpirationUpdateProcessorTest.test-seed#[C208BCC85FD7D299]) [n:127.0.0.1:60950_ej    ] o.a.s.s.SolrDispatchFilter user.dir=/Users/jenkins/workspace/Lucene-Solr-master-MacOSX/solr/build/solr-core/test/J1
   [junit4]   2> 590053 INFO  (TEST-DistribDocExpirationUpdateProcessorTest.test-seed#[C208BCC85FD7D299]) [n:127.0.0.1:60950_ej    ] o.a.s.s.SolrDispatchFilter SolrDispatchFilter.init() done
   [junit4]   2> 590053 INFO  (coreLoadExecutor-1847-thread-1-processing-n:127.0.0.1:60950_ej) [n:127.0.0.1:60950_ej c:control_collection   x:collection1] o.a.s.c.ZkController publishing state=down
   [junit4]   2> 590053 INFO  (coreLoadExecutor-1847-thread-1-processing-n:127.0.0.1:60950_ej) [n:127.0.0.1:60950_ej c:control_collection   x:collection1] o.a.s.c.ZkController numShards not found on descriptor - reading it from system property
   [junit4]   2> 590054 INFO  (coreLoadExecutor-1847-thread-1-processing-n:127.0.0.1:60950_ej) [n:127.0.0.1:60950_ej c:control_collection   x:collection1] o.a.s.c.ZkController Collection control_collection not visible yet, but flagging it so a watch is registered when it becomes visible
   [junit4]   2> 590055 INFO  (coreLoadExecutor-1847-thread-1-processing-n:127.0.0.1:60950_ej) [n:127.0.0.1:60950_ej c:control_collection   x:collection1] o.a.s.c.c.ZkStateReader addZkWatch [control_collection]
   [junit4]   2> 590055 INFO  (OverseerStateUpdate-95817776368779268-127.0.0.1:60950_ej-n_0000000000) [n:127.0.0.1:60950_ej    ] o.a.s.c.Overseer processMessage: queueSize: 1, message = {
   [junit4]   2>   "core":"collection1",
   [junit4]   2>   "roles":null,
   [junit4]   2>   "base_url":"http://127.0.0.1:60950/ej",
   [junit4]   2>   "node_name":"127.0.0.1:60950_ej",
   [junit4]   2>   "numShards":"1",
   [junit4]   2>   "state":"down",
   [junit4]   2>   "shard":null,
   [junit4]   2>   "collection":"control_collection",
   [junit4]   2>   "operation":"state"} current state version: 0
   [junit4]   2> 590056 INFO  (coreLoadExecutor-1847-thread-1-processing-n:127.0.0.1:60950_ej) [n:127.0.0.1:60950_ej c:control_collection   x:collection1] o.a.s.c.c.ZkStateReader Deleting data for [control_collection]
   [junit4]   2> 590056 INFO  (OverseerStateUpdate-95817776368779268-127.0.0.1:60950_ej-n_0000000000) [n:127.0.0.1:60950_ej    ] o.a.s.c.o.ReplicaMutator Update state numShards=1 message={
   [junit4]   2>   "core":"collection1",
   [junit4]   2>   "roles":null,
   [junit4]   2>   "base_url":"http://127.0.0.1:60950/ej",
   [junit4]   2>   "node_name":"127.0.0.1:60950_ej",
   [junit4]   2>   "numShards":"1",
   [junit4]   2>   "state":"down",
   [junit4]   2>   "shard":null,
   [junit4]   2>   "collection":"control_collection",
   [junit4]   2>   "operation":"state"}
   [junit4]   2> 590057 INFO  (OverseerStateUpdate-95817776368779268-127.0.0.1:60950_ej-n_0000000000) [n:127.0.0.1:60950_ej    ] o.a.s.c.o.ClusterStateMutator building a new cName: control_collection
   [junit4]   2> 590057 INFO  (coreLoadExecutor-1847-thread-1-processing-n:127.0.0.1:60950_ej) [n:127.0.0.1:60950_ej c:control_collection   x:collection1] o.a.s.c.ZkController look for our core node name
   [junit4]   2> 590057 INFO  (OverseerStateUpdate-95817776368779268-127.0.0.1:60950_ej-n_0000000000) [n:127.0.0.1:60950_ej    ] o.a.s.c.o.ReplicaMutator Assigning new node to shard shard=shard1
   [junit4]   2> 590059 INFO  (zkCallback-513-thread-1-processing-n:127.0.0.1:60950_ej) [n:127.0.0.1:60950_ej    ] o.a.s.c.c.ZkStateReader A cluster state change: [WatchedEvent state:SyncConnected type:NodeDataChanged path:/clusterstate.json], has occurred - updating... (live nodes size: [1])
   [junit4]   2> 591068 INFO  (coreLoadExecutor-1847-thread-1-processing-n:127.0.0.1:60950_ej) [n:127.0.0.1:60950_ej c:control_collection   x:collection1] o.a.s.c.ZkController waiting to find shard id in clusterstate for collection1
   [junit4]   2> 591068 INFO  (coreLoadExecutor-1847-thread-1-processing-n:127.0.0.1:60950_ej) [n:127.0.0.1:60950_ej c:control_collection   x:collection1] o.a.s.c.ZkController Check for collection zkNode:control_collection
   [junit4]   2> 591069 INFO  (coreLoadExecutor-1847-thread-1-processing-n:127.0.0.1:60950_ej) [n:127.0.0.1:60950_ej c:control_collection   x:collection1] o.a.s.c.ZkController Collection zkNode exists
   [junit4]   2> 591069 INFO  (coreLoadExecutor-1847-thread-1-processing-n:127.0.0.1:60950_ej) [n:127.0.0.1:60950_ej c:control_collection   x:collection1] o.a.s.c.c.ZkStateReader Load collection config from: [/collections/control_collection]
   [junit4]   2> 591070 INFO  (coreLoadExecutor-1847-thread-1-processing-n:127.0.0.1:60950_ej) [n:127.0.0.1:60950_ej c:control_collection   x:collection1] o.a.s.c.c.ZkStateReader path=[/collections/control_collection] [configName]=[conf1] specified config exists in ZooKeeper
   [junit4]   2> 591075 INFO  (coreLoadExecutor-1847-thread-1-processing-n:127.0.0.1:60950_ej) [n:127.0.0.1:60950_ej c:control_collection   x:collection1] o.a.s.c.SolrResourceLoader new SolrResourceLoader for directory: '/Users/jenkins/workspace/Lucene-Solr-master-MacOSX/solr/build/solr-core/test/J1/temp/solr.cloud.DistribDocExpirationUpdateProcessorTest_C208BCC85FD7D299-001/control-001/cores/collection1'
   [junit4]   2> 591075 INFO  (coreLoadExecutor-1847-thread-1-processing-n:127.0.0.1:60950_ej) [n:127.0.0.1:60950_ej c:control_collection   x:collection1] o.a.s.c.SolrResourceLoader JNDI not configured for solr (NoInitialContextEx)
   [junit4]   2> 591075 INFO  (coreLoadExecutor-1847-thread-1-processing-n:127.0.0.1:60950_ej) [n:127.0.0.1:60950_ej c:control_collection   x:collection1] o.a.s.c.SolrResourceLoader solr home defaulted to 'solr/' (could not find system property or JNDI)
   [junit4]   2> 591084 INFO  (coreLoadExecutor-1847-thread-1-processing-n:127.0.0.1:60950_ej) [n:127.0.0.1:60950_ej c:control_collection   x:collection1] o.a.s.c.Config loaded config solrconfig.xml with version 0 
   [junit4]   2> 591091 INFO  (coreLoadExecutor-1847-thread-1-processing-n:127.0.0.1:60950_ej) [n:127.0.0.1:60950_ej c:control_collection   x:collection1] o.a.s.c.SolrConfig current version of requestparams : -1
   [junit4]   2> 591100 INFO  (coreLoadExecutor-1847-thread-1-processing-n:127.0.0.1:60950_ej) [n:127.0.0.1:60950_ej c:control_collection   x:collection1] o.a.s.c.SolrConfig Using Lucene MatchVersion: 7.0.0
   [junit4]   2> 591111 INFO  (coreLoadExecutor-1847-thread-1-processing-n:127.0.0.1:60950_ej) [n:127.0.0.1:60950_ej c:control_collection   x:collection1] o.a.s.c.SolrConfig Loaded SolrConfig: solrconfig.xml
   [junit4]   2> 591121 INFO  (coreLoadExecutor-1847-thread-1-processing-n:127.0.0.1:60950_ej) [n:127.0.0.1:60950_ej c:control_collection   x:collection1] o.a.s.s.IndexSchema [collection1] Schema name=test
   [junit4]   2> 591246 INFO  (coreLoadExecutor-1847-thread-1-processing-n:127.0.0.1:60950_ej) [n:127.0.0.1:60950_ej c:control_collection   x:collection1] o.a.s.s.IndexSchema default search field in schema is text
   [junit4]   2> 591248 INFO  (coreLoadExecutor-1847-thread-1-processing-n:127.0.0.1:60950_ej) [n:127.0.0.1:60950_ej c:control_collection   x:collection1] o.a.s.s.IndexSchema unique key field: id
   [junit4]   2> 591254 INFO  (coreLoadExecutor-1847-thread-1-processing-n:127.0.0.1:60950_ej) [n:127.0.0.1:60950_ej c:control_collection   x:collection1] o.a.s.s.FileExchangeRateProvider Reloading exchange rates from file currency.xml
   [junit4]   2> 591258 INFO  (coreLoadExecutor-1847-thread-1-processing-n:127.0.0.1:60950_ej) [n:127.0.0.1:60950_ej c:control_collection   x:collection1] o.a.s.s.FileExchangeRateProvider Reloading exchange rates from file currency.xml
   [junit4]   2> 591292 INFO  (coreLoadExecutor-1847-thread-1-processing-n:127.0.0.1:60950_ej) [n:127.0.0.1:60950_ej c:control_collection   x:collection1] o.a.s.c.ConfigSetProperties Did not find ConfigSet properties, assuming default properties: Can't find resource 'configsetprops.json' in classpath or '/configs/conf1', cwd=/Users/jenkins/workspace/Lucene-Solr-master-MacOSX/solr/build/solr-core/test/J1
   [junit4]   2> 591292 INFO  (coreLoadExecutor-1847-thread-1-processing-n:127.0.0.1:60950_ej) [n:127.0.0.1:60950_ej c:control_collection   x:collection1] o.a.s.c.CoreContainer Creating SolrCore 'collection1' using configuration from collection control_collection
   [junit4]   2> 591292 INFO  (coreLoadExecutor-1847-thread-1-processing-n:127.0.0.1:60950_ej) [n:127.0.0.1:60950_ej c:control_collection s:shard1 r:core_node1 x:collection1] o.a.s.c.SolrCore org.apache.solr.core.MockDirectoryFactory
   [junit4]   2> 591292 INFO  (coreLoadExecutor-1847-thread-1-processing-n:127.0.0.1:60950_ej) [n:127.0.0.1:60950_ej c:control_collection s:shard1 r:core_node1 x:collection1] o.a.s.c.SolrCore [[collection1] ] Opening new SolrCore at [/Users/jenkins/workspace/Lucene-Solr-master-MacOSX/solr/build/solr-core/test/J1/temp/solr.cloud.DistribDocExpirationUpdateProcessorTest_C208BCC85FD7D299-001/control-001/cores/collection1], dataDir=[/Users/jenkins/workspace/Lucene-Solr-master-MacOSX/solr/build/solr-core/test/J1/temp/solr.cloud.DistribDocExpirationUpdateProcessorTest_C208BCC85FD7D299-001/control-001/cores/collection1/data/]
   [junit4]   2> 591292 INFO  (coreLoadExecutor-1847-thread-1-processing-n:127.0.0.1:60950_ej) [n:127.0.0.1:60950_ej c:control_collection s:shard1 r:core_node1 x:collection1] o.a.s.c.SolrCore JMX monitoring not detected for core: collection1
   [junit4]   2> 591293 INFO  (coreLoadExecutor-1847-thread-1-processing-n:127.0.0.1:60950_ej) [n:127.0.0.1:60950_ej c:control_collection s:shard1 r:core_node1 x:collection1] o.a.s.c.CachingDirectoryFactory return new directory for /Users/jenkins/workspace/Lucene-Solr-master-MacOSX/solr/build/solr-core/test/J1/temp/solr.cloud.DistribDocExpirationUpdateProcessorTest_C208BCC85FD7D299-001/control-001/cores/collection1/data
   [junit4]   2> 591293 INFO  (coreLoadExecutor-1847-thread-1-processing-n:127.0.0.1:60950_ej) [n:127.0.0.1:60950_ej c:control_collection s:shard1 r:core_node1 x:collection1] o.a.s.c.SolrCore New index directory detected: old=null new=/Users/jenkins/workspace/Lucene-Solr-master-MacOSX/solr/build/solr-core/test/J1/temp/solr.cloud.DistribDocExpirationUpdateProcessorTest_C208BCC85FD7D299-001/control-001/cores/collection1/data/index/
   [junit4]   2> 591293 WARN  (coreLoadExecutor-1847-thread-1-processing-n:127.0.0.1:60950_ej) [n:127.0.0.1:60950_ej c:control_collection s:shard1 r:core_node1 x:collection1] o.a.s.c.SolrCore [collection1] Solr index directory '/Users/jenkins/workspace/Lucene-Solr-master-MacOSX/solr/build/solr-core/test/J1/temp/solr.cloud.DistribDocExpirationUpdateProcessorTest_C208BCC85FD7D299-001/control-001/cores/collection1/data/index' doesn't exist. Creating new index...
   [junit4]   2> 591293 INFO  (coreLoadExecutor-1847-thread-1-processing-n:127.0.0.1:60950_ej) [n:127.0.0.1:60950_ej c:control_collection s:shard1 r:core_node1 x:collection1] o.a.s.c.CachingDirectoryFactory return new directory for /Users/jenkins/workspace/Lucene-Solr-master-MacOSX/solr/build/solr-core/test/J1/temp/solr.cloud.DistribDocExpirationUpdateProcessorTest_C208BCC85FD7D299-001/control-001/cores/collection1/data/index
   [junit4]   2> 591293 INFO  (coreLoadExecutor-1847-thread-1-processing-n:127.0.0.1:60950_ej) [n:127.0.0.1:60950_ej c:control_collection s:shard1 r:core_node1 x:collection1] o.a.s.u.RandomMergePolicy RandomMergePolicy wrapping class org.apache.lucene.index.LogDocMergePolicy: [LogDocMergePolicy: minMergeSize=1000, mergeFactor=12, maxMergeSize=9223372036854775807, maxMergeSizeForForcedMerge=9223372036854775807, calibrateSizeByDeletes=false, maxMergeDocs=2147483647, maxCFSSegmentSizeMB=8.796093022207999E12, noCFSRatio=0.6045447775638075]
   [junit4]   2> 591294 INFO  (coreLoadExecutor-1847-thread-1-processing-n:127.0.0.1:60950_ej) [n:127.0.0.1:60950_ej c:control_collection s:shard1 r:core_node1 x:collection1] o.a.s.c.SolrDeletionPolicy SolrDeletionPolicy.onCommit: commits: num=1
   [junit4]   2> 	commit{dir=MockDirectoryWrapper(RAMDirectory@6fc12be8 lockFactory=org.apache.lucene.store.SingleInstanceLockFactory@38848341),segFN=segments_1,generation=1}
   [junit4]   2> 591294 INFO  (coreLoadExecutor-1847-thread-1-processing-n:127.0.0.1:60950_ej) [n:127.0.0.1:60950_ej c:control_collection s:shard1 r:core_node1 x:collection1] o.a.s.c.SolrDeletionPolicy newest commit generation = 1
   [junit4]   2> 591294 INFO  (OldIndexDirectoryCleanupThreadForCore-collection1) [n:127.0.0.1:60950_ej c:control_collection s:shard1 r:core_node1 x:collection1] o.a.s.c.SolrCore Looking for old index directories to cleanup for core collection1 in /Users/jenkins/workspace/Lucene-Solr-master-MacOSX/solr/build/solr-core/test/J1/temp/solr.cloud.DistribDocExpirationUpdateProcessorTest_C208BCC85FD7D299-001/control-001/cores/collection1/data/
   [junit4]   2> 591295 WARN  (OldIndexDirectoryCleanupThreadForCore-collection1) [n:127.0.0.1:60950_ej c:control_collection s:shard1 r:core_node1 x:collection1] o.a.s.c.DirectoryFactory /Users/jenkins/workspace/Lucene-Solr-master-MacOSX/solr/build/solr-core/test/J1/temp/solr.cloud.DistribDocExpirationUpdateProcessorTest_C208BCC85FD7D299-001/control-001/cores/collection1/data/ does not point to a valid data directory; skipping clean-up of old index directories.
   [junit4]   2> 591298 INFO  (coreLoadExecutor-1847-thread-1-processing-n:127.0.0.1:60950_ej) [n:127.0.0.1:60950_ej c:control_collection s:shard1 r:core_node1 x:collection1] o.a.s.u.p.UpdateRequestProcessorChain creating updateRequestProcessorChain "convert-ttl-defaults"
   [junit4]   2> 591448 INFO  (coreLoadExecutor-1847-thread-1-processing-n:127.0.0.1:60950_ej) [n:127.0.0.1:60950_ej c:control_collection s:shard1 r:core_node1 x:collection1] o.a.s.u.p.UpdateRequestProcessorChain creating updateRequestProcessorChain "convert-ttl-field"
   [junit4]   2> 591448 INFO  (coreLoadExecutor-1847-thread-1-processing-n:127.0.0.1:60950_ej) [n:127.0.0.1:60950_ej c:control_collection s:shard1 r:core_node1 x:collection1] o.a.s.u.p.UpdateRequestProcessorChain creating updateRequestProcessorChain "convert-ttl-param"
   [junit4]   2> 591448 INFO  (coreLoadExecutor-1847-thread-1-processing-n:127.0.0.1:60950_ej) [n:127.0.0.1:60950_ej c:control_collection s:shard1 r:core_node1 x:collection1] o.a.s.u.p.UpdateRequestProcessorChain creating updateRequestProcessorChain "convert-ttl-field-with-param-default"
   [junit4]   2> 591448 INFO  (coreLoadExecutor-1847-thread-1-processing-n:127.0.0.1:60950_ej) [n:127.0.0.1:60950_ej c:control_collection s:shard1 r:core_node1 x:collection1] o.a.s.u.p.UpdateRequestProcessorChain creating updateRequestProcessorChain "scheduled-delete" (default)
   [junit4]   2> 591741 INFO  (coreLoadExecutor-1847-thread-1-processing-n:127.0.0.1:60950_ej) [n:127.0.0.1:60950_ej c:control_collection s:shard1 r:core_node1 x:collection1] o.a.s.u.p.UpdateRequestProcessorChain inserting DistributedUpdateProcessorFactory into updateRequestProcessorChain "scheduled-delete" (default)
   [junit4]   2> 591746 INFO  (coreLoadExecutor-1847-thread-1-processing-n:127.0.0.1:60950_ej) [n:127.0.0.1:60950_ej c:control_collection s:shard1 r:core_node1 x:collection1] o.a.s.h.l.XMLLoader xsltCacheLifetimeSeconds=60
   [junit4]   2> 591746 INFO  (coreLoadExecutor-1847-thread-1-processing-n:127.0.0.1:60950_ej) [n:127.0.0.1:60950_ej c:control_collection s:shard1 r:core_node1 x:collection1] o.a.s.h.l.XMLLoader xsltCacheLifetimeSeconds=60
   [junit4]   2> 591747 INFO  (coreLoadExecutor-1847-thread-1-processing-n:127.0.0.1:60950_ej) [n:127.0.0.1:60950_ej c:control_collection s:shard1 r:core_node1 x:collection1] o.a.s.h.l.XMLLoader xsltCacheLifetimeSeconds=60
   [junit4]   2> 591748 INFO  (coreLoadExecutor-1847-thread-1-processing-n:127.0.0.1:60950_ej) [n:127.0.0.1:60950_ej c:control_collection s:shard1 r:core_node1 x:collection1] o.a.s.h.l.XMLLoader xsltCacheLifetimeSeconds=60
   [junit4]   2> 591751 INFO  (coreLoadExecutor-1847-thread-1-processing-n:127.0.0.1:60950_ej) [n:127.0.0.1:60950_ej c:control_collection s:shard1 r:core_node1 x:collection1] o.a.s.c.RequestHandlers Registered paths: /admin/mbeans,,/update/csv,/sql,/update/json/docs,/admin/luke,/export,/select,/admin/segments,/get,/admin/system,/replication,/admin/properties,/config,/stream,/schema,/admin/plugins,/admin/logging,/update/json,/admin/ping,/admin/threads,/update,/admin/file
   [junit4]   2> 591752 INFO  (coreLoadExecutor-1847-thread-1-processing-n:127.0.0.1:60950_ej) [n:127.0.0.1:60950_ej c:control_collection s:shard1 r:core_node1 x:collection1] o.a.s.c.SolrCore Using default statsCache cache: org.apache.solr.search.stats.LocalStatsCache
   [junit4]   2> 591752 INFO  (coreLoadExecutor-1847-thread-1-processing-n:127.0.0.1:60950_ej) [n:127.0.0.1:60950_ej c:control_collection s:shard1 r:core_node1 x:collection1] o.a.s.u.UpdateHandler Using UpdateLog implementation: org.apache.solr.update.UpdateLog
   [junit4]   2> 591752 INFO  (coreLoadExecutor-1847-thread-1-processing-n:127.0.0.1:60950_ej) [n:127.0.0.1:60950_ej c:control_collection s:shard1 r:core_node1 x:collection1] o.a.s.u.UpdateLog Initializing UpdateLog: dataDir= defaultSyncLevel=FLUSH numRecordsToKeep=100 maxNumLogsToKeep=10 numVersionBuckets=65536
   [junit4]   2> 591753 INFO  (coreLoadExecutor-1847-thread-1-processing-n:127.0.0.1:60950_ej) [n:127.0.0.1:60950_ej c:control_collection s:shard1 r:core_node1 x:collection1] o.a.s.u.CommitTracker Hard AutoCommit: disabled
   [junit4]   2> 591753 INFO  (coreLoadExecutor-1847-thread-1-processing-n:127.0.0.1:60950_ej) [n:127.0.0.1:60950_ej c:control_collection s:shard1 r:core_node1 x:collection1] o.a.s.u.CommitTracker Soft AutoCommit: disabled
   [junit4]   2> 591754 INFO  (coreLoadExecutor-1847-thread-1-processing-n:127.0.0.1:60950_ej) [n:127.0.0.1:60950_ej c:control_collection s:shard1 r:core_node1 x:collection1] o.a.s.u.RandomMergePolicy RandomMergePolicy wrapping class org.apache.lucene.index.LogByteSizeMergePolicy: [LogByteSizeMergePolicy: minMergeSize=1677721, mergeFactor=21, maxMergeSize=2147483648, maxMergeSizeForForcedMerge=9223372036854775807, calibrateSizeByDeletes=true, maxMergeDocs=2147483647, maxCFSSegmentSizeMB=8.796093022207999E12, noCFSRatio=0.0]
   [junit4]   2> 591754 INFO  (coreLoadExecutor-1847-thread-1-processing-n:127.0.0.1:60950_ej) [n:127.0.0.1:60950_ej c:control_collection s:shard1 r:core_node1 x:collection1] o.a.s.c.SolrDeletionPolicy SolrDeletionPolicy.onInit: commits: num=1
   [junit4]   2> 	commit{dir=MockDirectoryWrapper(RAMDirectory@6fc12be8 lockFactory=org.apache.lucene.store.SingleInstanceLockFactory@38848341),segFN=segments_1,generation=1}
   [junit4]   2> 591754 INFO  (coreLoadExecutor-1847-thread-1-processing-n:127.0.0.1:60950_ej) [n:127.0.0.1:60950_ej c:control_collection s:shard1 r:core_node1 x:collection1] o.a.s.c.SolrDeletionPolicy newest commit generation = 1
   [junit4]   2> 591754 INFO  (coreLoadExecutor-1847-thread-1-processing-n:127.0.0.1:60950_ej) [n:127.0.0.1:60950_ej c:control_collection s:shard1 r:core_node1 x:collection1] o.a.s.s.SolrIndexSearcher Opening [Searcher@2144e376[collection1] main]
   [junit4]   2> 591754 INFO  (coreLoadExecutor-1847-thread-1-processing-n:127.0.0.1:60950_ej) [n:127.0.0.1:60950_ej c:control_collection s:shard1 r:core_node1 x:collection1] o.a.s.c.c.ZkStateReader Load collection config from: [/collections/control_collection]
   [junit4]   2> 591756 INFO  (coreLoadExecutor-1847-thread-1-processing-n:127.0.0.1:60950_ej) [n:127.0.0.1:60950_ej c:control_collection s:shard1 r:core_node1 x:collection1] o.a.s.c.c.ZkStateReader path=[/collections/control_collection] [configName]=[conf1] specified config exists in ZooKeeper
   [junit4]   2> 591756 INFO  (coreLoadExecutor-1847-thread-1-processing-n:127.0.0.1:60950_ej) [n:127.0.0.1:60950_ej c:control_collection s:shard1 r:core_node1 x:collection1] o.a.s.r.ManagedResourceStorage Setting up ZooKeeper-based storage for the RestManager with znodeBase: /configs/conf1
   [junit4]   2> 591757 INFO  (coreLoadExecutor-1847-thread-1-processing-n:127.0.0.1:60950_ej) [n:127.0.0.1:60950_ej c:control_collection s:shard1 r:core_node1 x:collection1] o.a.s.r.ManagedResourceStorage Configured ZooKeeperStorageIO with znodeBase: /configs/conf1
   [junit4]   2> 591757 INFO  (coreLoadExecutor-1847-thread-1-processing-n:127.0.0.1:60950_ej) [n:127.0.0.1:60950_ej c:control_collection s:shard1 r:core_node1 x:collection1] o.a.s.r.RestManager Initializing RestManager with initArgs: {}
   [junit4]   2> 591757 INFO  (coreLoadExecutor-1847-thread-1-processing-n:127.0.0.1:60950_ej) [n:127.0.0.1:60950_ej c:control_collection s:shard1 r:core_node1 x:collection1] o.a.s.r.ManagedResourceStorage Reading _rest_managed.json using ZooKeeperStorageIO:path=/configs/conf1
   [junit4]   2> 591757 INFO  (coreLoadExecutor-1847-thread-1-processing-n:127.0.0.1:60950_ej) [n:127.0.0.1:60950_ej c:control_collection s:shard1 r:core_node1 x:collection1] o.a.s.r.ManagedResourceStorage No data found for znode /configs/conf1/_rest_managed.json
   [junit4]   2> 591757 INFO  (coreLoadExecutor-1847-thread-1-processing-n:127.0.0.1:60950_ej) [n:127.0.0.1:60950_ej c:control_collection s:shard1 r:core_node1 x:collection1] o.a.s.r.ManagedResourceStorage Loaded null at path _rest_managed.json using ZooKeeperStorageIO:path=/configs/conf1
   [junit4]   2> 591757 INFO  (coreLoadExecutor-1847-thread-1-processing-n:127.0.0.1:60950_ej) [n:127.0.0.1:60950_ej c:control_collection s:shard1 r:core_node1 x:collection1] o.a.s.r.RestManager Initializing 0 registered ManagedResources
   [junit4]   2> 591825 INFO  (coreLoadExecutor-1847-thread-1-processing-n:127.0.0.1:60950_ej) [n:127.0.0.1:60950_ej c:control_collection s:shard1 r:core_node1 x:collection1] o.a.s.h.ReplicationHandler Commits will be reserved for  10000
   [junit4]   2> 591825 INFO  (coreLoadExecutor-1847-thread-1-processing-n:127.0.0.1:60950_ej) [n:127.0.0.1:60950_ej c:control_collection s:shard1 r:core_node1 x:collection1] o.a.s.u.UpdateLog Looking up max value of version field to seed version buckets
   [junit4]   2> 591825 INFO  (coreLoadExecutor-1847-thread-1-processing-n:127.0.0.1:60950_ej) [n:127.0.0.1:60950_ej c:control_collection s:shard1 r:core_node1 x:collection1] o.a.s.u.VersionInfo Refreshing highest value of _version_ for 65536 version buckets from index
   [junit4]   2> 591825 INFO  (searcherExecutor-1848-thread-1-processing-n:127.0.0.1:60950_ej x:collection1 s:shard1 c:control_collection r:core_node1) [n:127.0.0.1:60950_ej c:control_collection s:shard1 r:core_node1 x:collection1] o.a.s.c.SolrCore [collection1] Registered new searcher Searcher@2144e376[collection1] main{ExitableDirectoryReader(UninvertingDirectoryReader())}
   [junit4]   2> 591825 INFO  (coreLoadExecutor-1847-thread-1-processing-n:127.0.0.1:60950_ej) [n:127.0.0.1:60950_ej c:control_collection s:shard1 r:core_node1 x:collection1] o.a.s.u.VersionInfo No terms found for _version_, cannot seed version bucket highest value from index
   [junit4]   2> 591825 INFO  (coreLoadExecutor-1847-thread-1-processing-n:127.0.0.1:60950_ej) [n:127.0.0.1:60950_ej c:control_collection s:shard1 r:core_node1 x:collection1] o.a.s.u.UpdateLog Could not find max version in index or recent updates, using new clock 1533084424908832768
   [junit4]   2> 591828 INFO  (coreLoadExecutor-1847-thread-1-processing-n:127.0.0.1:60950_ej) [n:127.0.0.1:60950_ej c:control_collection s:shard1 r:core_node1 x:collection1] o.a.s.u.UpdateLog Took 2.0ms to seed version buckets with highest version 1533084424908832768
   [junit4]   2> 591828 INFO  (coreLoadExecutor-1847-thread-1-processing-n:127.0.0.1:60950_ej) [n:127.0.0.1:60950_ej c:control_collection s:shard1 r:core_node1 x:collection1] o.a.s.c.ZkController watch zkdir /configs/conf1
   [junit4]   2> 591829 INFO  (coreLoadExecutor-1847-thread-1-processing-n:127.0.0.1:60950_ej) [n:127.0.0.1:60950_ej c:control_collection s:shard1 r:core_node1 x:collection1] o.a.s.c.CoreContainer registering core: collection1
   [junit4]   2> 591830 INFO  (coreZkRegister-1841-thread-1-processing-n:127.0.0.1:60950_ej x:collection1 s:shard1 c:control_collection r:core_node1) [n:127.0.0.1:60950_ej c:control_collection s:shard1 r:core_node1 x:collection1] o.a.s.c.ZkController Register replica - core:collection1 address:http://127.0.0.1:60950/ej collection:control_collection shard:shard1
   [junit4]   2> 591831 INFO  (coreZkRegister-1841-thread-1-processing-n:127.0.0.1:60950_ej x:collection1 s:shard1 c:control_collection r:core_node1) [n:127.0.0.1:60950_ej c:control_collection s:shard1 r:core_node1 x:collection1] o.a.s.c.c.SolrZkClient makePath: /collections/control_collection/leader_elect/shard1/election
   [junit4]   2> 591838 INFO  (coreZkRegister-1841-thread-1-processing-n:127.0.0.1:60950_ej x:collection1 s:shard1 c:control_collection r:core_node1) [n:127.0.0.1:60950_ej c:control_collection s:shard1 r:core_node1 x:collection1] o.a.s.c.LeaderElector Joined leadership election with path: /collections/control_collection/leader_elect/shard1/election/95817776368779268-core_node1-n_0000000000
   [junit4]   2> 591839 INFO  (coreZkRegister-1841-thread-1-processing-n:127.0.0.1:60950_ej x:collection1 s:shard1 c:control_collection r:core_node1) [n:127.0.0.1:60950_ej c:control_collection s:shard1 r:core_node1 x:collection1] o.a.s.c.ShardLeaderElectionContext Running the leader process for shard=shard1 and weAreReplacement=false and leaderVoteWait=10000
   [junit4]   2> 591842 INFO  (coreZkRegister-1841-thread-1-processing-n:127.0.0.1:60950_ej x:collection1 s:shard1 c:control_collection r:core_node1) [n:127.0.0.1:60950_ej c:control_collection s:shard1 r:core_node1 x:collection1] o.a.s.c.ShardLeaderElectionContext Enough replicas found to continue.
   [junit4]   2> 591842 INFO  (coreZkRegister-1841-thread-1-processing-n:127.0.0.1:60950_ej x:collection1 s:shard1 c:control_collection r:core_node1) [n:127.0.0.1:60950_ej c:control_collection s:shard1 r:core_node1 x:collection1] o.a.s.c.ShardLeaderElectionContext I may be the new leader - try and sync
   [junit4]   2> 591842 INFO  (coreZkRegister-1841-thread-1-processing-n:127.0.0.1:60950_ej x:collection1 s:shard1 c:control_collection r:core_node1) [n:127.0.0.1:60950_ej c:control_collection s:shard1 r:core_node1 x:collection1] o.a.s.c.SyncStrategy Sync replicas to http://127.0.0.1:60950/ej/collection1/
   [junit4]   2> 591842 INFO  (coreZkRegister-1841-thread-1-processing-n:127.0.0.1:60950_ej x:collection1 s:shard1 c:control_collection r:core_node1) [n:127.0.0.1:60950_ej c:control_collection s:shard1 r:core_node1 x:collection1] o.a.s.c.SyncStrategy Sync Success - now sync replicas to me
   [junit4]   2> 591842 INFO  (coreZkRegister-1841-thread-1-processing-n:127.0.0.1:60950_ej x:collection1 s:shard1 c:control_collection r:core_node1) [n:127.0.0.1:60950_ej c:control_collection s:shard1 r:core_node1 x:collection1] o.a.s.c.SyncStrategy http://127.0.0.1:60950/ej/collection1/ has no replicas
   [junit4]   2> 591843 INFO  (OverseerStateUpdate-95817776368779268-127.0.0.1:60950_ej-n_0000000000) [n:127.0.0.1:60950_ej    ] o.a.s.c.Overseer processMessage: queueSize: 1, message = {
   [junit4]   2>   "operation":"leader",
   [junit4]   2>   "shard":"shard1",
   [junit4]   2>   "collection":"control_collection"} current state version: 1
   [junit4]   2> 591844 INFO  (coreZkRegister-1841-thread-1-processing-n:127.0.0.1:60950_ej x:collection1 s:shard1 c:control_collection r:core_node1) [n:127.0.0.1:60950_ej c:control_collection s:shard1 r:core_node1 x:collection1] o.a.s.c.c.SolrZkClient makePath: /collections/control_collection/leaders/shard1
   [junit4]   2> 591845 INFO  (zkCallback-513-thread-1-processing-n:127.0.0.1:60950_ej) [n:127.0.0.1:60950_ej    ] o.a.s.c.c.ZkStateReader A cluster state change: [WatchedEvent state:SyncConnected type:NodeDataChanged path:/clusterstate.json], has occurred - updating... (live nodes size: [1])
   [junit4]   2> 591849 INFO  (coreZkRegister-1841-thread-1-processing-n:127.0.0.1:60950_ej x:collection1 s:shard1 c:control_collection r:core_node1) [n:127.0.0.1:60950_ej c:control_collection s:shard1 r:core_node1 x:collection1] o.a.s.c.ShardLeaderElectionContextBase Creating leader registration node /collections/control_collection/leaders/shard1/leader after winning as /collections/control_collection/leader_elect/shard1/election/95817776368779268-core_node1-n_0000000000
   [junit4]   2> 591853 INFO  (coreZkRegister-1841-thread-1-processing-n:127.0.0.1:60950_ej x:collection1 s:shard1 c:control_collection r:core_node1) [n:127.0.0.1:60950_ej c:control_collection s:shard1 r:core_node1 x:collection1] o.a.s.c.ShardLeaderElectionContext I am the new leader: http://127.0.0.1:60950/ej/collection1/ shard1
   [junit4]   2> 591854 INFO  (OverseerStateUpdate-95817776368779268-127.0.0.1:60950_ej-n_0000000000) [n:127.0.0.1:60950_ej    ] o.a.s.c.Overseer processMessage: queueSize: 1, message = {
   [junit4]   2>   "operation":"leader",
   [junit4]   2>   "shard":"shard1",
   [junit4]   2>   "collection":"control_collection",
   [junit4]   2>   "base_url":"http://127.0.0.1:60950/ej",
   [junit4]   2>   "core":"collection1",
   [junit4]   2>   "state":"active"} current state version: 2
   [junit4]   2> 591959 INFO  (zkCallback-513-thread-1-processing-n:127.0.0.1:60950_ej) [n:127.0.0.1:60950_ej    ] o.a.s.c.c.ZkStateReader A cluster state change: [WatchedEvent state:SyncConnected type:NodeDataChanged path:/clusterstate.json], has occurred - updating... (live nodes size: [1])
   [junit4]   2> 592013 INFO  (coreZkRegister-1841-thread-1-processing-n:127.0.0.1:60950_ej x:collection1 s:shard1 c:control_collection r:core_node1) [n:127.0.0.1:60950_ej c:control_collection s:shard1 r:core_node1 x:collection1] o.a.s.c.ZkController We are http://127.0.0.1:60950/ej/collection1/ and leader is http://127.0.0.1:60950/ej/collection1/
   [junit4]   2> 592014 INFO  (coreZkRegister-1841-thread-1-processing-n:127.0.0.1:60950_ej x:collection1 s:shard1 c:control_collection r:core_node1) [n:127.0.0.1:60950_ej c:control_collection s:shard1 r:core_node1 x:collection1] o.a.s.c.ZkController No LogReplay needed for core=collection1 baseURL=http://127.0.0.1:60950/ej
   [junit4]   2> 592014 INFO  (coreZkRegister-1841-thread-1-processing-n:127.0.0.1:60950_ej x:collection1 s:shard1 c:control_collection r:core_node1) [n:127.0.0.1:60950_ej c:control_collection s:shard1 r:core_node1 x:collection1] o.a.s.c.ZkController I am the leader, no recovery necessary
   [junit4]   2> 592014 INFO  (coreZkRegister-1841-thread-1-processing-n:127.0.0.1:60950_ej x:collection1 s:shard1 c:control_collection r:core_node1) [n:127.0.0.1:60950_ej c:control_collection s:shard1 r:core_node1 x:collection1] o.a.s.c.ZkController publishing state=active
   [junit4]   2> 592014 INFO  (coreZkRegister-1841-thread-1-processing-n:127.0.0.1:60950_ej x:collection1 s:shard1 c:control_collection r:core_node1) [n:127.0.0.1:60950_ej c:control_collection s:shard1 r:core_node1 x:collection1] o.a.s.c.ZkController numShards not found on descriptor - reading it from system property
   [junit4]   2> 592017 INFO  (OverseerStateUpdate-95817776368779268-127.0.0.1:60950_ej-n_0000000000) [n:127.0.0.1:60950_ej    ] o.a.s.c.Overseer processMessage: queueSize: 1, message = {
   [junit4]   2>   "core":"collection1",
   [junit4]   2>   "core_node_name":"core_node1",
   [junit4]   2>   "roles":null,
   [junit4]   2>   "base_url":"http://127.0.0.1:60950/ej",
   [junit4]   2>   "node_name":"127.0.0.1:60950_ej",
   [junit4]   2>   "numShards":"1",
   [junit4]   2>   "state":"active",
   [junit4]   2>   "shard":"shard1",
   [junit4]   2>   "collection":"control_collection",
   [junit4]   2>   "operation":"state"} current state version: 3
   [junit4]   2> 592018 INFO  (OverseerStateUpdate-95817776368779268-127.0.0.1:60950_ej-n_0000000000) [n:127.0.0.1:60950_ej    ] o.a.s.c.o.ReplicaMutator Update state numShards=1 message={
   [junit4]   2>   "core":"collection1",
   [junit4]   2>   "core_node_name":"core_node1",
   [junit4]   2>   "roles":null,
   [junit4]   2>   "base_url":"http://127.0.0.1:60950/ej",
   [junit4]   2>   "node_name":"127.0.0.1:60950_ej",
   [junit4]   2>   "numShards":"1",
   [junit4]   2>   "state":"active",
   [junit4]   2>   "shard":"shard1",
   [junit4]   2>   "collection":"control_collection",
   [junit4]   2>   "operation":"state"}
   [junit4]   2> 592082 INFO  (TEST-DistribDocExpirationUpdateProcessorTest.test-seed#[C208BCC85FD7D299]) [    ] o.a.s.c.s.i.CloudSolrClient Final constructed zkHost string: 127.0.0.1:60947/solr
   [junit4]   2> 592083 INFO  (TEST-DistribDocExpirationUpdateProcessorTest.test-seed#[C208BCC85FD7D299]) [    ] o.a.s.c.c.SolrZkClient Using default ZkCredentialsProvider
   [junit4]   2> 592084 INFO  (TEST-DistribDocExpirationUpdateProcessorTest.test-seed#[C208BCC85FD7D299]) [    ] o.a.s.c.c.ConnectionManager Waiting for client to connect to ZooKeeper
   [junit4]   2> 592094 INFO  (zkCallback-515-thread-1) [    ] o.a.s.c.c.ConnectionManager Watcher org.apache.solr.common.cloud.ConnectionManager@55485c51 name:ZooKeeperConnection Watcher:127.0.0.1:60947/solr got event WatchedEvent state:SyncConnected type:None path:null path:null type:None
   [junit4]   2> 592095 INFO  (TEST-DistribDocExpirationUpdateProcessorTest.test-seed#[C208BCC85FD7D299]) [    ] o.a.s.c.c.ConnectionManager Client is connected to ZooKeeper
   [junit4]   2> 592095 INFO  (TEST-DistribDocExpirationUpdateProcessorTest.test-seed#[C208BCC85FD7D299]) [    ] o.a.s.c.c.SolrZkClient Using default ZkACLProvider
   [junit4]   2> 592095 INFO  (TEST-DistribDocExpirationUpdateProcessorTest.test-seed#[C208BCC85FD7D299]) [    ] o.a.s.c.c.ZkStateReader Updating cluster state from ZooKeeper... 
   [junit4]   2> 592097 INFO  (TEST-DistribDocExpirationUpdateProcessorTest.test-seed#[C208BCC85FD7D299]) [    ] o.a.s.c.c.ZkStateReader Updated live nodes from ZooKeeper... (0) -> (1)
   [junit4]   2> 592098 INFO  (TEST-DistribDocExpirationUpdateProcessorTest.test-seed#[C208BCC85FD7D299]) [    ] o.a.s.c.ChaosMonkey monkey: init - expire sessions:false cause connection loss:false
   [junit4]   2> 592123 INFO  (zkCallback-513-thread-1-processing-n:127.0.0.1:60950_ej) [n:127.0.0.1:60950_ej    ] o.a.s.c.c.ZkStateReader A cluster state change: [WatchedEvent state:SyncConnected type:NodeDataChanged path:/clusterstate.json], has occurred - updating... (live nodes size: [1])
   [junit4]   2> 592123 INFO  (zkCallback-515-thread-1) [    ] o.a.s.c.c.ZkStateReader A cluster state change: [WatchedEvent state:SyncConnected type:NodeDataChanged path:/clusterstate.json], has occurred - updating... (live nodes size: [1])
   [junit4]   2> 592477 INFO  (TEST-DistribDocExpirationUpdateProcessorTest.test-seed#[C208BCC85FD7D299]) [    ] o.a.s.SolrTestCaseJ4 Writing core.properties file to /Users/jenkins/workspace/Lucene-Solr-master-MacOSX/solr/build/solr-core/test/J1/temp/solr.cloud.DistribDocExpirationUpdateProcessorTest_C208BCC85FD7D299-001/shard-1-001/cores/collection1
   [junit4]   2> 592480 INFO  (TEST-DistribDocExpirationUpdateProcessorTest.test-seed#[C208BCC85FD7D299]) [    ] o.a.s.c.AbstractFullDistribZkTestBase create jetty 1 in directory /Users/jenkins/workspace/Lucene-Solr-master-MacOSX/solr/build/solr-core/test/J1/temp/solr.cloud.DistribDocExpirationUpdateProcessorTest_C208BCC85FD7D299-001/shard-1-001
   [junit4]   2> 592481 INFO  (TEST-DistribDocExpirationUpdateProcessorTest.test-seed#[C208BCC85FD7D299]) [    ] o.e.j.s.Server jetty-9.3.8.v20160314
   [junit4]   2> 592483 INFO  (TEST-DistribDocExpirationUpdateProcessorTest.test-seed#[C208BCC85FD7D299]) [    ] o.e.j.s.h.ContextHandler Started o.e.j.s.ServletContextHandler@458c6000{/ej,null,AVAILABLE}
   [junit4]   2> 592483 INFO  (TEST-DistribDocExpirationUpdateProcessorTest.test-seed#[C208BCC85FD7D299]) [    ] o.e.j.s.ServerConnector Started ServerConnector@4533c49e{HTTP/1.1,[http/1.1]}{127.0.0.1:60955}
   [junit4]   2> 592483 INFO  (TEST-DistribDocExpirationUpdateProcessorTest.test-seed#[C208BCC85FD7D299]) [    ] o.e.j.s.Server Started @598403ms
   [junit4]   2> 592483 INFO  (TEST-DistribDocExpirationUpdateProcessorTest.test-seed#[C208BCC85FD7D299]) [    ] o.a.s.c.s.e.JettySolrRunner Jetty properties: {solr.data.dir=/Users/jenkins/workspace/Lucene-Solr-master-MacOSX/solr/build/solr-core/test/J1/temp/solr.cloud.DistribDocExpirationUpdateProcessorTest_C208BCC85FD7D299-001/tempDir-001/jetty1, solrconfig=solrconfig.xml, hostContext=/ej, hostPort=60955, coreRootDirectory=/Users/jenkins/workspace/Lucene-Solr-master-MacOSX/solr/build/solr-core/test/J1/../../../../../../../../../Users/jenkins/workspace/Lucene-Solr-master-MacOSX/solr/build/solr-core/test/J1/temp/solr.cloud.DistribDocExpirationUpdateProcessorTest_C208BCC85FD7D299-001/shard-1-001/cores}
   [junit4]   2> 592484 INFO  (TEST-DistribDocExpirationUpdateProcessorTest.test-seed#[C208BCC85FD7D299]) [    ] o.a.s.s.SolrDispatchFilter SolrDispatchFilter.init(): sun.misc.Launcher$AppClassLoader@4554617c
   [junit4]   2> 592484 INFO  (TEST-DistribDocExpirationUpdateProcessorTest.test-seed#[C208BCC85FD7D299]) [    ] o.a.s.c.SolrResourceLoader new SolrResourceLoader for directory: '/Users/jenkins/workspace/Lucene-Solr-master-MacOSX/solr/build/solr-core/test/J1/temp/solr.cloud.DistribDocExpirationUpdateProcessorTest_C208BCC85FD7D299-001/shard-1-001'
   [junit4]   2> 592485 INFO  (TEST-DistribDocExpirationUpdateProcessorTest.test-seed#[C208BCC85FD7D299]) [    ] o.a.s.c.SolrResourceLoader JNDI not configured for solr (NoInitialContextEx)
   [junit4]   2> 592485 INFO  (TEST-DistribDocExpirationUpdateProcessorTest.test-seed#[C208BCC85FD7D299]) [    ] o.a.s.c.SolrResourceLoader solr home defaulted to 'solr/' (could not find system property or JNDI)
   [junit4]   2> 592485 INFO  (TEST-DistribDocExpirationUpdateProcessorTest.test-seed#[C208BCC85FD7D299]) [    ] o.a.s.c.c.SolrZkClient Using default ZkCredentialsProvider
   [junit4]   2> 592486 INFO  (TEST-DistribDocExpirationUpdateProcessorTest.test-seed#[C208BCC85FD7D299]) [    ] o.a.s.c.c.ConnectionManager Waiting for client to connect to ZooKeeper
   [junit4]   2> 592488 INFO  (zkCallback-516-thread-1) [    ] o.a.s.c.c.ConnectionManager Watcher org.apache.solr.common.cloud.ConnectionManager@2ab5cf8b name:ZooKeeperConnection Watcher:127.0.0.1:60947/solr got event WatchedEvent state:SyncConnected type:None path:null path:null type:None
   [junit4]   2> 592488 INFO  (TEST-DistribDocExpirationUpdateProcessorTest.test-seed#[C208BCC85FD7D299]) [    ] o.a.s.c.c.ConnectionManager Client is connected to ZooKeeper
   [junit4]   2> 592488 INFO  (TEST-DistribDocExpirationUpdateProcessorTest.test-seed#[C208BCC85FD7D299]) [    ] o.a.s.c.c.SolrZkClient Using default ZkACLProvider
   [junit4]   2> 592490 INFO  (TEST-DistribDocExpirationUpdateProcessorTest.test-seed#[C208BCC85FD7D299]) [    ] o.a.s.s.SolrDispatchFilter Loading solr.xml from SolrHome (not found in ZooKeeper)
   [junit4]   2> 592490 INFO  (TEST-DistribDocExpirationUpdateProcessorTest.test-seed#[C208BCC85FD7D299]) [    ] o.a.s.c.SolrXmlConfig Loading container configuration from /Users/jenkins/workspace/Lucene-Solr-master-MacOSX/solr/build/solr-core/test/J1/temp/solr.cloud.DistribDocExpirationUpdateProcessorTest_C208BCC85FD7D299-001/shard-1-001/solr.xml
   [junit4]   2> 592562 INFO  (TEST-DistribDocExpirationUpdateProcessorTest.test-seed#[C208BCC85FD7D299]) [    ] o.a.s.c.CorePropertiesLocator Config-defined core root directory: /Users/jenkins/workspace/Lucene-Solr-master-MacOSX/solr/build/solr-core/test/J1/../../../../../../../../../Users/jenkins/workspace/Lucene-Solr-master-MacOSX/solr/build/solr-core/test/J1/temp/solr.cloud.DistribDocExpirationUpdateProcessorTest_C208BCC85FD7D299-001/shard-1-001/cores
   [junit4]   2> 592562 INFO  (TEST-DistribDocExpirationUpdateProcessorTest.test-seed#[C208BCC85FD7D299]) [    ] o.a.s.c.CoreContainer New CoreContainer 1047284149
   [junit4]   2> 592562 INFO  (TEST-DistribDocExpirationUpdateProcessorTest.test-seed#[C208BCC85FD7D299]) [    ] o.a.s.c.CoreContainer Loading cores into CoreContainer [instanceDir=/Users/jenkins/workspace/Lucene-Solr-master-MacOSX/solr/build/solr-core/test/J1/temp/solr.cloud.DistribDocExpirationUpdateProcessorTest_C208BCC85FD7D299-001/shard-1-001]
   [junit4]   2> 592562 WARN  (TEST-DistribDocExpirationUpdateProcessorTest.test-seed#[C208BCC85FD7D299]) [    ] o.a.s.c.CoreContainer Couldn't add files from /Users/jenkins/workspace/Lucene-Solr-master-MacOSX/solr/build/solr-core/test/J1/temp/solr.cloud.DistribDocExpirationUpdateProcessorTest_C208BCC85FD7D299-001/shard-1-001/lib to classpath: /Users/jenkins/workspace/Lucene-Solr-master-MacOSX/solr/build/solr-core/test/J1/temp/solr.cloud.DistribDocExpirationUpdateProcessorTest_C208BCC85FD7D299-001/shard-1-001/lib
   [junit4]   2> 592562 INFO  (TEST-DistribDocExpirationUpdateProcessorTest.test-seed#[C208BCC85FD7D299]) [    ] o.a.s.h.c.HttpShardHandlerFactory created with socketTimeout : 90000,urlScheme : ,connTimeout : 15000,maxConnectionsPerHost : 20,maxConnections : 10000,corePoolSize : 0,maximumPoolSize : 2147483647,maxThreadIdleTime : 5,sizeOfQueue : -1,fairnessPolicy : false,
   [junit4]   2> 592565 INFO  (TEST-DistribDocExpirationUpdateProcessorTest.test-seed#[C208BCC85FD7D299]) [    ] o.a.s.u.UpdateShardHandler Creating UpdateShardHandler HTTP client with params: 
   [junit4]   2> 592566 INFO  (TEST-DistribDocExpirationUpdateProcessorTest.test-seed#[C208BCC85FD7D299]) [    ] o.a.s.l.LogWatcher SLF4J impl is org.slf4j.impl.Log4jLoggerFactory
   [junit4]   2> 592566 INFO  (TEST-DistribDocExpirationUpdateProcessorTest.test-seed#[C208BCC85FD7D299]) [    ] o.a.s.l.LogWatcher Registering Log Listener [Log4j (org.slf4j.impl.Log4jLoggerFactory)]
   [junit4]   2> 592566 INFO  (TEST-DistribDocExpirationUpdateProcessorTest.test-seed#[C208BCC85FD7D299]) [    ] o.a.s.c.ZkContainer Zookeeper client=127.0.0.1:60947/solr
   [junit4]   2> 592566 INFO  (TEST-DistribDocExpirationUpdateProcessorTest.test-seed#[C208BCC85FD7D299]) [    ] o.a.s.c.ZkController zkHost includes chroot
   [junit4]   2> 592566 INFO  (TEST-DistribDocExpirationUpdateProcessorTest.test-seed#[C208BCC85FD7D299]) [    ] o.a.s.c.c.SolrZkClient Using default ZkCredentialsProvider
   [junit4]   2> 592567 INFO  (TEST-DistribDocExpirationUpdateProcessorTest.test-seed#[C208BCC85FD7D299]) [    ] o.a.s.c.c.ConnectionManager Waiting for client to connect to ZooKeeper
   [junit4]   2> 592569 INFO  (zkCallback-519-thread-1) [    ] o.a.s.c.c.ConnectionManager Watcher org.apache.solr.common.cloud.ConnectionManager@6c4de86d name:ZooKeeperConnection Watcher:127.0.0.1:60947 got event WatchedEvent state:SyncConnected type:None path:null path:null type:None
   [junit4]   2> 592569 INFO  (TEST-DistribDocExpirationUpdateProcessorTest.test-seed#[C208BCC85FD7D299]) [    ] o.a.s.c.c.ConnectionManager Client is connected to ZooKeeper
   [junit4]   2> 592569 INFO  (TEST-DistribDocExpirationUpdateProcessorTest.test-seed#[C208BCC85FD7D299]) [    ] o.a.s.c.c.SolrZkClient Using default ZkACLProvider
   [junit4]   2> 592571 INFO  (TEST-DistribDocExpirationUpdateProcessorTest.test-seed#[C208BCC85FD7D299]) [n:127.0.0.1:60955_ej    ] o.a.s.c.ZkController Added new OnReconnect listener org.apache.solr.cloud.ZkController$$Lambda$52/209878376@61ae8a68
   [junit4]   2> 592572 INFO  (TEST-DistribDocExpirationUpdateProcessorTest.test-seed#[C208BCC85FD7D299]) [n:127.0.0.1:60955_ej    ] o.a.s.c.c.ConnectionManager Waiting for client to connect to ZooKeeper
   [junit4]   2> 592574 INFO  (zkCallback-520-thread-1-processing-n:127.0.0.1:60955_ej) [n:127.0.0.1:60955_ej    ] o.a.s.c.c.ConnectionManager Watcher org.apache.solr.common.cloud.ConnectionManager@23f5ef3 name:ZooKeeperConnection Watcher:127.0.0.1:60947/solr got event WatchedEvent state:SyncConnected type:None path:null path:null type:None
   [junit4]   2> 592574 INFO  (TEST-DistribDocExpirationUpdateProcessorTest.test-seed#[C208BCC85FD7D299]) [n:127.0.0.1:60955_ej    ] o.a.s.c.c.ConnectionManager Client is connected to ZooKeeper
   [junit4]   2> 592587 INFO  (TEST-DistribDocExpirationUpdateProcessorTest.test-seed#[C208BCC85FD7D299]) [n:127.0.0.1:60955_ej    ] o.a.s.c.c.ZkStateReader Updating cluster state from ZooKeeper... 
   [junit4]   2> 592589 INFO  (TEST-DistribDocExpirationUpdateProcessorTest.test-seed#[C208BCC85FD7D299]) [n:127.0.0.1:60955_ej    ] o.a.s.c.c.ZkStateReader Updated live nodes from ZooKeeper... (0) -> (1)
   [junit4]   2> 592593 INFO  (TEST-DistribDocExpirationUpdateProcessorTest.test-seed#[C208BCC85FD7D299]) [n:127.0.0.1:60955_ej    ] o.a.s.c.Overseer Overseer (id=null) closing
   [junit4]   2> 592593 INFO  (TEST-DistribDocExpirationUpdateProcessorTest.test-seed#[C208BCC85FD7D299]) [n:127.0.0.1:60955_ej    ] o.a.s.c.LeaderElector Joined leadership election with path: /overseer_elect/election/95817776368779272-127.0.0.1:60955_ej-n_0000000001
   [junit4]   2> 592595 INFO  (TEST-DistribDocExpirationUpdateProcessorTest.test-seed#[C208BCC85FD7D299]) [n:127.0.0.1:60955_ej    ] o.a.s.c.LeaderElector Watching path /overseer_elect/election/95817776368779268-127.0.0.1:60950_ej-n_0000000000 to know if I could be the leader
   [junit4]   2> 592596 INFO  (TEST-DistribDocExpirationUpdateProcessorTest.test-seed#[C208BCC85FD7D299]) [n:127.0.0.1:60955_ej    ] o.a.s.c.ZkController Publish node=127.0.0.1:60955_ej as DOWN
   [junit4]   2> 592599 INFO  (OverseerStateUpdate-95817776368779268-127.0.0.1:60950_ej-n_0000000000) [n:127.0.0.1:60950_ej    ] o.a.s.c.Overseer processMessage: queueSize: 1, message = {
   [junit4]   2>   "operation":"downnode",
   [junit4]   2>   "node_name":"127.0.0.1:60955_ej"} current state version: 4
   [junit4]   2> 592599 INFO  (OverseerStateUpdate-95817776368779268-127.0.0.1:60950_ej-n_0000000000) [n:127.0.0.1:60950_ej    ] o.a.s.c.o.NodeMutator DownNode state invoked for node: 127.0.0.1:60955_ej
   [junit4]   2> 592713 INFO  (zkCallback-513-thread-1-processing-n:127.0.0.1:60950_ej) [n:127.0.0.1:60950_ej    ] o.a.s.c.c.ZkStateReader A cluster state change: [WatchedEvent state:SyncConnected type:NodeDataChanged path:/clusterstate.json], has occurred - updating... (live nodes size: [1])
   [junit4]   2> 592713 INFO  (zkCallback-520-thread-1-processing-n:127.0.0.1:60955_ej) [n:127.0.0.1:60955_ej    ] o.a.s.c.c.ZkStateReader A cluster state change: [WatchedEvent state:SyncConnected type:NodeDataChanged path:/clusterstate.json], has occurred - updating... (live nodes size: [1])
   [junit4]   2> 592713 INFO  (zkCallback-515-thread-1) [    ] o.a.s.c.c.ZkStateReader A cluster state change: [WatchedEvent state:SyncConnected type:NodeDataChanged path:/clusterstate.json], has occurred - updating... (live nodes size: [1])
   [junit4]   2> 593609 INFO  (TEST-DistribDocExpirationUpdateProcessorTest.test-seed#[C208BCC85FD7D299]) [n:127.0.0.1:60955_ej    ] o.a.s.c.ZkController Register node as live in ZooKeeper:/live_nodes/127.0.0.1:60955_ej
   [junit4]   2> 593610 INFO  (TEST-DistribDocExpirationUpdateProcessorTest.test-seed#[C208BCC85FD7D299]) [n:127.0.0.1:60955_ej    ] o.a.s.c.c.SolrZkClient makePath: /live_nodes/127.0.0.1:60955_ej
   [junit4]   2> 593612 INFO  (zkCallback-520-thread-1-processing-n:127.0.0.1:60955_ej) [n:127.0.0.1:60955_ej    ] o.a.s.c.c.ZkStateReader A live node change: [WatchedEvent state:SyncConnected type:NodeChildrenChanged path:/live_nodes], has occurred - updating... (live nodes size: [1])
   [junit4]   2> 593612 INFO  (zkCallback-513-thread-1-processing-n:127.0.0.1:60950_ej) [n:127.0.0.1:60950_ej    ] o.a.s.c.c.ZkStateReader A live node change: [WatchedEvent state:SyncConnected type:NodeChildrenChanged path:/live_nodes], has occurred - updating... (live nodes size: [1])
   [junit4]   2> 593612 INFO  (zkCallback-515-thread-1) [    ] o.a.s.c.c.ZkStateReader A live node change: [WatchedEvent state:SyncConnected type:NodeChildrenChanged path:/live_nodes], has occurred - updating... (live nodes size: [1])
   [junit4]   2> 593613 INFO  (zkCallback-520-thread-1-processing-n:127.0.0.1:60955_ej) [n:127.0.0.1:60955_ej    ] o.a.s.c.c.ZkStateReader Updated live nodes from ZooKeeper... (1) -> (2)
   [junit4]   2> 593613 INFO  (zkCallback-513-thread-1-processing-n:127.0.0.1:60950_ej) [n:127.0.0.1:60950_ej    ] o.a.s.c.c.ZkStateReader Updated live nodes from ZooKeeper... (1) -> (2)
   [junit4]   2> 593613 INFO  (zkCallback-515-thread-1) [    ] o.a.s.c.c.ZkStateReader Updated live nodes from ZooKeeper... (1) -> (2)
   [junit4]   2> 593628 INFO  (TEST-DistribDocExpirationUpdateProcessorTest.test-seed#[C208BCC85FD7D299]) [n:127.0.0.1:60955_ej    ] o.a.s.c.CoreContainer Security conf doesn't exist. Skipping setup for authorization module.
   [junit4]   2> 593628 INFO  (TEST-DistribDocExpirationUpdateProcessorTest.test-seed#[C208BCC85FD7D299]) [n:127.0.0.1:60955_ej    ] o.a.s.c.CoreContainer No authentication plugin used.
   [junit4]   2> 593629 INFO  (TEST-DistribDocExpirationUpdateProcessorTest.test-seed#[C208BCC85FD7D299]) [n:127.0.0.1:60955_ej    ] o.a.s.c.CorePropertiesLocator Looking for core definitions underneath /Users/jenkins/workspace/Lucene-Solr-master-MacOSX/solr/build/solr-core/test/J1/../../../../../../../../../Users/jenkins/workspace/Lucene-Solr-master-MacOSX/solr/build/solr-core/test/J1/temp/solr.cloud.DistribDocExpirationUpdateProcessorTest_C208BCC85FD7D299-001/shard-1-001/cores
   [junit4]   2> 593630 INFO  (TEST-DistribDocExpirationUpdateProcessorTest.test-seed#[C208BCC85FD7D299]) [n:127.0.0.1:60955_ej    ] o.a.s.c.CoreDescriptor Created CoreDescriptor: {name=collection1, config=solrconfig.xml, transient=false, schema=schema.xml, loadOnStartup=true, configSetProperties=configsetprops.json, collection=collection1, coreNodeName=, dataDir=data/, shard=}
   [junit4]   2> 593630 INFO  (TEST-DistribDocExpirationUpdateProcessorTest.test-seed#[C208BCC85FD7D299]) [n:127.0.0.1:60955_ej    ] o.a.s.c.CorePropertiesLocator Found core collection1 in /Users/jenkins/workspace/Lucene-Solr-master-MacOSX/solr/build/solr-core/test/J1/../../../../../../../../../Users/jenkins/workspace/Lucene-Solr-master-MacOSX/solr/build/solr-core/test/J1/temp/solr.cloud.DistribDocExpirationUpdateProcessorTest_C208BCC85FD7D299-001/shard-1-001/cores/collection1
   [junit4]   2> 593630 INFO  (TEST-DistribDocExpirationUpdateProcessorTest.test-seed#[C208BCC85FD7D299]) [n:127.0.0.1:60955_ej    ] o.a.s.c.CorePropertiesLocator Found 1 core definitions
   [junit4]   2> 593632 INFO  (TEST-DistribDocExpirationUpdateProcessorTest.test-seed#[C208BCC85FD7D299]) [n:127.0.0.1:60955_ej    ] o.a.s.s.SolrDispatchFilter user.dir=/Users/jenkins/workspace/Lucene-Solr-master-MacOSX/solr/build/solr-core/test/J1
   [junit4]   2> 593632 INFO  (TEST-DistribDocExpirationUpdateProcessorTest.test-seed#[C208BCC85FD7D299]) [n:127.0.0.1:60955_ej    ] o.a.s.s.SolrDispatchFilter SolrDispatchFilter.init() done
   [junit4]   2> 593632 INFO  (coreLoadExecutor-1859-thread-1-processing-n:127.0.0.1:60955_ej) [n:127.0.0.1:60955_ej c:collection1   x:collection1] o.a.s.c.ZkController publishing state=down
   [junit4]   2> 593633 INFO  (coreLoadExecutor-1859-thread-1-processing-n:127.0.0.1:60955_ej) [n:127.0.0.1:60955_ej c:collection1   x:collection1] o.a.s.c.ZkController numShards not found on descriptor - reading it from system property
   [junit4]   2> 593634 INFO  (coreLoadExecutor-1859-thread-1-processing-n:127.0.0.1:60955_ej) [n:127.0.0.1:60955_ej c:collection1   x:collection1] o.a.s.c.ZkController Collection collection1 not visible yet, but flagging it so a watch is registered when it becomes visible
   [junit4]   2> 593634 INFO  (coreLoadExecutor-1859-thread-1-processing-n:127.0.0.1:60955_ej) [n:127.0.0.1:60955_ej c:collection1   x:collection1] o.a.s.c.c.ZkStateReader addZkWatch [collection1]
   [junit4]   2> 593635 INFO  (OverseerStateUpdate-95817776368779268-127.0.0.1:60950_ej-n_0000000000) [n:127.0.0.1:60950_ej    ] o.a.s.c.Overseer processMessage: queueSize: 1, message = {
   [junit4]   2>   "core":"collection1",
   [junit4]   2>   "roles":null,
   [junit4]   2>   "base_url":"http://127.0.0.1:60955/ej",
   [junit4]   2>   "node_name":"127.0.0.1:60955_ej",
   [junit4]   2>   "numShards":"2",
   [junit4]   2>   "state":"down",
   [junit4]   2>   "shard":null,
   [junit4]   2>   "collection":"collection1",
   [junit4]   2>   "operation":"state"} current state version: 5
   [junit4]   2> 593635 INFO  (coreLoadExecutor-1859-thread-1-processing-n:127.0.0.1:60955_ej) [n:127.0.0.1:60955_ej c:collection1   x:collection1] o.a.s.c.c.ZkStateReader Deleting data for [collection1]
   [junit4]   2> 593635 INFO  (OverseerStateUpdate-95817776368779268-127.0.0.1:60950_ej-n_0000000000) [n:127.0.0.1:60950_ej    ] o.a.s.c.o.ReplicaMutator Update state numShards=2 message={
   [junit4]   2>   "core":"collection1",
   [junit4]   2>   "roles":null,
   [junit4]   2>   "base_url":"http://127.0.0.1:60955/ej",
   [junit4]   2>   "node_name":"127.0.0.1:60955_ej",
   [junit4]   2>   "numShards":"2",
   [junit4]   2>   "state":"down",
   [junit4]   2>   "shard":null,
   [junit4]   2>   "collection":"collection1",
   [junit4]   2>   "operation":"state"}
   [junit4]   2> 593636 INFO  (OverseerStateUpdate-95817776368779268-127.0.0.1:60950_ej-n_0000000000) [n:127.0.0.1:60950_ej    ] o.a.s.c.o.ClusterStateMutator building a new cName: collection1
   [junit4]   2> 593636 INFO  (OverseerStateUpdate-95817776368779268-127.0.0.1:60950_ej-n_0000000000) [n:127.0.0.1:60950_ej    ] o.a.s.c.o.ReplicaMutator Assigning new node to shard shard=shard2
   [junit4]   2> 593637 INFO  (coreLoadExecutor-1859-thread-1-processing-n:127.0.0.1:60955_ej) [n:127.0.0.1:60955_ej c:collection1   x:collection1] o.a.s.c.ZkController look for our core node name
   [junit4]   2> 593751 INFO  (zkCallback-513-thread-1-processing-n:127.0.0.1:60950_ej) [n:127.0.0.1:60950_ej    ] o.a.s.c.c.ZkStateReader A cluster state change: [WatchedEvent state:SyncConnected type:NodeDataChanged path:/clusterstate.json], has occurred - updating... (live nodes size: [2])
   [junit4]   2> 593751 INFO  (zkCallback-515-thread-1) [    ] o.a.s.c.c.ZkStateReader A cluster state change: [WatchedEvent state:SyncConnected type:NodeDataChanged path:/clusterstate.json], has occurred - updating... (live nodes size: [2])
   [junit4]   2> 593751 INFO  (zkCallback-520-thread-1-processing-n:127.0.0.1:60955_ej) [n:127.0.0.1:60955_ej    ] o.a.s.c.c.ZkStateReader A cluster state change: [WatchedEvent state:SyncConnected type:NodeDataChanged path:/clusterstate.json], has occurred - updating... (live nodes size: [2])
   [junit4]   2> 594641 INFO  (coreLoadExecutor-1859-thread-1-processing-n:127.0.0.1:60955_ej) [n:127.0.0.1:60955_ej c:collection1   x:collection1] o.a.s.c.ZkController waiting to find shard id in clusterstate for collection1
   [junit4]   2> 594641 INFO  (coreLoadExecutor-1859-thread-1-processing-n:127.0.0.1:60955_ej) [n:127.0.0.1:60955_ej c:collection1   x:collection1] o.a.s.c.ZkController Check for collection zkNode:collection1
   [junit4]   2> 594642 INFO  (coreLoadExecutor-1859-thread-1-processing-n:127.0.0.1:60955_ej) [n:127.0.0.1:60955_ej c:collection1   x:collection1] o.a.s.c.ZkController Collection zkNode exists
   [junit4]   2> 594642 INFO  (coreLoadExecutor-1859-thread-1-processing-n:127.0.0.1:60955_ej) [n:127.0.0.1:60955_ej c:collection1   x:collection1] o.a.s.c.c.ZkStateReader Load collection config from: [/collections/collection1]
   [junit4]   2> 594643 INFO  (coreLoadExecutor-1859-thread-1-processing-n:127.0.0.1:60955_ej) [n:127.0.0.1:60955_ej c:collection1   x:collection1] o.a.s.c.c.ZkStateReader path=[/collections/collection1] [configName]=[conf1] specified config exists in ZooKeeper
   [junit4]   2> 594643 INFO  (coreLoadExecutor-1859-thread-1-processing-n:127.0.0.1:60955_ej) [n:127.0.0.1:60955_ej c:collection1   x:collection1] o.a.s.c.SolrResourceLoader new SolrResourceLoader for directory: '/Users/jenkins/workspace/Lucene-Solr-master-MacOSX/solr/build/solr-core/test/J1/temp/solr.cloud.DistribDocExpirationUpdateProcessorTest_C208BCC85FD7D299-001/shard-1-001/cores/collection1'
   [junit4]   2> 594643 INFO  (coreLoadExecutor-1859-thread-1-processing-n:127.0.0.1:60955_ej) [n:127.0.0.1:60955_ej c:collection1   x:collection1] o.a.s.c.SolrResourceLoader JNDI not configured for solr (NoInitialContextEx)
   [junit4]   2> 594644 INFO  (coreLoadExecutor-1859-thread-1-processing-n:127.0.0.1:60955_ej) [n:127.0.0.1:60955_ej c:collection1   x:collection1] o.a.s.c.SolrResourceLoader solr home defaulted to 'solr/' (could not find system property or JNDI)
   [junit4]   2> 594646 INFO  (coreLoadExecutor-1859-thread-1-processing-n:127.0.0.1:60955_ej) [n:127.0.0.1:60955_ej c:collection1   x:collection1] o.a.s.c.Config loaded config solrconfig.xml with version 0 
   [junit4]   2> 594655 INFO  (coreLoadExecutor-1859-thread-1-processing-n:127.0.0.1:60955_ej) [n:127.0.0.1:60955_ej c:collection1   x:collection1] o.a.s.c.SolrConfig current version of requestparams : -1
   [junit4]   2> 594662 INFO  (coreLoadExecutor-1859-thread-1-processing-n:127.0.0.1:60955_ej) [n:127.0.0.1:60955_ej c:collection1   x:collection1] o.a.s.c.SolrConfig Using Lucene MatchVersion: 7.0.0
   [junit4]   2> 594676 INFO  (coreLoadExecutor-1859-thread-1-processing-n:127.0.0.1:60955_ej) [n:127.0.0.1:60955_ej c:collection1   x:collection1] o.a.s.c.SolrConfig Loaded SolrConfig: solrconfig.xml
   [junit4]   2> 594682 INFO  (coreLoadExecutor-1859-thread-1-processing-n:127.0.0.1:60955_ej) [n:127.0.0.1:60955_ej c:collection1   x:collection1] o.a.s.s.IndexSchema [collection1] Schema name=test
   [junit4]   2> 594799 INFO  (coreLoadExecutor-1859-thread-1-processing-n:127.0.0.1:60955_ej) [n:127.0.0.1:60955_ej c:collection1   x:collection1] o.a.s.s.IndexSchema default search field in schema is text
   [junit4]   2> 594800 INFO  (coreLoadExecutor-1859-thread-1-processing-n:127.0.0.1:60955_ej) [n:127.0.0.1:60955_ej c:collection1   x:collection1] o.a.s.s.IndexSchema unique key field: id
   [junit4]   2> 594801 INFO  (coreLoadExecutor-1859-thread-1-processing-n:127.0.0.1:60955_ej) [n:127.0.0.1:60955_ej c:collection1   x:collection1] o.a.s.s.FileExchangeRateProvider Reloading exchange rates from file currency.xml
   [junit4]   2> 594805 INFO  (coreLoadExecutor-1859-thread-1-processing-n:127.0.0.1:60955_ej) [n:127.0.0.1:60955_ej c:collection1   x:collection1] o.a.s.s.FileExchangeRateProvider Reloading exchange rates from file currency.xml
   [junit4]   2> 594825 INFO  (autoExpireDocs-1853-thread-1) [n:127.0.0.1:60950_ej c:control_collection s:shard1 r:core_node1 x:collection1] o.a.s.u.p.DocExpirationUpdateProcessorFactory Begining periodic deletion of expired docs
   [junit4]   2> 594833 INFO  (autoExpireDocs-1853-thread-1) [n:127.0.0.1:60950_ej c:control_collection s:shard1 r:core_node1 x:collection1] o.a.s.u.DirectUpdateHandler2 start commit{,optimize=false,openSearcher=true,waitSearcher=true,expungeDeletes=false,softCommit=true,prepareCommit=false}
   [junit4]   2> 594834 INFO  (autoExpireDocs-1853-thread-1) [n:127.0.0.1:60950_ej c:control_collection s:shard1 r:core_node1 x:collection1] o.a.s.c.SolrCore SolrIndexSearcher has not changed - not re-opening: org.apache.solr.search.SolrIndexSearcher
   [junit4]   2> 594834 INFO  (autoExpireDocs-1853-thread-1) [n:127.0.0.1:60950_ej c:control_collection s:shard1 r:core_node1 x:collection1] o.a.s.u.DirectUpdateHandler2 end_commit_flush
   [junit4]   2> 594834 INFO  (autoExpireDocs-1853-thread-1) [n:127.0.0.1:60950_ej c:control_collection s:shard1 r:core_node1 x:collection1] o.a.s.u.p.LogUpdateProcessorFactory [collection1] {deleteByQuery={!cache=false}eXpField_tdt:[* TO 2016-05-01T00:40:43.918Z] (-1533084428055609344),commit=} 0 8
   [junit4]   2> 594834 INFO  (autoExpireDocs-1853-thread-1) [n:127.0.0.1:60950_ej c:control_collection s:shard1 r:core_node1 x:collection1] o.a.s.u.p.DocExpirationUpdateProcessorFactory Fi

[...truncated too long message...]

7_ej c:collection1 s:shard1 r:core_node4 x:collection1] o.a.s.c.CachingDirectoryFactory Closing directory: /Users/jenkins/workspace/Lucene-Solr-master-MacOSX/solr/build/solr-core/test/J1/../../../../../../../../../Users/jenkins/workspace/Lucene-Solr-master-MacOSX/solr/build/solr-core/test/J1/temp/solr.cloud.DistribDocExpirationUpdateProcessorTest_C208BCC85FD7D299-001/shard-4-001/cores/collection1/data
   [junit4]   2> 659357 WARN  (zkCallback-536-thread-2-processing-n:127.0.0.1:61007_ej) [n:127.0.0.1:61007_ej c:collection1 s:shard1 r:core_node4 x:collection1] o.a.s.c.LeaderElector 
   [junit4]   2> java.lang.RuntimeException: org.apache.zookeeper.KeeperException$SessionExpiredException: KeeperErrorCode = Session expired for /overseer
   [junit4]   2> 	at org.apache.solr.cloud.Overseer.createOverseerNode(Overseer.java:1062)
   [junit4]   2> 	at org.apache.solr.cloud.Overseer.getStateUpdateQueue(Overseer.java:926)
   [junit4]   2> 	at org.apache.solr.cloud.Overseer.getStateUpdateQueue(Overseer.java:913)
   [junit4]   2> 	at org.apache.solr.cloud.ShardLeaderElectionContext.runLeaderProcess(ElectionContext.java:314)
   [junit4]   2> 	at org.apache.solr.cloud.LeaderElector.runIamLeaderProcess(LeaderElector.java:170)
   [junit4]   2> 	at org.apache.solr.cloud.LeaderElector.checkIfIamLeader(LeaderElector.java:135)
   [junit4]   2> 	at org.apache.solr.cloud.LeaderElector.joinElection(LeaderElector.java:307)
   [junit4]   2> 	at org.apache.solr.cloud.LeaderElector.joinElection(LeaderElector.java:216)
   [junit4]   2> 	at org.apache.solr.cloud.ShardLeaderElectionContext.rejoinLeaderElection(ElectionContext.java:670)
   [junit4]   2> 	at org.apache.solr.cloud.ShardLeaderElectionContext.runLeaderProcess(ElectionContext.java:340)
   [junit4]   2> 	at org.apache.solr.cloud.LeaderElector.runIamLeaderProcess(LeaderElector.java:170)
   [junit4]   2> 	at org.apache.solr.cloud.LeaderElector.checkIfIamLeader(LeaderElector.java:135)
   [junit4]   2> 	at org.apache.solr.cloud.LeaderElector.access$200(LeaderElector.java:56)
   [junit4]   2> 	at org.apache.solr.cloud.LeaderElector$ElectionWatcher.process(LeaderElector.java:348)
   [junit4]   2> 	at org.apache.solr.common.cloud.SolrZkClient$3.lambda$process$0(SolrZkClient.java:266)
   [junit4]   2> 	at java.util.concurrent.Executors$RunnableAdapter.call(Executors.java:511)
   [junit4]   2> 	at java.util.concurrent.FutureTask.run(FutureTask.java:266)
   [junit4]   2> 	at org.apache.solr.common.util.ExecutorUtil$MDCAwareThreadPoolExecutor.lambda$execute$0(ExecutorUtil.java:229)
   [junit4]   2> 	at java.util.concurrent.ThreadPoolExecutor.runWorker(ThreadPoolExecutor.java:1142)
   [junit4]   2> 	at java.util.concurrent.ThreadPoolExecutor$Worker.run(ThreadPoolExecutor.java:617)
   [junit4]   2> 	at java.lang.Thread.run(Thread.java:745)
   [junit4]   2> Caused by: org.apache.zookeeper.KeeperException$SessionExpiredException: KeeperErrorCode = Session expired for /overseer
   [junit4]   2> 	at org.apache.zookeeper.KeeperException.create(KeeperException.java:127)
   [junit4]   2> 	at org.apache.zookeeper.KeeperException.create(KeeperException.java:51)
   [junit4]   2> 	at org.apache.zookeeper.ZooKeeper.create(ZooKeeper.java:783)
   [junit4]   2> 	at org.apache.solr.common.cloud.SolrZkClient$9.execute(SolrZkClient.java:383)
   [junit4]   2> 	at org.apache.solr.common.cloud.SolrZkClient$9.execute(SolrZkClient.java:380)
   [junit4]   2> 	at org.apache.solr.common.cloud.ZkCmdExecutor.retryOperation(ZkCmdExecutor.java:60)
   [junit4]   2> 	at org.apache.solr.common.cloud.SolrZkClient.create(SolrZkClient.java:380)
   [junit4]   2> 	at org.apache.solr.cloud.Overseer.createOverseerNode(Overseer.java:1053)
   [junit4]   2> 	... 20 more
   [junit4]   2> 659359 INFO  (TEST-DistribDocExpirationUpdateProcessorTest.test-seed#[C208BCC85FD7D299]) [    ] o.e.j.s.ServerConnector Stopped ServerConnector@6a46911c{HTTP/1.1,[http/1.1]}{127.0.0.1:0}
   [junit4]   2> 659359 INFO  (TEST-DistribDocExpirationUpdateProcessorTest.test-seed#[C208BCC85FD7D299]) [    ] o.e.j.s.h.ContextHandler Stopped o.e.j.s.ServletContextHandler@2ae57142{/ej,null,UNAVAILABLE}
   [junit4]   2> 659362 INFO  (TEST-DistribDocExpirationUpdateProcessorTest.test-seed#[C208BCC85FD7D299]) [    ] o.a.s.c.ZkTestServer connecting to 127.0.0.1:60947 60947
   [junit4]   2> 659380 INFO  (Thread-1232) [    ] o.a.s.c.ZkTestServer connecting to 127.0.0.1:60947 60947
   [junit4]   2> 660672 WARN  (Thread-1232) [    ] o.a.s.c.ZkTestServer Watch limit violations: 
   [junit4]   2> Maximum concurrent create/delete watches above limit:
   [junit4]   2> 
   [junit4]   2> 	6	/solr/aliases.json
   [junit4]   2> 	5	/solr/security.json
   [junit4]   2> 	5	/solr/configs/conf1
   [junit4]   2> 	4	/solr/collections/collection1/state.json
   [junit4]   2> 
   [junit4]   2> Maximum concurrent data watches above limit:
   [junit4]   2> 
   [junit4]   2> 	6	/solr/clusterstate.json
   [junit4]   2> 
   [junit4]   2> Maximum concurrent children watches above limit:
   [junit4]   2> 
   [junit4]   2> 	6	/solr/live_nodes
   [junit4]   2> 	6	/solr/collections
   [junit4]   2> 	5	/solr/overseer/collection-queue-work
   [junit4]   2> 	3	/solr/overseer/queue
   [junit4]   2> 
   [junit4]   2> NOTE: reproduce with: ant test  -Dtestcase=DistribDocExpirationUpdateProcessorTest -Dtests.method=test -Dtests.seed=C208BCC85FD7D299 -Dtests.slow=true -Dtests.locale=el -Dtests.timezone=Asia/Yekaterinburg -Dtests.asserts=true -Dtests.file.encoding=ISO-8859-1
   [junit4] FAILURE 71.7s J1 | DistribDocExpirationUpdateProcessorTest.test <<<
   [junit4]    > Throwable #1: java.lang.AssertionError: There are still nodes recoverying - waited for 45 seconds
   [junit4]    > 	at __randomizedtesting.SeedInfo.seed([C208BCC85FD7D299:4A5C8312F12BBF61]:0)
   [junit4]    > 	at org.apache.solr.cloud.AbstractDistribZkTestBase.waitForRecoveriesToFinish(AbstractDistribZkTestBase.java:173)
   [junit4]    > 	at org.apache.solr.cloud.AbstractFullDistribZkTestBase.waitForRecoveriesToFinish(AbstractFullDistribZkTestBase.java:858)
   [junit4]    > 	at org.apache.solr.cloud.DistribDocExpirationUpdateProcessorTest.test(DistribDocExpirationUpdateProcessorTest.java:74)
   [junit4]    > 	at org.apache.solr.BaseDistributedSearchTestCase$ShardsRepeatRule$ShardsFixedStatement.callStatement(BaseDistributedSearchTestCase.java:985)
   [junit4]    > 	at org.apache.solr.BaseDistributedSearchTestCase$ShardsRepeatRule$ShardsStatement.evaluate(BaseDistributedSearchTestCase.java:960)
   [junit4]    > 	at java.lang.Thread.run(Thread.java:745)
   [junit4]   2> 660676 INFO  (SUITE-DistribDocExpirationUpdateProcessorTest-seed#[C208BCC85FD7D299]-worker) [    ] o.a.s.SolrTestCaseJ4 ###deleteCore
   [junit4]   2> NOTE: leaving temporary files on disk at: /Users/jenkins/workspace/Lucene-Solr-master-MacOSX/solr/build/solr-core/test/J1/temp/solr.cloud.DistribDocExpirationUpdateProcessorTest_C208BCC85FD7D299-001
   [junit4]   2> NOTE: test params are: codec=Asserting(Lucene60): {_version_=FST50, id=Lucene50(blocksize=128)}, docValues:{}, maxPointsInLeafNode=1063, maxMBSortInHeap=6.677282501667069, sim=RandomSimilarity(queryNorm=false,coord=crazy): {}, locale=el, timezone=Asia/Yekaterinburg
   [junit4]   2> NOTE: Mac OS X 10.11.4 x86_64/Oracle Corporation 1.8.0_72 (64-bit)/cpus=3,threads=1,free=86709008,total=218116096
   [junit4]   2> NOTE: All tests run in this JVM: [DistributedIntervalFacetingTest, NotRequiredUniqueKeyTest, TestRandomFaceting, TestRawResponseWriter, ZkNodePropsTest, CollectionsAPISolrJTest, TestSimpleTrackingShardHandler, CdcrUpdateLogTest, TestOrdValues, RAMDirectoryFactoryTest, TestExactStatsCache, TestJoin, HdfsUnloadDistributedZkTest, OverseerRolesTest, IndexSchemaRuntimeFieldTest, DeleteStatusTest, LoggingHandlerTest, DocValuesMissingTest, TestSSLRandomization, TestCollationField, TestZkChroot, CloudMLTQParserTest, LeaderElectionIntegrationTest, TestDistributedGrouping, TestAnalyzeInfixSuggestions, RestartWhileUpdatingTest, ChangedSchemaMergeTest, QueryParsingTest, TestShardHandlerFactory, TestSolrQueryResponse, HdfsCollectionsAPIDistributedZkTest, DefaultValueUpdateProcessorTest, TestManagedResource, TestBinaryResponseWriter, InfoHandlerTest, HdfsChaosMonkeyNothingIsSafeTest, TestJsonFacets, ChaosMonkeySafeLeaderTest, SynonymTokenizerTest, ZkSolrClientTest, TestSolrJ, TestGraphTermsQParserPlugin, TestSolrCLIRunExample, WordBreakSolrSpellCheckerTest, SuggestComponentTest, RequestHandlersTest, SuggesterTSTTest, ConfigSetsAPITest, OpenExchangeRatesOrgProviderTest, CoreAdminHandlerTest, HdfsRestartWhileUpdatingTest, HdfsDirectoryFactoryTest, DistribDocExpirationUpdateProcessorTest]
   [junit4] Completed [88/592 (1!)] on J1 in 71.75s, 1 test, 1 failure <<< FAILURES!

[...truncated 1614 lines...]
BUILD FAILED
/Users/jenkins/workspace/Lucene-Solr-master-MacOSX/build.xml:740: The following error occurred while executing this line:
/Users/jenkins/workspace/Lucene-Solr-master-MacOSX/build.xml:684: The following error occurred while executing this line:
/Users/jenkins/workspace/Lucene-Solr-master-MacOSX/build.xml:59: The following error occurred while executing this line:
/Users/jenkins/workspace/Lucene-Solr-master-MacOSX/solr/build.xml:233: The following error occurred while executing this line:
/Users/jenkins/workspace/Lucene-Solr-master-MacOSX/solr/common-build.xml:529: The following error occurred while executing this line:
/Users/jenkins/workspace/Lucene-Solr-master-MacOSX/lucene/common-build.xml:1457: The following error occurred while executing this line:
/Users/jenkins/workspace/Lucene-Solr-master-MacOSX/lucene/common-build.xml:1014: There were test failures: 592 suites (10 ignored), 2394 tests, 1 failure, 120 ignored (70 assumptions) [seed: C208BCC85FD7D299]

Total time: 86 minutes 6 seconds
Build step 'Invoke Ant' marked build as failure
Archiving artifacts
[WARNINGS] Skipping publisher since build result is FAILURE
Recording test results
Email was triggered for: Failure - Any
Sending email for trigger: Failure - Any



Mime
View raw message