lucene-dev mailing list archives

Site index · List index
Message view « Date » · « Thread »
Top « Date » · « Thread »
From Apache Jenkins Server <jenk...@builds.apache.org>
Subject [JENKINS] Lucene-Solr-NightlyTests-master - Build # 1013 - Still Failing
Date Mon, 16 May 2016 07:43:08 GMT
Build: https://builds.apache.org/job/Lucene-Solr-NightlyTests-master/1013/

17 tests failed.
FAILED:  junit.framework.TestSuite.org.apache.solr.cloud.CollectionsAPIDistributedZkTest

Error Message:
Suite timeout exceeded (>= 7200000 msec).

Stack Trace:
java.lang.Exception: Suite timeout exceeded (>= 7200000 msec).
	at __randomizedtesting.SeedInfo.seed([87BAB0DFEB3E19FB]:0)


FAILED:  junit.framework.TestSuite.org.apache.solr.cloud.CollectionsAPIDistributedZkTest

Error Message:
Captured an uncaught exception in thread: Thread[id=18338, name=collection4, state=RUNNABLE, group=TGRP-CollectionsAPIDistributedZkTest]

Stack Trace:
com.carrotsearch.randomizedtesting.UncaughtExceptionError: Captured an uncaught exception in thread: Thread[id=18338, name=collection4, state=RUNNABLE, group=TGRP-CollectionsAPIDistributedZkTest]
Caused by: org.apache.solr.client.solrj.impl.HttpSolrClient$RemoteSolrException: Error from server at https://127.0.0.1:50956/_kgx: collection already exists: awholynewstresscollection_collection4_5
	at __randomizedtesting.SeedInfo.seed([87BAB0DFEB3E19FB]:0)
	at org.apache.solr.client.solrj.impl.HttpSolrClient.executeMethod(HttpSolrClient.java:606)
	at org.apache.solr.client.solrj.impl.HttpSolrClient.request(HttpSolrClient.java:259)
	at org.apache.solr.client.solrj.impl.HttpSolrClient.request(HttpSolrClient.java:248)
	at org.apache.solr.client.solrj.impl.LBHttpSolrClient.doRequest(LBHttpSolrClient.java:413)
	at org.apache.solr.client.solrj.impl.LBHttpSolrClient.request(LBHttpSolrClient.java:366)
	at org.apache.solr.client.solrj.impl.CloudSolrClient.sendRequest(CloudSolrClient.java:1228)
	at org.apache.solr.client.solrj.impl.CloudSolrClient.requestWithRetryOnStaleState(CloudSolrClient.java:998)
	at org.apache.solr.client.solrj.impl.CloudSolrClient.request(CloudSolrClient.java:934)
	at org.apache.solr.client.solrj.SolrClient.request(SolrClient.java:1219)
	at org.apache.solr.cloud.AbstractFullDistribZkTestBase.createCollection(AbstractFullDistribZkTestBase.java:1595)
	at org.apache.solr.cloud.AbstractFullDistribZkTestBase.createCollection(AbstractFullDistribZkTestBase.java:1616)
	at org.apache.solr.cloud.CollectionsAPIDistributedZkTest$1CollectionThread.run(CollectionsAPIDistributedZkTest.java:988)


FAILED:  junit.framework.TestSuite.org.apache.solr.cloud.CollectionsAPIDistributedZkTest

Error Message:
Captured an uncaught exception in thread: Thread[id=18339, name=collection5, state=RUNNABLE, group=TGRP-CollectionsAPIDistributedZkTest]

Stack Trace:
com.carrotsearch.randomizedtesting.UncaughtExceptionError: Captured an uncaught exception in thread: Thread[id=18339, name=collection5, state=RUNNABLE, group=TGRP-CollectionsAPIDistributedZkTest]
Caused by: org.apache.solr.client.solrj.impl.HttpSolrClient$RemoteSolrException: Error from server at https://127.0.0.1:50956/_kgx: collection already exists: awholynewstresscollection_collection5_4
	at __randomizedtesting.SeedInfo.seed([87BAB0DFEB3E19FB]:0)
	at org.apache.solr.client.solrj.impl.HttpSolrClient.executeMethod(HttpSolrClient.java:606)
	at org.apache.solr.client.solrj.impl.HttpSolrClient.request(HttpSolrClient.java:259)
	at org.apache.solr.client.solrj.impl.HttpSolrClient.request(HttpSolrClient.java:248)
	at org.apache.solr.client.solrj.impl.LBHttpSolrClient.doRequest(LBHttpSolrClient.java:413)
	at org.apache.solr.client.solrj.impl.LBHttpSolrClient.request(LBHttpSolrClient.java:366)
	at org.apache.solr.client.solrj.impl.CloudSolrClient.sendRequest(CloudSolrClient.java:1228)
	at org.apache.solr.client.solrj.impl.CloudSolrClient.requestWithRetryOnStaleState(CloudSolrClient.java:998)
	at org.apache.solr.client.solrj.impl.CloudSolrClient.request(CloudSolrClient.java:934)
	at org.apache.solr.client.solrj.SolrClient.request(SolrClient.java:1219)
	at org.apache.solr.cloud.AbstractFullDistribZkTestBase.createCollection(AbstractFullDistribZkTestBase.java:1595)
	at org.apache.solr.cloud.AbstractFullDistribZkTestBase.createCollection(AbstractFullDistribZkTestBase.java:1616)
	at org.apache.solr.cloud.CollectionsAPIDistributedZkTest$1CollectionThread.run(CollectionsAPIDistributedZkTest.java:988)


FAILED:  junit.framework.TestSuite.org.apache.solr.cloud.CollectionsAPIDistributedZkTest

Error Message:
Captured an uncaught exception in thread: Thread[id=18335, name=collection1, state=RUNNABLE, group=TGRP-CollectionsAPIDistributedZkTest]

Stack Trace:
com.carrotsearch.randomizedtesting.UncaughtExceptionError: Captured an uncaught exception in thread: Thread[id=18335, name=collection1, state=RUNNABLE, group=TGRP-CollectionsAPIDistributedZkTest]
Caused by: org.apache.solr.client.solrj.impl.HttpSolrClient$RemoteSolrException: Error from server at https://127.0.0.1:50956/_kgx: collection already exists: awholynewstresscollection_collection1_5
	at __randomizedtesting.SeedInfo.seed([87BAB0DFEB3E19FB]:0)
	at org.apache.solr.client.solrj.impl.HttpSolrClient.executeMethod(HttpSolrClient.java:606)
	at org.apache.solr.client.solrj.impl.HttpSolrClient.request(HttpSolrClient.java:259)
	at org.apache.solr.client.solrj.impl.HttpSolrClient.request(HttpSolrClient.java:248)
	at org.apache.solr.client.solrj.impl.LBHttpSolrClient.doRequest(LBHttpSolrClient.java:413)
	at org.apache.solr.client.solrj.impl.LBHttpSolrClient.request(LBHttpSolrClient.java:366)
	at org.apache.solr.client.solrj.impl.CloudSolrClient.sendRequest(CloudSolrClient.java:1228)
	at org.apache.solr.client.solrj.impl.CloudSolrClient.requestWithRetryOnStaleState(CloudSolrClient.java:998)
	at org.apache.solr.client.solrj.impl.CloudSolrClient.request(CloudSolrClient.java:934)
	at org.apache.solr.client.solrj.SolrClient.request(SolrClient.java:1219)
	at org.apache.solr.cloud.AbstractFullDistribZkTestBase.createCollection(AbstractFullDistribZkTestBase.java:1595)
	at org.apache.solr.cloud.AbstractFullDistribZkTestBase.createCollection(AbstractFullDistribZkTestBase.java:1616)
	at org.apache.solr.cloud.CollectionsAPIDistributedZkTest$1CollectionThread.run(CollectionsAPIDistributedZkTest.java:988)


FAILED:  junit.framework.TestSuite.org.apache.solr.cloud.CollectionsAPIDistributedZkTest

Error Message:
Captured an uncaught exception in thread: Thread[id=18337, name=collection3, state=RUNNABLE, group=TGRP-CollectionsAPIDistributedZkTest]

Stack Trace:
com.carrotsearch.randomizedtesting.UncaughtExceptionError: Captured an uncaught exception in thread: Thread[id=18337, name=collection3, state=RUNNABLE, group=TGRP-CollectionsAPIDistributedZkTest]
Caused by: java.lang.RuntimeException: org.apache.solr.client.solrj.SolrServerException: No live SolrServers available to handle this request:[https://127.0.0.1:48696/_kgx, https://127.0.0.1:50956/_kgx, https://127.0.0.1:50044/_kgx, https://127.0.0.1:37412/_kgx, https://127.0.0.1:58181/_kgx]
	at __randomizedtesting.SeedInfo.seed([87BAB0DFEB3E19FB]:0)
	at org.apache.solr.cloud.CollectionsAPIDistributedZkTest$1CollectionThread.run(CollectionsAPIDistributedZkTest.java:998)
Caused by: org.apache.solr.client.solrj.SolrServerException: No live SolrServers available to handle this request:[https://127.0.0.1:48696/_kgx, https://127.0.0.1:50956/_kgx, https://127.0.0.1:50044/_kgx, https://127.0.0.1:37412/_kgx, https://127.0.0.1:58181/_kgx]
	at org.apache.solr.client.solrj.impl.LBHttpSolrClient.request(LBHttpSolrClient.java:393)
	at org.apache.solr.client.solrj.impl.CloudSolrClient.sendRequest(CloudSolrClient.java:1228)
	at org.apache.solr.client.solrj.impl.CloudSolrClient.requestWithRetryOnStaleState(CloudSolrClient.java:998)
	at org.apache.solr.client.solrj.impl.CloudSolrClient.request(CloudSolrClient.java:934)
	at org.apache.solr.client.solrj.SolrClient.request(SolrClient.java:1219)
	at org.apache.solr.cloud.CollectionsAPIDistributedZkTest$1CollectionThread.run(CollectionsAPIDistributedZkTest.java:995)
Caused by: org.apache.solr.client.solrj.impl.HttpSolrClient$RemoteSolrException: Error from server at https://127.0.0.1:37412/_kgx: KeeperErrorCode = Session expired for /overseer/collection-queue-work/qnr-
	at org.apache.solr.client.solrj.impl.HttpSolrClient.executeMethod(HttpSolrClient.java:606)
	at org.apache.solr.client.solrj.impl.HttpSolrClient.request(HttpSolrClient.java:259)
	at org.apache.solr.client.solrj.impl.HttpSolrClient.request(HttpSolrClient.java:248)
	at org.apache.solr.client.solrj.impl.LBHttpSolrClient.doRequest(LBHttpSolrClient.java:413)
	at org.apache.solr.client.solrj.impl.LBHttpSolrClient.request(LBHttpSolrClient.java:366)
	... 5 more


FAILED:  junit.framework.TestSuite.org.apache.solr.cloud.CollectionsAPIDistributedZkTest

Error Message:
Captured an uncaught exception in thread: Thread[id=18336, name=collection2, state=RUNNABLE, group=TGRP-CollectionsAPIDistributedZkTest]

Stack Trace:
com.carrotsearch.randomizedtesting.UncaughtExceptionError: Captured an uncaught exception in thread: Thread[id=18336, name=collection2, state=RUNNABLE, group=TGRP-CollectionsAPIDistributedZkTest]
Caused by: java.lang.RuntimeException: org.apache.solr.client.solrj.SolrServerException: No live SolrServers available to handle this request:[https://127.0.0.1:48696/_kgx, https://127.0.0.1:50956/_kgx, https://127.0.0.1:50044/_kgx, https://127.0.0.1:37412/_kgx, https://127.0.0.1:58181/_kgx]
	at __randomizedtesting.SeedInfo.seed([87BAB0DFEB3E19FB]:0)
	at org.apache.solr.cloud.CollectionsAPIDistributedZkTest$1CollectionThread.run(CollectionsAPIDistributedZkTest.java:998)
Caused by: org.apache.solr.client.solrj.SolrServerException: No live SolrServers available to handle this request:[https://127.0.0.1:48696/_kgx, https://127.0.0.1:50956/_kgx, https://127.0.0.1:50044/_kgx, https://127.0.0.1:37412/_kgx, https://127.0.0.1:58181/_kgx]
	at org.apache.solr.client.solrj.impl.LBHttpSolrClient.request(LBHttpSolrClient.java:393)
	at org.apache.solr.client.solrj.impl.CloudSolrClient.sendRequest(CloudSolrClient.java:1228)
	at org.apache.solr.client.solrj.impl.CloudSolrClient.requestWithRetryOnStaleState(CloudSolrClient.java:998)
	at org.apache.solr.client.solrj.impl.CloudSolrClient.request(CloudSolrClient.java:934)
	at org.apache.solr.client.solrj.SolrClient.request(SolrClient.java:1219)
	at org.apache.solr.cloud.AbstractFullDistribZkTestBase.createCollection(AbstractFullDistribZkTestBase.java:1595)
	at org.apache.solr.cloud.AbstractFullDistribZkTestBase.createCollection(AbstractFullDistribZkTestBase.java:1616)
	at org.apache.solr.cloud.CollectionsAPIDistributedZkTest$1CollectionThread.run(CollectionsAPIDistributedZkTest.java:988)
Caused by: org.apache.solr.client.solrj.impl.HttpSolrClient$RemoteSolrException: Error from server at https://127.0.0.1:37412/_kgx: Expected mime type application/octet-stream but got text/html. <html>
<head>
<meta http-equiv="Content-Type" content="text/html;charset=ISO-8859-1"/>
<title>Error 500 </title>
</head>
<body>
<h2>HTTP ERROR: 500</h2>
<p>Problem accessing /_kgx/admin/collections. Reason:
<pre>    {msg=GC overhead limit exceeded,trace=java.lang.OutOfMemoryError: GC overhead limit exceeded
	at java.util.HashMap.newNode(HashMap.java:1734)
	at java.util.HashMap.putVal(HashMap.java:641)
	at java.util.HashMap.put(HashMap.java:611)
	at org.apache.solr.common.util.JavaBinCodec.writeExternString(JavaBinCodec.java:878)
	at org.apache.solr.common.util.JavaBinCodec.writeNamedList(JavaBinCodec.java:187)
	at org.apache.solr.common.util.JavaBinCodec.writeKnownType(JavaBinCodec.java:291)
	at org.apache.solr.common.util.JavaBinCodec.writeVal(JavaBinCodec.java:194)
	at org.apache.solr.common.util.JavaBinCodec.writeNamedList(JavaBinCodec.java:189)
	at org.apache.solr.common.util.JavaBinCodec.writeKnownType(JavaBinCodec.java:291)
	at org.apache.solr.common.util.JavaBinCodec.writeVal(JavaBinCodec.java:194)
	at org.apache.solr.common.util.JavaBinCodec.marshal(JavaBinCodec.java:133)
	at org.apache.solr.response.BinaryResponseWriter.write(BinaryResponseWriter.java:54)
	at org.apache.solr.response.QueryResponseWriterUtil.writeQueryResponse(QueryResponseWriterUtil.java:49)
	at org.apache.solr.servlet.HttpSolrCall.writeResponse(HttpSolrCall.java:732)
	at org.apache.solr.servlet.HttpSolrCall.handleAdminRequest(HttpSolrCall.java:671)
	at org.apache.solr.servlet.HttpSolrCall.call(HttpSolrCall.java:446)
	at org.apache.solr.servlet.SolrDispatchFilter.doFilter(SolrDispatchFilter.java:257)
	at org.apache.solr.servlet.SolrDispatchFilter.doFilter(SolrDispatchFilter.java:208)
	at org.eclipse.jetty.servlet.ServletHandler$CachedChain.doFilter(ServletHandler.java:1676)
	at org.apache.solr.client.solrj.embedded.JettySolrRunner$DebugFilter.doFilter(JettySolrRunner.java:111)
	at org.eclipse.jetty.servlet.ServletHandler$CachedChain.doFilter(ServletHandler.java:1676)
	at org.eclipse.jetty.servlet.ServletHandler.doHandle(ServletHandler.java:581)
	at org.eclipse.jetty.server.session.SessionHandler.doHandle(SessionHandler.java:224)
	at org.eclipse.jetty.server.handler.ContextHandler.doHandle(ContextHandler.java:1160)
	at org.eclipse.jetty.servlet.ServletHandler.doScope(ServletHandler.java:511)
	at org.eclipse.jetty.server.session.SessionHandler.doScope(SessionHandler.java:185)
	at org.eclipse.jetty.server.handler.ContextHandler.doScope(ContextHandler.java:1092)
	at org.eclipse.jetty.server.handler.ScopedHandler.handle(ScopedHandler.java:141)
	at org.eclipse.jetty.server.handler.gzip.GzipHandler.handle(GzipHandler.java:462)
	at org.eclipse.jetty.server.handler.HandlerWrapper.handle(HandlerWrapper.java:134)
	at org.eclipse.jetty.server.Server.handle(Server.java:518)
	at org.eclipse.jetty.server.HttpChannel.handle(HttpChannel.java:308)
,code=500}</pre></p>
<hr /><a href="http://eclipse.org/jetty">Powered by Jetty:// 9.3.8.v20160314</a><hr/>
</body>
</html>

	at org.apache.solr.client.solrj.impl.HttpSolrClient.executeMethod(HttpSolrClient.java:574)
	at org.apache.solr.client.solrj.impl.HttpSolrClient.request(HttpSolrClient.java:259)
	at org.apache.solr.client.solrj.impl.HttpSolrClient.request(HttpSolrClient.java:248)
	at org.apache.solr.client.solrj.impl.LBHttpSolrClient.doRequest(LBHttpSolrClient.java:413)
	at org.apache.solr.client.solrj.impl.LBHttpSolrClient.request(LBHttpSolrClient.java:366)
	... 7 more


FAILED:  junit.framework.TestSuite.org.apache.solr.cloud.CollectionsAPIDistributedZkTest

Error Message:
Captured an uncaught exception in thread: Thread[id=18334, name=collection0, state=RUNNABLE, group=TGRP-CollectionsAPIDistributedZkTest]

Stack Trace:
com.carrotsearch.randomizedtesting.UncaughtExceptionError: Captured an uncaught exception in thread: Thread[id=18334, name=collection0, state=RUNNABLE, group=TGRP-CollectionsAPIDistributedZkTest]
Caused by: java.lang.RuntimeException: org.apache.solr.client.solrj.SolrServerException: No live SolrServers available to handle this request:[https://127.0.0.1:48696/_kgx, https://127.0.0.1:50956/_kgx, https://127.0.0.1:50044/_kgx, https://127.0.0.1:37412/_kgx, https://127.0.0.1:58181/_kgx]
	at __randomizedtesting.SeedInfo.seed([87BAB0DFEB3E19FB]:0)
	at org.apache.solr.cloud.CollectionsAPIDistributedZkTest$1CollectionThread.run(CollectionsAPIDistributedZkTest.java:998)
Caused by: org.apache.solr.client.solrj.SolrServerException: No live SolrServers available to handle this request:[https://127.0.0.1:48696/_kgx, https://127.0.0.1:50956/_kgx, https://127.0.0.1:50044/_kgx, https://127.0.0.1:37412/_kgx, https://127.0.0.1:58181/_kgx]
	at org.apache.solr.client.solrj.impl.LBHttpSolrClient.request(LBHttpSolrClient.java:393)
	at org.apache.solr.client.solrj.impl.CloudSolrClient.sendRequest(CloudSolrClient.java:1228)
	at org.apache.solr.client.solrj.impl.CloudSolrClient.requestWithRetryOnStaleState(CloudSolrClient.java:998)
	at org.apache.solr.client.solrj.impl.CloudSolrClient.request(CloudSolrClient.java:934)
	at org.apache.solr.client.solrj.SolrClient.request(SolrClient.java:1219)
	at org.apache.solr.cloud.AbstractFullDistribZkTestBase.createCollection(AbstractFullDistribZkTestBase.java:1595)
	at org.apache.solr.cloud.AbstractFullDistribZkTestBase.createCollection(AbstractFullDistribZkTestBase.java:1616)
	at org.apache.solr.cloud.CollectionsAPIDistributedZkTest$1CollectionThread.run(CollectionsAPIDistributedZkTest.java:988)
Caused by: org.apache.solr.client.solrj.impl.HttpSolrClient$RemoteSolrException: Error from server at https://127.0.0.1:37412/_kgx: Expected mime type application/octet-stream but got text/html. <html>
<head>
<meta http-equiv="Content-Type" content="text/html;charset=ISO-8859-1"/>
<title>Error 500 </title>
</head>
<body>
<h2>HTTP ERROR: 500</h2>
<p>Problem accessing /_kgx/admin/collections. Reason:
<pre>    {msg=GC overhead limit exceeded,trace=java.lang.OutOfMemoryError: GC overhead limit exceeded
	at java.util.Arrays.copyOfRange(Arrays.java:3664)
	at java.lang.StringBuffer.toString(StringBuffer.java:671)
	at org.apache.log4j.EnhancedPatternLayout.format(EnhancedPatternLayout.java:548)
	at org.apache.log4j.WriterAppender.subAppend(WriterAppender.java:310)
	at org.apache.log4j.WriterAppender.append(WriterAppender.java:162)
	at org.apache.log4j.AppenderSkeleton.doAppend(AppenderSkeleton.java:251)
	at org.apache.log4j.helpers.AppenderAttachableImpl.appendLoopOnAppenders(AppenderAttachableImpl.java:66)
	at org.apache.log4j.Category.callAppenders(Category.java:206)
	at org.apache.log4j.Category.forcedLog(Category.java:391)
	at org.apache.log4j.Category.log(Category.java:856)
	at org.slf4j.impl.Log4jLoggerAdapter.error(Log4jLoggerAdapter.java:497)
	at org.apache.solr.common.SolrException.log(SolrException.java:159)
	at org.apache.solr.servlet.ResponseUtils.getErrorInfo(ResponseUtils.java:65)
	at org.apache.solr.servlet.HttpSolrCall.writeResponse(HttpSolrCall.java:725)
	at org.apache.solr.servlet.HttpSolrCall.handleAdminRequest(HttpSolrCall.java:671)
	at org.apache.solr.servlet.HttpSolrCall.call(HttpSolrCall.java:446)
	at org.apache.solr.servlet.SolrDispatchFilter.doFilter(SolrDispatchFilter.java:257)
	at org.apache.solr.servlet.SolrDispatchFilter.doFilter(SolrDispatchFilter.java:208)
	at org.eclipse.jetty.servlet.ServletHandler$CachedChain.doFilter(ServletHandler.java:1676)
	at org.apache.solr.client.solrj.embedded.JettySolrRunner$DebugFilter.doFilter(JettySolrRunner.java:111)
	at org.eclipse.jetty.servlet.ServletHandler$CachedChain.doFilter(ServletHandler.java:1676)
	at org.eclipse.jetty.servlet.ServletHandler.doHandle(ServletHandler.java:581)
	at org.eclipse.jetty.server.session.SessionHandler.doHandle(SessionHandler.java:224)
	at org.eclipse.jetty.server.handler.ContextHandler.doHandle(ContextHandler.java:1160)
	at org.eclipse.jetty.servlet.ServletHandler.doScope(ServletHandler.java:511)
	at org.eclipse.jetty.server.session.SessionHandler.doScope(SessionHandler.java:185)
	at org.eclipse.jetty.server.handler.ContextHandler.doScope(ContextHandler.java:1092)
	at org.eclipse.jetty.server.handler.ScopedHandler.handle(ScopedHandler.java:141)
	at org.eclipse.jetty.server.handler.gzip.GzipHandler.handle(GzipHandler.java:462)
	at org.eclipse.jetty.server.handler.HandlerWrapper.handle(HandlerWrapper.java:134)
	at org.eclipse.jetty.server.Server.handle(Server.java:518)
	at org.eclipse.jetty.server.HttpChannel.handle(HttpChannel.java:308)
,code=500}</pre></p>
<hr /><a href="http://eclipse.org/jetty">Powered by Jetty:// 9.3.8.v20160314</a><hr/>
</body>
</html>

	at org.apache.solr.client.solrj.impl.HttpSolrClient.executeMethod(HttpSolrClient.java:574)
	at org.apache.solr.client.solrj.impl.HttpSolrClient.request(HttpSolrClient.java:259)
	at org.apache.solr.client.solrj.impl.HttpSolrClient.request(HttpSolrClient.java:248)
	at org.apache.solr.client.solrj.impl.LBHttpSolrClient.doRequest(LBHttpSolrClient.java:413)
	at org.apache.solr.client.solrj.impl.LBHttpSolrClient.request(LBHttpSolrClient.java:366)
	... 7 more


FAILED:  org.apache.solr.handler.TestReplicationHandler.doTestStressReplication

Error Message:
timed out waiting for collection1 startAt time to exceed: Mon May 16 11:56:02 ICT 2016

Stack Trace:
java.lang.AssertionError: timed out waiting for collection1 startAt time to exceed: Mon May 16 11:56:02 ICT 2016
	at __randomizedtesting.SeedInfo.seed([87BAB0DFEB3E19FB:5C11B019EE167048]:0)
	at org.junit.Assert.fail(Assert.java:93)
	at org.apache.solr.handler.TestReplicationHandler.watchCoreStartAt(TestReplicationHandler.java:1506)
	at org.apache.solr.handler.TestReplicationHandler.doTestStressReplication(TestReplicationHandler.java:856)
	at sun.reflect.NativeMethodAccessorImpl.invoke0(Native Method)
	at sun.reflect.NativeMethodAccessorImpl.invoke(NativeMethodAccessorImpl.java:62)
	at sun.reflect.DelegatingMethodAccessorImpl.invoke(DelegatingMethodAccessorImpl.java:43)
	at java.lang.reflect.Method.invoke(Method.java:498)
	at com.carrotsearch.randomizedtesting.RandomizedRunner.invoke(RandomizedRunner.java:1764)
	at com.carrotsearch.randomizedtesting.RandomizedRunner$8.evaluate(RandomizedRunner.java:871)
	at com.carrotsearch.randomizedtesting.RandomizedRunner$9.evaluate(RandomizedRunner.java:907)
	at com.carrotsearch.randomizedtesting.RandomizedRunner$10.evaluate(RandomizedRunner.java:921)
	at com.carrotsearch.randomizedtesting.rules.SystemPropertiesRestoreRule$1.evaluate(SystemPropertiesRestoreRule.java:57)
	at org.apache.lucene.util.TestRuleSetupTeardownChained$1.evaluate(TestRuleSetupTeardownChained.java:49)
	at org.apache.lucene.util.AbstractBeforeAfterRule$1.evaluate(AbstractBeforeAfterRule.java:45)
	at org.apache.lucene.util.TestRuleThreadAndTestName$1.evaluate(TestRuleThreadAndTestName.java:48)
	at org.apache.lucene.util.TestRuleIgnoreAfterMaxFailures$1.evaluate(TestRuleIgnoreAfterMaxFailures.java:64)
	at org.apache.lucene.util.TestRuleMarkFailure$1.evaluate(TestRuleMarkFailure.java:47)
	at com.carrotsearch.randomizedtesting.rules.StatementAdapter.evaluate(StatementAdapter.java:36)
	at com.carrotsearch.randomizedtesting.ThreadLeakControl$StatementRunner.run(ThreadLeakControl.java:367)
	at com.carrotsearch.randomizedtesting.ThreadLeakControl.forkTimeoutingTask(ThreadLeakControl.java:809)
	at com.carrotsearch.randomizedtesting.ThreadLeakControl$3.evaluate(ThreadLeakControl.java:460)
	at com.carrotsearch.randomizedtesting.RandomizedRunner.runSingleTest(RandomizedRunner.java:880)
	at com.carrotsearch.randomizedtesting.RandomizedRunner$5.evaluate(RandomizedRunner.java:781)
	at com.carrotsearch.randomizedtesting.RandomizedRunner$6.evaluate(RandomizedRunner.java:816)
	at com.carrotsearch.randomizedtesting.RandomizedRunner$7.evaluate(RandomizedRunner.java:827)
	at com.carrotsearch.randomizedtesting.rules.StatementAdapter.evaluate(StatementAdapter.java:36)
	at com.carrotsearch.randomizedtesting.rules.SystemPropertiesRestoreRule$1.evaluate(SystemPropertiesRestoreRule.java:57)
	at org.apache.lucene.util.AbstractBeforeAfterRule$1.evaluate(AbstractBeforeAfterRule.java:45)
	at com.carrotsearch.randomizedtesting.rules.StatementAdapter.evaluate(StatementAdapter.java:36)
	at org.apache.lucene.util.TestRuleStoreClassName$1.evaluate(TestRuleStoreClassName.java:41)
	at com.carrotsearch.randomizedtesting.rules.NoShadowingOrOverridesOnMethodsRule$1.evaluate(NoShadowingOrOverridesOnMethodsRule.java:40)
	at com.carrotsearch.randomizedtesting.rules.NoShadowingOrOverridesOnMethodsRule$1.evaluate(NoShadowingOrOverridesOnMethodsRule.java:40)
	at com.carrotsearch.randomizedtesting.rules.StatementAdapter.evaluate(StatementAdapter.java:36)
	at com.carrotsearch.randomizedtesting.rules.StatementAdapter.evaluate(StatementAdapter.java:36)
	at com.carrotsearch.randomizedtesting.rules.StatementAdapter.evaluate(StatementAdapter.java:36)
	at org.apache.lucene.util.TestRuleAssertionsRequired$1.evaluate(TestRuleAssertionsRequired.java:53)
	at org.apache.lucene.util.TestRuleMarkFailure$1.evaluate(TestRuleMarkFailure.java:47)
	at org.apache.lucene.util.TestRuleIgnoreAfterMaxFailures$1.evaluate(TestRuleIgnoreAfterMaxFailures.java:64)
	at org.apache.lucene.util.TestRuleIgnoreTestSuites$1.evaluate(TestRuleIgnoreTestSuites.java:54)
	at com.carrotsearch.randomizedtesting.rules.StatementAdapter.evaluate(StatementAdapter.java:36)
	at com.carrotsearch.randomizedtesting.ThreadLeakControl$StatementRunner.run(ThreadLeakControl.java:367)
	at java.lang.Thread.run(Thread.java:745)


FAILED:  org.apache.solr.cloud.CollectionsAPIDistributedZkTest.test

Error Message:
Test abandoned because suite timeout was reached.

Stack Trace:
java.lang.Exception: Test abandoned because suite timeout was reached.
	at __randomizedtesting.SeedInfo.seed([87BAB0DFEB3E19FB]:0)


FAILED:  junit.framework.TestSuite.org.apache.solr.cloud.CdcrReplicationHandlerTest

Error Message:
ObjectTracker found 12 object(s) that were not released!!! [InternalHttpClient, InternalHttpClient, InternalHttpClient, InternalHttpClient, InternalHttpClient, InternalHttpClient, InternalHttpClient, InternalHttpClient, InternalHttpClient, InternalHttpClient, InternalHttpClient, InternalHttpClient]

Stack Trace:
java.lang.AssertionError: ObjectTracker found 12 object(s) that were not released!!! [InternalHttpClient, InternalHttpClient, InternalHttpClient, InternalHttpClient, InternalHttpClient, InternalHttpClient, InternalHttpClient, InternalHttpClient, InternalHttpClient, InternalHttpClient, InternalHttpClient, InternalHttpClient]
	at __randomizedtesting.SeedInfo.seed([87BAB0DFEB3E19FB]:0)
	at org.junit.Assert.fail(Assert.java:93)
	at org.junit.Assert.assertTrue(Assert.java:43)
	at org.junit.Assert.assertNull(Assert.java:551)
	at org.apache.solr.SolrTestCaseJ4.afterClass(SolrTestCaseJ4.java:255)
	at sun.reflect.GeneratedMethodAccessor17.invoke(Unknown Source)
	at sun.reflect.DelegatingMethodAccessorImpl.invoke(DelegatingMethodAccessorImpl.java:43)
	at java.lang.reflect.Method.invoke(Method.java:498)
	at com.carrotsearch.randomizedtesting.RandomizedRunner.invoke(RandomizedRunner.java:1764)
	at com.carrotsearch.randomizedtesting.RandomizedRunner$7.evaluate(RandomizedRunner.java:834)
	at com.carrotsearch.randomizedtesting.rules.StatementAdapter.evaluate(StatementAdapter.java:36)
	at com.carrotsearch.randomizedtesting.rules.SystemPropertiesRestoreRule$1.evaluate(SystemPropertiesRestoreRule.java:57)
	at org.apache.lucene.util.AbstractBeforeAfterRule$1.evaluate(AbstractBeforeAfterRule.java:45)
	at com.carrotsearch.randomizedtesting.rules.StatementAdapter.evaluate(StatementAdapter.java:36)
	at org.apache.lucene.util.TestRuleStoreClassName$1.evaluate(TestRuleStoreClassName.java:41)
	at com.carrotsearch.randomizedtesting.rules.NoShadowingOrOverridesOnMethodsRule$1.evaluate(NoShadowingOrOverridesOnMethodsRule.java:40)
	at com.carrotsearch.randomizedtesting.rules.NoShadowingOrOverridesOnMethodsRule$1.evaluate(NoShadowingOrOverridesOnMethodsRule.java:40)
	at com.carrotsearch.randomizedtesting.rules.StatementAdapter.evaluate(StatementAdapter.java:36)
	at com.carrotsearch.randomizedtesting.rules.StatementAdapter.evaluate(StatementAdapter.java:36)
	at com.carrotsearch.randomizedtesting.rules.StatementAdapter.evaluate(StatementAdapter.java:36)
	at org.apache.lucene.util.TestRuleAssertionsRequired$1.evaluate(TestRuleAssertionsRequired.java:53)
	at org.apache.lucene.util.TestRuleMarkFailure$1.evaluate(TestRuleMarkFailure.java:47)
	at org.apache.lucene.util.TestRuleIgnoreAfterMaxFailures$1.evaluate(TestRuleIgnoreAfterMaxFailures.java:64)
	at org.apache.lucene.util.TestRuleIgnoreTestSuites$1.evaluate(TestRuleIgnoreTestSuites.java:54)
	at com.carrotsearch.randomizedtesting.rules.StatementAdapter.evaluate(StatementAdapter.java:36)
	at com.carrotsearch.randomizedtesting.ThreadLeakControl$StatementRunner.run(ThreadLeakControl.java:367)
	at java.lang.Thread.run(Thread.java:745)


FAILED:  junit.framework.TestSuite.org.apache.solr.cloud.CdcrReplicationHandlerTest

Error Message:
12 threads leaked from SUITE scope at org.apache.solr.cloud.CdcrReplicationHandlerTest:     1) Thread[id=15162, name=Connection evictor, state=TIMED_WAITING, group=TGRP-CdcrReplicationHandlerTest]         at java.lang.Thread.sleep(Native Method)         at org.apache.http.impl.client.IdleConnectionEvictor$1.run(IdleConnectionEvictor.java:66)         at java.lang.Thread.run(Thread.java:745)    2) Thread[id=15690, name=Connection evictor, state=TIMED_WAITING, group=TGRP-CdcrReplicationHandlerTest]         at java.lang.Thread.sleep(Native Method)         at org.apache.http.impl.client.IdleConnectionEvictor$1.run(IdleConnectionEvictor.java:66)         at java.lang.Thread.run(Thread.java:745)    3) Thread[id=17306, name=Connection evictor, state=TIMED_WAITING, group=TGRP-CdcrReplicationHandlerTest]         at java.lang.Thread.sleep(Native Method)         at org.apache.http.impl.client.IdleConnectionEvictor$1.run(IdleConnectionEvictor.java:66)         at java.lang.Thread.run(Thread.java:745)    4) Thread[id=15809, name=Connection evictor, state=TIMED_WAITING, group=TGRP-CdcrReplicationHandlerTest]         at java.lang.Thread.sleep(Native Method)         at org.apache.http.impl.client.IdleConnectionEvictor$1.run(IdleConnectionEvictor.java:66)         at java.lang.Thread.run(Thread.java:745)    5) Thread[id=15426, name=Connection evictor, state=TIMED_WAITING, group=TGRP-CdcrReplicationHandlerTest]         at java.lang.Thread.sleep(Native Method)         at org.apache.http.impl.client.IdleConnectionEvictor$1.run(IdleConnectionEvictor.java:66)         at java.lang.Thread.run(Thread.java:745)    6) Thread[id=15161, name=Connection evictor, state=TIMED_WAITING, group=TGRP-CdcrReplicationHandlerTest]         at java.lang.Thread.sleep(Native Method)         at org.apache.http.impl.client.IdleConnectionEvictor$1.run(IdleConnectionEvictor.java:66)         at java.lang.Thread.run(Thread.java:745)    7) Thread[id=15427, name=Connection evictor, state=TIMED_WAITING, group=TGRP-CdcrReplicationHandlerTest]         at java.lang.Thread.sleep(Native Method)         at org.apache.http.impl.client.IdleConnectionEvictor$1.run(IdleConnectionEvictor.java:66)         at java.lang.Thread.run(Thread.java:745)    8) Thread[id=15810, name=Connection evictor, state=TIMED_WAITING, group=TGRP-CdcrReplicationHandlerTest]         at java.lang.Thread.sleep(Native Method)         at org.apache.http.impl.client.IdleConnectionEvictor$1.run(IdleConnectionEvictor.java:66)         at java.lang.Thread.run(Thread.java:745)    9) Thread[id=16051, name=Connection evictor, state=TIMED_WAITING, group=TGRP-CdcrReplicationHandlerTest]         at java.lang.Thread.sleep(Native Method)         at org.apache.http.impl.client.IdleConnectionEvictor$1.run(IdleConnectionEvictor.java:66)         at java.lang.Thread.run(Thread.java:745)   10) Thread[id=16050, name=Connection evictor, state=TIMED_WAITING, group=TGRP-CdcrReplicationHandlerTest]         at java.lang.Thread.sleep(Native Method)         at org.apache.http.impl.client.IdleConnectionEvictor$1.run(IdleConnectionEvictor.java:66)         at java.lang.Thread.run(Thread.java:745)   11) Thread[id=15691, name=Connection evictor, state=TIMED_WAITING, group=TGRP-CdcrReplicationHandlerTest]         at java.lang.Thread.sleep(Native Method)         at org.apache.http.impl.client.IdleConnectionEvictor$1.run(IdleConnectionEvictor.java:66)         at java.lang.Thread.run(Thread.java:745)   12) Thread[id=17307, name=Connection evictor, state=TIMED_WAITING, group=TGRP-CdcrReplicationHandlerTest]         at java.lang.Thread.sleep(Native Method)         at org.apache.http.impl.client.IdleConnectionEvictor$1.run(IdleConnectionEvictor.java:66)         at java.lang.Thread.run(Thread.java:745)

Stack Trace:
com.carrotsearch.randomizedtesting.ThreadLeakError: 12 threads leaked from SUITE scope at org.apache.solr.cloud.CdcrReplicationHandlerTest: 
   1) Thread[id=15162, name=Connection evictor, state=TIMED_WAITING, group=TGRP-CdcrReplicationHandlerTest]
        at java.lang.Thread.sleep(Native Method)
        at org.apache.http.impl.client.IdleConnectionEvictor$1.run(IdleConnectionEvictor.java:66)
        at java.lang.Thread.run(Thread.java:745)
   2) Thread[id=15690, name=Connection evictor, state=TIMED_WAITING, group=TGRP-CdcrReplicationHandlerTest]
        at java.lang.Thread.sleep(Native Method)
        at org.apache.http.impl.client.IdleConnectionEvictor$1.run(IdleConnectionEvictor.java:66)
        at java.lang.Thread.run(Thread.java:745)
   3) Thread[id=17306, name=Connection evictor, state=TIMED_WAITING, group=TGRP-CdcrReplicationHandlerTest]
        at java.lang.Thread.sleep(Native Method)
        at org.apache.http.impl.client.IdleConnectionEvictor$1.run(IdleConnectionEvictor.java:66)
        at java.lang.Thread.run(Thread.java:745)
   4) Thread[id=15809, name=Connection evictor, state=TIMED_WAITING, group=TGRP-CdcrReplicationHandlerTest]
        at java.lang.Thread.sleep(Native Method)
        at org.apache.http.impl.client.IdleConnectionEvictor$1.run(IdleConnectionEvictor.java:66)
        at java.lang.Thread.run(Thread.java:745)
   5) Thread[id=15426, name=Connection evictor, state=TIMED_WAITING, group=TGRP-CdcrReplicationHandlerTest]
        at java.lang.Thread.sleep(Native Method)
        at org.apache.http.impl.client.IdleConnectionEvictor$1.run(IdleConnectionEvictor.java:66)
        at java.lang.Thread.run(Thread.java:745)
   6) Thread[id=15161, name=Connection evictor, state=TIMED_WAITING, group=TGRP-CdcrReplicationHandlerTest]
        at java.lang.Thread.sleep(Native Method)
        at org.apache.http.impl.client.IdleConnectionEvictor$1.run(IdleConnectionEvictor.java:66)
        at java.lang.Thread.run(Thread.java:745)
   7) Thread[id=15427, name=Connection evictor, state=TIMED_WAITING, group=TGRP-CdcrReplicationHandlerTest]
        at java.lang.Thread.sleep(Native Method)
        at org.apache.http.impl.client.IdleConnectionEvictor$1.run(IdleConnectionEvictor.java:66)
        at java.lang.Thread.run(Thread.java:745)
   8) Thread[id=15810, name=Connection evictor, state=TIMED_WAITING, group=TGRP-CdcrReplicationHandlerTest]
        at java.lang.Thread.sleep(Native Method)
        at org.apache.http.impl.client.IdleConnectionEvictor$1.run(IdleConnectionEvictor.java:66)
        at java.lang.Thread.run(Thread.java:745)
   9) Thread[id=16051, name=Connection evictor, state=TIMED_WAITING, group=TGRP-CdcrReplicationHandlerTest]
        at java.lang.Thread.sleep(Native Method)
        at org.apache.http.impl.client.IdleConnectionEvictor$1.run(IdleConnectionEvictor.java:66)
        at java.lang.Thread.run(Thread.java:745)
  10) Thread[id=16050, name=Connection evictor, state=TIMED_WAITING, group=TGRP-CdcrReplicationHandlerTest]
        at java.lang.Thread.sleep(Native Method)
        at org.apache.http.impl.client.IdleConnectionEvictor$1.run(IdleConnectionEvictor.java:66)
        at java.lang.Thread.run(Thread.java:745)
  11) Thread[id=15691, name=Connection evictor, state=TIMED_WAITING, group=TGRP-CdcrReplicationHandlerTest]
        at java.lang.Thread.sleep(Native Method)
        at org.apache.http.impl.client.IdleConnectionEvictor$1.run(IdleConnectionEvictor.java:66)
        at java.lang.Thread.run(Thread.java:745)
  12) Thread[id=17307, name=Connection evictor, state=TIMED_WAITING, group=TGRP-CdcrReplicationHandlerTest]
        at java.lang.Thread.sleep(Native Method)
        at org.apache.http.impl.client.IdleConnectionEvictor$1.run(IdleConnectionEvictor.java:66)
        at java.lang.Thread.run(Thread.java:745)
	at __randomizedtesting.SeedInfo.seed([87BAB0DFEB3E19FB]:0)


FAILED:  junit.framework.TestSuite.org.apache.solr.cloud.CdcrReplicationDistributedZkTest

Error Message:
ObjectTracker found 48 object(s) that were not released!!! [InternalHttpClient, InternalHttpClient, InternalHttpClient, InternalHttpClient, InternalHttpClient, InternalHttpClient, InternalHttpClient, InternalHttpClient, InternalHttpClient, InternalHttpClient, InternalHttpClient, InternalHttpClient, InternalHttpClient, InternalHttpClient, InternalHttpClient, InternalHttpClient, InternalHttpClient, InternalHttpClient, InternalHttpClient, InternalHttpClient, InternalHttpClient, InternalHttpClient, InternalHttpClient, InternalHttpClient, InternalHttpClient, InternalHttpClient, InternalHttpClient, InternalHttpClient, InternalHttpClient, InternalHttpClient, InternalHttpClient, InternalHttpClient, InternalHttpClient, InternalHttpClient, InternalHttpClient, InternalHttpClient, InternalHttpClient, InternalHttpClient, InternalHttpClient, InternalHttpClient, InternalHttpClient, InternalHttpClient, InternalHttpClient, InternalHttpClient, InternalHttpClient, InternalHttpClient, InternalHttpClient, InternalHttpClient]

Stack Trace:
java.lang.AssertionError: ObjectTracker found 48 object(s) that were not released!!! [InternalHttpClient, InternalHttpClient, InternalHttpClient, InternalHttpClient, InternalHttpClient, InternalHttpClient, InternalHttpClient, InternalHttpClient, InternalHttpClient, InternalHttpClient, InternalHttpClient, InternalHttpClient, InternalHttpClient, InternalHttpClient, InternalHttpClient, InternalHttpClient, InternalHttpClient, InternalHttpClient, InternalHttpClient, InternalHttpClient, InternalHttpClient, InternalHttpClient, InternalHttpClient, InternalHttpClient, InternalHttpClient, InternalHttpClient, InternalHttpClient, InternalHttpClient, InternalHttpClient, InternalHttpClient, InternalHttpClient, InternalHttpClient, InternalHttpClient, InternalHttpClient, InternalHttpClient, InternalHttpClient, InternalHttpClient, InternalHttpClient, InternalHttpClient, InternalHttpClient, InternalHttpClient, InternalHttpClient, InternalHttpClient, InternalHttpClient, InternalHttpClient, InternalHttpClient, InternalHttpClient, InternalHttpClient]
	at __randomizedtesting.SeedInfo.seed([87BAB0DFEB3E19FB]:0)
	at org.junit.Assert.fail(Assert.java:93)
	at org.junit.Assert.assertTrue(Assert.java:43)
	at org.junit.Assert.assertNull(Assert.java:551)
	at org.apache.solr.SolrTestCaseJ4.afterClass(SolrTestCaseJ4.java:255)
	at sun.reflect.GeneratedMethodAccessor54.invoke(Unknown Source)
	at sun.reflect.DelegatingMethodAccessorImpl.invoke(DelegatingMethodAccessorImpl.java:43)
	at java.lang.reflect.Method.invoke(Method.java:498)
	at com.carrotsearch.randomizedtesting.RandomizedRunner.invoke(RandomizedRunner.java:1764)
	at com.carrotsearch.randomizedtesting.RandomizedRunner$7.evaluate(RandomizedRunner.java:834)
	at com.carrotsearch.randomizedtesting.rules.StatementAdapter.evaluate(StatementAdapter.java:36)
	at com.carrotsearch.randomizedtesting.rules.SystemPropertiesRestoreRule$1.evaluate(SystemPropertiesRestoreRule.java:57)
	at org.apache.lucene.util.AbstractBeforeAfterRule$1.evaluate(AbstractBeforeAfterRule.java:45)
	at com.carrotsearch.randomizedtesting.rules.StatementAdapter.evaluate(StatementAdapter.java:36)
	at org.apache.lucene.util.TestRuleStoreClassName$1.evaluate(TestRuleStoreClassName.java:41)
	at com.carrotsearch.randomizedtesting.rules.NoShadowingOrOverridesOnMethodsRule$1.evaluate(NoShadowingOrOverridesOnMethodsRule.java:40)
	at com.carrotsearch.randomizedtesting.rules.NoShadowingOrOverridesOnMethodsRule$1.evaluate(NoShadowingOrOverridesOnMethodsRule.java:40)
	at com.carrotsearch.randomizedtesting.rules.StatementAdapter.evaluate(StatementAdapter.java:36)
	at com.carrotsearch.randomizedtesting.rules.StatementAdapter.evaluate(StatementAdapter.java:36)
	at com.carrotsearch.randomizedtesting.rules.StatementAdapter.evaluate(StatementAdapter.java:36)
	at org.apache.lucene.util.TestRuleAssertionsRequired$1.evaluate(TestRuleAssertionsRequired.java:53)
	at org.apache.lucene.util.TestRuleMarkFailure$1.evaluate(TestRuleMarkFailure.java:47)
	at org.apache.lucene.util.TestRuleIgnoreAfterMaxFailures$1.evaluate(TestRuleIgnoreAfterMaxFailures.java:64)
	at org.apache.lucene.util.TestRuleIgnoreTestSuites$1.evaluate(TestRuleIgnoreTestSuites.java:54)
	at com.carrotsearch.randomizedtesting.rules.StatementAdapter.evaluate(StatementAdapter.java:36)
	at com.carrotsearch.randomizedtesting.ThreadLeakControl$StatementRunner.run(ThreadLeakControl.java:367)
	at java.lang.Thread.run(Thread.java:745)


FAILED:  junit.framework.TestSuite.org.apache.solr.cloud.CdcrReplicationDistributedZkTest

Error Message:
48 threads leaked from SUITE scope at org.apache.solr.cloud.CdcrReplicationDistributedZkTest:     1) Thread[id=76125, name=Connection evictor, state=TIMED_WAITING, group=TGRP-CdcrReplicationDistributedZkTest]         at java.lang.Thread.sleep(Native Method)         at org.apache.http.impl.client.IdleConnectionEvictor$1.run(IdleConnectionEvictor.java:66)         at java.lang.Thread.run(Thread.java:745)    2) Thread[id=83286, name=Connection evictor, state=TIMED_WAITING, group=TGRP-CdcrReplicationDistributedZkTest]         at java.lang.Thread.sleep(Native Method)         at org.apache.http.impl.client.IdleConnectionEvictor$1.run(IdleConnectionEvictor.java:66)         at java.lang.Thread.run(Thread.java:745)    3) Thread[id=81485, name=Connection evictor, state=TIMED_WAITING, group=TGRP-CdcrReplicationDistributedZkTest]         at java.lang.Thread.sleep(Native Method)         at org.apache.http.impl.client.IdleConnectionEvictor$1.run(IdleConnectionEvictor.java:66)         at java.lang.Thread.run(Thread.java:745)    4) Thread[id=81310, name=Connection evictor, state=TIMED_WAITING, group=TGRP-CdcrReplicationDistributedZkTest]         at java.lang.Thread.sleep(Native Method)         at org.apache.http.impl.client.IdleConnectionEvictor$1.run(IdleConnectionEvictor.java:66)         at java.lang.Thread.run(Thread.java:745)    5) Thread[id=78535, name=Connection evictor, state=TIMED_WAITING, group=TGRP-CdcrReplicationDistributedZkTest]         at java.lang.Thread.sleep(Native Method)         at org.apache.http.impl.client.IdleConnectionEvictor$1.run(IdleConnectionEvictor.java:66)         at java.lang.Thread.run(Thread.java:745)    6) Thread[id=76127, name=Connection evictor, state=TIMED_WAITING, group=TGRP-CdcrReplicationDistributedZkTest]         at java.lang.Thread.sleep(Native Method)         at org.apache.http.impl.client.IdleConnectionEvictor$1.run(IdleConnectionEvictor.java:66)         at java.lang.Thread.run(Thread.java:745)    7) Thread[id=75457, name=Connection evictor, state=TIMED_WAITING, group=TGRP-CdcrReplicationDistributedZkTest]         at java.lang.Thread.sleep(Native Method)         at org.apache.http.impl.client.IdleConnectionEvictor$1.run(IdleConnectionEvictor.java:66)         at java.lang.Thread.run(Thread.java:745)    8) Thread[id=75880, name=Connection evictor, state=TIMED_WAITING, group=TGRP-CdcrReplicationDistributedZkTest]         at java.lang.Thread.sleep(Native Method)         at org.apache.http.impl.client.IdleConnectionEvictor$1.run(IdleConnectionEvictor.java:66)         at java.lang.Thread.run(Thread.java:745)    9) Thread[id=81020, name=Connection evictor, state=TIMED_WAITING, group=TGRP-CdcrReplicationDistributedZkTest]         at java.lang.Thread.sleep(Native Method)         at org.apache.http.impl.client.IdleConnectionEvictor$1.run(IdleConnectionEvictor.java:66)         at java.lang.Thread.run(Thread.java:745)   10) Thread[id=75455, name=Connection evictor, state=TIMED_WAITING, group=TGRP-CdcrReplicationDistributedZkTest]         at java.lang.Thread.sleep(Native Method)         at org.apache.http.impl.client.IdleConnectionEvictor$1.run(IdleConnectionEvictor.java:66)         at java.lang.Thread.run(Thread.java:745)   11) Thread[id=78533, name=Connection evictor, state=TIMED_WAITING, group=TGRP-CdcrReplicationDistributedZkTest]         at java.lang.Thread.sleep(Native Method)         at org.apache.http.impl.client.IdleConnectionEvictor$1.run(IdleConnectionEvictor.java:66)         at java.lang.Thread.run(Thread.java:745)   12) Thread[id=81484, name=Connection evictor, state=TIMED_WAITING, group=TGRP-CdcrReplicationDistributedZkTest]         at java.lang.Thread.sleep(Native Method)         at org.apache.http.impl.client.IdleConnectionEvictor$1.run(IdleConnectionEvictor.java:66)         at java.lang.Thread.run(Thread.java:745)   13) Thread[id=81728, name=Connection evictor, state=TIMED_WAITING, group=TGRP-CdcrReplicationDistributedZkTest]         at java.lang.Thread.sleep(Native Method)         at org.apache.http.impl.client.IdleConnectionEvictor$1.run(IdleConnectionEvictor.java:66)         at java.lang.Thread.run(Thread.java:745)   14) Thread[id=75456, name=Connection evictor, state=TIMED_WAITING, group=TGRP-CdcrReplicationDistributedZkTest]         at java.lang.Thread.sleep(Native Method)         at org.apache.http.impl.client.IdleConnectionEvictor$1.run(IdleConnectionEvictor.java:66)         at java.lang.Thread.run(Thread.java:745)   15) Thread[id=82824, name=Connection evictor, state=TIMED_WAITING, group=TGRP-CdcrReplicationDistributedZkTest]         at java.lang.Thread.sleep(Native Method)         at org.apache.http.impl.client.IdleConnectionEvictor$1.run(IdleConnectionEvictor.java:66)         at java.lang.Thread.run(Thread.java:745)   16) Thread[id=81019, name=Connection evictor, state=TIMED_WAITING, group=TGRP-CdcrReplicationDistributedZkTest]         at java.lang.Thread.sleep(Native Method)         at org.apache.http.impl.client.IdleConnectionEvictor$1.run(IdleConnectionEvictor.java:66)         at java.lang.Thread.run(Thread.java:745)   17) Thread[id=81729, name=Connection evictor, state=TIMED_WAITING, group=TGRP-CdcrReplicationDistributedZkTest]         at java.lang.Thread.sleep(Native Method)         at org.apache.http.impl.client.IdleConnectionEvictor$1.run(IdleConnectionEvictor.java:66)         at java.lang.Thread.run(Thread.java:745)   18) Thread[id=75749, name=Connection evictor, state=TIMED_WAITING, group=TGRP-CdcrReplicationDistributedZkTest]         at java.lang.Thread.sleep(Native Method)         at org.apache.http.impl.client.IdleConnectionEvictor$1.run(IdleConnectionEvictor.java:66)         at java.lang.Thread.run(Thread.java:745)   19) Thread[id=78536, name=Connection evictor, state=TIMED_WAITING, group=TGRP-CdcrReplicationDistributedZkTest]         at java.lang.Thread.sleep(Native Method)         at org.apache.http.impl.client.IdleConnectionEvictor$1.run(IdleConnectionEvictor.java:66)         at java.lang.Thread.run(Thread.java:745)   20) Thread[id=79915, name=Connection evictor, state=TIMED_WAITING, group=TGRP-CdcrReplicationDistributedZkTest]         at java.lang.Thread.sleep(Native Method)         at org.apache.http.impl.client.IdleConnectionEvictor$1.run(IdleConnectionEvictor.java:66)         at java.lang.Thread.run(Thread.java:745)   21) Thread[id=81311, name=Connection evictor, state=TIMED_WAITING, group=TGRP-CdcrReplicationDistributedZkTest]         at java.lang.Thread.sleep(Native Method)         at org.apache.http.impl.client.IdleConnectionEvictor$1.run(IdleConnectionEvictor.java:66)         at java.lang.Thread.run(Thread.java:745)   22) Thread[id=81730, name=Connection evictor, state=TIMED_WAITING, group=TGRP-CdcrReplicationDistributedZkTest]         at java.lang.Thread.sleep(Native Method)         at org.apache.http.impl.client.IdleConnectionEvictor$1.run(IdleConnectionEvictor.java:66)         at java.lang.Thread.run(Thread.java:745)   23) Thread[id=82827, name=Connection evictor, state=TIMED_WAITING, group=TGRP-CdcrReplicationDistributedZkTest]         at java.lang.Thread.sleep(Native Method)         at org.apache.http.impl.client.IdleConnectionEvictor$1.run(IdleConnectionEvictor.java:66)         at java.lang.Thread.run(Thread.java:745)   24) Thread[id=81022, name=Connection evictor, state=TIMED_WAITING, group=TGRP-CdcrReplicationDistributedZkTest]         at java.lang.Thread.sleep(Native Method)         at org.apache.http.impl.client.IdleConnectionEvictor$1.run(IdleConnectionEvictor.java:66)         at java.lang.Thread.run(Thread.java:745)   25) Thread[id=83285, name=Connection evictor, state=TIMED_WAITING, group=TGRP-CdcrReplicationDistributedZkTest]         at java.lang.Thread.sleep(Native Method)         at org.apache.http.impl.client.IdleConnectionEvictor$1.run(IdleConnectionEvictor.java:66)         at java.lang.Thread.run(Thread.java:745)   26) Thread[id=83287, name=Connection evictor, state=TIMED_WAITING, group=TGRP-CdcrReplicationDistributedZkTest]         at java.lang.Thread.sleep(Native Method)         at org.apache.http.impl.client.IdleConnectionEvictor$1.run(IdleConnectionEvictor.java:66)         at java.lang.Thread.run(Thread.java:745)   27) Thread[id=79913, name=Connection evictor, state=TIMED_WAITING, group=TGRP-CdcrReplicationDistributedZkTest]         at java.lang.Thread.sleep(Native Method)         at org.apache.http.impl.client.IdleConnectionEvictor$1.run(IdleConnectionEvictor.java:66)         at java.lang.Thread.run(Thread.java:745)   28) Thread[id=75881, name=Connection evictor, state=TIMED_WAITING, group=TGRP-CdcrReplicationDistributedZkTest]         at java.lang.Thread.sleep(Native Method)         at org.apache.http.impl.client.IdleConnectionEvictor$1.run(IdleConnectionEvictor.java:66)         at java.lang.Thread.run(Thread.java:745)   29) Thread[id=81486, name=Connection evictor, state=TIMED_WAITING, group=TGRP-CdcrReplicationDistributedZkTest]         at java.lang.Thread.sleep(Native Method)         at org.apache.http.impl.client.IdleConnectionEvictor$1.run(IdleConnectionEvictor.java:66)         at java.lang.Thread.run(Thread.java:745)   30) Thread[id=81727, name=Connection evictor, state=TIMED_WAITING, group=TGRP-CdcrReplicationDistributedZkTest]         at java.lang.Thread.sleep(Native Method)         at org.apache.http.impl.client.IdleConnectionEvictor$1.run(IdleConnectionEvictor.java:66)         at java.lang.Thread.run(Thread.java:745)   31) Thread[id=75882, name=Connection evictor, state=TIMED_WAITING, group=TGRP-CdcrReplicationDistributedZkTest]         at java.lang.Thread.sleep(Native Method)         at org.apache.http.impl.client.IdleConnectionEvictor$1.run(IdleConnectionEvictor.java:66)         at java.lang.Thread.run(Thread.java:745)   32) Thread[id=76126, name=Connection evictor, state=TIMED_WAITING, group=TGRP-CdcrReplicationDistributedZkTest]         at java.lang.Thread.sleep(Native Method)         at org.apache.http.impl.client.IdleConnectionEvictor$1.run(IdleConnectionEvictor.java:66)         at java.lang.Thread.run(Thread.java:745)   33) Thread[id=79916, name=Connection evictor, state=TIMED_WAITING, group=TGRP-CdcrReplicationDistributedZkTest]         at java.lang.Thread.sleep(Native Method)         at org.apache.http.impl.client.IdleConnectionEvictor$1.run(IdleConnectionEvictor.java:66)         at java.lang.Thread.run(Thread.java:745)   34) Thread[id=82826, name=Connection evictor, state=TIMED_WAITING, group=TGRP-CdcrReplicationDistributedZkTest]         at java.lang.Thread.sleep(Native Method)         at org.apache.http.impl.client.IdleConnectionEvictor$1.run(IdleConnectionEvictor.java:66)         at java.lang.Thread.run(Thread.java:745)   35) Thread[id=75458, name=Connection evictor, state=TIMED_WAITING, group=TGRP-CdcrReplicationDistributedZkTest]         at java.lang.Thread.sleep(Native Method)         at org.apache.http.impl.client.IdleConnectionEvictor$1.run(IdleConnectionEvictor.java:66)         at java.lang.Thread.run(Thread.java:745)   36) Thread[id=81487, name=Connection evictor, state=TIMED_WAITING, group=TGRP-CdcrReplicationDistributedZkTest]         at java.lang.Thread.sleep(Native Method)         at org.apache.http.impl.client.IdleConnectionEvictor$1.run(IdleConnectionEvictor.java:66)         at java.lang.Thread.run(Thread.java:745)   37) Thread[id=75883, name=Connection evictor, state=TIMED_WAITING, group=TGRP-CdcrReplicationDistributedZkTest]         at java.lang.Thread.sleep(Native Method)         at org.apache.http.impl.client.IdleConnectionEvictor$1.run(IdleConnectionEvictor.java:66)         at java.lang.Thread.run(Thread.java:745)   38) Thread[id=83288, name=Connection evictor, state=TIMED_WAITING, group=TGRP-CdcrReplicationDistributedZkTest]         at java.lang.Thread.sleep(Native Method)         at org.apache.http.impl.client.IdleConnectionEvictor$1.run(IdleConnectionEvictor.java:66)         at java.lang.Thread.run(Thread.java:745)   39) Thread[id=81312, name=Connection evictor, state=TIMED_WAITING, group=TGRP-CdcrReplicationDistributedZkTest]         at java.lang.Thread.sleep(Native Method)         at org.apache.http.impl.client.IdleConnectionEvictor$1.run(IdleConnectionEvictor.java:66)         at java.lang.Thread.run(Thread.java:745)   40) Thread[id=75748, name=Connection evictor, state=TIMED_WAITING, group=TGRP-CdcrReplicationDistributedZkTest]         at java.lang.Thread.sleep(Native Method)         at org.apache.http.impl.client.IdleConnectionEvictor$1.run(IdleConnectionEvictor.java:66)         at java.lang.Thread.run(Thread.java:745)   41) Thread[id=81309, name=Connection evictor, state=TIMED_WAITING, group=TGRP-CdcrReplicationDistributedZkTest]         at java.lang.Thread.sleep(Native Method)         at org.apache.http.impl.client.IdleConnectionEvictor$1.run(IdleConnectionEvictor.java:66)         at java.lang.Thread.run(Thread.java:745)   42) Thread[id=76124, name=Connection evictor, state=TIMED_WAITING, group=TGRP-CdcrReplicationDistributedZkTest]         at java.lang.Thread.sleep(Native Method)         at org.apache.http.impl.client.IdleConnectionEvictor$1.run(IdleConnectionEvictor.java:66)         at java.lang.Thread.run(Thread.java:745)   43) Thread[id=75747, name=Connection evictor, state=TIMED_WAITING, group=TGRP-CdcrReplicationDistributedZkTest]         at java.lang.Thread.sleep(Native Method)         at org.apache.http.impl.client.IdleConnectionEvictor$1.run(IdleConnectionEvictor.java:66)         at java.lang.Thread.run(Thread.java:745)   44) Thread[id=81021, name=Connection evictor, state=TIMED_WAITING, group=TGRP-CdcrReplicationDistributedZkTest]         at java.lang.Thread.sleep(Native Method)         at org.apache.http.impl.client.IdleConnectionEvictor$1.run(IdleConnectionEvictor.java:66)         at java.lang.Thread.run(Thread.java:745)   45) Thread[id=75744, name=Connection evictor, state=TIMED_WAITING, group=TGRP-CdcrReplicationDistributedZkTest]         at java.lang.Thread.sleep(Native Method)         at org.apache.http.impl.client.IdleConnectionEvictor$1.run(IdleConnectionEvictor.java:66)         at java.lang.Thread.run(Thread.java:745)   46) Thread[id=82825, name=Connection evictor, state=TIMED_WAITING, group=TGRP-CdcrReplicationDistributedZkTest]         at java.lang.Thread.sleep(Native Method)         at org.apache.http.impl.client.IdleConnectionEvictor$1.run(IdleConnectionEvictor.java:66)         at java.lang.Thread.run(Thread.java:745)   47) Thread[id=78534, name=Connection evictor, state=TIMED_WAITING, group=TGRP-CdcrReplicationDistributedZkTest]         at java.lang.Thread.sleep(Native Method)         at org.apache.http.impl.client.IdleConnectionEvictor$1.run(IdleConnectionEvictor.java:66)         at java.lang.Thread.run(Thread.java:745)   48) Thread[id=79914, name=Connection evictor, state=TIMED_WAITING, group=TGRP-CdcrReplicationDistributedZkTest]         at java.lang.Thread.sleep(Native Method)         at org.apache.http.impl.client.IdleConnectionEvictor$1.run(IdleConnectionEvictor.java:66)         at java.lang.Thread.run(Thread.java:745)

Stack Trace:
com.carrotsearch.randomizedtesting.ThreadLeakError: 48 threads leaked from SUITE scope at org.apache.solr.cloud.CdcrReplicationDistributedZkTest: 
   1) Thread[id=76125, name=Connection evictor, state=TIMED_WAITING, group=TGRP-CdcrReplicationDistributedZkTest]
        at java.lang.Thread.sleep(Native Method)
        at org.apache.http.impl.client.IdleConnectionEvictor$1.run(IdleConnectionEvictor.java:66)
        at java.lang.Thread.run(Thread.java:745)
   2) Thread[id=83286, name=Connection evictor, state=TIMED_WAITING, group=TGRP-CdcrReplicationDistributedZkTest]
        at java.lang.Thread.sleep(Native Method)
        at org.apache.http.impl.client.IdleConnectionEvictor$1.run(IdleConnectionEvictor.java:66)
        at java.lang.Thread.run(Thread.java:745)
   3) Thread[id=81485, name=Connection evictor, state=TIMED_WAITING, group=TGRP-CdcrReplicationDistributedZkTest]
        at java.lang.Thread.sleep(Native Method)
        at org.apache.http.impl.client.IdleConnectionEvictor$1.run(IdleConnectionEvictor.java:66)
        at java.lang.Thread.run(Thread.java:745)
   4) Thread[id=81310, name=Connection evictor, state=TIMED_WAITING, group=TGRP-CdcrReplicationDistributedZkTest]
        at java.lang.Thread.sleep(Native Method)
        at org.apache.http.impl.client.IdleConnectionEvictor$1.run(IdleConnectionEvictor.java:66)
        at java.lang.Thread.run(Thread.java:745)
   5) Thread[id=78535, name=Connection evictor, state=TIMED_WAITING, group=TGRP-CdcrReplicationDistributedZkTest]
        at java.lang.Thread.sleep(Native Method)
        at org.apache.http.impl.client.IdleConnectionEvictor$1.run(IdleConnectionEvictor.java:66)
        at java.lang.Thread.run(Thread.java:745)
   6) Thread[id=76127, name=Connection evictor, state=TIMED_WAITING, group=TGRP-CdcrReplicationDistributedZkTest]
        at java.lang.Thread.sleep(Native Method)
        at org.apache.http.impl.client.IdleConnectionEvictor$1.run(IdleConnectionEvictor.java:66)
        at java.lang.Thread.run(Thread.java:745)
   7) Thread[id=75457, name=Connection evictor, state=TIMED_WAITING, group=TGRP-CdcrReplicationDistributedZkTest]
        at java.lang.Thread.sleep(Native Method)
        at org.apache.http.impl.client.IdleConnectionEvictor$1.run(IdleConnectionEvictor.java:66)
        at java.lang.Thread.run(Thread.java:745)
   8) Thread[id=75880, name=Connection evictor, state=TIMED_WAITING, group=TGRP-CdcrReplicationDistributedZkTest]
        at java.lang.Thread.sleep(Native Method)
        at org.apache.http.impl.client.IdleConnectionEvictor$1.run(IdleConnectionEvictor.java:66)
        at java.lang.Thread.run(Thread.java:745)
   9) Thread[id=81020, name=Connection evictor, state=TIMED_WAITING, group=TGRP-CdcrReplicationDistributedZkTest]
        at java.lang.Thread.sleep(Native Method)
        at org.apache.http.impl.client.IdleConnectionEvictor$1.run(IdleConnectionEvictor.java:66)
        at java.lang.Thread.run(Thread.java:745)
  10) Thread[id=75455, name=Connection evictor, state=TIMED_WAITING, group=TGRP-CdcrReplicationDistributedZkTest]
        at java.lang.Thread.sleep(Native Method)
        at org.apache.http.impl.client.IdleConnectionEvictor$1.run(IdleConnectionEvictor.java:66)
        at java.lang.Thread.run(Thread.java:745)
  11) Thread[id=78533, name=Connection evictor, state=TIMED_WAITING, group=TGRP-CdcrReplicationDistributedZkTest]
        at java.lang.Thread.sleep(Native Method)
        at org.apache.http.impl.client.IdleConnectionEvictor$1.run(IdleConnectionEvictor.java:66)
        at java.lang.Thread.run(Thread.java:745)
  12) Thread[id=81484, name=Connection evictor, state=TIMED_WAITING, group=TGRP-CdcrReplicationDistributedZkTest]
        at java.lang.Thread.sleep(Native Method)
        at org.apache.http.impl.client.IdleConnectionEvictor$1.run(IdleConnectionEvictor.java:66)
        at java.lang.Thread.run(Thread.java:745)
  13) Thread[id=81728, name=Connection evictor, state=TIMED_WAITING, group=TGRP-CdcrReplicationDistributedZkTest]
        at java.lang.Thread.sleep(Native Method)
        at org.apache.http.impl.client.IdleConnectionEvictor$1.run(IdleConnectionEvictor.java:66)
        at java.lang.Thread.run(Thread.java:745)
  14) Thread[id=75456, name=Connection evictor, state=TIMED_WAITING, group=TGRP-CdcrReplicationDistributedZkTest]
        at java.lang.Thread.sleep(Native Method)
        at org.apache.http.impl.client.IdleConnectionEvictor$1.run(IdleConnectionEvictor.java:66)
        at java.lang.Thread.run(Thread.java:745)
  15) Thread[id=82824, name=Connection evictor, state=TIMED_WAITING, group=TGRP-CdcrReplicationDistributedZkTest]
        at java.lang.Thread.sleep(Native Method)
        at org.apache.http.impl.client.IdleConnectionEvictor$1.run(IdleConnectionEvictor.java:66)
        at java.lang.Thread.run(Thread.java:745)
  16) Thread[id=81019, name=Connection evictor, state=TIMED_WAITING, group=TGRP-CdcrReplicationDistributedZkTest]
        at java.lang.Thread.sleep(Native Method)
        at org.apache.http.impl.client.IdleConnectionEvictor$1.run(IdleConnectionEvictor.java:66)
        at java.lang.Thread.run(Thread.java:745)
  17) Thread[id=81729, name=Connection evictor, state=TIMED_WAITING, group=TGRP-CdcrReplicationDistributedZkTest]
        at java.lang.Thread.sleep(Native Method)
        at org.apache.http.impl.client.IdleConnectionEvictor$1.run(IdleConnectionEvictor.java:66)
        at java.lang.Thread.run(Thread.java:745)
  18) Thread[id=75749, name=Connection evictor, state=TIMED_WAITING, group=TGRP-CdcrReplicationDistributedZkTest]
        at java.lang.Thread.sleep(Native Method)
        at org.apache.http.impl.client.IdleConnectionEvictor$1.run(IdleConnectionEvictor.java:66)
        at java.lang.Thread.run(Thread.java:745)
  19) Thread[id=78536, name=Connection evictor, state=TIMED_WAITING, group=TGRP-CdcrReplicationDistributedZkTest]
        at java.lang.Thread.sleep(Native Method)
        at org.apache.http.impl.client.IdleConnectionEvictor$1.run(IdleConnectionEvictor.java:66)
        at java.lang.Thread.run(Thread.java:745)
  20) Thread[id=79915, name=Connection evictor, state=TIMED_WAITING, group=TGRP-CdcrReplicationDistributedZkTest]
        at java.lang.Thread.sleep(Native Method)
        at org.apache.http.impl.client.IdleConnectionEvictor$1.run(IdleConnectionEvictor.java:66)
        at java.lang.Thread.run(Thread.java:745)
  21) Thread[id=81311, name=Connection evictor, state=TIMED_WAITING, group=TGRP-CdcrReplicationDistributedZkTest]
        at java.lang.Thread.sleep(Native Method)
        at org.apache.http.impl.client.IdleConnectionEvictor$1.run(IdleConnectionEvictor.java:66)
        at java.lang.Thread.run(Thread.java:745)
  22) Thread[id=81730, name=Connection evictor, state=TIMED_WAITING, group=TGRP-CdcrReplicationDistributedZkTest]
        at java.lang.Thread.sleep(Native Method)
        at org.apache.http.impl.client.IdleConnectionEvictor$1.run(IdleConnectionEvictor.java:66)
        at java.lang.Thread.run(Thread.java:745)
  23) Thread[id=82827, name=Connection evictor, state=TIMED_WAITING, group=TGRP-CdcrReplicationDistributedZkTest]
        at java.lang.Thread.sleep(Native Method)
        at org.apache.http.impl.client.IdleConnectionEvictor$1.run(IdleConnectionEvictor.java:66)
        at java.lang.Thread.run(Thread.java:745)
  24) Thread[id=81022, name=Connection evictor, state=TIMED_WAITING, group=TGRP-CdcrReplicationDistributedZkTest]
        at java.lang.Thread.sleep(Native Method)
        at org.apache.http.impl.client.IdleConnectionEvictor$1.run(IdleConnectionEvictor.java:66)
        at java.lang.Thread.run(Thread.java:745)
  25) Thread[id=83285, name=Connection evictor, state=TIMED_WAITING, group=TGRP-CdcrReplicationDistributedZkTest]
        at java.lang.Thread.sleep(Native Method)
        at org.apache.http.impl.client.IdleConnectionEvictor$1.run(IdleConnectionEvictor.java:66)
        at java.lang.Thread.run(Thread.java:745)
  26) Thread[id=83287, name=Connection evictor, state=TIMED_WAITING, group=TGRP-CdcrReplicationDistributedZkTest]
        at java.lang.Thread.sleep(Native Method)
        at org.apache.http.impl.client.IdleConnectionEvictor$1.run(IdleConnectionEvictor.java:66)
        at java.lang.Thread.run(Thread.java:745)
  27) Thread[id=79913, name=Connection evictor, state=TIMED_WAITING, group=TGRP-CdcrReplicationDistributedZkTest]
        at java.lang.Thread.sleep(Native Method)
        at org.apache.http.impl.client.IdleConnectionEvictor$1.run(IdleConnectionEvictor.java:66)
        at java.lang.Thread.run(Thread.java:745)
  28) Thread[id=75881, name=Connection evictor, state=TIMED_WAITING, group=TGRP-CdcrReplicationDistributedZkTest]
        at java.lang.Thread.sleep(Native Method)
        at org.apache.http.impl.client.IdleConnectionEvictor$1.run(IdleConnectionEvictor.java:66)
        at java.lang.Thread.run(Thread.java:745)
  29) Thread[id=81486, name=Connection evictor, state=TIMED_WAITING, group=TGRP-CdcrReplicationDistributedZkTest]
        at java.lang.Thread.sleep(Native Method)
        at org.apache.http.impl.client.IdleConnectionEvictor$1.run(IdleConnectionEvictor.java:66)
        at java.lang.Thread.run(Thread.java:745)
  30) Thread[id=81727, name=Connection evictor, state=TIMED_WAITING, group=TGRP-CdcrReplicationDistributedZkTest]
        at java.lang.Thread.sleep(Native Method)
        at org.apache.http.impl.client.IdleConnectionEvictor$1.run(IdleConnectionEvictor.java:66)
        at java.lang.Thread.run(Thread.java:745)
  31) Thread[id=75882, name=Connection evictor, state=TIMED_WAITING, group=TGRP-CdcrReplicationDistributedZkTest]
        at java.lang.Thread.sleep(Native Method)
        at org.apache.http.impl.client.IdleConnectionEvictor$1.run(IdleConnectionEvictor.java:66)
        at java.lang.Thread.run(Thread.java:745)
  32) Thread[id=76126, name=Connection evictor, state=TIMED_WAITING, group=TGRP-CdcrReplicationDistributedZkTest]
        at java.lang.Thread.sleep(Native Method)
        at org.apache.http.impl.client.IdleConnectionEvictor$1.run(IdleConnectionEvictor.java:66)
        at java.lang.Thread.run(Thread.java:745)
  33) Thread[id=79916, name=Connection evictor, state=TIMED_WAITING, group=TGRP-CdcrReplicationDistributedZkTest]
        at java.lang.Thread.sleep(Native Method)
        at org.apache.http.impl.client.IdleConnectionEvictor$1.run(IdleConnectionEvictor.java:66)
        at java.lang.Thread.run(Thread.java:745)
  34) Thread[id=82826, name=Connection evictor, state=TIMED_WAITING, group=TGRP-CdcrReplicationDistributedZkTest]
        at java.lang.Thread.sleep(Native Method)
        at org.apache.http.impl.client.IdleConnectionEvictor$1.run(IdleConnectionEvictor.java:66)
        at java.lang.Thread.run(Thread.java:745)
  35) Thread[id=75458, name=Connection evictor, state=TIMED_WAITING, group=TGRP-CdcrReplicationDistributedZkTest]
        at java.lang.Thread.sleep(Native Method)
        at org.apache.http.impl.client.IdleConnectionEvictor$1.run(IdleConnectionEvictor.java:66)
        at java.lang.Thread.run(Thread.java:745)
  36) Thread[id=81487, name=Connection evictor, state=TIMED_WAITING, group=TGRP-CdcrReplicationDistributedZkTest]
        at java.lang.Thread.sleep(Native Method)
        at org.apache.http.impl.client.IdleConnectionEvictor$1.run(IdleConnectionEvictor.java:66)
        at java.lang.Thread.run(Thread.java:745)
  37) Thread[id=75883, name=Connection evictor, state=TIMED_WAITING, group=TGRP-CdcrReplicationDistributedZkTest]
        at java.lang.Thread.sleep(Native Method)
        at org.apache.http.impl.client.IdleConnectionEvictor$1.run(IdleConnectionEvictor.java:66)
        at java.lang.Thread.run(Thread.java:745)
  38) Thread[id=83288, name=Connection evictor, state=TIMED_WAITING, group=TGRP-CdcrReplicationDistributedZkTest]
        at java.lang.Thread.sleep(Native Method)
        at org.apache.http.impl.client.IdleConnectionEvictor$1.run(IdleConnectionEvictor.java:66)
        at java.lang.Thread.run(Thread.java:745)
  39) Thread[id=81312, name=Connection evictor, state=TIMED_WAITING, group=TGRP-CdcrReplicationDistributedZkTest]
        at java.lang.Thread.sleep(Native Method)
        at org.apache.http.impl.client.IdleConnectionEvictor$1.run(IdleConnectionEvictor.java:66)
        at java.lang.Thread.run(Thread.java:745)
  40) Thread[id=75748, name=Connection evictor, state=TIMED_WAITING, group=TGRP-CdcrReplicationDistributedZkTest]
        at java.lang.Thread.sleep(Native Method)
        at org.apache.http.impl.client.IdleConnectionEvictor$1.run(IdleConnectionEvictor.java:66)
        at java.lang.Thread.run(Thread.java:745)
  41) Thread[id=81309, name=Connection evictor, state=TIMED_WAITING, group=TGRP-CdcrReplicationDistributedZkTest]
        at java.lang.Thread.sleep(Native Method)
        at org.apache.http.impl.client.IdleConnectionEvictor$1.run(IdleConnectionEvictor.java:66)
        at java.lang.Thread.run(Thread.java:745)
  42) Thread[id=76124, name=Connection evictor, state=TIMED_WAITING, group=TGRP-CdcrReplicationDistributedZkTest]
        at java.lang.Thread.sleep(Native Method)
        at org.apache.http.impl.client.IdleConnectionEvictor$1.run(IdleConnectionEvictor.java:66)
        at java.lang.Thread.run(Thread.java:745)
  43) Thread[id=75747, name=Connection evictor, state=TIMED_WAITING, group=TGRP-CdcrReplicationDistributedZkTest]
        at java.lang.Thread.sleep(Native Method)
        at org.apache.http.impl.client.IdleConnectionEvictor$1.run(IdleConnectionEvictor.java:66)
        at java.lang.Thread.run(Thread.java:745)
  44) Thread[id=81021, name=Connection evictor, state=TIMED_WAITING, group=TGRP-CdcrReplicationDistributedZkTest]
        at java.lang.Thread.sleep(Native Method)
        at org.apache.http.impl.client.IdleConnectionEvictor$1.run(IdleConnectionEvictor.java:66)
        at java.lang.Thread.run(Thread.java:745)
  45) Thread[id=75744, name=Connection evictor, state=TIMED_WAITING, group=TGRP-CdcrReplicationDistributedZkTest]
        at java.lang.Thread.sleep(Native Method)
        at org.apache.http.impl.client.IdleConnectionEvictor$1.run(IdleConnectionEvictor.java:66)
        at java.lang.Thread.run(Thread.java:745)
  46) Thread[id=82825, name=Connection evictor, state=TIMED_WAITING, group=TGRP-CdcrReplicationDistributedZkTest]
        at java.lang.Thread.sleep(Native Method)
        at org.apache.http.impl.client.IdleConnectionEvictor$1.run(IdleConnectionEvictor.java:66)
        at java.lang.Thread.run(Thread.java:745)
  47) Thread[id=78534, name=Connection evictor, state=TIMED_WAITING, group=TGRP-CdcrReplicationDistributedZkTest]
        at java.lang.Thread.sleep(Native Method)
        at org.apache.http.impl.client.IdleConnectionEvictor$1.run(IdleConnectionEvictor.java:66)
        at java.lang.Thread.run(Thread.java:745)
  48) Thread[id=79914, name=Connection evictor, state=TIMED_WAITING, group=TGRP-CdcrReplicationDistributedZkTest]
        at java.lang.Thread.sleep(Native Method)
        at org.apache.http.impl.client.IdleConnectionEvictor$1.run(IdleConnectionEvictor.java:66)
        at java.lang.Thread.run(Thread.java:745)
	at __randomizedtesting.SeedInfo.seed([87BAB0DFEB3E19FB]:0)


FAILED:  junit.framework.TestSuite.org.apache.solr.cloud.CdcrRequestHandlerTest

Error Message:
ObjectTracker found 8 object(s) that were not released!!! [InternalHttpClient, InternalHttpClient, InternalHttpClient, InternalHttpClient, InternalHttpClient, InternalHttpClient, InternalHttpClient, InternalHttpClient]

Stack Trace:
java.lang.AssertionError: ObjectTracker found 8 object(s) that were not released!!! [InternalHttpClient, InternalHttpClient, InternalHttpClient, InternalHttpClient, InternalHttpClient, InternalHttpClient, InternalHttpClient, InternalHttpClient]
	at __randomizedtesting.SeedInfo.seed([87BAB0DFEB3E19FB]:0)
	at org.junit.Assert.fail(Assert.java:93)
	at org.junit.Assert.assertTrue(Assert.java:43)
	at org.junit.Assert.assertNull(Assert.java:551)
	at org.apache.solr.SolrTestCaseJ4.afterClass(SolrTestCaseJ4.java:255)
	at sun.reflect.GeneratedMethodAccessor17.invoke(Unknown Source)
	at sun.reflect.DelegatingMethodAccessorImpl.invoke(DelegatingMethodAccessorImpl.java:43)
	at java.lang.reflect.Method.invoke(Method.java:498)
	at com.carrotsearch.randomizedtesting.RandomizedRunner.invoke(RandomizedRunner.java:1764)
	at com.carrotsearch.randomizedtesting.RandomizedRunner$7.evaluate(RandomizedRunner.java:834)
	at com.carrotsearch.randomizedtesting.rules.StatementAdapter.evaluate(StatementAdapter.java:36)
	at com.carrotsearch.randomizedtesting.rules.SystemPropertiesRestoreRule$1.evaluate(SystemPropertiesRestoreRule.java:57)
	at org.apache.lucene.util.AbstractBeforeAfterRule$1.evaluate(AbstractBeforeAfterRule.java:45)
	at com.carrotsearch.randomizedtesting.rules.StatementAdapter.evaluate(StatementAdapter.java:36)
	at org.apache.lucene.util.TestRuleStoreClassName$1.evaluate(TestRuleStoreClassName.java:41)
	at com.carrotsearch.randomizedtesting.rules.NoShadowingOrOverridesOnMethodsRule$1.evaluate(NoShadowingOrOverridesOnMethodsRule.java:40)
	at com.carrotsearch.randomizedtesting.rules.NoShadowingOrOverridesOnMethodsRule$1.evaluate(NoShadowingOrOverridesOnMethodsRule.java:40)
	at com.carrotsearch.randomizedtesting.rules.StatementAdapter.evaluate(StatementAdapter.java:36)
	at com.carrotsearch.randomizedtesting.rules.StatementAdapter.evaluate(StatementAdapter.java:36)
	at com.carrotsearch.randomizedtesting.rules.StatementAdapter.evaluate(StatementAdapter.java:36)
	at org.apache.lucene.util.TestRuleAssertionsRequired$1.evaluate(TestRuleAssertionsRequired.java:53)
	at org.apache.lucene.util.TestRuleMarkFailure$1.evaluate(TestRuleMarkFailure.java:47)
	at org.apache.lucene.util.TestRuleIgnoreAfterMaxFailures$1.evaluate(TestRuleIgnoreAfterMaxFailures.java:64)
	at org.apache.lucene.util.TestRuleIgnoreTestSuites$1.evaluate(TestRuleIgnoreTestSuites.java:54)
	at com.carrotsearch.randomizedtesting.rules.StatementAdapter.evaluate(StatementAdapter.java:36)
	at com.carrotsearch.randomizedtesting.ThreadLeakControl$StatementRunner.run(ThreadLeakControl.java:367)
	at java.lang.Thread.run(Thread.java:745)


FAILED:  junit.framework.TestSuite.org.apache.solr.cloud.CdcrRequestHandlerTest

Error Message:
8 threads leaked from SUITE scope at org.apache.solr.cloud.CdcrRequestHandlerTest:     1) Thread[id=19204, name=Connection evictor, state=TIMED_WAITING, group=TGRP-CdcrRequestHandlerTest]         at java.lang.Thread.sleep(Native Method)         at org.apache.http.impl.client.IdleConnectionEvictor$1.run(IdleConnectionEvictor.java:66)         at java.lang.Thread.run(Thread.java:745)    2) Thread[id=19203, name=Connection evictor, state=TIMED_WAITING, group=TGRP-CdcrRequestHandlerTest]         at java.lang.Thread.sleep(Native Method)         at org.apache.http.impl.client.IdleConnectionEvictor$1.run(IdleConnectionEvictor.java:66)         at java.lang.Thread.run(Thread.java:745)    3) Thread[id=19547, name=Connection evictor, state=TIMED_WAITING, group=TGRP-CdcrRequestHandlerTest]         at java.lang.Thread.sleep(Native Method)         at org.apache.http.impl.client.IdleConnectionEvictor$1.run(IdleConnectionEvictor.java:66)         at java.lang.Thread.run(Thread.java:745)    4) Thread[id=19548, name=Connection evictor, state=TIMED_WAITING, group=TGRP-CdcrRequestHandlerTest]         at java.lang.Thread.sleep(Native Method)         at org.apache.http.impl.client.IdleConnectionEvictor$1.run(IdleConnectionEvictor.java:66)         at java.lang.Thread.run(Thread.java:745)    5) Thread[id=19546, name=Connection evictor, state=TIMED_WAITING, group=TGRP-CdcrRequestHandlerTest]         at java.lang.Thread.sleep(Native Method)         at org.apache.http.impl.client.IdleConnectionEvictor$1.run(IdleConnectionEvictor.java:66)         at java.lang.Thread.run(Thread.java:745)    6) Thread[id=19549, name=Connection evictor, state=TIMED_WAITING, group=TGRP-CdcrRequestHandlerTest]         at java.lang.Thread.sleep(Native Method)         at org.apache.http.impl.client.IdleConnectionEvictor$1.run(IdleConnectionEvictor.java:66)         at java.lang.Thread.run(Thread.java:745)    7) Thread[id=19201, name=Connection evictor, state=TIMED_WAITING, group=TGRP-CdcrRequestHandlerTest]         at java.lang.Thread.sleep(Native Method)         at org.apache.http.impl.client.IdleConnectionEvictor$1.run(IdleConnectionEvictor.java:66)         at java.lang.Thread.run(Thread.java:745)    8) Thread[id=19202, name=Connection evictor, state=TIMED_WAITING, group=TGRP-CdcrRequestHandlerTest]         at java.lang.Thread.sleep(Native Method)         at org.apache.http.impl.client.IdleConnectionEvictor$1.run(IdleConnectionEvictor.java:66)         at java.lang.Thread.run(Thread.java:745)

Stack Trace:
com.carrotsearch.randomizedtesting.ThreadLeakError: 8 threads leaked from SUITE scope at org.apache.solr.cloud.CdcrRequestHandlerTest: 
   1) Thread[id=19204, name=Connection evictor, state=TIMED_WAITING, group=TGRP-CdcrRequestHandlerTest]
        at java.lang.Thread.sleep(Native Method)
        at org.apache.http.impl.client.IdleConnectionEvictor$1.run(IdleConnectionEvictor.java:66)
        at java.lang.Thread.run(Thread.java:745)
   2) Thread[id=19203, name=Connection evictor, state=TIMED_WAITING, group=TGRP-CdcrRequestHandlerTest]
        at java.lang.Thread.sleep(Native Method)
        at org.apache.http.impl.client.IdleConnectionEvictor$1.run(IdleConnectionEvictor.java:66)
        at java.lang.Thread.run(Thread.java:745)
   3) Thread[id=19547, name=Connection evictor, state=TIMED_WAITING, group=TGRP-CdcrRequestHandlerTest]
        at java.lang.Thread.sleep(Native Method)
        at org.apache.http.impl.client.IdleConnectionEvictor$1.run(IdleConnectionEvictor.java:66)
        at java.lang.Thread.run(Thread.java:745)
   4) Thread[id=19548, name=Connection evictor, state=TIMED_WAITING, group=TGRP-CdcrRequestHandlerTest]
        at java.lang.Thread.sleep(Native Method)
        at org.apache.http.impl.client.IdleConnectionEvictor$1.run(IdleConnectionEvictor.java:66)
        at java.lang.Thread.run(Thread.java:745)
   5) Thread[id=19546, name=Connection evictor, state=TIMED_WAITING, group=TGRP-CdcrRequestHandlerTest]
        at java.lang.Thread.sleep(Native Method)
        at org.apache.http.impl.client.IdleConnectionEvictor$1.run(IdleConnectionEvictor.java:66)
        at java.lang.Thread.run(Thread.java:745)
   6) Thread[id=19549, name=Connection evictor, state=TIMED_WAITING, group=TGRP-CdcrRequestHandlerTest]
        at java.lang.Thread.sleep(Native Method)
        at org.apache.http.impl.client.IdleConnectionEvictor$1.run(IdleConnectionEvictor.java:66)
        at java.lang.Thread.run(Thread.java:745)
   7) Thread[id=19201, name=Connection evictor, state=TIMED_WAITING, group=TGRP-CdcrRequestHandlerTest]
        at java.lang.Thread.sleep(Native Method)
        at org.apache.http.impl.client.IdleConnectionEvictor$1.run(IdleConnectionEvictor.java:66)
        at java.lang.Thread.run(Thread.java:745)
   8) Thread[id=19202, name=Connection evictor, state=TIMED_WAITING, group=TGRP-CdcrRequestHandlerTest]
        at java.lang.Thread.sleep(Native Method)
        at org.apache.http.impl.client.IdleConnectionEvictor$1.run(IdleConnectionEvictor.java:66)
        at java.lang.Thread.run(Thread.java:745)
	at __randomizedtesting.SeedInfo.seed([87BAB0DFEB3E19FB]:0)


FAILED:  junit.framework.TestSuite.org.apache.solr.cloud.ConcurrentDeleteAndCreateCollectionTest

Error Message:
ObjectTracker found 10 object(s) that were not released!!! [InternalHttpClient, InternalHttpClient, InternalHttpClient, InternalHttpClient, InternalHttpClient, InternalHttpClient, InternalHttpClient, InternalHttpClient, InternalHttpClient, InternalHttpClient]

Stack Trace:
java.lang.AssertionError: ObjectTracker found 10 object(s) that were not released!!! [InternalHttpClient, InternalHttpClient, InternalHttpClient, InternalHttpClient, InternalHttpClient, InternalHttpClient, InternalHttpClient, InternalHttpClient, InternalHttpClient, InternalHttpClient]
	at __randomizedtesting.SeedInfo.seed([87BAB0DFEB3E19FB]:0)
	at org.junit.Assert.fail(Assert.java:93)
	at org.junit.Assert.assertTrue(Assert.java:43)
	at org.junit.Assert.assertNull(Assert.java:551)
	at org.apache.solr.SolrTestCaseJ4.afterClass(SolrTestCaseJ4.java:255)
	at sun.reflect.GeneratedMethodAccessor54.invoke(Unknown Source)
	at sun.reflect.DelegatingMethodAccessorImpl.invoke(DelegatingMethodAccessorImpl.java:43)
	at java.lang.reflect.Method.invoke(Method.java:498)
	at com.carrotsearch.randomizedtesting.RandomizedRunner.invoke(RandomizedRunner.java:1764)
	at com.carrotsearch.randomizedtesting.RandomizedRunner$7.evaluate(RandomizedRunner.java:834)
	at com.carrotsearch.randomizedtesting.rules.StatementAdapter.evaluate(StatementAdapter.java:36)
	at com.carrotsearch.randomizedtesting.rules.SystemPropertiesRestoreRule$1.evaluate(SystemPropertiesRestoreRule.java:57)
	at org.apache.lucene.util.AbstractBeforeAfterRule$1.evaluate(AbstractBeforeAfterRule.java:45)
	at com.carrotsearch.randomizedtesting.rules.StatementAdapter.evaluate(StatementAdapter.java:36)
	at org.apache.lucene.util.TestRuleStoreClassName$1.evaluate(TestRuleStoreClassName.java:41)
	at com.carrotsearch.randomizedtesting.rules.NoShadowingOrOverridesOnMethodsRule$1.evaluate(NoShadowingOrOverridesOnMethodsRule.java:40)
	at com.carrotsearch.randomizedtesting.rules.NoShadowingOrOverridesOnMethodsRule$1.evaluate(NoShadowingOrOverridesOnMethodsRule.java:40)
	at com.carrotsearch.randomizedtesting.rules.StatementAdapter.evaluate(StatementAdapter.java:36)
	at com.carrotsearch.randomizedtesting.rules.StatementAdapter.evaluate(StatementAdapter.java:36)
	at com.carrotsearch.randomizedtesting.rules.StatementAdapter.evaluate(StatementAdapter.java:36)
	at org.apache.lucene.util.TestRuleAssertionsRequired$1.evaluate(TestRuleAssertionsRequired.java:53)
	at org.apache.lucene.util.TestRuleMarkFailure$1.evaluate(TestRuleMarkFailure.java:47)
	at org.apache.lucene.util.TestRuleIgnoreAfterMaxFailures$1.evaluate(TestRuleIgnoreAfterMaxFailures.java:64)
	at org.apache.lucene.util.TestRuleIgnoreTestSuites$1.evaluate(TestRuleIgnoreTestSuites.java:54)
	at com.carrotsearch.randomizedtesting.rules.StatementAdapter.evaluate(StatementAdapter.java:36)
	at com.carrotsearch.randomizedtesting.ThreadLeakControl$StatementRunner.run(ThreadLeakControl.java:367)
	at java.lang.Thread.run(Thread.java:745)


FAILED:  junit.framework.TestSuite.org.apache.solr.cloud.ConcurrentDeleteAndCreateCollectionTest

Error Message:
10 threads leaked from SUITE scope at org.apache.solr.cloud.ConcurrentDeleteAndCreateCollectionTest:     1) Thread[id=83756, name=Connection evictor, state=TIMED_WAITING, group=TGRP-ConcurrentDeleteAndCreateCollectionTest]         at java.lang.Thread.sleep(Native Method)         at org.apache.http.impl.client.IdleConnectionEvictor$1.run(IdleConnectionEvictor.java:66)         at java.lang.Thread.run(Thread.java:745)    2) Thread[id=83766, name=Connection evictor, state=TIMED_WAITING, group=TGRP-ConcurrentDeleteAndCreateCollectionTest]         at java.lang.Thread.sleep(Native Method)         at org.apache.http.impl.client.IdleConnectionEvictor$1.run(IdleConnectionEvictor.java:66)         at java.lang.Thread.run(Thread.java:745)    3) Thread[id=83771, name=Connection evictor, state=TIMED_WAITING, group=TGRP-ConcurrentDeleteAndCreateCollectionTest]         at java.lang.Thread.sleep(Native Method)         at org.apache.http.impl.client.IdleConnectionEvictor$1.run(IdleConnectionEvictor.java:66)         at java.lang.Thread.run(Thread.java:745)    4) Thread[id=83751, name=Connection evictor, state=TIMED_WAITING, group=TGRP-ConcurrentDeleteAndCreateCollectionTest]         at java.lang.Thread.sleep(Native Method)         at org.apache.http.impl.client.IdleConnectionEvictor$1.run(IdleConnectionEvictor.java:66)         at java.lang.Thread.run(Thread.java:745)    5) Thread[id=83726, name=Connection evictor, state=TIMED_WAITING, group=TGRP-ConcurrentDeleteAndCreateCollectionTest]         at java.lang.Thread.sleep(Native Method)         at org.apache.http.impl.client.IdleConnectionEvictor$1.run(IdleConnectionEvictor.java:66)         at java.lang.Thread.run(Thread.java:745)    6) Thread[id=83746, name=Connection evictor, state=TIMED_WAITING, group=TGRP-ConcurrentDeleteAndCreateCollectionTest]         at java.lang.Thread.sleep(Native Method)         at org.apache.http.impl.client.IdleConnectionEvictor$1.run(IdleConnectionEvictor.java:66)         at java.lang.Thread.run(Thread.java:745)    7) Thread[id=83736, name=Connection evictor, state=TIMED_WAITING, group=TGRP-ConcurrentDeleteAndCreateCollectionTest]         at java.lang.Thread.sleep(Native Method)         at org.apache.http.impl.client.IdleConnectionEvictor$1.run(IdleConnectionEvictor.java:66)         at java.lang.Thread.run(Thread.java:745)    8) Thread[id=83731, name=Connection evictor, state=TIMED_WAITING, group=TGRP-ConcurrentDeleteAndCreateCollectionTest]         at java.lang.Thread.sleep(Native Method)         at org.apache.http.impl.client.IdleConnectionEvictor$1.run(IdleConnectionEvictor.java:66)         at java.lang.Thread.run(Thread.java:745)    9) Thread[id=83761, name=Connection evictor, state=TIMED_WAITING, group=TGRP-ConcurrentDeleteAndCreateCollectionTest]         at java.lang.Thread.sleep(Native Method)         at org.apache.http.impl.client.IdleConnectionEvictor$1.run(IdleConnectionEvictor.java:66)         at java.lang.Thread.run(Thread.java:745)   10) Thread[id=83741, name=Connection evictor, state=TIMED_WAITING, group=TGRP-ConcurrentDeleteAndCreateCollectionTest]         at java.lang.Thread.sleep(Native Method)         at org.apache.http.impl.client.IdleConnectionEvictor$1.run(IdleConnectionEvictor.java:66)         at java.lang.Thread.run(Thread.java:745)

Stack Trace:
com.carrotsearch.randomizedtesting.ThreadLeakError: 10 threads leaked from SUITE scope at org.apache.solr.cloud.ConcurrentDeleteAndCreateCollectionTest: 
   1) Thread[id=83756, name=Connection evictor, state=TIMED_WAITING, group=TGRP-ConcurrentDeleteAndCreateCollectionTest]
        at java.lang.Thread.sleep(Native Method)
        at org.apache.http.impl.client.IdleConnectionEvictor$1.run(IdleConnectionEvictor.java:66)
        at java.lang.Thread.run(Thread.java:745)
   2) Thread[id=83766, name=Connection evictor, state=TIMED_WAITING, group=TGRP-ConcurrentDeleteAndCreateCollectionTest]
        at java.lang.Thread.sleep(Native Method)
        at org.apache.http.impl.client.IdleConnectionEvictor$1.run(IdleConnectionEvictor.java:66)
        at java.lang.Thread.run(Thread.java:745)
   3) Thread[id=83771, name=Connection evictor, state=TIMED_WAITING, group=TGRP-ConcurrentDeleteAndCreateCollectionTest]
        at java.lang.Thread.sleep(Native Method)
        at org.apache.http.impl.client.IdleConnectionEvictor$1.run(IdleConnectionEvictor.java:66)
        at java.lang.Thread.run(Thread.java:745)
   4) Thread[id=83751, name=Connection evictor, state=TIMED_WAITING, group=TGRP-ConcurrentDeleteAndCreateCollectionTest]
        at java.lang.Thread.sleep(Native Method)
        at org.apache.http.impl.client.IdleConnectionEvictor$1.run(IdleConnectionEvictor.java:66)
        at java.lang.Thread.run(Thread.java:745)
   5) Thread[id=83726, name=Connection evictor, state=TIMED_WAITING, group=TGRP-ConcurrentDeleteAndCreateCollectionTest]
        at java.lang.Thread.sleep(Native Method)
        at org.apache.http.impl.client.IdleConnectionEvictor$1.run(IdleConnectionEvictor.java:66)
        at java.lang.Thread.run(Thread.java:745)
   6) Thread[id=83746, name=Connection evictor, state=TIMED_WAITING, group=TGRP-ConcurrentDeleteAndCreateCollectionTest]
        at java.lang.Thread.sleep(Native Method)
        at org.apache.http.impl.client.IdleConnectionEvictor$1.run(IdleConnectionEvictor.java:66)
        at java.lang.Thread.run(Thread.java:745)
   7) Thread[id=83736, name=Connection evictor, state=TIMED_WAITING, group=TGRP-ConcurrentDeleteAndCreateCollectionTest]
        at java.lang.Thread.sleep(Native Method)
        at org.apache.http.impl.client.IdleConnectionEvictor$1.run(IdleConnectionEvictor.java:66)
        at java.lang.Thread.run(Thread.java:745)
   8) Thread[id=83731, name=Connection evictor, state=TIMED_WAITING, group=TGRP-ConcurrentDeleteAndCreateCollectionTest]
        at java.lang.Thread.sleep(Native Method)
        at org.apache.http.impl.client.IdleConnectionEvictor$1.run(IdleConnectionEvictor.java:66)
        at java.lang.Thread.run(Thread.java:745)
   9) Thread[id=83761, name=Connection evictor, state=TIMED_WAITING, group=TGRP-ConcurrentDeleteAndCreateCollectionTest]
        at java.lang.Thread.sleep(Native Method)
        at org.apache.http.impl.client.IdleConnectionEvictor$1.run(IdleConnectionEvictor.java:66)
        at java.lang.Thread.run(Thread.java:745)
  10) Thread[id=83741, name=Connection evictor, state=TIMED_WAITING, group=TGRP-ConcurrentDeleteAndCreateCollectionTest]
        at java.lang.Thread.sleep(Native Method)
        at org.apache.http.impl.client.IdleConnectionEvictor$1.run(IdleConnectionEvictor.java:66)
        at java.lang.Thread.run(Thread.java:745)
	at __randomizedtesting.SeedInfo.seed([87BAB0DFEB3E19FB]:0)




Build Log:
[...truncated 11470 lines...]
   [junit4] Suite: org.apache.solr.cloud.CdcrReplicationHandlerTest
   [junit4]   2> Creating dataDir: /x1/jenkins/jenkins-slave/workspace/Lucene-Solr-NightlyTests-master/solr/build/solr-core/test/J1/temp/solr.cloud.CdcrReplicationHandlerTest_87BAB0DFEB3E19FB-001/init-core-data-001
   [junit4]   2> 501344 INFO  (SUITE-CdcrReplicationHandlerTest-seed#[87BAB0DFEB3E19FB]-worker) [    ] o.a.s.SolrTestCaseJ4 Randomized ssl (false) and clientAuth (false)
   [junit4]   2> 501345 INFO  (SUITE-CdcrReplicationHandlerTest-seed#[87BAB0DFEB3E19FB]-worker) [    ] o.a.s.BaseDistributedSearchTestCase Setting hostContext system property: /
   [junit4]   2> 501395 INFO  (TEST-CdcrReplicationHandlerTest.testPartialReplication-seed#[87BAB0DFEB3E19FB]) [    ] o.a.s.c.ZkTestServer STARTING ZK TEST SERVER
   [junit4]   2> 501403 INFO  (Thread-12161) [    ] o.a.s.c.ZkTestServer client port:0.0.0.0/0.0.0.0:0
   [junit4]   2> 501403 INFO  (Thread-12161) [    ] o.a.s.c.ZkTestServer Starting server
   [junit4]   2> 501503 INFO  (TEST-CdcrReplicationHandlerTest.testPartialReplication-seed#[87BAB0DFEB3E19FB]) [    ] o.a.s.c.ZkTestServer start zk server on port:53843
   [junit4]   2> 501503 INFO  (TEST-CdcrReplicationHandlerTest.testPartialReplication-seed#[87BAB0DFEB3E19FB]) [    ] o.a.s.c.c.SolrZkClient Using default ZkCredentialsProvider
   [junit4]   2> 501515 INFO  (TEST-CdcrReplicationHandlerTest.testPartialReplication-seed#[87BAB0DFEB3E19FB]) [    ] o.a.s.c.c.ConnectionManager Waiting for client to connect to ZooKeeper
   [junit4]   2> 501520 INFO  (zkCallback-718-thread-1) [    ] o.a.s.c.c.ConnectionManager Watcher org.apache.solr.common.cloud.ConnectionManager@7f3a329b name:ZooKeeperConnection Watcher:127.0.0.1:53843 got event WatchedEvent state:SyncConnected type:None path:null path:null type:None
   [junit4]   2> 501520 INFO  (TEST-CdcrReplicationHandlerTest.testPartialReplication-seed#[87BAB0DFEB3E19FB]) [    ] o.a.s.c.c.ConnectionManager Client is connected to ZooKeeper
   [junit4]   2> 501520 INFO  (TEST-CdcrReplicationHandlerTest.testPartialReplication-seed#[87BAB0DFEB3E19FB]) [    ] o.a.s.c.c.SolrZkClie

[...truncated too long message...]

urrent.Executors$RunnableAdapter.call(Executors.java:511)
   [junit4]   2> 	at java.util.concurrent.FutureTask.run(FutureTask.java:266)
   [junit4]   2> 	at org.apache.solr.common.util.ExecutorUtil$MDCAwareThreadPoolExecutor.lambda$execute$0(ExecutorUtil.java:229)
   [junit4]   2> 	at java.util.concurrent.ThreadPoolExecutor.runWorker(ThreadPoolExecutor.java:1142)
   [junit4]   2> 	at java.util.concurrent.ThreadPoolExecutor$Worker.run(ThreadPoolExecutor.java:617)
   [junit4]   2> 	at java.lang.Thread.run(Thread.java:745)
   [junit4]   2> 
   [junit4]   2> 11969071 INFO  (recoveryExecutor-30702-thread-15-processing-n:127.0.0.1:50736_ x:awholynewcollection_4_shard2_replica4 s:shard2 c:awholynewcollection_4 r:core_node4) [n:127.0.0.1:50736_ c:awholynewcollection_4 s:shard2 r:core_node4 x:awholynewcollection_4_shard2_replica4] o.a.s.c.RecoveryStrategy Replay not started, or was not successful... still buffering updates.
   [junit4]   2> 11957294 INFO  (zkCallback-30755-thread-15-processing-n:127.0.0.1:43270_-EventThread) [n:127.0.0.1:43270_    ] o.a.s.c.c.ConnectionManager Watcher org.apache.solr.common.cloud.ConnectionManager@4ef5cbc8 name:ZooKeeperConnection Watcher:127.0.0.1:59405/solr got event WatchedEvent state:Disconnected type:None path:null path:null type:None
   [junit4]   2> NOTE: test params are: codec=Asserting(Lucene62): {other_tl1=FST50, range_facet_l_dv=BlockTreeOrds(blocksize=128), _version_=FST50, multiDefault=FSTOrd50, a_t=FSTOrd50, intDefault=FST50, a_i1=FSTOrd50, id=BlockTreeOrds(blocksize=128), range_facet_i_dv=FSTOrd50, text=Lucene50(blocksize=128), range_facet_l=FSTOrd50, timestamp=FSTOrd50}, docValues:{range_facet_l_dv=DocValuesFormat(name=Direct), range_facet_i_dv=DocValuesFormat(name=Memory), timestamp=DocValuesFormat(name=Memory)}, maxPointsInLeafNode=1280, maxMBSortInHeap=7.573998106485543, sim=ClassicSimilarity, locale=sr-Latn-BA, timezone=America/Yakutat
   [junit4]   2> 11969072 ERROR (recoveryExecutor-30702-thread-15-processing-n:127.0.0.1:50736_ x:awholynewcollection_4_shard2_replica4 s:shard2 c:awholynewcollection_4 r:core_node4) [n:127.0.0.1:50736_ c:awholynewcollection_4 s:shard2 r:core_node4 x:awholynewcollection_4_shard2_replica4] o.a.s.c.RecoveryStrategy Recovery failed - trying again... (7)
   [junit4]   2> 11969072 INFO  (recoveryExecutor-30702-thread-15-processing-n:127.0.0.1:50736_ x:awholynewcollection_4_shard2_replica4 s:shard2 c:awholynewcollection_4 r:core_node4) [n:127.0.0.1:50736_ c:awholynewcollection_4 s:shard2 r:core_node4 x:awholynewcollection_4_shard2_replica4] o.a.s.c.RecoveryStrategy Wait [12.0] seconds before trying to recover again (attempt=8)
   [junit4]   2> NOTE: Linux 3.13.0-85-generic amd64/Oracle Corporation 1.8.0_74 (64-bit)/cpus=4,threads=555,free=45245752,total=489684992
   [junit4]   2> NOTE: All tests run in this JVM: [TestExactStatsCache, BadComponentTest, TestSimpleQParserPlugin, CoreAdminRequestStatusTest, TestReqParamsAPI, TestPivotHelperCode, LukeRequestHandlerTest, TestRuleBasedAuthorizationPlugin, TestSuggestSpellingConverter, IgnoreCommitOptimizeUpdateProcessorFactoryTest, TestSweetSpotSimilarityFactory, ClusterStateTest, SuggesterWFSTTest, TestAddFieldRealTimeGet, SimpleCollectionCreateDeleteTest, HdfsThreadLeakTest, EnumFieldTest, TestCloudManagedSchema, HighlighterMaxOffsetTest, RequestHandlersTest, OverseerTest, TestAuthenticationFramework, TestCryptoKeys, SampleTest, AssignTest, TestJettySolrRunner, TestReversedWildcardFilterFactory, OverseerStatusTest, TermVectorComponentDistributedTest, PluginInfoTest, TestCloudInspectUtil, TestXIncludeConfig, TestPostingsSolrHighlighter, MergeStrategyTest, TestConfigSets, TestElisionMultitermQuery, TestIndexingPerformance, DeleteShardTest, DistributedExpandComponentTest, StatelessScriptUpdateProcessorFactoryTest, DateMathParserTest, CollectionsAPISolrJTest, TestMacros, FieldMutatingUpdateProcessorTest, LeaderElectionTest, DistributedVersionInfoTest, TestComplexPhraseQParserPlugin, TestWriterPerf, ClassificationUpdateProcessorFactoryTest, QueryParsingTest, PrimitiveFieldTypeTest, FacetPivotSmallTest, DirectUpdateHandlerTest, DocValuesMultiTest, ChangedSchemaMergeTest, SparseHLLTest, TestScoreJoinQPScore, TestDefaultStatsCache, TestSchemaSimilarityResource, TestSchemaManager, TestSearchPerf, UpdateParamsTest, FullHLLTest, HardAutoCommitTest, RegexBoostProcessorTest, SuggesterTest, AnalyticsMergeStrategyTest, TestFilteredDocIdSet, LeaderFailoverAfterPartitionTest, NoCacheHeaderTest, TestCSVResponseWriter, TestPHPSerializedResponseWriter, TestConfigOverlay, BaseCdcrDistributedZkTest, HdfsRecoveryZkTest, TestRandomCollapseQParserPlugin, SuggesterTSTTest, DistanceUnitsTest, BigEndianAscendingWordSerializerTest, TestSort, TestCollationField, TestReloadAndDeleteDocs, CollectionStateFormat2Test, TestManagedStopFilterFactory, TestDistributedMissingSort, BlockJoinFacetSimpleTest, TestFileDictionaryLookup, SearchHandlerTest, TestGraphMLResponseWriter, XmlUpdateRequestHandlerTest, TestJmxIntegration, TestTrieFacet, TestSolrFieldCacheMBean, BadIndexSchemaTest, TestFuzzyAnalyzedSuggestions, BasicDistributedZkTest, ChaosMonkeySafeLeaderTest, BasicDistributedZk2Test, UnloadDistributedZkTest, OpenCloseCoreStressTest, LeaderElectionIntegrationTest, ShardRoutingTest, BasicZkTest, RecoveryZkTest, FullSolrCloudDistribCmdsTest, TestReplicationHandler, ClusterStateUpdateTest, TestRandomFaceting, ZkSolrClientTest, TestZkChroot, AutoCommitTest, TestRecovery, TestHashPartitioner, TestRealTimeGet, TestStressVersions, TestSolr4Spatial, SpellCheckComponentTest, TestGroupingSearch, TestIndexSearcher, HighlighterTest, SoftAutoCommitTest, SpellCheckCollatorTest, SolrRequestParserTest, TestStressLucene, SolrCoreCheckLockOnStartupTest, TestWordDelimiterFilterFactory, DirectUpdateHandlerOptimizeTest, SortByFunctionTest, SolrInfoMBeanTest, TestSurroundQueryParser, TestQueryUtils, DocumentAnalysisRequestHandlerTest, DocumentBuilderTest, PathHierarchyTokenizerFactoryTest, FieldAnalysisRequestHandlerTest, TestArbitraryIndexDir, BinaryUpdateRequestHandlerTest, TestComponentsName, TestLFUCache, EchoParamsTest, TestDFRSimilarityFactory, TestPerFieldSimilarity, TestFastWriter, TimeZoneUtilsTest, ResourceLoaderTest, ScriptEngineTest, PreAnalyzedFieldTest, TestSystemIdResolver, PrimUtilsTest, DateFieldTest, DOMUtilTest, TestSolrJ, TestLRUCache, TestUtils, SliceStateTest, FileUtilsTest, CircularListTest, DistributedMLTComponentTest, TestRTGBase, CursorPagingTest, SolrTestCaseJ4Test, TestCrossCoreJoin, TestCursorMarkWithoutUniqueKey, TestTolerantSearch, TestEmbeddedSolrServerConstructors, CdcrRequestHandlerTest, CollectionsAPIAsyncDistributedZkTest, ConnectionManagerTest, CustomCollectionTest, DeleteStatusTest, DistribDocExpirationUpdateProcessorTest, LeaderInitiatedRecoveryOnCommitTest, LeaderInitiatedRecoveryOnShardRestartTest, MultiThreadedOCPTest, RemoteQueryErrorTest, ReplicationFactorTest, RestartWhileUpdatingTest, ShardSplitTest, SolrCloudExampleTest, TestCloudDeleteByQuery, TestCollectionAPI, TestDownShardTolerantSearch, TestExclusionRuleCollectionAccess, TestMiniSolrCloudCluster, TestRandomRequestDistribution, TestReplicaProperties, TestSSLRandomization, TestSizeLimitedDistributedMap, TestStressLiveNodes, VMParamsZkACLAndCredentialsProvidersTest, HdfsBasicDistributedZk2Test, HdfsCollectionsAPIDistributedZkTest]
   [junit4]   2> 11969072 INFO  (zkCallback-30755-thread-15-processing-n:127.0.0.1:43270_-EventThread) [n:127.0.0.1:43270_    ] o.a.s.c.c.ConnectionManager zkClient has disconnected
   [junit4]   2> 11969071 WARN  (zkCallback-30691-thread-16-processing-n:127.0.0.1:51568_-EventThread) [n:127.0.0.1:51568_    ] o.a.s.c.RecoveryStrategy Stopping recovery for core=[nodes_used_collection_shard2_replica2] coreNodeName=[core_node3]
   [junit4] ERROR   0.00s J2 | HdfsCollectionsAPIDistributedZkTest (suite) <<<
   [junit4]    > Throwable #1: java.lang.OutOfMemoryError: Java heap space
   [junit4] Completed [597/597 (7!)] on J2 in 7596.35s, 1 test, 1 error <<< FAILURES!

[...truncated 2 lines...]
   [junit4] JVM J2: stdout was not empty, see: /x1/jenkins/jenkins-slave/workspace/Lucene-Solr-NightlyTests-master/solr/build/solr-core/test/temp/junit4-J2-20160516_041926_880.sysout
   [junit4] >>> JVM J2 emitted unexpected output (verbatim) ----
   [junit4] java.lang.OutOfMemoryError: Java heap space
   [junit4] Dumping heap to /x1/jenkins/jenkins-slave/workspace/Lucene-Solr-NightlyTests-master/heapdumps/java_pid7657.hprof ...
   [junit4] Heap dump file created [653223653 bytes in 3.343 secs]
   [junit4] <<< JVM J2: EOF ----

[...truncated 17 lines...]
BUILD FAILED
/x1/jenkins/jenkins-slave/workspace/Lucene-Solr-NightlyTests-master/build.xml:747: The following error occurred while executing this line:
/x1/jenkins/jenkins-slave/workspace/Lucene-Solr-NightlyTests-master/build.xml:684: The following error occurred while executing this line:
/x1/jenkins/jenkins-slave/workspace/Lucene-Solr-NightlyTests-master/build.xml:59: The following error occurred while executing this line:
/x1/jenkins/jenkins-slave/workspace/Lucene-Solr-NightlyTests-master/solr/build.xml:233: The following error occurred while executing this line:
/x1/jenkins/jenkins-slave/workspace/Lucene-Solr-NightlyTests-master/solr/common-build.xml:529: The following error occurred while executing this line:
/x1/jenkins/jenkins-slave/workspace/Lucene-Solr-NightlyTests-master/lucene/common-build.xml:1457: The following error occurred while executing this line:
/x1/jenkins/jenkins-slave/workspace/Lucene-Solr-NightlyTests-master/lucene/common-build.xml:1014: There were test failures: 597 suites (10 ignored), 2413 tests, 16 suite-level errors, 1 error, 1 failure, 249 ignored (17 assumptions) [seed: 87BAB0DFEB3E19FB]

Total time: 390 minutes 7 seconds
Build step 'Invoke Ant' marked build as failure
Archiving artifacts
No prior successful build to compare, so performing full copy of artifacts
Recording test results
Email was triggered for: Failure - Any
Sending email for trigger: Failure - Any




Mime
View raw message