lucene-dev mailing list archives

Site index · List index
Message view « Date » · « Thread »
Top « Date » · « Thread »
From Policeman Jenkins Server <jenk...@thetaphi.de>
Subject [JENKINS] Lucene-Solr-master-Windows (64bit/jdk1.8.0_92) - Build # 5867 - Still Failing!
Date Thu, 26 May 2016 00:36:36 GMT
Build: http://jenkins.thetaphi.de/job/Lucene-Solr-master-Windows/5867/
Java: 64bit/jdk1.8.0_92 -XX:+UseCompressedOops -XX:+UseSerialGC

1 tests failed.
FAILED:  org.apache.lucene.store.TestRAFDirectory.testPendingDeletions

Error Message:
access denied ("java.io.FilePermission" "C:\Users\jenkins\workspace\Lucene-Solr-master-Windows\lucene\build\misc\test\J0\temp\lucene.store.TestRAFDirectory_712FF8EC1F85FA28-001\tempDir-006\nul"
"write")

Stack Trace:
java.security.AccessControlException: access denied ("java.io.FilePermission" "C:\Users\jenkins\workspace\Lucene-Solr-master-Windows\lucene\build\misc\test\J0\temp\lucene.store.TestRAFDirectory_712FF8EC1F85FA28-001\tempDir-006\nul"
"write")
	at __randomizedtesting.SeedInfo.seed([712FF8EC1F85FA28:EA338F9467E3F68A]:0)
	at java.security.AccessControlContext.checkPermission(AccessControlContext.java:472)
	at java.security.AccessController.checkPermission(AccessController.java:884)
	at java.lang.SecurityManager.checkPermission(SecurityManager.java:549)
	at java.lang.SecurityManager.checkWrite(SecurityManager.java:979)
	at sun.nio.fs.WindowsChannelFactory.open(WindowsChannelFactory.java:295)
	at sun.nio.fs.WindowsChannelFactory.newFileChannel(WindowsChannelFactory.java:162)
	at sun.nio.fs.WindowsFileSystemProvider.newByteChannel(WindowsFileSystemProvider.java:225)
	at java.nio.file.spi.FileSystemProvider.newOutputStream(FileSystemProvider.java:434)
	at org.apache.lucene.mockfile.FilterFileSystemProvider.newOutputStream(FilterFileSystemProvider.java:197)
	at org.apache.lucene.mockfile.FilterFileSystemProvider.newOutputStream(FilterFileSystemProvider.java:197)
	at org.apache.lucene.mockfile.HandleTrackingFS.newOutputStream(HandleTrackingFS.java:129)
	at org.apache.lucene.mockfile.HandleTrackingFS.newOutputStream(HandleTrackingFS.java:129)
	at org.apache.lucene.mockfile.FilterFileSystemProvider.newOutputStream(FilterFileSystemProvider.java:197)
	at org.apache.lucene.mockfile.FilterFileSystemProvider.newOutputStream(FilterFileSystemProvider.java:197)
	at java.nio.file.Files.newOutputStream(Files.java:216)
	at org.apache.lucene.store.FSDirectory$FSIndexOutput.<init>(FSDirectory.java:408)
	at org.apache.lucene.store.FSDirectory$FSIndexOutput.<init>(FSDirectory.java:404)
	at org.apache.lucene.store.FSDirectory.createOutput(FSDirectory.java:253)
	at org.apache.lucene.store.BaseDirectoryTestCase.testPendingDeletions(BaseDirectoryTestCase.java:1215)
	at sun.reflect.NativeMethodAccessorImpl.invoke0(Native Method)
	at sun.reflect.NativeMethodAccessorImpl.invoke(NativeMethodAccessorImpl.java:62)
	at sun.reflect.DelegatingMethodAccessorImpl.invoke(DelegatingMethodAccessorImpl.java:43)
	at java.lang.reflect.Method.invoke(Method.java:498)
	at com.carrotsearch.randomizedtesting.RandomizedRunner.invoke(RandomizedRunner.java:1764)
	at com.carrotsearch.randomizedtesting.RandomizedRunner$8.evaluate(RandomizedRunner.java:871)
	at com.carrotsearch.randomizedtesting.RandomizedRunner$9.evaluate(RandomizedRunner.java:907)
	at com.carrotsearch.randomizedtesting.RandomizedRunner$10.evaluate(RandomizedRunner.java:921)
	at org.apache.lucene.util.TestRuleSetupTeardownChained$1.evaluate(TestRuleSetupTeardownChained.java:49)
	at org.apache.lucene.util.AbstractBeforeAfterRule$1.evaluate(AbstractBeforeAfterRule.java:45)
	at org.apache.lucene.util.TestRuleThreadAndTestName$1.evaluate(TestRuleThreadAndTestName.java:48)
	at org.apache.lucene.util.TestRuleIgnoreAfterMaxFailures$1.evaluate(TestRuleIgnoreAfterMaxFailures.java:64)
	at org.apache.lucene.util.TestRuleMarkFailure$1.evaluate(TestRuleMarkFailure.java:47)
	at com.carrotsearch.randomizedtesting.rules.StatementAdapter.evaluate(StatementAdapter.java:36)
	at com.carrotsearch.randomizedtesting.ThreadLeakControl$StatementRunner.run(ThreadLeakControl.java:367)
	at com.carrotsearch.randomizedtesting.ThreadLeakControl.forkTimeoutingTask(ThreadLeakControl.java:809)
	at com.carrotsearch.randomizedtesting.ThreadLeakControl$3.evaluate(ThreadLeakControl.java:460)
	at com.carrotsearch.randomizedtesting.RandomizedRunner.runSingleTest(RandomizedRunner.java:880)
	at com.carrotsearch.randomizedtesting.RandomizedRunner$5.evaluate(RandomizedRunner.java:781)
	at com.carrotsearch.randomizedtesting.RandomizedRunner$6.evaluate(RandomizedRunner.java:816)
	at com.carrotsearch.randomizedtesting.RandomizedRunner$7.evaluate(RandomizedRunner.java:827)
	at org.apache.lucene.util.AbstractBeforeAfterRule$1.evaluate(AbstractBeforeAfterRule.java:45)
	at com.carrotsearch.randomizedtesting.rules.StatementAdapter.evaluate(StatementAdapter.java:36)
	at org.apache.lucene.util.TestRuleStoreClassName$1.evaluate(TestRuleStoreClassName.java:41)
	at com.carrotsearch.randomizedtesting.rules.NoShadowingOrOverridesOnMethodsRule$1.evaluate(NoShadowingOrOverridesOnMethodsRule.java:40)
	at com.carrotsearch.randomizedtesting.rules.NoShadowingOrOverridesOnMethodsRule$1.evaluate(NoShadowingOrOverridesOnMethodsRule.java:40)
	at com.carrotsearch.randomizedtesting.rules.StatementAdapter.evaluate(StatementAdapter.java:36)
	at com.carrotsearch.randomizedtesting.rules.StatementAdapter.evaluate(StatementAdapter.java:36)
	at com.carrotsearch.randomizedtesting.rules.StatementAdapter.evaluate(StatementAdapter.java:36)
	at org.apache.lucene.util.TestRuleAssertionsRequired$1.evaluate(TestRuleAssertionsRequired.java:53)
	at org.apache.lucene.util.TestRuleMarkFailure$1.evaluate(TestRuleMarkFailure.java:47)
	at org.apache.lucene.util.TestRuleIgnoreAfterMaxFailures$1.evaluate(TestRuleIgnoreAfterMaxFailures.java:64)
	at org.apache.lucene.util.TestRuleIgnoreTestSuites$1.evaluate(TestRuleIgnoreTestSuites.java:54)
	at com.carrotsearch.randomizedtesting.rules.StatementAdapter.evaluate(StatementAdapter.java:36)
	at com.carrotsearch.randomizedtesting.ThreadLeakControl$StatementRunner.run(ThreadLeakControl.java:367)
	at java.lang.Thread.run(Thread.java:745)




Build Log:
[...truncated 7467 lines...]
   [junit4] Suite: org.apache.lucene.store.TestRAFDirectory
   [junit4]   2> NOTE: reproduce with: ant test  -Dtestcase=TestRAFDirectory -Dtests.method=testPendingDeletions
-Dtests.seed=712FF8EC1F85FA28 -Dtests.slow=true -Dtests.locale=es-US -Dtests.timezone=Africa/Ouagadougou
-Dtests.asserts=true -Dtests.file.encoding=UTF-8
   [junit4] ERROR   0.17s J0 | TestRAFDirectory.testPendingDeletions <<<
   [junit4]    > Throwable #1: java.security.AccessControlException: access denied ("java.io.FilePermission"
"C:\Users\jenkins\workspace\Lucene-Solr-master-Windows\lucene\build\misc\test\J0\temp\lucene.store.TestRAFDirectory_712FF8EC1F85FA28-001\tempDir-006\nul"
"write")
   [junit4]    > 	at __randomizedtesting.SeedInfo.seed([712FF8EC1F85FA28:EA338F9467E3F68A]:0)
   [junit4]    > 	at java.security.AccessControlContext.checkPermission(AccessControlContext.java:472)
   [junit4]    > 	at java.security.AccessController.checkPermission(AccessController.java:884)
   [junit4]    > 	at java.lang.SecurityManager.checkPermission(SecurityManager.java:549)
   [junit4]    > 	at java.lang.SecurityManager.checkWrite(SecurityManager.java:979)
   [junit4]    > 	at sun.nio.fs.WindowsChannelFactory.open(WindowsChannelFactory.java:295)
   [junit4]    > 	at sun.nio.fs.WindowsChannelFactory.newFileChannel(WindowsChannelFactory.java:162)
   [junit4]    > 	at sun.nio.fs.WindowsFileSystemProvider.newByteChannel(WindowsFileSystemProvider.java:225)
   [junit4]    > 	at java.nio.file.spi.FileSystemProvider.newOutputStream(FileSystemProvider.java:434)
   [junit4]    > 	at org.apache.lucene.mockfile.FilterFileSystemProvider.newOutputStream(FilterFileSystemProvider.java:197)
   [junit4]    > 	at org.apache.lucene.mockfile.FilterFileSystemProvider.newOutputStream(FilterFileSystemProvider.java:197)
   [junit4]    > 	at org.apache.lucene.mockfile.HandleTrackingFS.newOutputStream(HandleTrackingFS.java:129)
   [junit4]    > 	at org.apache.lucene.mockfile.HandleTrackingFS.newOutputStream(HandleTrackingFS.java:129)
   [junit4]    > 	at org.apache.lucene.mockfile.FilterFileSystemProvider.newOutputStream(FilterFileSystemProvider.java:197)
   [junit4]    > 	at org.apache.lucene.mockfile.FilterFileSystemProvider.newOutputStream(FilterFileSystemProvider.java:197)
   [junit4]    > 	at java.nio.file.Files.newOutputStream(Files.java:216)
   [junit4]    > 	at org.apache.lucene.store.FSDirectory$FSIndexOutput.<init>(FSDirectory.java:408)
   [junit4]    > 	at org.apache.lucene.store.FSDirectory$FSIndexOutput.<init>(FSDirectory.java:404)
   [junit4]    > 	at org.apache.lucene.store.FSDirectory.createOutput(FSDirectory.java:253)
   [junit4]    > 	at org.apache.lucene.store.BaseDirectoryTestCase.testPendingDeletions(BaseDirectoryTestCase.java:1215)
   [junit4]    > 	at java.lang.Thread.run(Thread.java:745)
   [junit4]   2> NOTE: leaving temporary files on disk at: C:\Users\jenkins\workspace\Lucene-Solr-master-Windows\lucene\build\misc\test\J0\temp\lucene.store.TestRAFDirectory_712FF8EC1F85FA28-001
   [junit4]   2> NOTE: test params are: codec=Asserting(Lucene62): {}, docValues:{}, maxPointsInLeafNode=331,
maxMBSortInHeap=7.234830074930294, sim=ClassicSimilarity, locale=es-US, timezone=Africa/Ouagadougou
   [junit4]   2> NOTE: Windows 10 10.0 amd64/Oracle Corporation 1.8.0_92 (64-bit)/cpus=3,threads=1,free=40821984,total=64880640
   [junit4]   2> NOTE: All tests run in this JVM: [TestLazyDocument, TestRAFDirectory]
   [junit4] Completed [3/9 (1!)] on J0 in 3.15s, 45 tests, 1 error <<< FAILURES!

[...truncated 28 lines...]
BUILD FAILED
C:\Users\jenkins\workspace\Lucene-Solr-master-Windows\build.xml:740: The following error occurred
while executing this line:
C:\Users\jenkins\workspace\Lucene-Solr-master-Windows\build.xml:684: The following error occurred
while executing this line:
C:\Users\jenkins\workspace\Lucene-Solr-master-Windows\build.xml:59: The following error occurred
while executing this line:
C:\Users\jenkins\workspace\Lucene-Solr-master-Windows\lucene\build.xml:476: The following
error occurred while executing this line:
C:\Users\jenkins\workspace\Lucene-Solr-master-Windows\lucene\common-build.xml:2161: The following
error occurred while executing this line:
C:\Users\jenkins\workspace\Lucene-Solr-master-Windows\lucene\module-build.xml:58: The following
error occurred while executing this line:
C:\Users\jenkins\workspace\Lucene-Solr-master-Windows\lucene\common-build.xml:1427: The following
error occurred while executing this line:
C:\Users\jenkins\workspace\Lucene-Solr-master-Windows\lucene\common-build.xml:984: There were
test failures: 9 suites, 69 tests, 1 error [seed: 712FF8EC1F85FA28]

Total time: 17 minutes 20 seconds
Build step 'Invoke Ant' marked build as failure
Archiving artifacts
[WARNINGS] Skipping publisher since build result is FAILURE
Recording test results
Email was triggered for: Failure - Any
Sending email for trigger: Failure - Any



Mime
View raw message