lucene-dev mailing list archives

Site index · List index
Message view « Date » · « Thread »
Top « Date » · « Thread »
From Policeman Jenkins Server <jenk...@thetaphi.de>
Subject [JENKINS] Lucene-Solr-6.x-Solaris (64bit/jdk1.8.0) - Build # 131 - Still Failing!
Date Sat, 14 May 2016 11:28:16 GMT
Build: http://jenkins.thetaphi.de/job/Lucene-Solr-6.x-Solaris/131/
Java: 64bit/jdk1.8.0 -XX:+UseCompressedOops -XX:+UseConcMarkSweepGC

2 tests failed.
FAILED:  org.apache.solr.cloud.overseer.ZkStateReaderTest.testStateFormatUpdateWithExplicitRefresh

Error Message:
java.util.concurrent.TimeoutException: Could not connect to ZooKeeper 127.0.0.1:46856 within 30000 ms

Stack Trace:
org.apache.solr.common.SolrException: java.util.concurrent.TimeoutException: Could not connect to ZooKeeper 127.0.0.1:46856 within 30000 ms
	at __randomizedtesting.SeedInfo.seed([A08BB5E852E6C714:BF31C41F828601D1]:0)
	at org.apache.solr.common.cloud.SolrZkClient.<init>(SolrZkClient.java:181)
	at org.apache.solr.common.cloud.SolrZkClient.<init>(SolrZkClient.java:115)
	at org.apache.solr.common.cloud.SolrZkClient.<init>(SolrZkClient.java:110)
	at org.apache.solr.common.cloud.SolrZkClient.<init>(SolrZkClient.java:97)
	at org.apache.solr.cloud.AbstractZkTestCase.tryCleanPath(AbstractZkTestCase.java:182)
	at org.apache.solr.cloud.AbstractZkTestCase.tryCleanSolrZkNode(AbstractZkTestCase.java:178)
	at org.apache.solr.cloud.overseer.ZkStateReaderTest.testStateFormatUpdate(ZkStateReaderTest.java:70)
	at org.apache.solr.cloud.overseer.ZkStateReaderTest.testStateFormatUpdateWithExplicitRefresh(ZkStateReaderTest.java:42)
	at sun.reflect.NativeMethodAccessorImpl.invoke0(Native Method)
	at sun.reflect.NativeMethodAccessorImpl.invoke(NativeMethodAccessorImpl.java:62)
	at sun.reflect.DelegatingMethodAccessorImpl.invoke(DelegatingMethodAccessorImpl.java:43)
	at java.lang.reflect.Method.invoke(Method.java:498)
	at com.carrotsearch.randomizedtesting.RandomizedRunner.invoke(RandomizedRunner.java:1764)
	at com.carrotsearch.randomizedtesting.RandomizedRunner$8.evaluate(RandomizedRunner.java:871)
	at com.carrotsearch.randomizedtesting.RandomizedRunner$9.evaluate(RandomizedRunner.java:907)
	at com.carrotsearch.randomizedtesting.RandomizedRunner$10.evaluate(RandomizedRunner.java:921)
	at com.carrotsearch.randomizedtesting.rules.SystemPropertiesRestoreRule$1.evaluate(SystemPropertiesRestoreRule.java:57)
	at org.apache.lucene.util.TestRuleSetupTeardownChained$1.evaluate(TestRuleSetupTeardownChained.java:49)
	at org.apache.lucene.util.AbstractBeforeAfterRule$1.evaluate(AbstractBeforeAfterRule.java:45)
	at org.apache.lucene.util.TestRuleThreadAndTestName$1.evaluate(TestRuleThreadAndTestName.java:48)
	at org.apache.lucene.util.TestRuleIgnoreAfterMaxFailures$1.evaluate(TestRuleIgnoreAfterMaxFailures.java:64)
	at org.apache.lucene.util.TestRuleMarkFailure$1.evaluate(TestRuleMarkFailure.java:47)
	at com.carrotsearch.randomizedtesting.rules.StatementAdapter.evaluate(StatementAdapter.java:36)
	at com.carrotsearch.randomizedtesting.ThreadLeakControl$StatementRunner.run(ThreadLeakControl.java:367)
	at com.carrotsearch.randomizedtesting.ThreadLeakControl.forkTimeoutingTask(ThreadLeakControl.java:809)
	at com.carrotsearch.randomizedtesting.ThreadLeakControl$3.evaluate(ThreadLeakControl.java:460)
	at com.carrotsearch.randomizedtesting.RandomizedRunner.runSingleTest(RandomizedRunner.java:880)
	at com.carrotsearch.randomizedtesting.RandomizedRunner$5.evaluate(RandomizedRunner.java:781)
	at com.carrotsearch.randomizedtesting.RandomizedRunner$6.evaluate(RandomizedRunner.java:816)
	at com.carrotsearch.randomizedtesting.RandomizedRunner$7.evaluate(RandomizedRunner.java:827)
	at com.carrotsearch.randomizedtesting.rules.StatementAdapter.evaluate(StatementAdapter.java:36)
	at com.carrotsearch.randomizedtesting.rules.SystemPropertiesRestoreRule$1.evaluate(SystemPropertiesRestoreRule.java:57)
	at org.apache.lucene.util.AbstractBeforeAfterRule$1.evaluate(AbstractBeforeAfterRule.java:45)
	at com.carrotsearch.randomizedtesting.rules.StatementAdapter.evaluate(StatementAdapter.java:36)
	at org.apache.lucene.util.TestRuleStoreClassName$1.evaluate(TestRuleStoreClassName.java:41)
	at com.carrotsearch.randomizedtesting.rules.NoShadowingOrOverridesOnMethodsRule$1.evaluate(NoShadowingOrOverridesOnMethodsRule.java:40)
	at com.carrotsearch.randomizedtesting.rules.NoShadowingOrOverridesOnMethodsRule$1.evaluate(NoShadowingOrOverridesOnMethodsRule.java:40)
	at com.carrotsearch.randomizedtesting.rules.StatementAdapter.evaluate(StatementAdapter.java:36)
	at com.carrotsearch.randomizedtesting.rules.StatementAdapter.evaluate(StatementAdapter.java:36)
	at com.carrotsearch.randomizedtesting.rules.StatementAdapter.evaluate(StatementAdapter.java:36)
	at org.apache.lucene.util.TestRuleAssertionsRequired$1.evaluate(TestRuleAssertionsRequired.java:53)
	at org.apache.lucene.util.TestRuleMarkFailure$1.evaluate(TestRuleMarkFailure.java:47)
	at org.apache.lucene.util.TestRuleIgnoreAfterMaxFailures$1.evaluate(TestRuleIgnoreAfterMaxFailures.java:64)
	at org.apache.lucene.util.TestRuleIgnoreTestSuites$1.evaluate(TestRuleIgnoreTestSuites.java:54)
	at com.carrotsearch.randomizedtesting.rules.StatementAdapter.evaluate(StatementAdapter.java:36)
	at com.carrotsearch.randomizedtesting.ThreadLeakControl$StatementRunner.run(ThreadLeakControl.java:367)
	at java.lang.Thread.run(Thread.java:745)
Caused by: java.util.concurrent.TimeoutException: Could not connect to ZooKeeper 127.0.0.1:46856 within 30000 ms
	at org.apache.solr.common.cloud.ConnectionManager.waitForConnected(ConnectionManager.java:228)
	at org.apache.solr.common.cloud.SolrZkClient.<init>(SolrZkClient.java:173)
	... 46 more


FAILED:  org.apache.solr.schema.TestManagedSchemaAPI.test

Error Message:
Error from server at http://127.0.0.1:49344/solr/testschemaapi_shard1_replica1: ERROR: [doc=2] unknown field 'myNewField1'

Stack Trace:
org.apache.solr.client.solrj.impl.CloudSolrClient$RouteException: Error from server at http://127.0.0.1:49344/solr/testschemaapi_shard1_replica1: ERROR: [doc=2] unknown field 'myNewField1'
	at __randomizedtesting.SeedInfo.seed([A08BB5E852E6C714:28DF8A32FC1AAAEC]:0)
	at org.apache.solr.client.solrj.impl.CloudSolrClient.directUpdate(CloudSolrClient.java:697)
	at org.apache.solr.client.solrj.impl.CloudSolrClient.sendRequest(CloudSolrClient.java:1109)
	at org.apache.solr.client.solrj.impl.CloudSolrClient.requestWithRetryOnStaleState(CloudSolrClient.java:998)
	at org.apache.solr.client.solrj.impl.CloudSolrClient.request(CloudSolrClient.java:934)
	at org.apache.solr.schema.TestManagedSchemaAPI.testAddFieldAndDocument(TestManagedSchemaAPI.java:86)
	at org.apache.solr.schema.TestManagedSchemaAPI.test(TestManagedSchemaAPI.java:55)
	at sun.reflect.NativeMethodAccessorImpl.invoke0(Native Method)
	at sun.reflect.NativeMethodAccessorImpl.invoke(NativeMethodAccessorImpl.java:62)
	at sun.reflect.DelegatingMethodAccessorImpl.invoke(DelegatingMethodAccessorImpl.java:43)
	at java.lang.reflect.Method.invoke(Method.java:498)
	at com.carrotsearch.randomizedtesting.RandomizedRunner.invoke(RandomizedRunner.java:1764)
	at com.carrotsearch.randomizedtesting.RandomizedRunner$8.evaluate(RandomizedRunner.java:871)
	at com.carrotsearch.randomizedtesting.RandomizedRunner$9.evaluate(RandomizedRunner.java:907)
	at com.carrotsearch.randomizedtesting.RandomizedRunner$10.evaluate(RandomizedRunner.java:921)
	at com.carrotsearch.randomizedtesting.rules.SystemPropertiesRestoreRule$1.evaluate(SystemPropertiesRestoreRule.java:57)
	at org.apache.lucene.util.TestRuleSetupTeardownChained$1.evaluate(TestRuleSetupTeardownChained.java:49)
	at org.apache.lucene.util.AbstractBeforeAfterRule$1.evaluate(AbstractBeforeAfterRule.java:45)
	at org.apache.lucene.util.TestRuleThreadAndTestName$1.evaluate(TestRuleThreadAndTestName.java:48)
	at org.apache.lucene.util.TestRuleIgnoreAfterMaxFailures$1.evaluate(TestRuleIgnoreAfterMaxFailures.java:64)
	at org.apache.lucene.util.TestRuleMarkFailure$1.evaluate(TestRuleMarkFailure.java:47)
	at com.carrotsearch.randomizedtesting.rules.StatementAdapter.evaluate(StatementAdapter.java:36)
	at com.carrotsearch.randomizedtesting.ThreadLeakControl$StatementRunner.run(ThreadLeakControl.java:367)
	at com.carrotsearch.randomizedtesting.ThreadLeakControl.forkTimeoutingTask(ThreadLeakControl.java:809)
	at com.carrotsearch.randomizedtesting.ThreadLeakControl$3.evaluate(ThreadLeakControl.java:460)
	at com.carrotsearch.randomizedtesting.RandomizedRunner.runSingleTest(RandomizedRunner.java:880)
	at com.carrotsearch.randomizedtesting.RandomizedRunner$5.evaluate(RandomizedRunner.java:781)
	at com.carrotsearch.randomizedtesting.RandomizedRunner$6.evaluate(RandomizedRunner.java:816)
	at com.carrotsearch.randomizedtesting.RandomizedRunner$7.evaluate(RandomizedRunner.java:827)
	at com.carrotsearch.randomizedtesting.rules.StatementAdapter.evaluate(StatementAdapter.java:36)
	at com.carrotsearch.randomizedtesting.rules.SystemPropertiesRestoreRule$1.evaluate(SystemPropertiesRestoreRule.java:57)
	at org.apache.lucene.util.AbstractBeforeAfterRule$1.evaluate(AbstractBeforeAfterRule.java:45)
	at com.carrotsearch.randomizedtesting.rules.StatementAdapter.evaluate(StatementAdapter.java:36)
	at org.apache.lucene.util.TestRuleStoreClassName$1.evaluate(TestRuleStoreClassName.java:41)
	at com.carrotsearch.randomizedtesting.rules.NoShadowingOrOverridesOnMethodsRule$1.evaluate(NoShadowingOrOverridesOnMethodsRule.java:40)
	at com.carrotsearch.randomizedtesting.rules.NoShadowingOrOverridesOnMethodsRule$1.evaluate(NoShadowingOrOverridesOnMethodsRule.java:40)
	at com.carrotsearch.randomizedtesting.rules.StatementAdapter.evaluate(StatementAdapter.java:36)
	at com.carrotsearch.randomizedtesting.rules.StatementAdapter.evaluate(StatementAdapter.java:36)
	at com.carrotsearch.randomizedtesting.rules.StatementAdapter.evaluate(StatementAdapter.java:36)
	at org.apache.lucene.util.TestRuleAssertionsRequired$1.evaluate(TestRuleAssertionsRequired.java:53)
	at org.apache.lucene.util.TestRuleMarkFailure$1.evaluate(TestRuleMarkFailure.java:47)
	at org.apache.lucene.util.TestRuleIgnoreAfterMaxFailures$1.evaluate(TestRuleIgnoreAfterMaxFailures.java:64)
	at org.apache.lucene.util.TestRuleIgnoreTestSuites$1.evaluate(TestRuleIgnoreTestSuites.java:54)
	at com.carrotsearch.randomizedtesting.rules.StatementAdapter.evaluate(StatementAdapter.java:36)
	at com.carrotsearch.randomizedtesting.ThreadLeakControl$StatementRunner.run(ThreadLeakControl.java:367)
	at java.lang.Thread.run(Thread.java:745)
Caused by: org.apache.solr.client.solrj.impl.HttpSolrClient$RemoteSolrException: Error from server at http://127.0.0.1:49344/solr/testschemaapi_shard1_replica1: ERROR: [doc=2] unknown field 'myNewField1'
	at org.apache.solr.client.solrj.impl.HttpSolrClient.executeMethod(HttpSolrClient.java:590)
	at org.apache.solr.client.solrj.impl.HttpSolrClient.request(HttpSolrClient.java:259)
	at org.apache.solr.client.solrj.impl.HttpSolrClient.request(HttpSolrClient.java:248)
	at org.apache.solr.client.solrj.impl.LBHttpSolrClient.doRequest(LBHttpSolrClient.java:404)
	at org.apache.solr.client.solrj.impl.LBHttpSolrClient.request(LBHttpSolrClient.java:357)
	at org.apache.solr.client.solrj.impl.CloudSolrClient.lambda$directUpdate$0(CloudSolrClient.java:674)
	at java.util.concurrent.FutureTask.run(FutureTask.java:266)
	at org.apache.solr.common.util.ExecutorUtil$MDCAwareThreadPoolExecutor.lambda$execute$0(ExecutorUtil.java:229)
	at java.util.concurrent.ThreadPoolExecutor.runWorker(ThreadPoolExecutor.java:1142)
	at java.util.concurrent.ThreadPoolExecutor$Worker.run(ThreadPoolExecutor.java:617)
	... 1 more




Build Log:
[...truncated 10681 lines...]
   [junit4] Suite: org.apache.solr.schema.TestManagedSchemaAPI
   [junit4]   2> Creating dataDir: /export/home/jenkins/workspace/Lucene-Solr-6.x-Solaris/solr/build/solr-core/test/J1/temp/solr.schema.TestManagedSchemaAPI_A08BB5E852E6C714-001/init-core-data-001
   [junit4]   2> 297290 INFO  (SUITE-TestManagedSchemaAPI-seed#[A08BB5E852E6C714]-worker) [    ] o.a.s.SolrTestCaseJ4 Randomized ssl (false) and clientAuth (false)
   [junit4]   2> 297296 INFO  (SUITE-TestManagedSchemaAPI-seed#[A08BB5E852E6C714]-worker) [    ] o.a.s.c.ZkTestServer STARTING ZK TEST SERVER
   [junit4]   2> 297296 INFO  (Thread-342) [    ] o.a.s.c.ZkTestServer client port:0.0.0.0/0.0.0.0:0
   [junit4]   2> 297296 INFO  (Thread-342) [    ] o.a.s.c.ZkTestServer Starting server
   [junit4]   2> 297396 INFO  (SUITE-TestManagedSchemaAPI-seed#[A08BB5E852E6C714]-worker) [    ] o.a.s.c.ZkTestServer start zk server on port:38591
   [junit4]   2> 297396 INFO  (SUITE-TestManagedSchemaAPI-seed#[A08BB5E852E6C714]-worker) [    ] o.a.s.c.c.SolrZkClient Using default ZkCredentialsProvider
   [junit4]   2> 297397 INFO  (SUITE-TestManagedSchemaAPI-seed#[A08BB5E852E6C714]-worker) [    ] o.a.s.c.c.ConnectionManager Waiting for client to connect to ZooKeeper
   [junit4]   2> 297400 INFO  (zkCallback-163-thread-1) [    ] o.a.s.c.c.ConnectionManager Watcher org.apache.solr.common.cloud.ConnectionManager@532ea964 name:ZooKeeperConnection Watcher:127.0.0.1:38591 got event WatchedEvent state:SyncConnected type:None path:null path:null type:None
   [junit4]   2> 297400 INFO  (SUITE-TestManagedSchemaAPI-seed#[A08BB5E852E6C714]-worker) [    ] o.a.s.c.c.ConnectionManager Client is connected to ZooKeeper
   [junit4]   2> 297401 INFO  (SUITE-TestManagedSchemaAPI-seed#[A08BB5E852E6C714]-worker) [    ] o.a.s.c.c.SolrZkClient Using default ZkACLProvider
   [junit4]   2> 297401 INFO  (SUITE-TestManagedSchemaAPI-seed#[A08BB5E852E6C714]-worker) [    ] o.a.s.c.c.SolrZkClient makePath: /solr/solr.xml
   [junit4]   2> 297410 INFO  (jetty-launcher-162-thread-1) [    ] o.e.j.s.Server jetty-9.3.8.v20160314
   [junit4]   2> 297411 INFO  (jetty-launcher-162-thread-2) [    ] o.e.j.s.Server jetty-9.3.8.v20160314
   [junit4]   2> 297414 INFO  (jetty-launcher-162-thread-1) [    ] o.e.j.s.h.ContextHandler Started o.e.j.s.ServletContextHandler@289832e5{/solr,null,AVAILABLE}
   [junit4]   2> 297415 INFO  (jetty-launcher-162-thread-2) [    ] o.e.j.s.h.ContextHandler Started o.e.j.s.ServletContextHandler@8fa170f{/solr,null,AVAILABLE}
   [junit4]   2> 297417 INFO  (jetty-launcher-162-thread-2) [    ] o.e.j.s.ServerConnector Started ServerConnector@6e8b65bb{HTTP/1.1,[http/1.1]}{127.0.0.1:54075}
   [junit4]   2> 297417 INFO  (jetty-launcher-162-thread-2) [    ] o.e.j.s.Server Started @300054ms
   [junit4]   2> 297417 INFO  (jetty-launcher-162-thread-2) [    ] o.a.s.c.s.e.JettySolrRunner Jetty properties: {hostContext=/solr, hostPort=54075}
   [junit4]   2> 297417 INFO  (jetty-launcher-162-thread-2) [    ] o.a.s.s.SolrDispatchFilter SolrDispatchFilter.init(): sun.misc.Launcher$AppClassLoader@6d06d69c
   [junit4]   2> 297417 INFO  (jetty-launcher-162-thread-2) [    ] o.a.s.c.SolrResourceLoader new SolrResourceLoader for directory: '/export/home/jenkins/workspace/Lucene-Solr-6.x-Solaris/solr/build/solr-core/test/J1/temp/solr.schema.TestManagedSchemaAPI_A08BB5E852E6C714-001/tempDir-001/node2'
   [junit4]   2> 297417 INFO  (jetty-launcher-162-thread-2) [    ] o.a.s.c.SolrResourceLoader JNDI not configured for solr (NoInitialContextEx)
   [junit4]   2> 297417 INFO  (jetty-launcher-162-thread-2) [    ] o.a.s.c.SolrResourceLoader solr home defaulted to 'solr/' (could not find system property or JNDI)
   [junit4]   2> 297417 INFO  (jetty-launcher-162-thread-2) [    ] o.a.s.c.c.SolrZkClient Using default ZkCredentialsProvider
   [junit4]   2> 297418 INFO  (jetty-launcher-162-thread-2) [    ] o.a.s.c.c.ConnectionManager Waiting for client to connect to ZooKeeper
   [junit4]   2> 297418 INFO  (jetty-launcher-162-thread-1) [    ] o.e.j.s.ServerConnector Started ServerConnector@1cbee162{HTTP/1.1,[http/1.1]}{127.0.0.1:49344}
   [junit4]   2> 297418 INFO  (jetty-launcher-162-thread-1) [    ] o.e.j.s.Server Started @300055ms
   [junit4]   2> 297418 INFO  (jetty-launcher-162-thread-1) [    ] o.a.s.c.s.e.JettySolrRunner Jetty properties: {hostContext=/solr, hostPort=49344}
   [junit4]   2> 297418 INFO  (jetty-launcher-162-thread-1) [    ] o.a.s.s.SolrDispatchFilter SolrDispatchFilter.init(): sun.misc.Launcher$AppClassLoader@6d06d69c
   [junit4]   2> 297418 INFO  (jetty-launcher-162-thread-1) [    ] o.a.s.c.SolrResourceLoader new SolrResourceLoader for directory: '/export/home/jenkins/workspace/Lucene-Solr-6.x-Solaris/solr/build/solr-core/test/J1/temp/solr.schema.TestManagedSchemaAPI_A08BB5E852E6C714-001/tempDir-001/node1'
   [junit4]   2> 297418 INFO  (jetty-launcher-162-thread-1) [    ] o.a.s.c.SolrResourceLoader JNDI not configured for solr (NoInitialContextEx)
   [junit4]   2> 297418 INFO  (jetty-launcher-162-thread-1) [    ] o.a.s.c.SolrResourceLoader solr home defaulted to 'solr/' (could not find system property or JNDI)
   [junit4]   2> 297419 INFO  (jetty-launcher-162-thread-1) [    ] o.a.s.c.c.SolrZkClient Using default ZkCredentialsProvider
   [junit4]   2> 297419 INFO  (jetty-launcher-162-thread-1) [    ] o.a.s.c.c.ConnectionManager Waiting for client to connect to ZooKeeper
   [junit4]   2> 297434 INFO  (zkCallback-165-thread-1) [    ] o.a.s.c.c.ConnectionManager Watcher org.apache.solr.common.cloud.ConnectionManager@42046648 name:ZooKeeperConnection Watcher:127.0.0.1:38591/solr got event WatchedEvent state:SyncConnected type:None path:null path:null type:None
   [junit4]   2> 297434 INFO  (jetty-launcher-162-thread-1) [    ] o.a.s.c.c.ConnectionManager Client is connected to ZooKeeper
   [junit4]   2> 297434 INFO  (jetty-launcher-162-thread-1) [    ] o.a.s.c.c.SolrZkClient Using default ZkACLProvider
   [junit4]   2> 297435 INFO  (jetty-launcher-162-thread-1) [    ] o.a.s.s.SolrDispatchFilter solr.xml found in ZooKeeper. Loading...
   [junit4]   2> 297435 INFO  (zkCallback-164-thread-1) [    ] o.a.s.c.c.ConnectionManager Watcher org.apache.solr.common.cloud.ConnectionManager@4ab56fbd name:ZooKeeperConnection Watcher:127.0.0.1:38591/solr got event WatchedEvent state:SyncConnected type:None path:null path:null type:None
   [junit4]   2> 297435 INFO  (jetty-launcher-162-thread-2) [    ] o.a.s.c.c.ConnectionManager Client is connected to ZooKeeper
   [junit4]   2> 297436 INFO  (jetty-launcher-162-thread-2) [    ] o.a.s.c.c.SolrZkClient Using default ZkACLProvider
   [junit4]   2> 297437 INFO  (jetty-launcher-162-thread-2) [    ] o.a.s.s.SolrDispatchFilter solr.xml found in ZooKeeper. Loading...
   [junit4]   2> 297444 INFO  (jetty-launcher-162-thread-2) [    ] o.a.s.c.CorePropertiesLocator Config-defined core root directory: /export/home/jenkins/workspace/Lucene-Solr-6.x-Solaris/solr/build/solr-core/test/J1/temp/solr.schema.TestManagedSchemaAPI_A08BB5E852E6C714-001/tempDir-001/node2/.
   [junit4]   2> 297444 INFO  (jetty-launcher-162-thread-2) [    ] o.a.s.c.CoreContainer New CoreContainer 372910349
   [junit4]   2> 297444 INFO  (jetty-launcher-162-thread-2) [    ] o.a.s.c.CoreContainer Loading cores into CoreContainer [instanceDir=/export/home/jenkins/workspace/Lucene-Solr-6.x-Solaris/solr/build/solr-core/test/J1/temp/solr.schema.TestManagedSchemaAPI_A08BB5E852E6C714-001/tempDir-001/node2]
   [junit4]   2> 297444 WARN  (jetty-launcher-162-thread-2) [    ] o.a.s.c.CoreContainer Couldn't add files from /export/home/jenkins/workspace/Lucene-Solr-6.x-Solaris/solr/build/solr-core/test/J1/temp/solr.schema.TestManagedSchemaAPI_A08BB5E852E6C714-001/tempDir-001/node2/lib to classpath: /export/home/jenkins/workspace/Lucene-Solr-6.x-Solaris/solr/build/solr-core/test/J1/temp/solr.schema.TestManagedSchemaAPI_A08BB5E852E6C714-001/tempDir-001/node2/lib
   [junit4]   2> 297445 INFO  (jetty-launcher-162-thread-2) [    ] o.a.s.h.c.HttpShardHandlerFactory created with socketTimeout : 90000,urlScheme : ,connTimeout : 15000,maxConnectionsPerHost : 20,maxConnections : 10000,corePoolSize : 0,maximumPoolSize : 2147483647,maxThreadIdleTime : 5,sizeOfQueue : -1,fairnessPolicy : false,useRetries : false,
   [junit4]   2> 297445 INFO  (jetty-launcher-162-thread-1) [    ] o.a.s.c.CorePropertiesLocator Config-defined core root directory: /export/home/jenkins/workspace/Lucene-Solr-6.x-Solaris/solr/build/solr-core/test/J1/temp/solr.schema.TestManagedSchemaAPI_A08BB5E852E6C714-001/tempDir-001/node1/.
   [junit4]   2> 297445 INFO  (jetty-launcher-162-thread-1) [    ] o.a.s.c.CoreContainer New CoreContainer 1669048174
   [junit4]   2> 297445 INFO  (jetty-launcher-162-thread-1) [    ] o.a.s.c.CoreContainer Loading cores into CoreContainer [instanceDir=/export/home/jenkins/workspace/Lucene-Solr-6.x-Solaris/solr/build/solr-core/test/J1/temp/solr.schema.TestManagedSchemaAPI_A08BB5E852E6C714-001/tempDir-001/node1]
   [junit4]   2> 297445 WARN  (jetty-launcher-162-thread-1) [    ] o.a.s.c.CoreContainer Couldn't add files from /export/home/jenkins/workspace/Lucene-Solr-6.x-Solaris/solr/build/solr-core/test/J1/temp/solr.schema.TestManagedSchemaAPI_A08BB5E852E6C714-001/tempDir-001/node1/lib to classpath: /export/home/jenkins/workspace/Lucene-Solr-6.x-Solaris/solr/build/solr-core/test/J1/temp/solr.schema.TestManagedSchemaAPI_A08BB5E852E6C714-001/tempDir-001/node1/lib
   [junit4]   2> 297445 INFO  (jetty-launcher-162-thread-1) [    ] o.a.s.h.c.HttpShardHandlerFactory created with socketTimeout : 90000,urlScheme : ,connTimeout : 15000,maxConnectionsPerHost : 20,maxConnections : 10000,corePoolSize : 0,maximumPoolSize : 2147483647,maxThreadIdleTime : 5,sizeOfQueue : -1,fairnessPolicy : false,useRetries : false,
   [junit4]   2> 297446 INFO  (jetty-launcher-162-thread-2) [    ] o.a.s.u.UpdateShardHandler Creating UpdateShardHandler HTTP client with params: socketTimeout=340000&connTimeout=45000&retry=true
   [junit4]   2> 297446 INFO  (jetty-launcher-162-thread-1) [    ] o.a.s.u.UpdateShardHandler Creating UpdateShardHandler HTTP client with params: socketTimeout=340000&connTimeout=45000&retry=true
   [junit4]   2> 297446 INFO  (jetty-launcher-162-thread-2) [    ] o.a.s.l.LogWatcher SLF4J impl is org.slf4j.impl.Log4jLoggerFactory
   [junit4]   2> 297447 INFO  (jetty-launcher-162-thread-2) [    ] o.a.s.l.LogWatcher Registering Log Listener [Log4j (org.slf4j.impl.Log4jLoggerFactory)]
   [junit4]   2> 297447 INFO  (jetty-launcher-162-thread-2) [    ] o.a.s.c.ZkContainer Zookeeper client=127.0.0.1:38591/solr
   [junit4]   2> 297447 INFO  (jetty-launcher-162-thread-2) [    ] o.a.s.c.ZkController zkHost includes chroot
   [junit4]   2> 297447 INFO  (jetty-launcher-162-thread-2) [    ] o.a.s.c.c.SolrZkClient Using default ZkCredentialsProvider
   [junit4]   2> 297447 INFO  (jetty-launcher-162-thread-1) [    ] o.a.s.l.LogWatcher SLF4J impl is org.slf4j.impl.Log4jLoggerFactory
   [junit4]   2> 297447 INFO  (jetty-launcher-162-thread-1) [    ] o.a.s.l.LogWatcher Registering Log Listener [Log4j (org.slf4j.impl.Log4jLoggerFactory)]
   [junit4]   2> 297447 INFO  (jetty-launcher-162-thread-1) [    ] o.a.s.c.ZkContainer Zookeeper client=127.0.0.1:38591/solr
   [junit4]   2> 297447 INFO  (jetty-launcher-162-thread-1) [    ] o.a.s.c.ZkController zkHost includes chroot
   [junit4]   2> 297447 INFO  (jetty-launcher-162-thread-2) [    ] o.a.s.c.c.ConnectionManager Waiting for client to connect to ZooKeeper
   [junit4]   2> 297447 INFO  (jetty-launcher-162-thread-1) [    ] o.a.s.c.c.SolrZkClient Using default ZkCredentialsProvider
   [junit4]   2> 297449 INFO  (jetty-launcher-162-thread-1) [    ] o.a.s.c.c.ConnectionManager Waiting for client to connect to ZooKeeper
   [junit4]   2> 297452 INFO  (zkCallback-171-thread-1) [    ] o.a.s.c.c.ConnectionManager Watcher org.apache.solr.common.cloud.ConnectionManager@20ec9920 name:ZooKeeperConnection Watcher:127.0.0.1:38591 got event WatchedEvent state:SyncConnected type:None path:null path:null type:None
   [junit4]   2> 297452 INFO  (jetty-launcher-162-thread-1) [    ] o.a.s.c.c.ConnectionManager Client is connected to ZooKeeper
   [junit4]   2> 297452 INFO  (jetty-launcher-162-thread-1) [    ] o.a.s.c.c.SolrZkClient Using default ZkACLProvider
   [junit4]   2> 297453 INFO  (zkCallback-170-thread-1) [    ] o.a.s.c.c.ConnectionManager Watcher org.apache.solr.common.cloud.ConnectionManager@226529d2 name:ZooKeeperConnection Watcher:127.0.0.1:38591 got event WatchedEvent state:SyncConnected type:None path:null path:null type:None
   [junit4]   2> 297453 INFO  (jetty-launcher-162-thread-2) [    ] o.a.s.c.c.ConnectionManager Client is connected to ZooKeeper
   [junit4]   2> 297453 INFO  (jetty-launcher-162-thread-2) [    ] o.a.s.c.c.SolrZkClient Using default ZkACLProvider
   [junit4]   2> 297455 INFO  (jetty-launcher-162-thread-1) [n:127.0.0.1:49344_solr    ] o.a.s.c.ZkController Added new OnReconnect listener org.apache.solr.cloud.ZkController$$Lambda$28/1896020644@268cda33
   [junit4]   2> 297457 INFO  (jetty-launcher-162-thread-1) [n:127.0.0.1:49344_solr    ] o.a.s.c.c.ConnectionManager Waiting for client to connect to ZooKeeper
   [junit4]   2> 297457 INFO  (jetty-launcher-162-thread-2) [n:127.0.0.1:54075_solr    ] o.a.s.c.ZkController Added new OnReconnect listener org.apache.solr.cloud.ZkController$$Lambda$28/1896020644@2aa271d1
   [junit4]   2> 297458 INFO  (jetty-launcher-162-thread-2) [n:127.0.0.1:54075_solr    ] o.a.s.c.c.ConnectionManager Waiting for client to connect to ZooKeeper
   [junit4]   2> 297462 INFO  (zkCallback-173-thread-1-processing-n:127.0.0.1:54075_solr) [n:127.0.0.1:54075_solr    ] o.a.s.c.c.ConnectionManager Watcher org.apache.solr.common.cloud.ConnectionManager@6d986ae6 name:ZooKeeperConnection Watcher:127.0.0.1:38591/solr got event WatchedEvent state:SyncConnected type:None path:null path:null type:None
   [junit4]   2> 297462 INFO  (zkCallback-172-thread-1-processing-n:127.0.0.1:49344_solr) [n:127.0.0.1:49344_solr    ] o.a.s.c.c.ConnectionManager Watcher org.apache.solr.common.cloud.ConnectionManager@532edfc2 name:ZooKeeperConnection Watcher:127.0.0.1:38591/solr got event WatchedEvent state:SyncConnected type:None path:null path:null type:None
   [junit4]   2> 297462 INFO  (jetty-launcher-162-thread-1) [n:127.0.0.1:49344_solr    ] o.a.s.c.c.ConnectionManager Client is connected to ZooKeeper
   [junit4]   2> 297462 INFO  (jetty-launcher-162-thread-2) [n:127.0.0.1:54075_solr    ] o.a.s.c.c.ConnectionManager Client is connected to ZooKeeper
   [junit4]   2> 297464 INFO  (jetty-launcher-162-thread-1) [n:127.0.0.1:49344_solr    ] o.a.s.c.c.SolrZkClient makePath: /overseer/queue
   [junit4]   2> 297464 INFO  (jetty-launcher-162-thread-2) [n:127.0.0.1:54075_solr    ] o.a.s.c.c.SolrZkClient makePath: /overseer/queue
   [junit4]   2> 297467 INFO  (jetty-launcher-162-thread-2) [n:127.0.0.1:54075_solr    ] o.a.s.c.c.SolrZkClient makePath: /overseer/collection-queue-work
   [junit4]   2> 297471 INFO  (jetty-launcher-162-thread-2) [n:127.0.0.1:54075_solr    ] o.a.s.c.c.SolrZkClient makePath: /overseer/collection-map-running
   [junit4]   2> 297474 INFO  (jetty-launcher-162-thread-2) [n:127.0.0.1:54075_solr    ] o.a.s.c.c.SolrZkClient makePath: /overseer/collection-map-completed
   [junit4]   2> 297477 INFO  (jetty-launcher-162-thread-2) [n:127.0.0.1:54075_solr    ] o.a.s.c.c.SolrZkClient makePath: /overseer/collection-map-failure
   [junit4]   2> 297478 INFO  (jetty-launcher-162-thread-2) [n:127.0.0.1:54075_solr    ] o.a.s.c.c.SolrZkClient makePath: /live_nodes
   [junit4]   2> 297480 INFO  (jetty-launcher-162-thread-2) [n:127.0.0.1:54075_solr    ] o.a.s.c.c.SolrZkClient makePath: /collections
   [junit4]   2> 297481 INFO  (jetty-launcher-162-thread-2) [n:127.0.0.1:54075_solr    ] o.a.s.c.c.SolrZkClient makePath: /aliases.json
   [junit4]   2> 297483 INFO  (jetty-launcher-162-thread-2) [n:127.0.0.1:54075_solr    ] o.a.s.c.c.SolrZkClient makePath: /clusterstate.json
   [junit4]   2> 297484 INFO  (jetty-launcher-162-thread-2) [n:127.0.0.1:54075_solr    ] o.a.s.c.c.SolrZkClient makePath: /security.json
   [junit4]   2> 297486 INFO  (jetty-launcher-162-thread-2) [n:127.0.0.1:54075_solr    ] o.a.s.c.c.ZkStateReader Updating cluster state from ZooKeeper... 
   [junit4]   2> 297486 INFO  (jetty-launcher-162-thread-2) [n:127.0.0.1:54075_solr    ] o.a.s.c.c.ZkStateReader Loaded empty cluster properties
   [junit4]   2> 297487 INFO  (jetty-launcher-162-thread-2) [n:127.0.0.1:54075_solr    ] o.a.s.c.c.ZkStateReader Updated live nodes from ZooKeeper... (0) -> (0)
   [junit4]   2> 297490 INFO  (jetty-launcher-162-thread-2) [n:127.0.0.1:54075_solr    ] o.a.s.c.c.SolrZkClient makePath: /overseer_elect
   [junit4]   2> 297491 INFO  (jetty-launcher-162-thread-1) [n:127.0.0.1:49344_solr    ] o.a.s.c.c.SolrZkClient makePath: /overseer/collection-queue-work
   [junit4]   2> 297491 INFO  (jetty-launcher-162-thread-2) [n:127.0.0.1:54075_solr    ] o.a.s.c.c.SolrZkClient makePath: /overseer_elect/election
   [junit4]   2> 297493 INFO  (jetty-launcher-162-thread-2) [n:127.0.0.1:54075_solr    ] o.a.s.c.Overseer Overseer (id=null) closing
   [junit4]   2> 297494 INFO  (jetty-launcher-162-thread-2) [n:127.0.0.1:54075_solr    ] o.a.s.c.LeaderElector Joined leadership election with path: /overseer_elect/election/95893674118414342-127.0.0.1:54075_solr-n_0000000000
   [junit4]   2> 297494 INFO  (jetty-launcher-162-thread-2) [n:127.0.0.1:54075_solr    ] o.a.s.c.OverseerElectionContext I am going to be the leader 127.0.0.1:54075_solr
   [junit4]   2> 297494 INFO  (jetty-launcher-162-thread-2) [n:127.0.0.1:54075_solr    ] o.a.s.c.c.SolrZkClient makePath: /overseer_elect/leader
   [junit4]   2> 297496 INFO  (jetty-launcher-162-thread-2) [n:127.0.0.1:54075_solr    ] o.a.s.c.Overseer Overseer (id=95893674118414342-127.0.0.1:54075_solr-n_0000000000) starting
   [junit4]   2> 297499 INFO  (jetty-launcher-162-thread-2) [n:127.0.0.1:54075_solr    ] o.a.s.c.c.SolrZkClient makePath: /overseer/queue-work
   [junit4]   2> 297499 INFO  (jetty-launcher-162-thread-1) [n:127.0.0.1:49344_solr    ] o.a.s.c.c.ZkStateReader Updating cluster state from ZooKeeper... 
   [junit4]   2> 297500 INFO  (jetty-launcher-162-thread-1) [n:127.0.0.1:49344_solr    ] o.a.s.c.c.ZkStateReader Loaded empty cluster properties
   [junit4]   2> 297501 INFO  (jetty-launcher-162-thread-1) [n:127.0.0.1:49344_solr    ] o.a.s.c.c.ZkStateReader Updated live nodes from ZooKeeper... (0) -> (0)
   [junit4]   2> 297508 INFO  (jetty-launcher-162-thread-1) [n:127.0.0.1:49344_solr    ] o.a.s.c.Overseer Overseer (id=null) closing
   [junit4]   2> 297509 INFO  (jetty-launcher-162-thread-1) [n:127.0.0.1:49344_solr    ] o.a.s.c.LeaderElector Joined leadership election with path: /overseer_elect/election/95893674118414341-127.0.0.1:49344_solr-n_0000000001
   [junit4]   2> 297510 INFO  (jetty-launcher-162-thread-1) [n:127.0.0.1:49344_solr    ] o.a.s.c.LeaderElector Watching path /overseer_elect/election/95893674118414342-127.0.0.1:54075_solr-n_0000000000 to know if I could be the leader
   [junit4]   2> 297510 INFO  (jetty-launcher-162-thread-1) [n:127.0.0.1:49344_solr    ] o.a.s.c.ZkController Register node as live in ZooKeeper:/live_nodes/127.0.0.1:49344_solr
   [junit4]   2> 297511 INFO  (jetty-launcher-162-thread-1) [n:127.0.0.1:49344_solr    ] o.a.s.c.c.SolrZkClient makePath: /live_nodes/127.0.0.1:49344_solr
   [junit4]   2> 297511 INFO  (jetty-launcher-162-thread-2) [n:127.0.0.1:54075_solr    ] o.a.s.c.OverseerAutoReplicaFailoverThread Starting OverseerAutoReplicaFailoverThread autoReplicaFailoverWorkLoopDelay=10000 autoReplicaFailoverWaitAfterExpiration=30000 autoReplicaFailoverBadNodeExpiration=60000
   [junit4]   2> 297512 INFO  (OverseerCollectionConfigSetProcessor-95893674118414342-127.0.0.1:54075_solr-n_0000000000) [n:127.0.0.1:54075_solr    ] o.a.s.c.OverseerTaskProcessor Process current queue of overseer operations
   [junit4]   2> 297513 INFO  (OverseerStateUpdate-95893674118414342-127.0.0.1:54075_solr-n_0000000000) [n:127.0.0.1:54075_solr    ] o.a.s.c.Overseer Starting to work on the main queue
   [junit4]   2> 297513 INFO  (zkCallback-172-thread-1-processing-n:127.0.0.1:49344_solr) [n:127.0.0.1:49344_solr    ] o.a.s.c.c.ZkStateReader A live node change: [WatchedEvent state:SyncConnected type:NodeChildrenChanged path:/live_nodes], has occurred - updating... (live nodes size: [0])
   [junit4]   2> 297514 INFO  (jetty-launcher-162-thread-2) [n:127.0.0.1:54075_solr    ] o.a.s.c.ZkController Publish node=127.0.0.1:54075_solr as DOWN
   [junit4]   2> 297514 INFO  (zkCallback-173-thread-1-processing-n:127.0.0.1:54075_solr) [n:127.0.0.1:54075_solr    ] o.a.s.c.c.ZkStateReader A live node change: [WatchedEvent state:SyncConnected type:NodeChildrenChanged path:/live_nodes], has occurred - updating... (live nodes size: [0])
   [junit4]   2> 297546 INFO  (zkCallback-172-thread-1-processing-n:127.0.0.1:49344_solr) [n:127.0.0.1:49344_solr    ] o.a.s.c.c.ZkStateReader Updated live nodes from ZooKeeper... (0) -> (1)
   [junit4]   2> 297562 INFO  (jetty-launcher-162-thread-1) [n:127.0.0.1:49344_solr    ] o.a.s.c.CoreContainer Security conf doesn't exist. Skipping setup for authorization module.
   [junit4]   2> 297562 INFO  (jetty-launcher-162-thread-1) [n:127.0.0.1:49344_solr    ] o.a.s.c.CoreContainer No authentication plugin used.
   [junit4]   2> 297563 INFO  (jetty-launcher-162-thread-1) [n:127.0.0.1:49344_solr    ] o.a.s.c.CorePropertiesLocator Looking for core definitions underneath /export/home/jenkins/workspace/Lucene-Solr-6.x-Solaris/solr/build/solr-core/test/J1/temp/solr.schema.TestManagedSchemaAPI_A08BB5E852E6C714-001/tempDir-001/node1/.
   [junit4]   2> 297563 INFO  (jetty-launcher-162-thread-1) [n:127.0.0.1:49344_solr    ] o.a.s.c.CorePropertiesLocator Found 0 core definitions
   [junit4]   2> 297563 INFO  (OverseerStateUpdate-95893674118414342-127.0.0.1:54075_solr-n_0000000000) [n:127.0.0.1:54075_solr    ] o.a.s.c.c.ZkStateReader Updated live nodes from ZooKeeper... (0) -> (1)
   [junit4]   2> 297564 INFO  (jetty-launcher-162-thread-1) [n:127.0.0.1:49344_solr    ] o.a.s.s.SolrDispatchFilter user.dir=/export/home/jenkins/workspace/Lucene-Solr-6.x-Solaris/solr/build/solr-core/test/J1
   [junit4]   2> 297564 INFO  (jetty-launcher-162-thread-1) [n:127.0.0.1:49344_solr    ] o.a.s.s.SolrDispatchFilter SolrDispatchFilter.init() done
   [junit4]   2> 297565 INFO  (OverseerStateUpdate-95893674118414342-127.0.0.1:54075_solr-n_0000000000) [n:127.0.0.1:54075_solr    ] o.a.s.c.Overseer processMessage: queueSize: 1, message = {
   [junit4]   2>   "operation":"downnode",
   [junit4]   2>   "node_name":"127.0.0.1:54075_solr"} current state version: 0
   [junit4]   2> 297566 INFO  (OverseerStateUpdate-95893674118414342-127.0.0.1:54075_solr-n_0000000000) [n:127.0.0.1:54075_solr    ] o.a.s.c.o.NodeMutator DownNode state invoked for node: 127.0.0.1:54075_solr
   [junit4]   2> 298564 INFO  (jetty-launcher-162-thread-2) [n:127.0.0.1:54075_solr    ] o.a.s.c.ZkController Register node as live in ZooKeeper:/live_nodes/127.0.0.1:54075_solr
   [junit4]   2> 298566 INFO  (jetty-launcher-162-thread-2) [n:127.0.0.1:54075_solr    ] o.a.s.c.c.SolrZkClient makePath: /live_nodes/127.0.0.1:54075_solr
   [junit4]   2> 298568 INFO  (zkCallback-173-thread-1-processing-n:127.0.0.1:54075_solr) [n:127.0.0.1:54075_solr    ] o.a.s.c.c.ZkStateReader A live node change: [WatchedEvent state:SyncConnected type:NodeChildrenChanged path:/live_nodes], has occurred - updating... (live nodes size: [1])
   [junit4]   2> 298568 INFO  (zkCallback-173-thread-1-processing-n:127.0.0.1:54075_solr) [n:127.0.0.1:54075_solr    ] o.a.s.c.c.ZkStateReader Updated live nodes from ZooKeeper... (1) -> (2)
   [junit4]   2> 298570 INFO  (zkCallback-172-thread-1-processing-n:127.0.0.1:49344_solr) [n:127.0.0.1:49344_solr    ] o.a.s.c.c.ZkStateReader A live node change: [WatchedEvent state:SyncConnected type:NodeChildrenChanged path:/live_nodes], has occurred - updating... (live nodes size: [1])
   [junit4]   2> 298571 INFO  (zkCallback-172-thread-1-processing-n:127.0.0.1:49344_solr) [n:127.0.0.1:49344_solr    ] o.a.s.c.c.ZkStateReader Updated live nodes from ZooKeeper... (1) -> (2)
   [junit4]   2> 298586 INFO  (jetty-launcher-162-thread-2) [n:127.0.0.1:54075_solr    ] o.a.s.c.CoreContainer Security conf doesn't exist. Skipping setup for authorization module.
   [junit4]   2> 298586 INFO  (jetty-launcher-162-thread-2) [n:127.0.0.1:54075_solr    ] o.a.s.c.CoreContainer No authentication plugin used.
   [junit4]   2> 298587 INFO  (jetty-launcher-162-thread-2) [n:127.0.0.1:54075_solr    ] o.a.s.c.CorePropertiesLocator Looking for core definitions underneath /export/home/jenkins/workspace/Lucene-Solr-6.x-Solaris/solr/build/solr-core/test/J1/temp/solr.schema.TestManagedSchemaAPI_A08BB5E852E6C714-001/tempDir-001/node2/.
   [junit4]   2> 298588 INFO  (jetty-launcher-162-thread-2) [n:127.0.0.1:54075_solr    ] o.a.s.c.CorePropertiesLocator Found 0 core definitions
   [junit4]   2> 298588 INFO  (jetty-launcher-162-thread-2) [n:127.0.0.1:54075_solr    ] o.a.s.s.SolrDispatchFilter user.dir=/export/home/jenkins/workspace/Lucene-Solr-6.x-Solaris/solr/build/solr-core/test/J1
   [junit4]   2> 298588 INFO  (jetty-launcher-162-thread-2) [n:127.0.0.1:54075_solr    ] o.a.s.s.SolrDispatchFilter SolrDispatchFilter.init() done
   [junit4]   2> 298589 INFO  (SUITE-TestManagedSchemaAPI-seed#[A08BB5E852E6C714]-worker) [    ] o.a.s.c.c.SolrZkClient Using default ZkCredentialsProvider
   [junit4]   2> 298589 INFO  (SUITE-TestManagedSchemaAPI-seed#[A08BB5E852E6C714]-worker) [    ] o.a.s.c.c.ConnectionManager Waiting for client to connect to ZooKeeper
   [junit4]   2> 298592 INFO  (zkCallback-176-thread-1) [    ] o.a.s.c.c.ConnectionManager Watcher org.apache.solr.common.cloud.ConnectionManager@795038aa name:ZooKeeperConnection Watcher:127.0.0.1:38591 got event WatchedEvent state:SyncConnected type:None path:null path:null type:None
   [junit4]   2> 298592 INFO  (SUITE-TestManagedSchemaAPI-seed#[A08BB5E852E6C714]-worker) [    ] o.a.s.c.c.ConnectionManager Client is connected to ZooKeeper
   [junit4]   2> 298592 INFO  (SUITE-TestManagedSchemaAPI-seed#[A08BB5E852E6C714]-worker) [    ] o.a.s.c.c.SolrZkClient Using default ZkACLProvider
   [junit4]   2> 298595 INFO  (SUITE-TestManagedSchemaAPI-seed#[A08BB5E852E6C714]-worker) [    ] o.a.s.c.s.i.CloudSolrClient Final constructed zkHost string: 127.0.0.1:38591/solr
   [junit4]   2> 298595 INFO  (SUITE-TestManagedSchemaAPI-seed#[A08BB5E852E6C714]-worker) [    ] o.a.s.c.c.SolrZkClient Using default ZkCredentialsProvider
   [junit4]   2> 298595 INFO  (SUITE-TestManagedSchemaAPI-seed#[A08BB5E852E6C714]-worker) [    ] o.a.s.c.c.ConnectionManager Waiting for client to connect to ZooKeeper
   [junit4]   2> 298597 INFO  (zkCallback-179-thread-1) [    ] o.a.s.c.c.ConnectionManager Watcher org.apache.solr.common.cloud.ConnectionManager@6b3d9318 name:ZooKeeperConnection Watcher:127.0.0.1:38591/solr got event WatchedEvent state:SyncConnected type:None path:null path:null type:None
   [junit4]   2> 298598 INFO  (SUITE-TestManagedSchemaAPI-seed#[A08BB5E852E6C714]-worker) [    ] o.a.s.c.c.ConnectionManager Client is connected to ZooKeeper
   [junit4]   2> 298598 INFO  (SUITE-TestManagedSchemaAPI-seed#[A08BB5E852E6C714]-worker) [    ] o.a.s.c.c.SolrZkClient Using default ZkACLProvider
   [junit4]   2> 298598 INFO  (SUITE-TestManagedSchemaAPI-seed#[A08BB5E852E6C714]-worker) [    ] o.a.s.c.c.ZkStateReader Updating cluster state from ZooKeeper... 
   [junit4]   2> 298599 INFO  (SUITE-TestManagedSchemaAPI-seed#[A08BB5E852E6C714]-worker) [    ] o.a.s.c.c.ZkStateReader Loaded empty cluster properties
   [junit4]   2> 298600 INFO  (SUITE-TestManagedSchemaAPI-seed#[A08BB5E852E6C714]-worker) [    ] o.a.s.c.c.ZkStateReader Updated live nodes from ZooKeeper... (0) -> (2)
   [junit4]   2> 298604 INFO  (SUITE-TestManagedSchemaAPI-seed#[A08BB5E852E6C714]-worker) [    ] o.a.s.c.c.SolrZkClient makePath: /configs/conf1/solrconfig.xml
   [junit4]   2> 298607 INFO  (SUITE-TestManagedSchemaAPI-seed#[A08BB5E852E6C714]-worker) [    ] o.a.s.c.c.SolrZkClient makePath: /configs/conf1/managed-schema
   [junit4]   2> 298631 INFO  (TEST-TestManagedSchemaAPI.test-seed#[A08BB5E852E6C714]) [    ] o.a.s.SolrTestCaseJ4 ###Starting test
   [junit4]   2> 298636 INFO  (qtp341901992-1132) [n:127.0.0.1:54075_solr    ] o.a.s.h.a.CollectionsHandler Invoked Collection Action :create with params replicationFactor=2&collection.configName=conf1&name=testschemaapi&action=CREATE&numShards=1&wt=javabin&version=2 and sendToOCPQueue=true
   [junit4]   2> 298640 INFO  (OverseerCollectionConfigSetProcessor-95893674118414342-127.0.0.1:54075_solr-n_0000000000) [n:127.0.0.1:54075_solr    ] o.a.s.c.OverseerTaskProcessor Overseer Collection Message Handler: Get the message id:/overseer/collection-queue-work/qn-0000000000 message:{
   [junit4]   2>   "name":"testschemaapi",
   [junit4]   2>   "fromApi":"true",
   [junit4]   2>   "replicationFactor":"2",
   [junit4]   2>   "collection.configName":"conf1",
   [junit4]   2>   "numShards":"1",
   [junit4]   2>   "stateFormat":"2",
   [junit4]   2>   "operation":"create"}
   [junit4]   2> 298641 INFO  (OverseerThreadFactory-531-thread-1-processing-n:127.0.0.1:54075_solr) [n:127.0.0.1:54075_solr    ] o.a.s.c.OverseerCollectionMessageHandler OverseerCollectionMessageHandler.processMessage : create , {
   [junit4]   2>   "name":"testschemaapi",
   [junit4]   2>   "fromApi":"true",
   [junit4]   2>   "replicationFactor":"2",
   [junit4]   2>   "collection.configName":"conf1",
   [junit4]   2>   "numShards":"1",
   [junit4]   2>   "stateFormat":"2",
   [junit4]   2>   "operation":"create"}
   [junit4]   2> 298641 INFO  (OverseerThreadFactory-531-thread-1-processing-n:127.0.0.1:54075_solr) [n:127.0.0.1:54075_solr    ] o.a.s.c.OverseerCollectionMessageHandler Create collection testschemaapi
   [junit4]   2> 298641 INFO  (OverseerThreadFactory-531-thread-1-processing-n:127.0.0.1:54075_solr) [n:127.0.0.1:54075_solr    ] o.a.s.c.OverseerCollectionMessageHandler creating collections conf node /collections/testschemaapi 
   [junit4]   2> 298642 INFO  (OverseerThreadFactory-531-thread-1-processing-n:127.0.0.1:54075_solr) [n:127.0.0.1:54075_solr    ] o.a.s.c.c.SolrZkClient makePath: /collections/testschemaapi
   [junit4]   2> 298644 INFO  (zkCallback-172-thread-1-processing-n:127.0.0.1:49344_solr) [n:127.0.0.1:49344_solr    ] o.a.s.c.c.ZkStateReader A collections change: [WatchedEvent state:SyncConnected type:NodeChildrenChanged path:/collections], has occurred - updating...
   [junit4]   2> 298644 INFO  (zkCallback-173-thread-1-processing-n:127.0.0.1:54075_solr) [n:127.0.0.1:54075_solr    ] o.a.s.c.c.ZkStateReader A collections change: [WatchedEvent state:SyncConnected type:NodeChildrenChanged path:/collections], has occurred - updating...
   [junit4]   2> 298644 INFO  (zkCallback-179-thread-1) [    ] o.a.s.c.c.ZkStateReader A collections change: [WatchedEvent state:SyncConnected type:NodeChildrenChanged path:/collections], has occurred - updating...
   [junit4]   2> 298648 INFO  (OverseerStateUpdate-95893674118414342-127.0.0.1:54075_solr-n_0000000000) [n:127.0.0.1:54075_solr    ] o.a.s.c.Overseer processMessage: queueSize: 1, message = {
   [junit4]   2>   "name":"testschemaapi",
   [junit4]   2>   "fromApi":"true",
   [junit4]   2>   "replicationFactor":"2",
   [junit4]   2>   "collection.configName":"conf1",
   [junit4]   2>   "numShards":"1",
   [junit4]   2>   "stateFormat":"2",
   [junit4]   2>   "operation":"create"} current state version: 0
   [junit4]   2> 298648 INFO  (OverseerStateUpdate-95893674118414342-127.0.0.1:54075_solr-n_0000000000) [n:127.0.0.1:54075_solr    ] o.a.s.c.o.ClusterStateMutator building a new cName: testschemaapi
   [junit4]   2> 298650 INFO  (OverseerStateUpdate-95893674118414342-127.0.0.1:54075_solr-n_0000000000) [n:127.0.0.1:54075_solr    ] o.a.s.c.o.ZkStateWriter going to create_collection /collections/testschemaapi/state.json
   [junit4]   2> 298748 INFO  (OverseerThreadFactory-531-thread-1-processing-n:127.0.0.1:54075_solr) [n:127.0.0.1:54075_solr    ] o.a.s.c.OverseerCollectionMessageHandler Creating SolrCores for new collection testschemaapi, shardNames [shard1] , replicationFactor : 2
   [junit4]   2> 298748 INFO  (OverseerThreadFactory-531-thread-1-processing-n:127.0.0.1:54075_solr) [n:127.0.0.1:54075_solr    ] o.a.s.c.OverseerCollectionMessageHandler Creating core testschemaapi_shard1_replica1 as part of shard shard1 of collection testschemaapi on 127.0.0.1:49344_solr
   [junit4]   2> 298748 INFO  (OverseerThreadFactory-531-thread-1-processing-n:127.0.0.1:54075_solr) [n:127.0.0.1:54075_solr    ] o.a.s.c.OverseerCollectionMessageHandler Creating core testschemaapi_shard1_replica2 as part of shard shard1 of collection testschemaapi on 127.0.0.1:54075_solr
   [junit4]   2> 298755 INFO  (qtp341901992-1135) [n:127.0.0.1:54075_solr    ] o.a.s.h.a.CoreAdminOperation core create command qt=/admin/cores&collection.configName=conf1&name=testschemaapi_shard1_replica2&action=CREATE&numShards=1&collection=testschemaapi&shard=shard1&wt=javabin&version=2
   [junit4]   2> 298755 INFO  (qtp2129711928-1131) [n:127.0.0.1:49344_solr    ] o.a.s.h.a.CoreAdminOperation core create command qt=/admin/cores&collection.configName=conf1&name=testschemaapi_shard1_replica1&action=CREATE&numShards=1&collection=testschemaapi&shard=shard1&wt=javabin&version=2
   [junit4]   2> 298756 INFO  (qtp341901992-1135) [n:127.0.0.1:54075_solr    ] o.a.s.c.CoreDescriptor Created CoreDescriptor: {name=testschemaapi_shard1_replica2, collection.configName=conf1, config=solrconfig.xml, transient=false, schema=schema.xml, loadOnStartup=true, configSetProperties=configsetprops.json, collection=testschemaapi, numShards=1, dataDir=data/, shard=shard1}
   [junit4]   2> 298756 INFO  (qtp2129711928-1131) [n:127.0.0.1:49344_solr    ] o.a.s.c.CoreDescriptor Created CoreDescriptor: {name=testschemaapi_shard1_replica1, collection.configName=conf1, config=solrconfig.xml, transient=false, schema=schema.xml, loadOnStartup=true, configSetProperties=configsetprops.json, collection=testschemaapi, numShards=1, dataDir=data/, shard=shard1}
   [junit4]   2> 298756 INFO  (qtp2129711928-1131) [n:127.0.0.1:49344_solr c:testschemaapi s:shard1  x:testschemaapi_shard1_replica1] o.a.s.c.ZkController publishing state=down
   [junit4]   2> 298758 INFO  (qtp2129711928-1131) [n:127.0.0.1:49344_solr c:testschemaapi s:shard1  x:testschemaapi_shard1_replica1] o.a.s.c.ZkController Registering watch for collection testschemaapi
   [junit4]   2> 298758 INFO  (qtp341901992-1135) [n:127.0.0.1:54075_solr c:testschemaapi s:shard1  x:testschemaapi_shard1_replica2] o.a.s.c.ZkController publishing state=down
   [junit4]   2> 298758 INFO  (qtp2129711928-1131) [n:127.0.0.1:49344_solr c:testschemaapi s:shard1  x:testschemaapi_shard1_replica1] o.a.s.c.c.ZkStateReader Add data for [testschemaapi] ver [0]
   [junit4]   2> 298759 INFO  (qtp2129711928-1131) [n:127.0.0.1:49344_solr c:testschemaapi s:shard1  x:testschemaapi_shard1_replica1] o.a.s.c.ZkController look for our core node name
   [junit4]   2> 298760 INFO  (qtp341901992-1135) [n:127.0.0.1:54075_solr c:testschemaapi s:shard1  x:testschemaapi_shard1_replica2] o.a.s.c.ZkController Registering watch for collection testschemaapi
   [junit4]   2> 298760 INFO  (OverseerStateUpdate-95893674118414342-127.0.0.1:54075_solr-n_0000000000) [n:127.0.0.1:54075_solr    ] o.a.s.c.Overseer processMessage: queueSize: 2, message = {
   [junit4]   2>   "core":"testschemaapi_shard1_replica1",
   [junit4]   2>   "roles":null,
   [junit4]   2>   "base_url":"http://127.0.0.1:49344/solr",
   [junit4]   2>   "node_name":"127.0.0.1:49344_solr",
   [junit4]   2>   "numShards":"1",
   [junit4]   2>   "state":"down",
   [junit4]   2>   "shard":"shard1",
   [junit4]   2>   "collection":"testschemaapi",
   [junit4]   2>   "operation":"state"} current state version: 0
   [junit4]   2> 298760 INFO  (OverseerStateUpdate-95893674118414342-127.0.0.1:54075_solr-n_0000000000) [n:127.0.0.1:54075_solr    ] o.a.s.c.o.ReplicaMutator Update state numShards=1 message={
   [junit4]   2>   "core":"testschemaapi_shard1_replica1",
   [junit4]   2>   "roles":null,
   [junit4]   2>   "base_url":"http://127.0.0.1:49344/solr",
   [junit4]   2>   "node_name":"127.0.0.1:49344_solr",
   [junit4]   2>   "numShards":"1",
   [junit4]   2>   "state":"down",
   [junit4]   2>   "shard":"shard1",
   [junit4]   2>   "collection":"testschemaapi",
   [junit4]   2>   "operation":"state"}
   [junit4]   2> 298760 INFO  (qtp341901992-1135) [n:127.0.0.1:54075_solr c:testschemaapi s:shard1  x:testschemaapi_shard1_replica2] o.a.s.c.c.ZkStateReader Add data for [testschemaapi] ver [0]
   [junit4]   2> 298760 INFO  (qtp341901992-1135) [n:127.0.0.1:54075_solr c:testschemaapi s:shard1  x:testschemaapi_shard1_replica2] o.a.s.c.ZkController look for our core node name
   [junit4]   2> 298763 INFO  (OverseerStateUpdate-95893674118414342-127.0.0.1:54075_solr-n_0000000000) [n:127.0.0.1:54075_solr    ] o.a.s.c.Overseer processMessage: queueSize: 2, message = {
   [junit4]   2>   "core":"testschemaapi_shard1_replica2",
   [junit4]   2>   "roles":null,
   [junit4]   2>   "base_url":"http://127.0.0.1:54075/solr",
   [junit4]   2>   "node_name":"127.0.0.1:54075_solr",
   [junit4]   2>   "numShards":"1",
   [junit4]   2>   "state":"down",
   [junit4]   2>   "shard":"shard1",
   [junit4]   2>   "collection":"testschemaapi",
   [junit4]   2>   "operation":"state"} current state version: 0
   [junit4]   2> 298763 INFO  (OverseerStateUpdate-95893674118414342-127.0.0.1:54075_solr-n_0000000000) [n:127.0.0.1:54075_solr    ] o.a.s.c.o.ReplicaMutator Update state numShards=1 message={
   [junit4]   2>   "core":"testschemaapi_shard1_replica2",
   [junit4]   2>   "roles":null,
   [junit4]   2>   "base_url":"http://127.0.0.1:54075/solr",
   [junit4]   2>   "node_name":"127.0.0.1:54075_solr",
   [junit4]   2>   "numShards":"1",
   [junit4]   2>   "state":"down",
   [junit4]   2>   "shard":"shard1",
   [junit4]   2>   "collection":"testschemaapi",
   [junit4]   2>   "operation":"state"}
   [junit4]   2> 298866 INFO  (OverseerStateUpdate-95893674118414342-127.0.0.1:54075_solr-n_0000000000) [n:127.0.0.1:54075_solr    ] o.a.s.c.o.ZkStateWriter going to update_collection /collections/testschemaapi/state.json version: 0
   [junit4]   2> 298867 INFO  (zkCallback-172-thread-1-processing-n:127.0.0.1:49344_solr) [n:127.0.0.1:49344_solr    ] o.a.s.c.c.ZkStateReader A cluster state change: [WatchedEvent state:SyncConnected type:NodeDataChanged path:/collections/testschemaapi/state.json] for collection [testschemaapi] has occurred - updating... (live nodes size: [2])
   [junit4]   2> 298867 INFO  (zkCallback-173-thread-1-processing-n:127.0.0.1:54075_solr) [n:127.0.0.1:54075_solr    ] o.a.s.c.c.ZkStateReader A cluster state change: [WatchedEvent state:SyncConnected type:NodeDataChanged path:/collections/testschemaapi/state.json] for collection [testschemaapi] has occurred - updating... (live nodes size: [2])
   [junit4]   2> 298867 INFO  (zkCallback-172-thread-1-processing-n:127.0.0.1:49344_solr) [n:127.0.0.1:49344_solr    ] o.a.s.c.c.ZkStateReader Updating data for [testschemaapi] from [0] to [1]
   [junit4]   2> 298867 INFO  (zkCallback-173-thread-1-processing-n:127.0.0.1:54075_solr) [n:127.0.0.1:54075_solr    ] o.a.s.c.c.ZkStateReader Updating data for [testschemaapi] from [0] to [1]
   [junit4]   2> 299759 INFO  (qtp2129711928-1131) [n:127.0.0.1:49344_solr c:testschemaapi s:shard1  x:testschemaapi_shard1_replica1] o.a.s.c.ZkController waiting to find shard id in clusterstate for testschemaapi_shard1_replica1
   [junit4]   2> 299759 INFO  (qtp2129711928-1131) [n:127.0.0.1:49344_solr c:testschemaapi s:shard1  x:testschemaapi_shard1_replica1] o.a.s.c.ZkController Check for collection zkNode:testschemaapi
   [junit4]   2> 299760 INFO  (qtp2129711928-1131) [n:127.0.0.1:49344_solr c:testschemaapi s:shard1  x:testschemaapi_shard1_replica1] o.a.s.c.ZkController Collection zkNode exists
   [junit4]   2> 299760 INFO  (qtp2129711928-1131) [n:127.0.0.1:49344_solr c:testschemaapi s:shard1  x:testschemaapi_shard1_replica1] o.a.s.c.c.ZkStateReader Load collection config from: [/collections/testschemaapi]
   [junit4]   2> 299761 INFO  (qtp2129711928-1131) [n:127.0.0.1:49344_solr c:testschemaapi s:shard1  x:testschemaapi_shard1_replica1] o.a.s.c.c.ZkStateReader path=[/collections/testschemaapi] [configName]=[conf1] specified config exists in ZooKeeper
   [junit4]   2> 299761 INFO  (qtp2129711928-1131) [n:127.0.0.1:49344_solr c:testschemaapi s:shard1  x:testschemaapi_shard1_replica1] o.a.s.c.SolrResourceLoader new SolrResourceLoader for directory: '/export/home/jenkins/workspace/Lucene-Solr-6.x-Solaris/solr/build/solr-core/test/J1/temp/solr.schema.TestManagedSchemaAPI_A08BB5E852E6C714-001/tempDir-001/node1/testschemaapi_shard1_replica1'
   [junit4]   2> 299761 INFO  (qtp341901992-1135) [n:127.0.0.1:54075_solr c:testschemaapi s:shard1  x:testschemaapi_shard1_replica2] o.a.s.c.ZkController waiting to find shard id in clusterstate for testschemaapi_shard1_replica2
   [junit4]   2> 299761 INFO  (qtp2129711928-1131) [n:127.0.0.1:49344_solr c:testschemaapi s:shard1  x:testschemaapi_shard1_replica1] o.a.s.c.SolrResourceLoader JNDI not configured for solr (NoInitialContextEx)
   [junit4]   2> 299761 INFO  (qtp341901992-1135) [n:127.0.0.1:54075_solr c:testschemaapi s:shard1  x:testschemaapi_shard1_replica2] o.a.s.c.ZkController Check for collection zkNode:testschemaapi
   [junit4]   2> 299761 INFO  (qtp2129711928-1131) [n:127.0.0.1:49344_solr c:testschemaapi s:shard1  x:testschemaapi_shard1_replica1] o.a.s.c.SolrResourceLoader solr home defaulted to 'solr/' (could not find system property or JNDI)
   [junit4]   2> 299762 INFO  (qtp341901992-1135) [n:127.0.0.1:54075_solr c:testschemaapi s:shard1  x:testschemaapi_shard1_replica2] o.a.s.c.ZkController Collection zkNode exists
   [junit4]   2> 299762 INFO  (qtp341901992-1135) [n:127.0.0.1:54075_solr c:testschemaapi s:shard1  x:testschemaapi_shard1_replica2] o.a.s.c.c.ZkStateReader Load collection config from: [/collections/testschemaapi]
   [junit4]   2> 299763 INFO  (qtp341901992-1135) [n:127.0.0.1:54075_solr c:testschemaapi s:shard1  x:testschemaapi_shard1_replica2] o.a.s.c.c.ZkStateReader path=[/collections/testschemaapi] [configName]=[conf1] specified config exists in ZooKeeper
   [junit4]   2> 299763 INFO  (qtp341901992-1135) [n:127.0.0.1:54075_solr c:testschemaapi s:shard1  x:testschemaapi_shard1_replica2] o.a.s.c.SolrResourceLoader new SolrResourceLoader for directory: '/export/home/jenkins/workspace/Lucene-Solr-6.x-Solaris/solr/build/solr-core/test/J1/temp/solr.schema.TestManagedSchemaAPI_A08BB5E852E6C714-001/tempDir-001/node2/testschemaapi_shard1_replica2'
   [junit4]   2> 299763 INFO  (qtp341901992-1135) [n:127.0.0.1:54075_solr c:testschemaapi s:shard1  x:testschemaapi_shard1_replica2] o.a.s.c.SolrResourceLoader JNDI not configured for solr (NoInitialContextEx)
   [junit4]   2> 299763 INFO  (qtp341901992-1135) [n:127.0.0.1:54075_solr c:testschemaapi s:shard1  x:testschemaapi_shard1_replica2] o.a.s.c.SolrResourceLoader solr home defaulted to 'solr/' (could not find system property or JNDI)
   [junit4]   2> 299763 INFO  (qtp2129711928-1131) [n:127.0.0.1:49344_solr c:testschemaapi s:shard1  x:testschemaapi_shard1_replica1] o.a.s.c.Config loaded config solrconfig.xml with version 0 
   [junit4]   2> 299766 INFO  (qtp341901992-1135) [n:127.0.0.1:54075_solr c:testschemaapi s:shard1  x:testschemaapi_shard1_replica2] o.a.s.c.Config loaded config solrconfig.xml with version 0 
   [junit4]   2> 299775 INFO  (qtp2129711928-1131) [n:127.0.0.1:49344_solr c:testschemaapi s:shard1  x:testschemaapi_shard1_replica1] o.a.s.c.SolrConfig current version of requestparams : -1
   [junit4]   2> 299866 INFO  (qtp2129711928-1131) [n:127.0.0.1:49344_solr c:testschemaapi s:shard1  x:testschemaapi_shard1_replica1] o.a.s.c.SolrConfig Using Lucene MatchVersion: 6.1.0
   [junit4]   2> 299869 INFO  (qtp341901992-1135) [n:127.0.0.1:54075_solr c:testschemaapi s:shard1  x:testschemaapi_shard1_replica2] o.a.s.c.SolrConfig current version of requestparams : -1
   [junit4]   2> 299874 INFO  (qtp2129711928-1131) [n:127.0.0.1:49344_solr c:testschemaapi s:shard1  x:testschemaapi_shard1_replica1] o.a.s.c.SolrConfig Loaded SolrConfig: solrconfig.xml
   [junit4]   2> 299875 INFO  (qtp341901992-1135) [n:127.0.0.1:54075_solr c:testschemaapi s:shard1  x:testschemaapi_shard1_replica2] o.a.s.c.SolrConfig Using Lucene MatchVersion: 6.1.0
   [junit4]   2> 299883 INFO  (qtp341901992-1135) [n:127.0.0.1:54075_solr c:testschemaapi s:shard1  x:testschemaapi_shard1_replica2] o.a.s.c.SolrConfig Loaded SolrConfig: solrconfig.xml
   [junit4]   2> 299886 INFO  (qtp2129711928-1131) [n:127.0.0.1:49344_solr c:testschemaapi s:shard1  x:testschemaapi_shard1_replica1] o.a.s.s.IndexSchema [testschemaapi_shard1_replica1] Schema name=minimal
   [junit4]   2> 299886 INFO  (qtp341901992-1135) [n:127.0.0.1:54075_solr c:testschemaapi s:shard1  x:testschemaapi_shard1_replica2] o.a.s.s.IndexSchema [testschemaapi_shard1_replica2] Schema name=minimal
   [junit4]   2> 299893 INFO  (qtp341901992-1135) [n:127.0.0.1:54075_solr c:testschemaapi s:shard1  x:testschemaapi_shard1_replica2] o.a.s.s.IndexSchema unique key field: id
   [junit4]   2> 299893 INFO  (qtp2129711928-1131) [n:127.0.0.1:49344_solr c:testschemaapi s:shard1  x:testschemaapi_shard1_replica1] o.a.s.s.IndexSchema unique key field: id
   [junit4]   2> 299895 INFO  (qtp2129711928-1131) [n:127.0.0.1:49344_solr c:testschemaapi s:shard1  x:testschemaapi_shard1_replica1] o.a.s.c.ConfigSetProperties Did not find ConfigSet properties, assuming default properties: Can't find resource 'configsetprops.json' in classpath or '/configs/conf1', cwd=/export/home/jenkins/workspace/Lucene-Solr-6.x-Solaris/solr/build/solr-core/test/J1
   [junit4]   2> 299895 INFO  (qtp2129711928-1131) [n:127.0.0.1:49344_solr c:testschemaapi s:shard1  x:testschemaapi_shard1_replica1] o.a.s.c.CoreContainer Creating SolrCore 'testschemaapi_shard1_replica1' using configuration from collection testschemaapi
   [junit4]   2> 299895 INFO  (qtp2129711928-1131) [n:127.0.0.1:49344_solr c:testschemaapi s:shard1 r:core_node1 x:testschemaapi_shard1_replica1] o.a.s.c.SolrCore org.apache.solr.core.MockDirectoryFactory
   [junit4]   2> 299895 INFO  (qtp341901992-1135) [n:127.0.0.1:54075_solr c:testschemaapi s:shard1  x:testschemaapi_shard1_replica2] o.a.s.c.ConfigSetProperties Did not find ConfigSet properties, assuming default properties: Can't find resource 'configsetprops.json' in classpath or '/configs/conf1', cwd=/export/home/jenkins/workspace/Lucene-Solr-6.x-Solaris/solr/build/solr-core/test/J1
   [junit4]   2> 299895 INFO  (qtp341901992-1135) [n:127.0.0.1:54075_solr c:testschemaapi s:shard1  x:testschemaapi_shard1_replica2] o.a.s.c.CoreContainer Creating SolrCore 'testschemaapi_shard1_replica2' using configuration from collection testschemaapi
   [junit4]   2> 299895 INFO  (qtp2129711928-1131) [n:127.0.0.1:49344_solr c:testschemaapi s:shard1 r:core_node1 x:testschemaapi_shard1_replica1] o.a.s.c.SolrCore [[testschemaapi_shard1_replica1] ] Opening new SolrCore at [/export/home/jenkins/workspace/Lucene-Solr-6.x-Solaris/solr/build/solr-core/test/J1/temp/solr.schema.TestManagedSchemaAPI_A08BB5E852E6C714-001/tempDir-001/node1/testschemaapi_shard1_replica1], dataDir=[/export/home/jenkins/workspace/Lucene-Solr-6.x-Solaris/solr/build/solr-core/test/J1/temp/solr.schema.TestManagedSchemaAPI_A08BB5E852E6C714-001/tempDir-001/node1/./testschemaapi_shard1_replica1/data/]
   [junit4]   2> 299895 INFO  (qtp2129711928-1131) [n:127.0.0.1:49344_solr c:testschemaapi s:shard1 r:core_node1 x:testschemaapi_shard1_replica1] o.a.s.c.SolrCore JMX monitoring not detected for core: testschemaapi_shard1_replica1
   [junit4]   2> 299895 INFO  (qtp341901992-1135) [n:127.0.0.1:54075_solr c:testschemaapi s:shard1 r:core_node2 x:testschemaapi_shard1_replica2] o.a.s.c.SolrCore org.apache.solr.core.MockDirectoryFactory
   [junit4]   2> 299895 INFO  (qtp341901992-1135) [n:127.0.0.1:54075_solr c:testschemaapi s:shard1 r:core_node2 x:testschemaapi_shard1_replica2] o.a.s.c.SolrCore [[testschemaapi_shard1_replica2] ] Opening new SolrCore at [/export/home/jenkins/workspace/Lucene-Solr-6.x-Solaris/solr/build/solr-core/test/J1/temp/solr.schema.TestManagedSchemaAPI_A08BB5E852E6C714-001/tempDir-001/node2/testschemaapi_shard1_replica2], dataDir=[/export/home/jenkins/workspace/Lucene-Solr-6.x-Solaris/solr/build/solr-core/test/J1/temp/solr.schema.TestManagedSchemaAPI_A08BB5E852E6C714-001/tempDir-001/node2/./testschemaapi_shard1_replica2/data/]
   [junit4]   2> 299895 INFO  (qtp341901992-1135) [n:127.0.0.1:54075_solr c:testschemaapi s:shard1 r:core_node2 x:testschemaapi_shard1_replica2] o.a.s.c.SolrCore JMX monitoring not detected for core: testschemaapi_shard1_replica2
   [junit4]   2> 299896 INFO  (qtp2129711928-1131) [n:127.0.0.1:49344_solr c:testschemaapi s:shard1 r:core_node1 x:testschemaapi_shard1_replica1] o.a.s.c.CachingDirectoryFactory return new directory for /export/home/jenkins/workspace/Lucene-Solr-6.x-Solaris/solr/build/solr-core/test/J1/temp/solr.schema.TestManagedSchemaAPI_A08BB5E852E6C714-001/tempDir-001/node1/./testschemaapi_shard1_replica1/data
   [junit4]   2> 299896 INFO  (qtp2129711928-1131) [n:127.0.0.1:49344_solr c:testschemaapi s:shard1 r:core_node1 x:testschemaapi_shard1_replica1] o.a.s.c.SolrCore New index directory detected: old=null new=/export/home/jenkins/workspace/Lucene-Solr-6.x-Solaris/solr/build/solr-core/test/J1/temp/solr.schema.TestManagedSchemaAPI_A08BB5E852E6C714-001/tempDir-001/node1/./testschemaapi_shard1_replica1/data/index/
   [junit4]   2> 299896 WARN  (qtp2129711928-1131) [n:127.0.0.1:49344_solr c:testschemaapi s:shard1 r:core_node1 x:testschemaapi_shard1_replica1] o.a.s.c.SolrCore [testschemaapi_shard1_replica1] Solr index directory '/export/home/jenkins/workspace/Lucene-Solr-6.x-Solaris/solr/build/solr-core/test/J1/temp/solr.schema.TestManagedSchemaAPI_A08BB5E852E6C714-001/tempDir-001/node1/./testschemaapi_shard1_replica1/data/index' doesn't exist. Creating new index...
   [junit4]   2> 299896 INFO  (qtp341901992-1135) [n:127.0.0.1:54075_solr c:testschemaapi s:shard1 r:core_node2 x:testschemaapi_shard1_replica2] o.a.s.c.CachingDirectoryFactory return new directory for /export/home/jenkins/workspace/Lucene-Solr-6.x-Solaris/solr/build/solr-core/test/J1/temp/solr.schema.TestManagedSchemaAPI_A08BB5E852E6C714-001/tempDir-001/node2/./testschemaapi_shard1_replica2/data
   [junit4]   2> 299896 INFO  (qtp341901992-1135) [n:127.0.0.1:54075_solr c:testschemaapi s:shard1 r:core_node2 x:testschemaapi_shard1_replica2] o.a.s.c.SolrCore New index directory detected: old=null new=/export/home/jenkins/workspace/Lucene-Solr-6.x-Solaris/solr/build/solr-core/test/J1/temp/solr.schema.TestManagedSchemaAPI_A08BB5E852E6C714-001/tempDir-001/node2/./testschemaapi_shard1_replica2/data/index/
   [junit4]   2> 299896 WARN  (qtp341901992-1135) [n:127.0.0.1:54075_solr c:testschemaapi s:shard1 r:core_node2 x:testschemaapi_shard1_replica2] o.a.s.c.SolrCore [testschemaapi_shard1_replica2] Solr index directory '/export/home/jenkins/workspace/Lucene-Solr-6.x-Solaris/solr/build/solr-core/test/J1/temp/solr.schema.TestManagedSchemaAPI_A08BB5E852E6C714-001/tempDir-001/node2/./testschemaapi_shard1_replica2/data/index' doesn't exist. Creating new index...
   [junit4]   2> 299896 INFO  (qtp2129711928-1131) [n:127.0.0.1:49344_solr c:testschemaapi s:shard1 r:core_node1 x:testschemaapi_shard1_replica1] o.a.s.c.CachingDirectoryFactory return new directory for /export/home/jenkins/workspace/Lucene-Solr-6.x-Solaris/solr/build/solr-core/test/J1/temp/solr.schema.TestManagedSchemaAPI_A08BB5E852E6C714-001/tempDir-001/node1/./testschemaapi_shard1_replica1/data/index
   [junit4]   2> 299898 INFO  (qtp341901992-1135) [n:127.0.0.1:54075_solr c:testschemaapi s:shard1 r:core_node2 x:testschemaapi_shard1_replica2] o.a.s.c.CachingDirectoryFactory return new directory for /export/home/jenkins/workspace/Lucene-Solr-6.x-Solaris/solr/build/solr-core/test/J1/temp/solr.schema.TestManagedSchemaAPI_A08BB5E852E6C714-001/tempDir-001/node2/./testschemaapi_shard1_replica2/data/index
   [junit4]   2> 299898 INFO  (qtp2129711928-1131) [n:127.0.0.1:49344_solr c:testschemaapi s:shard1 r:core_node1 x:testschemaapi_shard1_replica1] o.a.s.c.SolrDeletionPolicy SolrDeletionPolicy.onCommit: commits: num=1
   [junit4]   2> 	commit{dir=MockDirectoryWrapper(RAMDirectory@406098b7 lockFactory=org.apache.lucene.store.SingleInstanceLockFactory@205f8a87),segFN=segments_1,generation=1}
   [junit4]   2> 299898 INFO  (qtp2129711928-1131) [n:127.0.0.1:49344_solr c:testschemaapi s:shard1 r:core_node1 x:testschemaapi_shard1_replica1] o.a.s.c.SolrDeletionPolicy newest commit generation = 1
   [junit4]   2> 299898 INFO  (qtp341901992-1135) [n:127.0.0.1:54075_solr c:testschemaapi s:shard1 r:core_node2 x:testschemaapi_shard1_replica2] o.a.s.c.SolrDeletionPolicy SolrDeletionPolicy.onCommit: commits: num=1
   [junit4]   2> 	commit{dir=MockDirectoryWrapper(RAMDirectory@41eaaa6f lockFactory=org.apache.lucene.store.SingleInstanceLockFactory@4d3093c4),segFN=segments_1,generation=1}
   [junit4]   2> 299898 INFO  (qtp341901992-1135) [n:127.0.0.1:54075_solr c:testschemaapi s:shard1 r:core_node2 x:testschemaapi_shard1_replica2] o.a.s.c.SolrDeletionPolicy newest commit generation = 1
   [junit4]   2> 299900 INFO  (OldIndexDirectoryCleanupThreadForCore-testschemaapi_shard1_replica2) [n:127.0.0.1:54075_solr c:testschemaapi s:shard1 r:core_node2 x:testschemaapi_shard1_replica2] o.a.s.c.SolrCore Looking for old index directories to cleanup for core testschemaapi_shard1_replica2 in /export/home/jenkins/workspace/Lucene-Solr-6.x-Solaris/solr/build/solr-core/test/J1/temp/solr.schema.TestManagedSchemaAPI_A08BB5E852E6C714-001/tempDir-001/node2/./testschemaapi_shard1_replica2/data/
   [junit4]   2> 299900 WARN  (OldIndexDirectoryCleanupThreadForCore-testschemaapi_shard1_replica2) [n:127.0.0.1:54075_solr c:testschemaapi s:shard1 r:core_node2 x:testschemaapi_shard1_replica2] o.a.s.c.DirectoryFactory /export/home/jenkins/workspace/Lucene-Solr-6.x-Solaris/solr/build/solr-core/test/J1/temp/solr.schema.TestManagedSchemaAPI_A08BB5E852E6C714-001/tempDir-001/node2/./testschemaapi_shard1_replica2/data/ does not point to a valid data directory; skipping clean-up of old index directories.
   [junit4]   2> 299901 INFO  (qtp341901992-1135) [n:127.0.0.1:54075_solr c:testschemaapi s:shard1 r:core_node2 x:testschemaapi_shard1_replica2] o.a.s.c.SolrCore no updateRequestProcessorChain defined as default, creating implicit default
   [junit4]   2> 299901 INFO  (qtp2129711928-1131) [n:127.0.0.1:49344_solr c:testschemaapi s:shard1 r:core_node1 x:testschemaapi_shard1_replica1] o.a.s.c.SolrCore no updateRequestProcessorChain defined as default, creating implicit default
   [junit4]   2> 299902 INFO  (OldIndexDirectoryCleanupThreadForCore-testschemaapi_shard1_replica1) [n:127.0.0.1:49344_solr c:testschemaapi s:shard1 r:core_node1 x:testschemaapi_shard1_replica1] o.a.s.c.SolrCore Looking for old index directories to cleanup for core testschemaapi_shard1_replica1 in /export/home/jenkins/workspace/Lucene-Solr-6.x-Solaris/solr/build/solr-core/test/J1/temp/solr.schema.TestManagedSchemaAPI_A08BB5E852E6C714-001/tempDir-001/node1/./testschemaapi_shard1_replica1/data/
   [junit4]   2> 299902 WARN  (OldIndexDirectoryCleanupThreadForCore-testschemaapi_shard1_replica1) [n:127.0.0.1:49344_solr c:testschemaapi s:shard1 r:core_node1 x:testschemaapi_shard1_replica1] o.a.s.c.DirectoryFactory /export/home/jenkins/workspace/Lucene-Solr-6.x-Solaris/solr/build/solr-core/test/J1/temp/solr.schema.TestManagedSchemaAPI_A08BB5E852E6C714-001/tempDir-001/node1/./testschemaapi_shard1_replica1/data/ does not point to a valid data directory; skipping clean-up of old index directories.
   [junit4]   2> 299903 INFO  (qtp2129711928-1131) [n:127.0.0.1:49344_solr c:testschemaapi s:shard1 r:core_node1 x:testschemaapi_shard1_replica1] o.a.s.h.l.XMLLoader xsltCacheLifetimeSeconds=60
   [junit4]   2> 299903 INFO  (qtp341901992-1135) [n:127.0.0.1:54075_solr c:testschemaapi s:shard1 r:core_node2 x:testschemaapi_shard1_replica2] o.a.s.h.l.XMLLoader xsltCacheLifetimeSeconds=60
   [junit4]   2> 299904 INFO  (qtp2129711928-1131) [n:127.0.0.1:49344_solr c:testschemaapi s:shard1 r:core_node1 x:testschemaapi_shard1_replica1] o.a.s.h.l.XMLLoader xsltCacheLifetimeSeconds=60
   [junit4]   2> 299904 INFO  (qtp341901992-1135) [n:127.0.0.1:54075_solr c:testschemaapi s:shard1 r:core_node2 x:testschemaapi_shard1_replica2] o.a.s.h.l.XMLLoader xsltCacheLifetimeSeconds=60
   [junit4]   2> 299905 INFO  (qtp2129711928-1131) [n:127.0.0.1:49344_solr c:testschemaapi s:shard1 r:core_node1 x:testschemaapi_shard1_replica1] o.a.s.h.l.XMLLoader xsltCacheLifetimeSeconds=60
   [junit4]   2> 299905 INFO  (qtp341901992-1135) [n:127.0.0.1:54075_solr c:testschemaapi s:shard1 r:core_node2 x:testschemaapi_shard1_replica2] o.a.s.h.l.XMLLoader xsltCacheLifetimeSeconds=60
   [junit4]   2> 299906 INFO  (qtp2129711928-1131) [n:127.0.0.1:49344_solr c:testschemaapi s:shard1 r:core_node1 x:testschemaapi_shard1_replica1] o.a.s.h.l.XMLLoader xsltCacheLifetimeSeconds=60
   [junit4]   2> 299906 INFO  (qtp341901992-1135) [n:127.0.0.1:54075_solr c:testschemaapi s:shard1 r:core_node2 x:testschemaapi_shard1_replica2] o.a.s.h.l.XMLLoader xsltCacheLifetimeSeconds=60
   [junit4]   2> 299908 INFO  (qtp2129711928-1131) [n:127.0.0.1:49344_solr c:testschemaapi s:shard1 r:core_node1 x:testschemaapi_shard1_replica1] o.a.s.c.RequestHandlers Registered paths: /admin/mbeans,/update/csv,/sql,/update/json/docs,/admin/luke,/graph,/export,/select,/admin/segments,/get,/admin/system,/replication,/admin/properties,/config,/stream,/schema,/admin/plugins,/admin/logging,/update/json,/admin/ping,/admin/threads,/update,/admin/file
   [junit4]   2> 299908 INFO  (qtp2129711928-1131) [n:127.0.0.1:49344_solr c:testschemaapi s:shard1 r:core_node1 x:testschemaapi_shard1_replica1] o.a.s.c.SolrCore Using default statsCache cache: org.apache.solr.search.stats.LocalStatsCache
   [junit4]   2> 299908 INFO  (qtp341901992-1135) [n:127.0.0.1:54075_solr c:testschemaapi s:shard1 r:core_node2 x:testschemaapi_shard1_replica2] o.a.s.c.RequestHandlers Registered paths: /admin/mbeans,/update/csv,/sql,/update/json/docs,/admin/luke,/graph,/export,/select,/admin/segments,/get,/admin/system,/replication,/admin/properties,/config,/stream,/schema,/admin/plugins,/admin/logging,/update/json,/admin/ping,/admin/threads,/update,/admin/file
   [junit4]   2> 299908 INFO  (qtp341901992-1135) [n:127.0.0.1:54075_solr c:testschemaapi s:shard1 r:core_node2 x:testschemaapi_shard1_replica2] o.a.s.c.SolrCore Using default statsCache cache: org.apache.solr.search.stats.LocalStatsCache
   [junit4]   2> 299908 INFO  (qtp2129711928-1131) [n:127.0.0.1:49344_solr c:testschemaapi s:shard1 r:core_node1 x:testschemaapi_shard1_replica1] o.a.s.u.UpdateHandler Using UpdateLog implementation: org.apache.solr.update.UpdateLog
   [junit4]   2> 299911 INFO  (qtp2129711928-1131) [n:127.0.0.1:49344_solr c:testschemaapi s:shard1 r:core_node1 x:testschemaapi_shard1_replica1] o.a.s.u.UpdateLog Initializing UpdateLog: dataDir=null defaultSyncLevel=FLUSH numRecordsToKeep=100 maxNumLogsToKeep=10 numVersionBuckets=65536
   [junit4]   2> 299911 INFO  (qtp341901992-1135) [n:127.0.0.1:54075_solr c:testschemaapi s:shard1 r:core_node2 x:testschemaapi_shard1_replica2] o.a.s.u.UpdateHandler Using UpdateLog implementation: org.apache.solr.update.UpdateLog
   [junit4]   2> 299911 INFO  (qtp341901992-1135) [n:127.0.0.1:54075_solr c:testschemaapi s:shard1 r:core_node2 x:testschemaapi_shard1_replica2] o.a.s.u.UpdateLog Initializing UpdateLog: dataDir=null defaultSyncLevel=FLUSH numRecordsToKeep=100 maxNumLogsToKeep=10 numVersionBuckets=65536
   [junit4]   2> 299912 INFO  (qtp2129711928-1131) [n:127.0.0.1:49344_solr c:testschemaapi s:shard1 r:core_node1 x:testschemaapi_shard1_replica1] o.a.s.u.CommitTracker Hard AutoCommit: disabled
   [junit4]   2> 299912 INFO  (qtp2129711928-1131) [n:127.0.0.1:49344_solr c:testschemaapi s:shard1 r:core_node1 x:testschemaapi_shard1_replica1] o.a.s.u.CommitTracker Soft AutoCommit: disabled
   [junit4]   2> 299912 INFO  (qtp341901992-1135) [n:127.0.0.1:54075_solr c:testschemaapi s:shard1 r:core_node2 x:testschemaapi_shard1_replica2] o.a.s.u.CommitTracker Hard AutoCommit: disabled
   [junit4]   2> 299912 INFO  (qtp341901992-1135) [n:127.0.0.1:54075_solr c:testschemaapi s:shard1 r:core_node2 x:testschemaapi_shard1_replica2] o.a.s.u.CommitTracker Soft AutoCommit: disabled
   [junit4]   2> 299912 INFO  (qtp2129711928-1131) [n:127.0.0.1:49344_solr c:testschemaapi s:shard1 r:core_node1 x:testschemaapi_shard1_replica1] o.a.s.c.SolrDeletionPolicy SolrDeletionPolicy.onInit: commits: num=1
   [junit4]   2> 	commit{dir=MockDirectoryWrapper(RAMDirectory@406098b7 lockFactory=org.apache.lucene.store.SingleInstanceLockFactory@205f8a87),segFN=segments_1,generation=1}
   [junit4]   2> 299912 INFO  (qtp2129711928-1131) [n:127.0.0.1:49344_solr c:testschemaapi s:shard1 r:core_node1 x:testschemaapi_shard1_replica1] o.a.s.c.SolrDeletionPolicy newest commit generation = 1
   [junit4]   2> 299912 INFO  (qtp2129711928-1131) [n:127.0.0.1:49344_solr c:testschemaapi s:shard1 r:core_node1 x:testschemaapi_shard1_replica1] o.a.s.s.SolrIndexSearcher Opening [Searcher@b587bc3[testschemaapi_shard1_replica1] main]
   [junit4]   2> 299912 INFO  (qtp341901992-1135) [n:127.0.0.1:54075_solr c:testschemaapi s:shard1 r:core_node2 x:testschemaapi_shard1_replica2] o.a.s.c.SolrDeletionPolicy SolrDeletionPolicy.onInit: commits: num=1
   [junit4]   2> 	commit{dir=MockDirectoryWrapper(RAMDirectory@41eaaa6f lockFactory=org.apache.lucene.store.SingleInstanceLockFactory@4d3093c4),segFN=segments_1,generation=1}
   [junit4]   2> 299913 INFO  (qtp341901992-1135) [n:127.0.0.1:54075_solr c:testschemaapi s:shard1 r:core_node2 x:testschemaapi_shard1_replica2] o.a.s.c.SolrDeletionPolicy newest commit generation = 1
   [junit4]   2> 299913 INFO  (qtp2129711928-1131) [n:127.0.0.1:49344_solr c:testschemaapi s:shard1 r:core_node1 x:testschemaapi_shard1_replica1] o.a.s.c.c.ZkStateReader Load collection config from: [/collections/testschemaapi]
   [junit4]   2> 299913 INFO  (qtp341901992-1135) [n:127.0.0.1:54075_solr c:testschemaapi s:shard1 r:core_node2 x:testschemaapi_shard1_replica2] o.a.s.s.SolrIndexSearcher Opening [Searcher@2546355a[testschemaapi_shard1_replica2] main]
   [junit4]   2> 299913 INFO  (qtp341901992-1135) [n:127.0.0.1:54075_solr c:testschemaapi s:shard1 r:core_node2 x:testschemaapi_shard1_replica2] o.a.s.c.c.ZkStateReader Load collection config from: [/collections/testschemaapi]
   [junit4]   2> 299918 INFO  (qtp2129711928-1131) [n:127.0.0.1:49344_solr c:testschemaapi s:shard1 r:core_node1 x:testschemaapi_shard1_replica1] o.a.s.c.c.ZkStateReader path=[/collections/testschemaapi] [configName]=[conf1] specified config exists in ZooKeeper
   [junit4]   2> 299918 INFO  (qtp2129711928-1131) [n:127.0.0.1:49344_solr c:testschemaapi s:shard1 r:core_node1 x:testschemaapi_shard1_replica1] o.a.s.r.ManagedResourceStorage Setting up ZooKeeper-based storage for the RestManager with znodeBase: /configs/conf1
   [junit4]   2> 299918 INFO  (qtp341901992-1135) [n:127.0.0.1:54075_solr c:testschemaapi s:shard1 r:core_node2 x:testschemaapi_shard1_replica2] o.a.s.c.c.ZkStateReader path=[/collections/testschemaapi] [configName]=[conf1] specified config exists in ZooKeeper
   [junit4]   2> 299919 INFO  (qtp341901992-1135) [n:127.0.0.1:54075_solr c:testschemaapi s:shard1 r:core_node2 x:testschemaapi_shard1_replica2] o.a.s.r.ManagedResourceStorage Setting up ZooKeeper-based storage for the RestManager with znodeBase: /configs/conf1
   [junit4]   2> 299919 INFO  (qtp2129711928-1131) [n:127.0.0.1:49344_solr c:testschemaapi s:shard1 r:core_node1 x:testschemaapi_shard1_replica1] o.a.s.r.ManagedResourceStorage Configured ZooKeeperStorageIO with znodeBase: /configs/conf1
   [junit4]   2> 299919 INFO  (qtp2129711928-1131) [n:127.0.0.1:49344_solr c:testschemaapi s:shard1 r:core_node1 x:testschemaapi_shard1_replica1] o.a.s.r.RestManager Initializing RestManager with initArgs: {}
   [junit4]   2> 299919 INFO  (qtp2129711928-1131) [n:127.0.0.1:49344_solr c:testschemaapi s:shard1 r:core_node1 x:testschemaapi_shard1_replica1] o.a.s.r.ManagedResourceStorage Reading _rest_managed.json using ZooKeeperStorageIO:path=/configs/conf1
   [junit4]   2> 299919 INFO  (qtp2129711928-1131) [n:127.0.0.1:49344_solr c:testschemaapi s:shard1 r:core_node1 x:testschemaapi_shard1_replica1] o.a.s.r.ManagedResourceStorage No data found for znode /configs/conf1/_rest_managed.json
   [junit4]   2> 299919 INFO  (qtp2129711928-1131) [n:127.0.0.1:49344_solr c:testschemaapi s:shard1 r:core_node1 x:testschemaapi_shard1_replica1] o.a.s.r.ManagedResourceStorage Loaded null at path _rest_managed.json using ZooKeeperStorageIO:path=/configs/conf1
   [junit4]   2> 299919 INFO  (qtp2129711928-1131) [n:127.0.0.1:49344_solr c:testschemaapi s:shard1 r:core_node1 x:testschemaapi_shard1_replica1] o.a.s.r.RestManager Initializing 0 registered ManagedResources
   [junit4]   2> 299922 INFO  (qtp2129711928-1131) [n:127.0.0.1:49344_solr c:testschemaapi s:shard1 r:core_node1 x:testschemaapi_shard1_replica1] o.a.s.s.ZkIndexSchemaReader Creating ZooKeeper watch for the managed schema at /configs/conf1/managed-schema
   [junit4]   2> 299924 INFO  (qtp341901992-1135) [n:127.0.0.1:54075_solr c:testschemaapi s:shard1 r:core_node2 x:testschemaapi_shard1_replica2] o.a.s.r.ManagedResourceStorage Configured ZooKeeperStorageIO with znodeBase: /configs/conf1
   [junit4]   2> 299924 INFO  (qtp341901992-1135) [n:127.0.0.1:54075_solr c:testschemaapi s:shard1 r:core_node2 x:testschemaapi_shard1_replica2] o.a.s.r.RestManager Initializing RestManager with initArgs: {}
   [junit4]   2> 299924 INFO  (qtp341901992-1135) [n:127.0.0.1:54075_solr c:testschemaapi s:shard1 r:core_node2 x:testschemaapi_shard1_replica2] o.a.s.r.ManagedResourceStorage Reading _rest_managed.json using ZooKeeperStorageIO:path=/configs/conf1
   [junit4]   2> 299924 INFO  (qtp2129711928-1131) [n:127.0.0.1:49344_solr c:testschemaapi s:shard1 r:core_node1 x:testschemaapi_shard1_replica1] o.a.s.c.ZkController Added new OnReconnect listener ZkIndexSchemaReader: /configs/conf1/managed-schema, uniqueCoreId: testschemaapi_shard1_replica1:679939925099752
   [junit4]   2> 299924 INFO  (qtp2129711928-1131) [n:127.0.0.1:49344_solr c:testschemaapi s:shard1 r:core_node1 x:testschemaapi_shard1_replica1] o.a.s.h.ReplicationHandler Commits will be reserved for  10000
   [junit4]   2> 299925 INFO  (qtp2129711928-1131) [n:127.0.0.1:49344_solr c:testschemaapi s:shard1 r:core_node1 x:testschemaapi_shard1_replica1] o.a.s.u.UpdateLog Looking up max value of version field to seed version buckets
   [junit4]   2> 299925 INFO  (qtp2129711928-1131) [n:127.0.0.1:49344_solr c:testschemaapi s:shard1 r:core_node1 x:testschemaapi_shard1_replica1] o.a.s.u.VersionInfo Refreshing highest value of _version_ for 65536 version buckets from index
   [junit4]   2> 299925 INFO  (qtp2129711928-1131) [n:127.0.0.1:49344_solr c:testschemaapi s:shard1 r:core_node1 x:testschemaapi_shard1_replica1] o.a.s.u.VersionInfo No terms found for _version_, cannot seed version bucket highest value from index
   [junit4]   2> 299925 INFO  (qtp2129711928-1131) [n:127.0.0.1:49344_solr c:testschemaapi s:shard1 r:core_node1 x:testschemaapi_shard1_replica1] o.a.s.u.UpdateLog Could not find max version in index or recent updates, using new clock 1534298788647141376
   [junit4]   2> 299926 INFO  (qtp2129711928-1131) [n:127.0.0.1:49344_solr c:testschemaapi s:shard1 r:core_node1 x:testschemaapi_shard1_replica1] o.a.s.u.UpdateLog Took 1.0ms to seed version buckets with highest version 1534298788647141376
   [junit4]   2> 299927 INFO  (qtp2129711928-1131) [n:127.0.0.1:49344_solr c:testschemaapi s:shard1 r:core_node1 x:testschemaapi_shard1_replica1] o.a.s.c.ZkController watch zkdir /configs/conf1
   [junit4]   2> 299927 INFO  (searcherExecutor-536-thread-1-processing-n:127.0.0.1:49344_solr x:testschemaapi_shard1_replica1 s:shard1 c:testschemaapi r:core_node1) [n:127.0.0.1:49344_solr c:testschemaapi s:shard1 r:core_node1 x:testschemaapi_shard1_replica1] o.a.s.c.SolrCore [testschemaapi_shard1_replica1] Registered new searcher Searcher@b587bc3[testschemaapi_shard1_replica1] main{ExitableDirectoryReader(UninvertingDirectoryReader())}
   [junit4]   2> 299927 INFO  (qtp2129711928-1131) [n:127.0.0.1:49344_solr c:testschemaapi s:shard1 r:core_node1 x:testschemaapi_shard1_replica1] o.a.s.c.CoreContainer registering core: testschemaapi_shard1_replica1
   [junit4]   2> 299927 INFO  (qtp2129711928-1131) [n:127.0.0.1:49344_solr c:testschemaapi s:shard1 r:core_node1 x:testschemaapi_shard1_replica1] o.a.s.c.ZkController Register replica - core:testschemaapi_shard1_replica1 address:http://127.0.0.1:49344/solr collection:testschemaapi shard:shard1
   [junit4]   2> 299928 INFO  (qtp2129711928-1131) [n:127.0.0.1:49344_solr c:testschemaapi s:shard1 r:core_node1 x:testschemaapi_shard1_replica1] o.a.s.c.c.SolrZkClient makePath: /collections/testschemaapi/leader_elect/shard1/election
   [junit4]   2> 299929 INFO  (qtp341901992-1135) [n:127.0.0.1:54075_solr c:testschemaapi s:shard1 r:core_node2 x:testschemaapi_shard1_replica2] o.a.s.r.ManagedResourceStorage No data found for znode /configs/conf1/_rest_managed.json
   [junit4]   2> 299929 INFO  (qtp341901992-1135) [n:127.0.0.1:54075_solr c:testschemaapi s:shard1 r:core_node2 x:testschemaapi_shard1_replica2] o.a.s.r.ManagedResourceStorage Loaded null at path _rest_managed.json using ZooKeeperStorageIO:path=/configs/conf1
   [junit4]   2> 299929 INFO  (qtp341901992-1135) [n:127.0.0.1:54075_solr c:testschemaapi s:shard1 r:core_node2 x:testschemaapi_shard1_replica2] o.a.s.r.RestManager Initializing 0 registered ManagedResources
   [junit4]   2> 299929 INFO  (qtp341901992-1135) [n:127.0.0.1:54075_solr c:testschemaapi s:shard1 r:core_node2 x:testschemaapi_shard1_replica2] o.a.s.s.ZkIndexSchemaReader Creating ZooKeeper watch for the managed schema at /configs/conf1/managed-schema
   [junit4]   2> 299931 INFO  (qtp341901992-1135) [n:127.0.0.1:54075_solr c:testschemaapi s:shard1 r:core_node2 x:testschemaapi_shard1_replica2] o.a.s.c.ZkController Added new OnReconnect listener ZkIndexSchemaReader: /configs/conf1/managed-schema, uniqueCoreId: testschemaapi_shard1_replica2:679939925449472
   [junit4]   2> 299931 INFO  (qtp341901992-1135) [n:127.0.0.1:54075_solr c:testschemaapi s:shard1 r:core_node2 x:testschemaapi_shard1_replica2] o.a.s.h.ReplicationHandler Commits will be reserved for  10000
   [junit4]   2> 299931 INFO  (qtp341901992-1135) [n:127.0.0.1:54075_solr c:testschemaapi s:shard1 r:core_node2 x:testschemaapi_shard1_replica2] o.a.s.u.UpdateLog Looking up max value of version field to seed version buckets
   [junit4]   2> 299931 INFO  (qtp341901992-1135) [n:127.0.0.1:54075_solr c:testschemaapi s:shard1 r:core_node2 x:testschemaapi_shard1_replica2] o.a.s.u.VersionInfo Refreshing highest value of _version_ for 65536 version buckets from index
   [junit4]   2> 299931 INFO  (qtp341901992-1135) [n:127.0.0.1:54075_solr c:testschemaapi s:shard1 r:core_node2 x:testschemaapi_shard1_replica2] o.a.s.u.VersionInfo No terms found for _version_, cannot seed version bucket highest value from index
   [junit4]   2> 299931 INFO  (qtp341901992-1135) [n:127.0.0.1:54075_solr c:testschemaapi s:shard1 r:core_node2 x:testschemaapi_shard1_replica2] o.a.s.u.UpdateLog Could not find max version in index or recent updates, using new clock 1534298788653432832
   [junit4]   2> 299933 INFO  (qtp341901992-1135) [n:127.0.0.1:54075_solr c:testschemaapi s:shard1 r:core_node2 x:testschemaapi_shard1_replica2] o.a.s.u.UpdateLog Took 1.0ms to seed version buckets with highest version 1534298788653432832
   [junit4]   2> 299933 INFO  (qtp341901992-1135) [n:127.0.0.1:54075_solr c:testschemaapi s:shard1 r:core_node2 x:testschemaapi_shard1_replica2] o.a.s.c.ZkController watch zkdir /configs/conf1
   [junit4]   2> 299933 INFO  (searcherExecutor-537-thread-1-processing-n:127.0.0.1:54075_solr x:testschemaapi_shard1_replica2 s:shard1 c:testschemaapi r:core_node2) [n:127.0.0.1:54075_solr c:testschemaapi s:shard1 r:core_node2 x:testschemaapi_shard1_replica2] o.a.s.c.SolrCore [testschemaapi_shard1_replica2] Registered new searcher Searcher@2546355a[testschemaapi_shard1_replica2] main{ExitableDirectoryReader(UninvertingDirectoryReader())}
   [junit4]   2> 299934 INFO  (qtp341901992-1135) [n:127.0.0.1:54075_solr c:testschemaapi s:shard1 r:core_node2 x:testschemaapi_shard1_replica2] o.a.s.c.CoreContainer registering core: testschemaapi_shard1_replica2
   [junit4]   2> 299934 INFO  (qtp341901992-1135) [n:127.0.0.1:54075_solr c:testschemaapi s:shard1 r:core_node2 x:testschemaapi_shard1_replica2] o.a.s.c.ZkController Register replica - core:testschemaapi_shard1_replica2 address:http://127.0.0.1:54075/solr collection:testschemaapi shard:shard1
   [junit4]   2> 299938 INFO  (qtp2129711928-1131) [n:127.0.0.1:49344_solr c:testschemaapi s:shard1 r:core_node1 x:testschemaapi_shard1_replica1] o.a.s.c.LeaderElector Joined leadership election with path: /collections/testschemaapi/leader_elect/shard1/election/95893674118414341-core_node1-n_0000000000
   [junit4]   2> 299939 INFO  (qtp341901992-1135) [n:127.0.0.1:54075_solr c:testschemaapi s:shard1 r:core_node2 x:testschemaapi_shard1_replica2] o.a.s.c.LeaderElector Joined leadership election with path: /collections/testschemaapi/leader_elect/shard1/election/95893674118414342-core_node2-n_0000000001
   [junit4]   2> 299939 INFO  (qtp2129711928-1131) [n:127.0.0.1:49344_solr c:testschemaapi s:shard1 r:core_node1 x:testschemaapi_shard1_replica1] o.a.s.c.ShardLeaderElectionContext Running the leader process for shard=shard1 and weAreReplacement=false and leaderVoteWait=10000
   [junit4]   2> 299941 INFO  (qtp341901992-1135) [n:127.0.0.1:54075_solr c:testschemaapi s:shard1 r:core_node2 x:testschemaapi_shard1_replica2] o.a.s.c.LeaderElector Watching path /collections/testschemaapi/leader_elect/shard1/election/95893674118414341-core_node1-n_0000000000 to know if I could be the leader
   [junit4]   2> 299941 INFO  (qtp2129711928-1131) [n:127.0.0.1:49344_solr c:testschemaapi s:shard1 r:core_node1 x:testschemaapi_shard1_replica1] o.a.s.c.ShardLeaderElectionContext Enough replicas found to continue.
   [junit4]   2> 299942 INFO  (qtp2129711928-1131) [n:127.0.0.1:49344_solr c:testschemaapi s:shard1 r:core_node1 x:testschemaapi_shard1_replica1] o.a.s.c.ShardLeaderElectionContext I may be the new leader - try and sync
   [junit4]   2> 299942 INFO  (qtp2129711928-1131) [n:127.0.0.1:49344_solr c:testschemaapi s:shard1 r:core_node1 x:testschemaapi_shard1_replica1] o.a.s.c.SyncStrategy Sync replicas to http://127.0.0.1:49344/solr/testschemaapi_shard1_replica1/
   [junit4]   2> 299942 INFO  (qtp2129711928-1131) [n:127.0.0.1:49344_solr c:testschemaapi s:shard1 r:core_node1 x:testschemaapi_shard1_replica1] o.a.s.u.PeerSync PeerSync: core=testschemaapi_shard1_replica1 url=http://127.0.0.1:49344/solr START replicas=[http://127.0.0.1:54075/solr/testschemaapi_shard1_replica2/] nUpdates=100
   [junit4]   2> 299942 INFO  (qtp2129711928-1131) [n:127.0.0.1:49344_solr c:testschemaapi s:shard1 r:core_node1 x:testschemaapi_shard1_replica1] o.a.s.u.PeerSync PeerSync: core=testschemaapi_shard1_replica1 url=http://127.0.0.1:49344/solr DONE.  We have no versions.  sync failed.
   [junit4]   2> 299942 INFO  (qtp2129711928-1131) [n:127.0.0.1:49344_solr c:testschemaapi s:shard1 r:core_node1 x:testschemaapi_shard1_replica1] o.a.s.c.SyncStrategy Leader's attempt to sync with shard failed, moving to the next candidate
   [junit4]   2> 299942 INFO  (qtp2129711928-1131) [n:127.0.0.1:49344_solr c:testschemaapi s:shard1 r:core_node1 x:testschemaapi_shard1_replica1] o.a.s.c.ShardLeaderElectionContext We failed sync, but we have no versions - we can't sync in that case - we were active before, so become leader anyway
   [junit4]   2> 299949 INFO  (qtp2129711928-1131) [n:127.0.0.1:49344_solr c:testschemaapi s:shard1 r:core_node1 x:testschemaapi_shard1_replica1] o.a.s.c.c.SolrZkClient makePath: /collections/testschemaapi/leaders/shard1
   [junit4]   2> 299951 INFO  (qtp2129711928-1131) [n:127.0.0.1:49344_solr c:testschemaapi s:shard1 r:core_node1 x:testschemaapi_shard1_replica1] o.a.s.c.ShardLeaderElectionContextBase Creating leader registration node /collections/testschemaapi/leaders/shard1/leader after winning as /collections/testschemaapi/leader_elect/shard1/election/95893674118414341-core_node1-n_0000000000
   [junit4]   2> 299953 INFO  (qtp341901992-1142) [n:127.0.0.1:54075_solr c:testschemaapi s:shard1 r:core_node2 x:testschemaapi_shard1_replica2] o.a.s.c.S.Request [testschemaapi_shard1_replica2]  webapp=/solr path=/get params={distrib=false&qt=/get&fingerprint=false&getVersions=100&wt=javabin&version=2} status=0 QTime=1
   [junit4]   2> 299957 INFO  (qtp2129711928-1131) [n:127.0.0.1:49344_solr c:testschemaapi s:shard1 r:core_node1 x:testschemaapi_shard1_replica1] o.a.s.c.ShardLeaderElectionContext I am the new leader: http://127.0.0.1:49344/solr/testschemaapi_shard1_replica1/ shard1
   [junit4]   2> 299958 INFO  (OverseerStateUpdate-95893674118414342-127.0.0.1:54075_solr-n_0000000000) [n:127.0.0.1:54075_solr    ] o.a.s.c.Overseer processMessage: queueSize: 1, message = {
   [junit4]   2>   "operation":"leader",
   [junit4]   2>   "shard":"shard1",
   [junit4]   2>   "collection":"testschemaapi"} current state version: 0
   [junit4]   2> 299961 INFO  (OverseerStateUpdate-95893674118414342-127.0.0.1:54075_solr-n_0000000000) [n:127.0.0.1:54075_solr    ] o.a.s.c.Overseer processMessage: queueSize: 1, message = {
   [junit4]   2>   "operation":"leader",
   [junit4]   2>   "shard":"shard1",
   [junit4]   2>   "collection":"testschemaapi",
   [junit4]   2>   "base_url":"http://127.0.0.1:49344/solr",
   [junit4]   2>   "core":"testschemaapi_shard1_replica1",
   [junit4]   2>   "state":"active"} current state version: 0
   [junit4]   2> 300065 INFO  (OverseerStateUpdate-95893674118414342-127.0.0.1:54075_solr-n_0000000000) [n:127.0.0.1:54075_solr    ] o.a.s.c.o.ZkStateWriter going to update_collection /collections/testschemaapi/state.json version: 1
   [junit4]   2> 300067 INFO  (zkCallback-173-thread-1-processing-n:127.0.0.1:54075_solr) [n:127.0.0.1:54075_solr    ] o.a.s.c.c.ZkStateReader A cluster state change: [WatchedEvent state:SyncConnected type:N

[...truncated too long message...]

WatchedCollectionCreation-seed#[A08BB5E852E6C714]) [    ] o.a.s.c.c.ZkStateReader Loaded empty cluster properties
   [junit4]   2> 3722177 INFO  (TEST-ZkStateReaderTest.testWatchedCollectionCreation-seed#[A08BB5E852E6C714]) [    ] o.a.s.c.c.ZkStateReader Updated live nodes from ZooKeeper... (0) -> (0)
   [junit4]   2> 3722180 INFO  (TEST-ZkStateReaderTest.testWatchedCollectionCreation-seed#[A08BB5E852E6C714]) [    ] o.a.s.c.c.ZkStateReader Deleting data for [c1]
   [junit4]   2> 3722181 INFO  (TEST-ZkStateReaderTest.testWatchedCollectionCreation-seed#[A08BB5E852E6C714]) [    ] o.a.s.c.c.SolrZkClient makePath: /collections/c1
   [junit4]   2> 3722184 INFO  (zkCallback-2931-thread-1) [    ] o.a.s.c.c.ZkStateReader A collections change: [WatchedEvent state:SyncConnected type:NodeChildrenChanged path:/collections], has occurred - updating...
   [junit4]   2> 3722188 INFO  (TEST-ZkStateReaderTest.testWatchedCollectionCreation-seed#[A08BB5E852E6C714]) [    ] o.a.s.c.o.ZkStateWriter going to create_collection /collections/c1/state.json
   [junit4]   2> 3722188 INFO  (zkCallback-2931-thread-1) [    ] o.a.s.c.c.ZkStateReader A cluster state change: [WatchedEvent state:SyncConnected type:NodeCreated path:/collections/c1/state.json] for collection [c1] has occurred - updating... (live nodes size: [0])
   [junit4]   2> 3722189 INFO  (zkCallback-2931-thread-1) [    ] o.a.s.c.c.ZkStateReader Add data for [c1] ver [0]
   [junit4]   2> 3722242 INFO  (TEST-ZkStateReaderTest.testWatchedCollectionCreation-seed#[A08BB5E852E6C714]) [    ] o.a.s.c.ZkTestServer connecting to 127.0.0.1:50445 50445
   [junit4]   2> 3727265 INFO  (Thread-6839) [    ] o.a.s.c.ZkTestServer connecting to 127.0.0.1:50445 50445
   [junit4]   2> 3727266 INFO  (TEST-ZkStateReaderTest.testWatchedCollectionCreation-seed#[A08BB5E852E6C714]) [    ] o.a.s.SolrTestCaseJ4 ###Ending testWatchedCollectionCreation
   [junit4]   2> 3727267 INFO  (SUITE-ZkStateReaderTest-seed#[A08BB5E852E6C714]-worker) [    ] o.a.s.SolrTestCaseJ4 ###deleteCore
   [junit4]   2> NOTE: leaving temporary files on disk at: /export/home/jenkins/workspace/Lucene-Solr-6.x-Solaris/solr/build/solr-core/test/J1/temp/solr.cloud.overseer.ZkStateReaderTest_A08BB5E852E6C714-001
   [junit4]   2> NOTE: test params are: codec=Asserting(Lucene60): {}, docValues:{}, maxPointsInLeafNode=745, maxMBSortInHeap=5.297731327770461, sim=RandomSimilarity(queryNorm=false,coord=crazy): {}, locale=sk-SK, timezone=America/Pangnirtung
   [junit4]   2> NOTE: SunOS 5.11 amd64/Oracle Corporation 1.8.0_92 (64-bit)/cpus=3,threads=1,free=58737680,total=518979584
   [junit4]   2> NOTE: All tests run in this JVM: [TestCollationFieldDocValues, TestPerFieldSimilarity, ForceLeaderTest, HdfsBasicDistributedZkTest, TestSchemaSimilarityResource, OverseerTaskQueueTest, DefaultValueUpdateProcessorTest, DateMathParserTest, TestSerializedLuceneMatchVersion, BinaryUpdateRequestHandlerTest, TestUseDocValuesAsStored, TestJoin, TestTrie, RAMDirectoryFactoryTest, TestFileDictionaryLookup, TestCustomSort, TestCopyFieldCollectionResource, CdcrUpdateLogTest, CleanupOldIndexTest, BlockJoinFacetSimpleTest, SortByFunctionTest, TestSolrCoreProperties, TestStressRecovery, TestGraphMLResponseWriter, TestConfigSetImmutable, TestRuleBasedAuthorizationPlugin, TestPivotHelperCode, TestManagedSchemaAPI, TestExactStatsCache, TestDistribDocBasedVersion, TestSchemaNameResource, ZkSolrClientTest, TestSystemIdResolver, TestQuerySenderListener, TestAnalyzeInfixSuggestions, AnalyticsMergeStrategyTest, StatsComponentTest, ParsingFieldUpdateProcessorsTest, DebugComponentTest, ShardSplitTest, HdfsNNFailoverTest, TestRequestStatusCollectionAPI, TestBulkSchemaConcurrent, ChaosMonkeySafeLeaderTest, TestIndexingPerformance, TestBM25SimilarityFactory, DocExpirationUpdateProcessorFactoryTest, TestRandomRequestDistribution, TermVectorComponentDistributedTest, TestCSVResponseWriter, TestDynamicFieldCollectionResource, VMParamsZkACLAndCredentialsProvidersTest, SuggestComponentContextFilterQueryTest, TestDistributedMissingSort, DateFieldTest, TestZkChroot, TestCollationField, TestFastWriter, TestCloudDeleteByQuery, FileBasedSpellCheckerTest, CurrencyFieldOpenExchangeTest, TestReplicationHandlerBackup, EchoParamsTest, BlockJoinFacetDistribTest, LeaderInitiatedRecoveryOnShardRestartTest, AddBlockUpdateTest, TestFieldTypeCollectionResource, TestMinMaxOnMultiValuedField, TestSolrIndexConfig, EnumFieldTest, TlogReplayBufferedWhileIndexingTest, SpellingQueryConverterTest, OutputWriterTest, TestManagedResourceStorage, BasicZkTest, NotRequiredUniqueKeyTest, BadIndexSchemaTest, DistributedDebugComponentTest, SSLMigrationTest, HdfsRecoveryZkTest, MultiTermTest, BasicAuthIntegrationTest, TestShortCircuitedRequests, TestSolrDeletionPolicy2, TestSuggestSpellingConverter, HdfsTlogReplayBufferedWhileIndexingTest, ResponseHeaderTest, ResourceLoaderTest, DateRangeFieldTest, ExitableDirectoryReaderTest, FieldMutatingUpdateProcessorTest, DistributedFacetPivotWhiteBoxTest, TestHighFrequencyDictionaryFactory, TestRecovery, NumericFieldsTest, SolrCmdDistributorTest, DistributedMLTComponentTest, OpenExchangeRatesOrgProviderTest, FileUtilsTest, TestSolr4Spatial, SignatureUpdateProcessorFactoryTest, CursorMarkTest, LeaderFailoverAfterPartitionTest, RankQueryTest, TestImplicitCoreProperties, HdfsChaosMonkeySafeLeaderTest, HdfsSyncSliceTest, CachingDirectoryFactoryTest, TestConfigSetsAPI, TestSubQueryTransformer, TestHdfsUpdateLog, TestSolrQueryParserResource, TestJsonRequest, CacheHeaderTest, TestQueryUtils, DeleteInactiveReplicaTest, TestIntervalFaceting, DistributedFacetPivotSmallAdvancedTest, SecurityConfHandlerTest, ShowFileRequestHandlerTest, TestQueryWrapperFilter, SpellCheckCollatorTest, TestReplicaProperties, SpellCheckComponentTest, SimpleMLTQParserTest, DirectUpdateHandlerOptimizeTest, HdfsWriteToMultipleCollectionsTest, CollectionsAPISolrJTest, TestObjectReleaseTracker, FieldAnalysisRequestHandlerTest, CoreMergeIndexesAdminHandlerTest, TestClusterStateMutator, TestSolrConfigHandler, TestSearcherReuse, TestPHPSerializedResponseWriter, TermVectorComponentTest, TestAddFieldRealTimeGet, LoggingHandlerTest, TestRTGBase, QueryResultKeyTest, RemoteQueryErrorTest, DistanceFunctionTest, SynonymTokenizerTest, DistributedQueueTest, LukeRequestHandlerTest, SyncSliceTest, OpenCloseCoreStressTest, OverseerTest, FullSolrCloudDistribCmdsTest, AutoCommitTest, TestDistributedGrouping, TestHashPartitioner, TestRealTimeGet, TestStressReorder, TestReload, DistributedTermsComponentTest, TestRangeQuery, TestCoreContainer, SimpleFacetsTest, SolrCoreTest, TestGroupingSearch, PeerSyncTest, ConvertedLegacyTest, TestSort, TestFiltering, BasicFunctionalityTest, TestBadConfig, TestIndexSearcher, SoftAutoCommitTest, TestCoreDiscovery, SuggesterFSTTest, TestFoldingMultitermQuery, SuggesterTSTTest, SpatialFilterTest, SuggesterWFSTTest, WordBreakSolrSpellCheckerTest, TestAtomicUpdateErrorCases, StatelessScriptUpdateProcessorFactoryTest, IndexBasedSpellCheckerTest, DisMaxRequestHandlerTest, DirectSolrSpellCheckerTest, TestReversedWildcardFilterFactory, TestOmitPositions, TermsComponentTest, RequestHandlersTest, PathHierarchyTokenizerFactoryTest, TestSolrQueryParser, IndexSchemaRuntimeFieldTest, ReturnFieldsTest, MBeansHandlerTest, TestAnalyzedSuggestions, JsonLoaderTest, CSVRequestHandlerTest, TestComponentsName, SearchHandlerTest, TestBinaryResponseWriter, TestLFUCache, DOMUtilTest, ClusterStateTest, TestSolrJ, TestLRUCache, TestUtils, TestDocumentBuilder, ZkNodePropsTest, SliceStateTest, SystemInfoHandlerTest, UUIDFieldTest, CursorPagingTest, DistributedIntervalFacetingTest, SolrTestCaseJ4Test, TestCrossCoreJoin, TestSimpleTrackingShardHandler, TestTolerantSearch, ConnectionReuseTest, TestEmbeddedSolrServerConstructors, TestJettySolrRunner, ActionThrottleTest, AssignTest, AsyncCallRequestStatusResponseTest, AsyncMigrateRouteKeyTest, CollectionReloadTest, CollectionsAPIAsyncDistributedZkTest, ConcurrentDeleteAndCreateCollectionTest, ConfigSetsAPITest, DeleteReplicaTest, DistribDocExpirationUpdateProcessorTest, HttpPartitionTest, OutOfBoxZkACLAndCredentialsProvidersTest, OverriddenZkACLAndCredentialsProvidersTest, RecoveryAfterSoftCommitTest, RestartWhileUpdatingTest, SaslZkACLProviderTest, SolrXmlInZkTest, TestCloudInspectUtil, TestCloudPivotFacet, TestConfigSetsAPIExclusivity, TestConfigSetsAPIZkFailure, TestDownShardTolerantSearch, TestExclusionRuleCollectionAccess, TestLeaderElectionZkExpiry, TestLeaderInitiatedRecoveryThread, TestMiniSolrCloudCluster, TestSSLRandomization, TestSolrCloudWithKerberosAlt, TestTolerantUpdateProcessorCloud, ZkStateReaderTest]
   [junit4] Completed [491/598 (2!)] on J1 in 56.55s, 6 tests, 1 error <<< FAILURES!

[...truncated 334 lines...]
BUILD FAILED
/export/home/jenkins/workspace/Lucene-Solr-6.x-Solaris/build.xml:740: The following error occurred while executing this line:
/export/home/jenkins/workspace/Lucene-Solr-6.x-Solaris/build.xml:684: The following error occurred while executing this line:
/export/home/jenkins/workspace/Lucene-Solr-6.x-Solaris/build.xml:59: The following error occurred while executing this line:
/export/home/jenkins/workspace/Lucene-Solr-6.x-Solaris/solr/build.xml:233: The following error occurred while executing this line:
/export/home/jenkins/workspace/Lucene-Solr-6.x-Solaris/solr/common-build.xml:529: The following error occurred while executing this line:
/export/home/jenkins/workspace/Lucene-Solr-6.x-Solaris/lucene/common-build.xml:1457: The following error occurred while executing this line:
/export/home/jenkins/workspace/Lucene-Solr-6.x-Solaris/lucene/common-build.xml:1014: There were test failures: 598 suites (10 ignored), 2420 tests, 2 errors, 87 ignored (72 assumptions) [seed: A08BB5E852E6C714]

Total time: 89 minutes 45 seconds
Build step 'Invoke Ant' marked build as failure
Archiving artifacts
[WARNINGS] Skipping publisher since build result is FAILURE
Recording test results
Email was triggered for: Failure - Any
Sending email for trigger: Failure - Any



Mime
View raw message