lucene-dev mailing list archives

Site index · List index
Message view « Date » · « Thread »
Top « Date » · « Thread »
From Policeman Jenkins Server <jenk...@thetaphi.de>
Subject [JENKINS] Lucene-Solr-6.x-Linux (32bit/jdk1.8.0_92) - Build # 609 - Still Failing!
Date Tue, 10 May 2016 02:43:16 GMT
Build: http://jenkins.thetaphi.de/job/Lucene-Solr-6.x-Linux/609/
Java: 32bit/jdk1.8.0_92 -client -XX:+UseSerialGC

1 tests failed.
FAILED:  junit.framework.TestSuite.org.apache.solr.schema.TestManagedSchemaAPI

Error Message:
ObjectTracker found 4 object(s) that were not released!!! [MDCAwareThreadPoolExecutor, MockDirectoryWrapper, MockDirectoryWrapper, TransactionLog]

Stack Trace:
java.lang.AssertionError: ObjectTracker found 4 object(s) that were not released!!! [MDCAwareThreadPoolExecutor, MockDirectoryWrapper, MockDirectoryWrapper, TransactionLog]
	at __randomizedtesting.SeedInfo.seed([B7650CA29295C2C9]:0)
	at org.junit.Assert.fail(Assert.java:93)
	at org.junit.Assert.assertTrue(Assert.java:43)
	at org.junit.Assert.assertNull(Assert.java:551)
	at org.apache.solr.SolrTestCaseJ4.afterClass(SolrTestCaseJ4.java:256)
	at sun.reflect.GeneratedMethodAccessor20.invoke(Unknown Source)
	at sun.reflect.DelegatingMethodAccessorImpl.invoke(DelegatingMethodAccessorImpl.java:43)
	at java.lang.reflect.Method.invoke(Method.java:498)
	at com.carrotsearch.randomizedtesting.RandomizedRunner.invoke(RandomizedRunner.java:1764)
	at com.carrotsearch.randomizedtesting.RandomizedRunner$7.evaluate(RandomizedRunner.java:834)
	at com.carrotsearch.randomizedtesting.rules.StatementAdapter.evaluate(StatementAdapter.java:36)
	at com.carrotsearch.randomizedtesting.rules.SystemPropertiesRestoreRule$1.evaluate(SystemPropertiesRestoreRule.java:57)
	at org.apache.lucene.util.AbstractBeforeAfterRule$1.evaluate(AbstractBeforeAfterRule.java:45)
	at com.carrotsearch.randomizedtesting.rules.StatementAdapter.evaluate(StatementAdapter.java:36)
	at org.apache.lucene.util.TestRuleStoreClassName$1.evaluate(TestRuleStoreClassName.java:41)
	at com.carrotsearch.randomizedtesting.rules.NoShadowingOrOverridesOnMethodsRule$1.evaluate(NoShadowingOrOverridesOnMethodsRule.java:40)
	at com.carrotsearch.randomizedtesting.rules.NoShadowingOrOverridesOnMethodsRule$1.evaluate(NoShadowingOrOverridesOnMethodsRule.java:40)
	at com.carrotsearch.randomizedtesting.rules.StatementAdapter.evaluate(StatementAdapter.java:36)
	at com.carrotsearch.randomizedtesting.rules.StatementAdapter.evaluate(StatementAdapter.java:36)
	at com.carrotsearch.randomizedtesting.rules.StatementAdapter.evaluate(StatementAdapter.java:36)
	at org.apache.lucene.util.TestRuleAssertionsRequired$1.evaluate(TestRuleAssertionsRequired.java:53)
	at org.apache.lucene.util.TestRuleMarkFailure$1.evaluate(TestRuleMarkFailure.java:47)
	at org.apache.lucene.util.TestRuleIgnoreAfterMaxFailures$1.evaluate(TestRuleIgnoreAfterMaxFailures.java:64)
	at org.apache.lucene.util.TestRuleIgnoreTestSuites$1.evaluate(TestRuleIgnoreTestSuites.java:54)
	at com.carrotsearch.randomizedtesting.rules.StatementAdapter.evaluate(StatementAdapter.java:36)
	at com.carrotsearch.randomizedtesting.ThreadLeakControl$StatementRunner.run(ThreadLeakControl.java:367)
	at java.lang.Thread.run(Thread.java:745)




Build Log:
[...truncated 10857 lines...]
   [junit4] Suite: org.apache.solr.schema.TestManagedSchemaAPI
   [junit4]   2> Creating dataDir: /home/jenkins/workspace/Lucene-Solr-6.x-Linux/solr/build/solr-core/test/J1/temp/solr.schema.TestManagedSchemaAPI_B7650CA29295C2C9-001/init-core-data-001
   [junit4]   2> 464087 INFO  (SUITE-TestManagedSchemaAPI-seed#[B7650CA29295C2C9]-worker) [    ] o.a.s.SolrTestCaseJ4 Randomized ssl (false) and clientAuth (false)
   [junit4]   2> 464088 INFO  (SUITE-TestManagedSchemaAPI-seed#[B7650CA29295C2C9]-worker) [    ] o.a.s.c.ZkTestServer STARTING ZK TEST SERVER
   [junit4]   2> 464088 INFO  (Thread-1113) [    ] o.a.s.c.ZkTestServer client port:0.0.0.0/0.0.0.0:0
   [junit4]   2> 464088 INFO  (Thread-1113) [    ] o.a.s.c.ZkTestServer Starting server
   [junit4]   2> 464188 INFO  (SUITE-TestManagedSchemaAPI-seed#[B7650CA29295C2C9]-worker) [    ] o.a.s.c.ZkTestServer start zk server on port:40070
   [junit4]   2> 464188 INFO  (SUITE-TestManagedSchemaAPI-seed#[B7650CA29295C2C9]-worker) [    ] o.a.s.c.c.SolrZkClient Using default ZkCredentialsProvider
   [junit4]   2> 464189 INFO  (SUITE-TestManagedSchemaAPI-seed#[B7650CA29295C2C9]-worker) [    ] o.a.s.c.c.ConnectionManager Waiting for client to connect to ZooKeeper
   [junit4]   2> 464195 INFO  (zkCallback-19314-thread-1) [    ] o.a.s.c.c.ConnectionManager Watcher org.apache.solr.common.cloud.ConnectionManager@252970 name:ZooKeeperConnection Watcher:127.0.0.1:40070 got event WatchedEvent state:SyncConnected type:None path:null path:null type:None
   [junit4]   2> 464195 INFO  (SUITE-TestManagedSchemaAPI-seed#[B7650CA29295C2C9]-worker) [    ] o.a.s.c.c.ConnectionManager Client is connected to ZooKeeper
   [junit4]   2> 464195 INFO  (SUITE-TestManagedSchemaAPI-seed#[B7650CA29295C2C9]-worker) [    ] o.a.s.c.c.SolrZkClient Using default ZkACLProvider
   [junit4]   2> 464195 INFO  (SUITE-TestManagedSchemaAPI-seed#[B7650CA29295C2C9]-worker) [    ] o.a.s.c.c.SolrZkClient makePath: /solr/solr.xml
   [junit4]   2> 464198 INFO  (jetty-launcher-19313-thread-1) [    ] o.e.j.s.Server jetty-9.3.8.v20160314
   [junit4]   2> 464199 INFO  (jetty-launcher-19313-thread-1) [    ] o.e.j.s.h.ContextHandler Started o.e.j.s.ServletContextHandler@36792d{/solr,null,AVAILABLE}
   [junit4]   2> 464200 INFO  (jetty-launcher-19313-thread-1) [    ] o.e.j.s.ServerConnector Started ServerConnector@1f60c4b{HTTP/1.1,[http/1.1]}{127.0.0.1:36348}
   [junit4]   2> 464200 INFO  (jetty-launcher-19313-thread-1) [    ] o.e.j.s.Server Started @465416ms
   [junit4]   2> 464200 INFO  (jetty-launcher-19313-thread-1) [    ] o.a.s.c.s.e.JettySolrRunner Jetty properties: {hostContext=/solr, hostPort=36348}
   [junit4]   2> 464200 INFO  (jetty-launcher-19313-thread-1) [    ] o.a.s.s.SolrDispatchFilter SolrDispatchFilter.init(): sun.misc.Launcher$AppClassLoader@1d16e93
   [junit4]   2> 464200 INFO  (jetty-launcher-19313-thread-1) [    ] o.a.s.c.SolrResourceLoader new SolrResourceLoader for directory: '/home/jenkins/workspace/Lucene-Solr-6.x-Linux/solr/build/solr-core/test/J1/temp/solr.schema.TestManagedSchemaAPI_B7650CA29295C2C9-001/tempDir-001/node1'
   [junit4]   2> 464200 INFO  (jetty-launcher-19313-thread-1) [    ] o.a.s.c.SolrResourceLoader JNDI not configured for solr (NoInitialContextEx)
   [junit4]   2> 464200 INFO  (jetty-launcher-19313-thread-1) [    ] o.a.s.c.SolrResourceLoader solr home defaulted to 'solr/' (could not find system property or JNDI)
   [junit4]   2> 464201 INFO  (jetty-launcher-19313-thread-1) [    ] o.a.s.c.c.SolrZkClient Using default ZkCredentialsProvider
   [junit4]   2> 464201 INFO  (jetty-launcher-19313-thread-1) [    ] o.a.s.c.c.ConnectionManager Waiting for client to connect to ZooKeeper
   [junit4]   2> 464207 INFO  (zkCallback-19315-thread-1) [    ] o.a.s.c.c.ConnectionManager Watcher org.apache.solr.common.cloud.ConnectionManager@9294eb name:ZooKeeperConnection Watcher:127.0.0.1:40070/solr got event WatchedEvent state:SyncConnected type:None path:null path:null type:None
   [junit4]   2> 464207 INFO  (jetty-launcher-19313-thread-1) [    ] o.a.s.c.c.ConnectionManager Client is connected to ZooKeeper
   [junit4]   2> 464207 INFO  (jetty-launcher-19313-thread-2) [    ] o.e.j.s.Server jetty-9.3.8.v20160314
   [junit4]   2> 464207 INFO  (jetty-launcher-19313-thread-1) [    ] o.a.s.c.c.SolrZkClient Using default ZkACLProvider
   [junit4]   2> 464207 INFO  (jetty-launcher-19313-thread-1) [    ] o.a.s.s.SolrDispatchFilter solr.xml found in ZooKeeper. Loading...
   [junit4]   2> 464208 INFO  (jetty-launcher-19313-thread-2) [    ] o.e.j.s.h.ContextHandler Started o.e.j.s.ServletContextHandler@235cf8{/solr,null,AVAILABLE}
   [junit4]   2> 464208 INFO  (jetty-launcher-19313-thread-2) [    ] o.e.j.s.ServerConnector Started ServerConnector@13f80b4{HTTP/1.1,[http/1.1]}{127.0.0.1:38095}
   [junit4]   2> 464208 INFO  (jetty-launcher-19313-thread-2) [    ] o.e.j.s.Server Started @465424ms
   [junit4]   2> 464208 INFO  (jetty-launcher-19313-thread-2) [    ] o.a.s.c.s.e.JettySolrRunner Jetty properties: {hostContext=/solr, hostPort=38095}
   [junit4]   2> 464209 INFO  (jetty-launcher-19313-thread-2) [    ] o.a.s.s.SolrDispatchFilter SolrDispatchFilter.init(): sun.misc.Launcher$AppClassLoader@1d16e93
   [junit4]   2> 464209 INFO  (jetty-launcher-19313-thread-2) [    ] o.a.s.c.SolrResourceLoader new SolrResourceLoader for directory: '/home/jenkins/workspace/Lucene-Solr-6.x-Linux/solr/build/solr-core/test/J1/temp/solr.schema.TestManagedSchemaAPI_B7650CA29295C2C9-001/tempDir-001/node2'
   [junit4]   2> 464209 INFO  (jetty-launcher-19313-thread-2) [    ] o.a.s.c.SolrResourceLoader JNDI not configured for solr (NoInitialContextEx)
   [junit4]   2> 464209 INFO  (jetty-launcher-19313-thread-2) [    ] o.a.s.c.SolrResourceLoader solr home defaulted to 'solr/' (could not find system property or JNDI)
   [junit4]   2> 464209 INFO  (jetty-launcher-19313-thread-2) [    ] o.a.s.c.c.SolrZkClient Using default ZkCredentialsProvider
   [junit4]   2> 464209 INFO  (jetty-launcher-19313-thread-2) [    ] o.a.s.c.c.ConnectionManager Waiting for client to connect to ZooKeeper
   [junit4]   2> 464210 INFO  (zkCallback-19316-thread-1) [    ] o.a.s.c.c.ConnectionManager Watcher org.apache.solr.common.cloud.ConnectionManager@dd1ef name:ZooKeeperConnection Watcher:127.0.0.1:40070/solr got event WatchedEvent state:SyncConnected type:None path:null path:null type:None
   [junit4]   2> 464210 INFO  (jetty-launcher-19313-thread-2) [    ] o.a.s.c.c.ConnectionManager Client is connected to ZooKeeper
   [junit4]   2> 464210 INFO  (jetty-launcher-19313-thread-2) [    ] o.a.s.c.c.SolrZkClient Using default ZkACLProvider
   [junit4]   2> 464211 INFO  (jetty-launcher-19313-thread-2) [    ] o.a.s.s.SolrDispatchFilter solr.xml found in ZooKeeper. Loading...
   [junit4]   2> 464236 INFO  (jetty-launcher-19313-thread-1) [    ] o.a.s.c.CorePropertiesLocator Config-defined core root directory: /home/jenkins/workspace/Lucene-Solr-6.x-Linux/solr/build/solr-core/test/J1/temp/solr.schema.TestManagedSchemaAPI_B7650CA29295C2C9-001/tempDir-001/node1/.
   [junit4]   2> 464236 WARN  (NIOServerCxn.Factory:0.0.0.0/0.0.0.0:0) [    ] o.a.z.s.NIOServerCnxn caught end of stream exception
   [junit4]   2> EndOfStreamException: Unable to read additional data from client sessionid 0x1549871a1520002, likely client has closed socket
   [junit4]   2> 	at org.apache.zookeeper.server.NIOServerCnxn.doIO(NIOServerCnxn.java:228)
   [junit4]   2> 	at org.apache.zookeeper.server.NIOServerCnxnFactory.run(NIOServerCnxnFactory.java:208)
   [junit4]   2> 	at java.lang.Thread.run(Thread.java:745)
   [junit4]   2> 464236 INFO  (jetty-launcher-19313-thread-1) [    ] o.a.s.c.CoreContainer New CoreContainer 15527602
   [junit4]   2> 464236 INFO  (jetty-launcher-19313-thread-2) [    ] o.a.s.c.CorePropertiesLocator Config-defined core root directory: /home/jenkins/workspace/Lucene-Solr-6.x-Linux/solr/build/solr-core/test/J1/temp/solr.schema.TestManagedSchemaAPI_B7650CA29295C2C9-001/tempDir-001/node2/.
   [junit4]   2> 464236 INFO  (jetty-launcher-19313-thread-1) [    ] o.a.s.c.CoreContainer Loading cores into CoreContainer [instanceDir=/home/jenkins/workspace/Lucene-Solr-6.x-Linux/solr/build/solr-core/test/J1/temp/solr.schema.TestManagedSchemaAPI_B7650CA29295C2C9-001/tempDir-001/node1]
   [junit4]   2> 464236 INFO  (jetty-launcher-19313-thread-2) [    ] o.a.s.c.CoreContainer New CoreContainer 30978855
   [junit4]   2> 464236 INFO  (jetty-launcher-19313-thread-2) [    ] o.a.s.c.CoreContainer Loading cores into CoreContainer [instanceDir=/home/jenkins/workspace/Lucene-Solr-6.x-Linux/solr/build/solr-core/test/J1/temp/solr.schema.TestManagedSchemaAPI_B7650CA29295C2C9-001/tempDir-001/node2]
   [junit4]   2> 464236 WARN  (jetty-launcher-19313-thread-1) [    ] o.a.s.c.CoreContainer Couldn't add files from /home/jenkins/workspace/Lucene-Solr-6.x-Linux/solr/build/solr-core/test/J1/temp/solr.schema.TestManagedSchemaAPI_B7650CA29295C2C9-001/tempDir-001/node1/lib to classpath: /home/jenkins/workspace/Lucene-Solr-6.x-Linux/solr/build/solr-core/test/J1/temp/solr.schema.TestManagedSchemaAPI_B7650CA29295C2C9-001/tempDir-001/node1/lib
   [junit4]   2> 464236 WARN  (jetty-launcher-19313-thread-2) [    ] o.a.s.c.CoreContainer Couldn't add files from /home/jenkins/workspace/Lucene-Solr-6.x-Linux/solr/build/solr-core/test/J1/temp/solr.schema.TestManagedSchemaAPI_B7650CA29295C2C9-001/tempDir-001/node2/lib to classpath: /home/jenkins/workspace/Lucene-Solr-6.x-Linux/solr/build/solr-core/test/J1/temp/solr.schema.TestManagedSchemaAPI_B7650CA29295C2C9-001/tempDir-001/node2/lib
   [junit4]   2> 464236 INFO  (jetty-launcher-19313-thread-1) [    ] o.a.s.h.c.HttpShardHandlerFactory created with socketTimeout : 90000,urlScheme : ,connTimeout : 15000,maxConnectionsPerHost : 20,maxConnections : 10000,corePoolSize : 0,maximumPoolSize : 2147483647,maxThreadIdleTime : 5,sizeOfQueue : -1,fairnessPolicy : false,useRetries : false,
   [junit4]   2> 464236 INFO  (jetty-launcher-19313-thread-2) [    ] o.a.s.h.c.HttpShardHandlerFactory created with socketTimeout : 90000,urlScheme : ,connTimeout : 15000,maxConnectionsPerHost : 20,maxConnections : 10000,corePoolSize : 0,maximumPoolSize : 2147483647,maxThreadIdleTime : 5,sizeOfQueue : -1,fairnessPolicy : false,useRetries : false,
   [junit4]   2> 464238 INFO  (jetty-launcher-19313-thread-2) [    ] o.a.s.u.UpdateShardHandler Creating UpdateShardHandler HTTP client with params: socketTimeout=340000&connTimeout=45000&retry=true
   [junit4]   2> 464238 INFO  (jetty-launcher-19313-thread-1) [    ] o.a.s.u.UpdateShardHandler Creating UpdateShardHandler HTTP client with params: socketTimeout=340000&connTimeout=45000&retry=true
   [junit4]   2> 464239 INFO  (jetty-launcher-19313-thread-2) [    ] o.a.s.l.LogWatcher SLF4J impl is org.slf4j.impl.Log4jLoggerFactory
   [junit4]   2> 464239 INFO  (jetty-launcher-19313-thread-1) [    ] o.a.s.l.LogWatcher SLF4J impl is org.slf4j.impl.Log4jLoggerFactory
   [junit4]   2> 464239 INFO  (jetty-launcher-19313-thread-2) [    ] o.a.s.l.LogWatcher Registering Log Listener [Log4j (org.slf4j.impl.Log4jLoggerFactory)]
   [junit4]   2> 464239 INFO  (jetty-launcher-19313-thread-1) [    ] o.a.s.l.LogWatcher Registering Log Listener [Log4j (org.slf4j.impl.Log4jLoggerFactory)]
   [junit4]   2> 464239 INFO  (jetty-launcher-19313-thread-1) [    ] o.a.s.c.ZkContainer Zookeeper client=127.0.0.1:40070/solr
   [junit4]   2> 464239 INFO  (jetty-launcher-19313-thread-2) [    ] o.a.s.c.ZkContainer Zookeeper client=127.0.0.1:40070/solr
   [junit4]   2> 464239 INFO  (jetty-launcher-19313-thread-1) [    ] o.a.s.c.ZkController zkHost includes chroot
   [junit4]   2> 464240 INFO  (jetty-launcher-19313-thread-2) [    ] o.a.s.c.ZkController zkHost includes chroot
   [junit4]   2> 464240 INFO  (jetty-launcher-19313-thread-1) [    ] o.a.s.c.c.SolrZkClient Using default ZkCredentialsProvider
   [junit4]   2> 464240 INFO  (jetty-launcher-19313-thread-2) [    ] o.a.s.c.c.SolrZkClient Using default ZkCredentialsProvider
   [junit4]   2> 464240 INFO  (jetty-launcher-19313-thread-2) [    ] o.a.s.c.c.ConnectionManager Waiting for client to connect to ZooKeeper
   [junit4]   2> 464240 INFO  (jetty-launcher-19313-thread-1) [    ] o.a.s.c.c.ConnectionManager Waiting for client to connect to ZooKeeper
   [junit4]   2> 464241 INFO  (zkCallback-19322-thread-1) [    ] o.a.s.c.c.ConnectionManager Watcher org.apache.solr.common.cloud.ConnectionManager@c69634 name:ZooKeeperConnection Watcher:127.0.0.1:40070 got event WatchedEvent state:SyncConnected type:None path:null path:null type:None
   [junit4]   2> 464241 INFO  (jetty-launcher-19313-thread-2) [    ] o.a.s.c.c.ConnectionManager Client is connected to ZooKeeper
   [junit4]   2> 464241 INFO  (zkCallback-19321-thread-1) [    ] o.a.s.c.c.ConnectionManager Watcher org.apache.solr.common.cloud.ConnectionManager@1b08e48 name:ZooKeeperConnection Watcher:127.0.0.1:40070 got event WatchedEvent state:SyncConnected type:None path:null path:null type:None
   [junit4]   2> 464241 INFO  (jetty-launcher-19313-thread-1) [    ] o.a.s.c.c.ConnectionManager Client is connected to ZooKeeper
   [junit4]   2> 464241 INFO  (jetty-launcher-19313-thread-2) [    ] o.a.s.c.c.SolrZkClient Using default ZkACLProvider
   [junit4]   2> 464242 INFO  (jetty-launcher-19313-thread-1) [    ] o.a.s.c.c.SolrZkClient Using default ZkACLProvider
   [junit4]   2> 464242 WARN  (NIOServerCxn.Factory:0.0.0.0/0.0.0.0:0) [    ] o.a.z.s.NIOServerCnxn caught end of stream exception
   [junit4]   2> EndOfStreamException: Unable to read additional data from client sessionid 0x1549871a1520004, likely client has closed socket
   [junit4]   2> 	at org.apache.zookeeper.server.NIOServerCnxn.doIO(NIOServerCnxn.java:228)
   [junit4]   2> 	at org.apache.zookeeper.server.NIOServerCnxnFactory.run(NIOServerCnxnFactory.java:208)
   [junit4]   2> 	at java.lang.Thread.run(Thread.java:745)
   [junit4]   2> 464242 INFO  (jetty-launcher-19313-thread-1) [n:127.0.0.1:36348_solr    ] o.a.s.c.ZkController Added new OnReconnect listener org.apache.solr.cloud.ZkController$$Lambda$53/10392504@706d74
   [junit4]   2> 464242 INFO  (jetty-launcher-19313-thread-2) [n:127.0.0.1:38095_solr    ] o.a.s.c.ZkController Added new OnReconnect listener org.apache.solr.cloud.ZkController$$Lambda$53/10392504@11ddbb8
   [junit4]   2> 464243 INFO  (jetty-launcher-19313-thread-1) [n:127.0.0.1:36348_solr    ] o.a.s.c.c.ConnectionManager Waiting for client to connect to ZooKeeper
   [junit4]   2> 464243 INFO  (jetty-launcher-19313-thread-2) [n:127.0.0.1:38095_solr    ] o.a.s.c.c.ConnectionManager Waiting for client to connect to ZooKeeper
   [junit4]   2> 464243 INFO  (zkCallback-19323-thread-1-processing-n:127.0.0.1:36348_solr) [n:127.0.0.1:36348_solr    ] o.a.s.c.c.ConnectionManager Watcher org.apache.solr.common.cloud.ConnectionManager@1586464 name:ZooKeeperConnection Watcher:127.0.0.1:40070/solr got event WatchedEvent state:SyncConnected type:None path:null path:null type:None
   [junit4]   2> 464244 INFO  (jetty-launcher-19313-thread-1) [n:127.0.0.1:36348_solr    ] o.a.s.c.c.ConnectionManager Client is connected to ZooKeeper
   [junit4]   2> 464244 INFO  (zkCallback-19324-thread-1-processing-n:127.0.0.1:38095_solr) [n:127.0.0.1:38095_solr    ] o.a.s.c.c.ConnectionManager Watcher org.apache.solr.common.cloud.ConnectionManager@8585f6 name:ZooKeeperConnection Watcher:127.0.0.1:40070/solr got event WatchedEvent state:SyncConnected type:None path:null path:null type:None
   [junit4]   2> 464244 INFO  (jetty-launcher-19313-thread-2) [n:127.0.0.1:38095_solr    ] o.a.s.c.c.ConnectionManager Client is connected to ZooKeeper
   [junit4]   2> 464244 INFO  (jetty-launcher-19313-thread-1) [n:127.0.0.1:36348_solr    ] o.a.s.c.c.SolrZkClient makePath: /overseer/queue
   [junit4]   2> 464244 INFO  (jetty-launcher-19313-thread-2) [n:127.0.0.1:38095_solr    ] o.a.s.c.c.SolrZkClient makePath: /overseer/queue
   [junit4]   2> 464245 INFO  (jetty-launcher-19313-thread-2) [n:127.0.0.1:38095_solr    ] o.a.s.c.c.SolrZkClient makePath: /overseer/collection-queue-work
   [junit4]   2> 464245 INFO  (jetty-launcher-19313-thread-1) [n:127.0.0.1:36348_solr    ] o.a.s.c.c.SolrZkClient makePath: /overseer/collection-queue-work
   [junit4]   2> 464260 INFO  (jetty-launcher-19313-thread-2) [n:127.0.0.1:38095_solr    ] o.a.s.c.c.SolrZkClient makePath: /overseer/collection-map-running
   [junit4]   2> 464260 INFO  (jetty-launcher-19313-thread-1) [n:127.0.0.1:36348_solr    ] o.a.s.c.c.SolrZkClient makePath: /overseer/collection-map-running
   [junit4]   2> 464261 INFO  (jetty-launcher-19313-thread-1) [n:127.0.0.1:36348_solr    ] o.a.s.c.c.SolrZkClient makePath: /overseer/collection-map-completed
   [junit4]   2> 464261 INFO  (jetty-launcher-19313-thread-2) [n:127.0.0.1:38095_solr    ] o.a.s.c.c.SolrZkClient makePath: /overseer/collection-map-completed
   [junit4]   2> 464263 INFO  (jetty-launcher-19313-thread-2) [n:127.0.0.1:38095_solr    ] o.a.s.c.c.SolrZkClient makePath: /overseer/collection-map-failure
   [junit4]   2> 464263 INFO  (jetty-launcher-19313-thread-1) [n:127.0.0.1:36348_solr    ] o.a.s.c.c.SolrZkClient makePath: /overseer/collection-map-failure
   [junit4]   2> 464264 INFO  (jetty-launcher-19313-thread-2) [n:127.0.0.1:38095_solr    ] o.a.s.c.c.SolrZkClient makePath: /live_nodes
   [junit4]   2> 464264 INFO  (jetty-launcher-19313-thread-1) [n:127.0.0.1:36348_solr    ] o.a.s.c.c.SolrZkClient makePath: /live_nodes
   [junit4]   2> 464265 INFO  (jetty-launcher-19313-thread-1) [n:127.0.0.1:36348_solr    ] o.a.s.c.c.SolrZkClient makePath: /collections
   [junit4]   2> 464265 INFO  (jetty-launcher-19313-thread-2) [n:127.0.0.1:38095_solr    ] o.a.s.c.c.SolrZkClient makePath: /collections
   [junit4]   2> 464265 INFO  (jetty-launcher-19313-thread-2) [n:127.0.0.1:38095_solr    ] o.a.s.c.c.SolrZkClient makePath: /aliases.json
   [junit4]   2> 464265 INFO  (jetty-launcher-19313-thread-1) [n:127.0.0.1:36348_solr    ] o.a.s.c.c.SolrZkClient makePath: /aliases.json
   [junit4]   2> 464266 INFO  (jetty-launcher-19313-thread-1) [n:127.0.0.1:36348_solr    ] o.a.s.c.c.SolrZkClient makePath: /clusterstate.json
   [junit4]   2> 464266 INFO  (jetty-launcher-19313-thread-2) [n:127.0.0.1:38095_solr    ] o.a.s.c.c.SolrZkClient makePath: /clusterstate.json
   [junit4]   2> 464267 INFO  (jetty-launcher-19313-thread-2) [n:127.0.0.1:38095_solr    ] o.a.s.c.c.SolrZkClient makePath: /security.json
   [junit4]   2> 464267 INFO  (jetty-launcher-19313-thread-1) [n:127.0.0.1:36348_solr    ] o.a.s.c.c.SolrZkClient makePath: /security.json
   [junit4]   2> 464267 INFO  (jetty-launcher-19313-thread-1) [n:127.0.0.1:36348_solr    ] o.a.s.c.c.ZkStateReader Updating cluster state from ZooKeeper... 
   [junit4]   2> 464267 INFO  (jetty-launcher-19313-thread-2) [n:127.0.0.1:38095_solr    ] o.a.s.c.c.ZkStateReader Updating cluster state from ZooKeeper... 
   [junit4]   2> 464268 INFO  (jetty-launcher-19313-thread-1) [n:127.0.0.1:36348_solr    ] o.a.s.c.c.ZkStateReader Updated live nodes from ZooKeeper... (0) -> (0)
   [junit4]   2> 464268 INFO  (jetty-launcher-19313-thread-2) [n:127.0.0.1:38095_solr    ] o.a.s.c.c.ZkStateReader Updated live nodes from ZooKeeper... (0) -> (0)
   [junit4]   2> 464269 INFO  (jetty-launcher-19313-thread-2) [n:127.0.0.1:38095_solr    ] o.a.s.c.c.SolrZkClient makePath: /overseer_elect
   [junit4]   2> 464269 INFO  (jetty-launcher-19313-thread-1) [n:127.0.0.1:36348_solr    ] o.a.s.c.c.SolrZkClient makePath: /overseer_elect
   [junit4]   2> 464269 INFO  (jetty-launcher-19313-thread-1) [n:127.0.0.1:36348_solr    ] o.a.s.c.c.SolrZkClient makePath: /overseer_elect/election
   [junit4]   2> 464270 INFO  (jetty-launcher-19313-thread-2) [n:127.0.0.1:38095_solr    ] o.a.s.c.c.SolrZkClient makePath: /overseer_elect/election
   [junit4]   2> 464270 INFO  (jetty-launcher-19313-thread-2) [n:127.0.0.1:38095_solr    ] o.a.s.c.Overseer Overseer (id=null) closing
   [junit4]   2> 464270 INFO  (jetty-launcher-19313-thread-1) [n:127.0.0.1:36348_solr    ] o.a.s.c.Overseer Overseer (id=null) closing
   [junit4]   2> 464270 INFO  (jetty-launcher-19313-thread-2) [n:127.0.0.1:38095_solr    ] o.a.s.c.LeaderElector Joined leadership election with path: /overseer_elect/election/95869105886855174-127.0.0.1:38095_solr-n_0000000000
   [junit4]   2> 464271 INFO  (jetty-launcher-19313-thread-1) [n:127.0.0.1:36348_solr    ] o.a.s.c.LeaderElector Joined leadership election with path: /overseer_elect/election/95869105886855173-127.0.0.1:36348_solr-n_0000000001
   [junit4]   2> 464271 INFO  (jetty-launcher-19313-thread-2) [n:127.0.0.1:38095_solr    ] o.a.s.c.OverseerElectionContext I am going to be the leader 127.0.0.1:38095_solr
   [junit4]   2> 464271 INFO  (jetty-launcher-19313-thread-2) [n:127.0.0.1:38095_solr    ] o.a.s.c.c.SolrZkClient makePath: /overseer_elect/leader
   [junit4]   2> 464271 INFO  (jetty-launcher-19313-thread-1) [n:127.0.0.1:36348_solr    ] o.a.s.c.LeaderElector Watching path /overseer_elect/election/95869105886855174-127.0.0.1:38095_solr-n_0000000000 to know if I could be the leader
   [junit4]   2> 464271 INFO  (jetty-launcher-19313-thread-1) [n:127.0.0.1:36348_solr    ] o.a.s.c.ZkController Register node as live in ZooKeeper:/live_nodes/127.0.0.1:36348_solr
   [junit4]   2> 464272 INFO  (jetty-launcher-19313-thread-1) [n:127.0.0.1:36348_solr    ] o.a.s.c.c.SolrZkClient makePath: /live_nodes/127.0.0.1:36348_solr
   [junit4]   2> 464272 INFO  (jetty-launcher-19313-thread-2) [n:127.0.0.1:38095_solr    ] o.a.s.c.Overseer Overseer (id=95869105886855174-127.0.0.1:38095_solr-n_0000000000) starting
   [junit4]   2> 464272 INFO  (zkCallback-19323-thread-1-processing-n:127.0.0.1:36348_solr) [n:127.0.0.1:36348_solr    ] o.a.s.c.c.ZkStateReader A live node change: [WatchedEvent state:SyncConnected type:NodeChildrenChanged path:/live_nodes], has occurred - updating... (live nodes size: [0])
   [junit4]   2> 464272 INFO  (zkCallback-19324-thread-1-processing-n:127.0.0.1:38095_solr) [n:127.0.0.1:38095_solr    ] o.a.s.c.c.ZkStateReader A live node change: [WatchedEvent state:SyncConnected type:NodeChildrenChanged path:/live_nodes], has occurred - updating... (live nodes size: [0])
   [junit4]   2> 464275 INFO  (zkCallback-19324-thread-1-processing-n:127.0.0.1:38095_solr) [n:127.0.0.1:38095_solr    ] o.a.s.c.c.ZkStateReader Updated live nodes from ZooKeeper... (0) -> (1)
   [junit4]   2> 464275 INFO  (zkCallback-19323-thread-1-processing-n:127.0.0.1:36348_solr) [n:127.0.0.1:36348_solr    ] o.a.s.c.c.ZkStateReader Updated live nodes from ZooKeeper... (0) -> (1)
   [junit4]   2> 464275 INFO  (jetty-launcher-19313-thread-2) [n:127.0.0.1:38095_solr    ] o.a.s.c.c.SolrZkClient makePath: /overseer/queue-work
   [junit4]   2> 464293 INFO  (jetty-launcher-19313-thread-2) [n:127.0.0.1:38095_solr    ] o.a.s.c.OverseerAutoReplicaFailoverThread Starting OverseerAutoReplicaFailoverThread autoReplicaFailoverWorkLoopDelay=10000 autoReplicaFailoverWaitAfterExpiration=30000 autoReplicaFailoverBadNodeExpiration=60000
   [junit4]   2> 464293 INFO  (OverseerCollectionConfigSetProcessor-95869105886855174-127.0.0.1:38095_solr-n_0000000000) [n:127.0.0.1:38095_solr    ] o.a.s.c.OverseerTaskProcessor Process current queue of overseer operations
   [junit4]   2> 464293 INFO  (jetty-launcher-19313-thread-2) [n:127.0.0.1:38095_solr    ] o.a.s.c.ZkController Publish node=127.0.0.1:38095_solr as DOWN
   [junit4]   2> 464293 INFO  (OverseerStateUpdate-95869105886855174-127.0.0.1:38095_solr-n_0000000000) [n:127.0.0.1:38095_solr    ] o.a.s.c.Overseer Starting to work on the main queue
   [junit4]   2> 464295 INFO  (OverseerStateUpdate-95869105886855174-127.0.0.1:38095_solr-n_0000000000) [n:127.0.0.1:38095_solr    ] o.a.s.c.c.ZkStateReader Updated live nodes from ZooKeeper... (1) -> (1)
   [junit4]   2> 464295 INFO  (OverseerStateUpdate-95869105886855174-127.0.0.1:38095_solr-n_0000000000) [n:127.0.0.1:38095_solr    ] o.a.s.c.Overseer processMessage: queueSize: 1, message = {
   [junit4]   2>   "operation":"downnode",
   [junit4]   2>   "node_name":"127.0.0.1:38095_solr"} current state version: 0
   [junit4]   2> 464296 INFO  (OverseerStateUpdate-95869105886855174-127.0.0.1:38095_solr-n_0000000000) [n:127.0.0.1:38095_solr    ] o.a.s.c.o.NodeMutator DownNode state invoked for node: 127.0.0.1:38095_solr
   [junit4]   2> 464345 INFO  (jetty-launcher-19313-thread-1) [n:127.0.0.1:36348_solr    ] o.a.s.c.CoreContainer Security conf doesn't exist. Skipping setup for authorization module.
   [junit4]   2> 464345 INFO  (jetty-launcher-19313-thread-1) [n:127.0.0.1:36348_solr    ] o.a.s.c.CoreContainer No authentication plugin used.
   [junit4]   2> 464347 INFO  (jetty-launcher-19313-thread-1) [n:127.0.0.1:36348_solr    ] o.a.s.c.CorePropertiesLocator Looking for core definitions underneath /home/jenkins/workspace/Lucene-Solr-6.x-Linux/solr/build/solr-core/test/J1/temp/solr.schema.TestManagedSchemaAPI_B7650CA29295C2C9-001/tempDir-001/node1/.
   [junit4]   2> 464347 INFO  (jetty-launcher-19313-thread-1) [n:127.0.0.1:36348_solr    ] o.a.s.c.CorePropertiesLocator Found 0 core definitions
   [junit4]   2> 464348 INFO  (jetty-launcher-19313-thread-1) [n:127.0.0.1:36348_solr    ] o.a.s.s.SolrDispatchFilter user.dir=/home/jenkins/workspace/Lucene-Solr-6.x-Linux/solr/build/solr-core/test/J1
   [junit4]   2> 464348 INFO  (jetty-launcher-19313-thread-1) [n:127.0.0.1:36348_solr    ] o.a.s.s.SolrDispatchFilter SolrDispatchFilter.init() done
   [junit4]   2> 465295 INFO  (jetty-launcher-19313-thread-2) [n:127.0.0.1:38095_solr    ] o.a.s.c.ZkController Register node as live in ZooKeeper:/live_nodes/127.0.0.1:38095_solr
   [junit4]   2> 465295 INFO  (jetty-launcher-19313-thread-2) [n:127.0.0.1:38095_solr    ] o.a.s.c.c.SolrZkClient makePath: /live_nodes/127.0.0.1:38095_solr
   [junit4]   2> 465296 INFO  (zkCallback-19323-thread-1-processing-n:127.0.0.1:36348_solr) [n:127.0.0.1:36348_solr    ] o.a.s.c.c.ZkStateReader A live node change: [WatchedEvent state:SyncConnected type:NodeChildrenChanged path:/live_nodes], has occurred - updating... (live nodes size: [1])
   [junit4]   2> 465296 INFO  (zkCallback-19324-thread-1-processing-n:127.0.0.1:38095_solr) [n:127.0.0.1:38095_solr    ] o.a.s.c.c.ZkStateReader A live node change: [WatchedEvent state:SyncConnected type:NodeChildrenChanged path:/live_nodes], has occurred - updating... (live nodes size: [1])
   [junit4]   2> 465296 INFO  (zkCallback-19323-thread-1-processing-n:127.0.0.1:36348_solr) [n:127.0.0.1:36348_solr    ] o.a.s.c.c.ZkStateReader Updated live nodes from ZooKeeper... (1) -> (2)
   [junit4]   2> 465296 INFO  (zkCallback-19324-thread-1-processing-n:127.0.0.1:38095_solr) [n:127.0.0.1:38095_solr    ] o.a.s.c.c.ZkStateReader Updated live nodes from ZooKeeper... (1) -> (2)
   [junit4]   2> 465343 INFO  (jetty-launcher-19313-thread-2) [n:127.0.0.1:38095_solr    ] o.a.s.c.CoreContainer Security conf doesn't exist. Skipping setup for authorization module.
   [junit4]   2> 465343 INFO  (jetty-launcher-19313-thread-2) [n:127.0.0.1:38095_solr    ] o.a.s.c.CoreContainer No authentication plugin used.
   [junit4]   2> 465344 INFO  (jetty-launcher-19313-thread-2) [n:127.0.0.1:38095_solr    ] o.a.s.c.CorePropertiesLocator Looking for core definitions underneath /home/jenkins/workspace/Lucene-Solr-6.x-Linux/solr/build/solr-core/test/J1/temp/solr.schema.TestManagedSchemaAPI_B7650CA29295C2C9-001/tempDir-001/node2/.
   [junit4]   2> 465344 INFO  (jetty-launcher-19313-thread-2) [n:127.0.0.1:38095_solr    ] o.a.s.c.CorePropertiesLocator Found 0 core definitions
   [junit4]   2> 465345 INFO  (jetty-launcher-19313-thread-2) [n:127.0.0.1:38095_solr    ] o.a.s.s.SolrDispatchFilter user.dir=/home/jenkins/workspace/Lucene-Solr-6.x-Linux/solr/build/solr-core/test/J1
   [junit4]   2> 465345 INFO  (jetty-launcher-19313-thread-2) [n:127.0.0.1:38095_solr    ] o.a.s.s.SolrDispatchFilter SolrDispatchFilter.init() done
   [junit4]   2> 465345 INFO  (SUITE-TestManagedSchemaAPI-seed#[B7650CA29295C2C9]-worker) [    ] o.a.s.c.c.SolrZkClient Using default ZkCredentialsProvider
   [junit4]   2> 465345 INFO  (SUITE-TestManagedSchemaAPI-seed#[B7650CA29295C2C9]-worker) [    ] o.a.s.c.c.ConnectionManager Waiting for client to connect to ZooKeeper
   [junit4]   2> 465347 INFO  (zkCallback-19325-thread-1) [    ] o.a.s.c.c.ConnectionManager Watcher org.apache.solr.common.cloud.ConnectionManager@6761d0 name:ZooKeeperConnection Watcher:127.0.0.1:40070 got event WatchedEvent state:SyncConnected type:None path:null path:null type:None
   [junit4]   2> 465347 INFO  (SUITE-TestManagedSchemaAPI-seed#[B7650CA29295C2C9]-worker) [    ] o.a.s.c.c.ConnectionManager Client is connected to ZooKeeper
   [junit4]   2> 465347 INFO  (SUITE-TestManagedSchemaAPI-seed#[B7650CA29295C2C9]-worker) [    ] o.a.s.c.c.SolrZkClient Using default ZkACLProvider
   [junit4]   2> 465348 INFO  (SUITE-TestManagedSchemaAPI-seed#[B7650CA29295C2C9]-worker) [    ] o.a.s.c.s.i.CloudSolrClient Final constructed zkHost string: 127.0.0.1:40070/solr
   [junit4]   2> 465348 INFO  (SUITE-TestManagedSchemaAPI-seed#[B7650CA29295C2C9]-worker) [    ] o.a.s.c.c.SolrZkClient Using default ZkCredentialsProvider
   [junit4]   2> 465349 INFO  (SUITE-TestManagedSchemaAPI-seed#[B7650CA29295C2C9]-worker) [    ] o.a.s.c.c.ConnectionManager Waiting for client to connect to ZooKeeper
   [junit4]   2> 465349 INFO  (zkCallback-19327-thread-1) [    ] o.a.s.c.c.ConnectionManager Watcher org.apache.solr.common.cloud.ConnectionManager@115f732 name:ZooKeeperConnection Watcher:127.0.0.1:40070/solr got event WatchedEvent state:SyncConnected type:None path:null path:null type:None
   [junit4]   2> 465349 INFO  (SUITE-TestManagedSchemaAPI-seed#[B7650CA29295C2C9]-worker) [    ] o.a.s.c.c.ConnectionManager Client is connected to ZooKeeper
   [junit4]   2> 465350 INFO  (SUITE-TestManagedSchemaAPI-seed#[B7650CA29295C2C9]-worker) [    ] o.a.s.c.c.SolrZkClient Using default ZkACLProvider
   [junit4]   2> 465350 INFO  (SUITE-TestManagedSchemaAPI-seed#[B7650CA29295C2C9]-worker) [    ] o.a.s.c.c.ZkStateReader Updating cluster state from ZooKeeper... 
   [junit4]   2> 465351 INFO  (SUITE-TestManagedSchemaAPI-seed#[B7650CA29295C2C9]-worker) [    ] o.a.s.c.c.ZkStateReader Updated live nodes from ZooKeeper... (0) -> (2)
   [junit4]   2> 465351 INFO  (SUITE-TestManagedSchemaAPI-seed#[B7650CA29295C2C9]-worker) [    ] o.a.s.c.c.SolrZkClient makePath: /configs/conf1/solrconfig.xml
   [junit4]   2> 465353 INFO  (SUITE-TestManagedSchemaAPI-seed#[B7650CA29295C2C9]-worker) [    ] o.a.s.c.c.SolrZkClient makePath: /configs/conf1/managed-schema
   [junit4]   2> 465367 INFO  (TEST-TestManagedSchemaAPI.test-seed#[B7650CA29295C2C9]) [    ] o.a.s.SolrTestCaseJ4 ###Starting test
   [junit4]   2> 465371 INFO  (qtp7138856-71733) [n:127.0.0.1:38095_solr    ] o.a.s.h.a.CollectionsHandler Invoked Collection Action :create with params replicationFactor=2&collection.configName=conf1&name=testschemaapi&action=CREATE&numShards=1&wt=javabin&version=2 and sendToOCPQueue=true
   [junit4]   2> 465372 INFO  (OverseerCollectionConfigSetProcessor-95869105886855174-127.0.0.1:38095_solr-n_0000000000) [n:127.0.0.1:38095_solr    ] o.a.s.c.OverseerTaskProcessor Overseer Collection Message Handler: Get the message id:/overseer/collection-queue-work/qn-0000000000 message:{
   [junit4]   2>   "name":"testschemaapi",
   [junit4]   2>   "fromApi":"true",
   [junit4]   2>   "replicationFactor":"2",
   [junit4]   2>   "collection.configName":"conf1",
   [junit4]   2>   "numShards":"1",
   [junit4]   2>   "stateFormat":"2",
   [junit4]   2>   "operation":"create"}
   [junit4]   2> 465372 INFO  (OverseerThreadFactory-4938-thread-1-processing-n:127.0.0.1:38095_solr) [n:127.0.0.1:38095_solr    ] o.a.s.c.OverseerCollectionMessageHandler OverseerCollectionMessageHandler.processMessage : create , {
   [junit4]   2>   "name":"testschemaapi",
   [junit4]   2>   "fromApi":"true",
   [junit4]   2>   "replicationFactor":"2",
   [junit4]   2>   "collection.configName":"conf1",
   [junit4]   2>   "numShards":"1",
   [junit4]   2>   "stateFormat":"2",
   [junit4]   2>   "operation":"create"}
   [junit4]   2> 465373 INFO  (OverseerThreadFactory-4938-thread-1-processing-n:127.0.0.1:38095_solr) [n:127.0.0.1:38095_solr    ] o.a.s.c.OverseerCollectionMessageHandler Create collection testschemaapi
   [junit4]   2> 465373 INFO  (OverseerThreadFactory-4938-thread-1-processing-n:127.0.0.1:38095_solr) [n:127.0.0.1:38095_solr    ] o.a.s.c.OverseerCollectionMessageHandler creating collections conf node /collections/testschemaapi 
   [junit4]   2> 465373 INFO  (OverseerThreadFactory-4938-thread-1-processing-n:127.0.0.1:38095_solr) [n:127.0.0.1:38095_solr    ] o.a.s.c.c.SolrZkClient makePath: /collections/testschemaapi
   [junit4]   2> 465373 INFO  (zkCallback-19327-thread-1) [    ] o.a.s.c.c.ZkStateReader A collections change: [WatchedEvent state:SyncConnected type:NodeChildrenChanged path:/collections], has occurred - updating...
   [junit4]   2> 465374 INFO  (zkCallback-19324-thread-1-processing-n:127.0.0.1:38095_solr) [n:127.0.0.1:38095_solr    ] o.a.s.c.c.ZkStateReader A collections change: [WatchedEvent state:SyncConnected type:NodeChildrenChanged path:/collections], has occurred - updating...
   [junit4]   2> 465374 INFO  (zkCallback-19323-thread-1-processing-n:127.0.0.1:36348_solr) [n:127.0.0.1:36348_solr    ] o.a.s.c.c.ZkStateReader A collections change: [WatchedEvent state:SyncConnected type:NodeChildrenChanged path:/collections], has occurred - updating...
   [junit4]   2> 465375 INFO  (OverseerStateUpdate-95869105886855174-127.0.0.1:38095_solr-n_0000000000) [n:127.0.0.1:38095_solr    ] o.a.s.c.Overseer processMessage: queueSize: 1, message = {
   [junit4]   2>   "name":"testschemaapi",
   [junit4]   2>   "fromApi":"true",
   [junit4]   2>   "replicationFactor":"2",
   [junit4]   2>   "collection.configName":"conf1",
   [junit4]   2>   "numShards":"1",
   [junit4]   2>   "stateFormat":"2",
   [junit4]   2>   "operation":"create"} current state version: 0
   [junit4]   2> 465375 INFO  (OverseerStateUpdate-95869105886855174-127.0.0.1:38095_solr-n_0000000000) [n:127.0.0.1:38095_solr    ] o.a.s.c.o.ClusterStateMutator building a new cName: testschemaapi
   [junit4]   2> 465376 INFO  (OverseerStateUpdate-95869105886855174-127.0.0.1:38095_solr-n_0000000000) [n:127.0.0.1:38095_solr    ] o.a.s.c.o.ZkStateWriter going to create_collection /collections/testschemaapi/state.json
   [junit4]   2> 465476 INFO  (OverseerThreadFactory-4938-thread-1-processing-n:127.0.0.1:38095_solr) [n:127.0.0.1:38095_solr    ] o.a.s.c.OverseerCollectionMessageHandler Creating SolrCores for new collection testschemaapi, shardNames [shard1] , replicationFactor : 2
   [junit4]   2> 465476 INFO  (OverseerThreadFactory-4938-thread-1-processing-n:127.0.0.1:38095_solr) [n:127.0.0.1:38095_solr    ] o.a.s.c.OverseerCollectionMessageHandler Creating core testschemaapi_shard1_replica2 as part of shard shard1 of collection testschemaapi on 127.0.0.1:36348_solr
   [junit4]   2> 465476 INFO  (OverseerThreadFactory-4938-thread-1-processing-n:127.0.0.1:38095_solr) [n:127.0.0.1:38095_solr    ] o.a.s.c.OverseerCollectionMessageHandler Creating core testschemaapi_shard1_replica1 as part of shard shard1 of collection testschemaapi on 127.0.0.1:38095_solr
   [junit4]   2> 465478 INFO  (qtp7138856-71729) [n:127.0.0.1:38095_solr    ] o.a.s.h.a.CoreAdminOperation core create command qt=/admin/cores&collection.configName=conf1&name=testschemaapi_shard1_replica1&action=CREATE&numShards=1&collection=testschemaapi&shard=shard1&wt=javabin&version=2
   [junit4]   2> 465478 INFO  (qtp628113-71720) [n:127.0.0.1:36348_solr    ] o.a.s.h.a.CoreAdminOperation core create command qt=/admin/cores&collection.configName=conf1&name=testschemaapi_shard1_replica2&action=CREATE&numShards=1&collection=testschemaapi&shard=shard1&wt=javabin&version=2
   [junit4]   2> 465479 INFO  (qtp7138856-71729) [n:127.0.0.1:38095_solr    ] o.a.s.c.CoreDescriptor Created CoreDescriptor: {name=testschemaapi_shard1_replica1, collection.configName=conf1, config=solrconfig.xml, transient=false, schema=schema.xml, loadOnStartup=true, configSetProperties=configsetprops.json, collection=testschemaapi, numShards=1, dataDir=data/, shard=shard1}
   [junit4]   2> 465479 INFO  (qtp628113-71720) [n:127.0.0.1:36348_solr    ] o.a.s.c.CoreDescriptor Created CoreDescriptor: {name=testschemaapi_shard1_replica2, collection.configName=conf1, config=solrconfig.xml, transient=false, schema=schema.xml, loadOnStartup=true, configSetProperties=configsetprops.json, collection=testschemaapi, numShards=1, dataDir=data/, shard=shard1}
   [junit4]   2> 465480 INFO  (qtp7138856-71729) [n:127.0.0.1:38095_solr c:testschemaapi s:shard1  x:testschemaapi_shard1_replica1] o.a.s.c.ZkController publishing state=down
   [junit4]   2> 465480 INFO  (qtp628113-71720) [n:127.0.0.1:36348_solr c:testschemaapi s:shard1  x:testschemaapi_shard1_replica2] o.a.s.c.ZkController publishing state=down
   [junit4]   2> 465480 INFO  (qtp628113-71720) [n:127.0.0.1:36348_solr c:testschemaapi s:shard1  x:testschemaapi_shard1_replica2] o.a.s.c.ZkController Registering watch for collection testschemaapi
   [junit4]   2> 465480 INFO  (qtp628113-71720) [n:127.0.0.1:36348_solr c:testschemaapi s:shard1  x:testschemaapi_shard1_replica2] o.a.s.c.c.ZkStateReader addZkWatch [testschemaapi]
   [junit4]   2> 465481 INFO  (qtp7138856-71729) [n:127.0.0.1:38095_solr c:testschemaapi s:shard1  x:testschemaapi_shard1_replica1] o.a.s.c.ZkController Registering watch for collection testschemaapi
   [junit4]   2> 465481 INFO  (qtp7138856-71729) [n:127.0.0.1:38095_solr c:testschemaapi s:shard1  x:testschemaapi_shard1_replica1] o.a.s.c.c.ZkStateReader addZkWatch [testschemaapi]
   [junit4]   2> 465481 INFO  (OverseerStateUpdate-95869105886855174-127.0.0.1:38095_solr-n_0000000000) [n:127.0.0.1:38095_solr    ] o.a.s.c.Overseer processMessage: queueSize: 2, message = {
   [junit4]   2>   "core":"testschemaapi_shard1_replica1",
   [junit4]   2>   "roles":null,
   [junit4]   2>   "base_url":"http://127.0.0.1:38095/solr",
   [junit4]   2>   "node_name":"127.0.0.1:38095_solr",
   [junit4]   2>   "numShards":"1",
   [junit4]   2>   "state":"down",
   [junit4]   2>   "shard":"shard1",
   [junit4]   2>   "collection":"testschemaapi",
   [junit4]   2>   "operation":"state"} current state version: 0
   [junit4]   2> 465481 INFO  (qtp628113-71720) [n:127.0.0.1:36348_solr c:testschemaapi s:shard1  x:testschemaapi_shard1_replica2] o.a.s.c.c.ZkStateReader Add data for [testschemaapi] ver [0]
   [junit4]   2> 465481 INFO  (qtp628113-71720) [n:127.0.0.1:36348_solr c:testschemaapi s:shard1  x:testschemaapi_shard1_replica2] o.a.s.c.ZkController look for our core node name
   [junit4]   2> 465481 INFO  (qtp7138856-71729) [n:127.0.0.1:38095_solr c:testschemaapi s:shard1  x:testschemaapi_shard1_replica1] o.a.s.c.c.ZkStateReader Add data for [testschemaapi] ver [0]
   [junit4]   2> 465481 INFO  (qtp7138856-71729) [n:127.0.0.1:38095_solr c:testschemaapi s:shard1  x:testschemaapi_shard1_replica1] o.a.s.c.ZkController look for our core node name
   [junit4]   2> 465481 INFO  (OverseerStateUpdate-95869105886855174-127.0.0.1:38095_solr-n_0000000000) [n:127.0.0.1:38095_solr    ] o.a.s.c.o.ReplicaMutator Update state numShards=1 message={
   [junit4]   2>   "core":"testschemaapi_shard1_replica1",
   [junit4]   2>   "roles":null,
   [junit4]   2>   "base_url":"http://127.0.0.1:38095/solr",
   [junit4]   2>   "node_name":"127.0.0.1:38095_solr",
   [junit4]   2>   "numShards":"1",
   [junit4]   2>   "state":"down",
   [junit4]   2>   "shard":"shard1",
   [junit4]   2>   "collection":"testschemaapi",
   [junit4]   2>   "operation":"state"}
   [junit4]   2> 465482 INFO  (OverseerStateUpdate-95869105886855174-127.0.0.1:38095_solr-n_0000000000) [n:127.0.0.1:38095_solr    ] o.a.s.c.Overseer processMessage: queueSize: 2, message = {
   [junit4]   2>   "core":"testschemaapi_shard1_replica2",
   [junit4]   2>   "roles":null,
   [junit4]   2>   "base_url":"http://127.0.0.1:36348/solr",
   [junit4]   2>   "node_name":"127.0.0.1:36348_solr",
   [junit4]   2>   "numShards":"1",
   [junit4]   2>   "state":"down",
   [junit4]   2>   "shard":"shard1",
   [junit4]   2>   "collection":"testschemaapi",
   [junit4]   2>   "operation":"state"} current state version: 0
   [junit4]   2> 465482 INFO  (OverseerStateUpdate-95869105886855174-127.0.0.1:38095_solr-n_0000000000) [n:127.0.0.1:38095_solr    ] o.a.s.c.o.ReplicaMutator Update state numShards=1 message={
   [junit4]   2>   "core":"testschemaapi_shard1_replica2",
   [junit4]   2>   "roles":null,
   [junit4]   2>   "base_url":"http://127.0.0.1:36348/solr",
   [junit4]   2>   "node_name":"127.0.0.1:36348_solr",
   [junit4]   2>   "numShards":"1",
   [junit4]   2>   "state":"down",
   [junit4]   2>   "shard":"shard1",
   [junit4]   2>   "collection":"testschemaapi",
   [junit4]   2>   "operation":"state"}
   [junit4]   2> 465586 INFO  (OverseerStateUpdate-95869105886855174-127.0.0.1:38095_solr-n_0000000000) [n:127.0.0.1:38095_solr    ] o.a.s.c.o.ZkStateWriter going to update_collection /collections/testschemaapi/state.json version: 0
   [junit4]   2> 465586 INFO  (zkCallback-19324-thread-1-processing-n:127.0.0.1:38095_solr) [n:127.0.0.1:38095_solr    ] o.a.s.c.c.ZkStateReader A cluster state change: [WatchedEvent state:SyncConnected type:NodeDataChanged path:/collections/testschemaapi/state.json] for collection [testschemaapi] has occurred - updating... (live nodes size: [2])
   [junit4]   2> 465586 INFO  (zkCallback-19323-thread-1-processing-n:127.0.0.1:36348_solr) [n:127.0.0.1:36348_solr    ] o.a.s.c.c.ZkStateReader A cluster state change: [WatchedEvent state:SyncConnected type:NodeDataChanged path:/collections/testschemaapi/state.json] for collection [testschemaapi] has occurred - updating... (live nodes size: [2])
   [junit4]   2> 465586 INFO  (zkCallback-19323-thread-1-processing-n:127.0.0.1:36348_solr) [n:127.0.0.1:36348_solr    ] o.a.s.c.c.ZkStateReader Updating data for [testschemaapi] from [0] to [1]
   [junit4]   2> 465587 INFO  (zkCallback-19324-thread-1-processing-n:127.0.0.1:38095_solr) [n:127.0.0.1:38095_solr    ] o.a.s.c.c.ZkStateReader Updating data for [testschemaapi] from [0] to [1]
   [junit4]   2> 466481 INFO  (qtp628113-71720) [n:127.0.0.1:36348_solr c:testschemaapi s:shard1  x:testschemaapi_shard1_replica2] o.a.s.c.ZkController waiting to find shard id in clusterstate for testschemaapi_shard1_replica2
   [junit4]   2> 466481 INFO  (qtp628113-71720) [n:127.0.0.1:36348_solr c:testschemaapi s:shard1  x:testschemaapi_shard1_replica2] o.a.s.c.ZkController Check for collection zkNode:testschemaapi
   [junit4]   2> 466481 INFO  (qtp7138856-71729) [n:127.0.0.1:38095_solr c:testschemaapi s:shard1  x:testschemaapi_shard1_replica1] o.a.s.c.ZkController waiting to find shard id in clusterstate for testschemaapi_shard1_replica1
   [junit4]   2> 466481 INFO  (qtp7138856-71729) [n:127.0.0.1:38095_solr c:testschemaapi s:shard1  x:testschemaapi_shard1_replica1] o.a.s.c.ZkController Check for collection zkNode:testschemaapi
   [junit4]   2> 466481 INFO  (qtp628113-71720) [n:127.0.0.1:36348_solr c:testschemaapi s:shard1  x:testschemaapi_shard1_replica2] o.a.s.c.ZkController Collection zkNode exists
   [junit4]   2> 466481 INFO  (qtp628113-71720) [n:127.0.0.1:36348_solr c:testschemaapi s:shard1  x:testschemaapi_shard1_replica2] o.a.s.c.c.ZkStateReader Load collection config from: [/collections/testschemaapi]
   [junit4]   2> 466481 INFO  (qtp7138856-71729) [n:127.0.0.1:38095_solr c:testschemaapi s:shard1  x:testschemaapi_shard1_replica1] o.a.s.c.ZkController Collection zkNode exists
   [junit4]   2> 466481 INFO  (qtp7138856-71729) [n:127.0.0.1:38095_solr c:testschemaapi s:shard1  x:testschemaapi_shard1_replica1] o.a.s.c.c.ZkStateReader Load collection config from: [/collections/testschemaapi]
   [junit4]   2> 466481 INFO  (qtp628113-71720) [n:127.0.0.1:36348_solr c:testschemaapi s:shard1  x:testschemaapi_shard1_replica2] o.a.s.c.c.ZkStateReader path=[/collections/testschemaapi] [configName]=[conf1] specified config exists in ZooKeeper
   [junit4]   2> 466482 INFO  (qtp628113-71720) [n:127.0.0.1:36348_solr c:testschemaapi s:shard1  x:testschemaapi_shard1_replica2] o.a.s.c.SolrResourceLoader new SolrResourceLoader for directory: '/home/jenkins/workspace/Lucene-Solr-6.x-Linux/solr/build/solr-core/test/J1/temp/solr.schema.TestManagedSchemaAPI_B7650CA29295C2C9-001/tempDir-001/node1/testschemaapi_shard1_replica2'
   [junit4]   2> 466482 INFO  (qtp7138856-71729) [n:127.0.0.1:38095_solr c:testschemaapi s:shard1  x:testschemaapi_shard1_replica1] o.a.s.c.c.ZkStateReader path=[/collections/testschemaapi] [configName]=[conf1] specified config exists in ZooKeeper
   [junit4]   2> 466482 INFO  (qtp7138856-71729) [n:127.0.0.1:38095_solr c:testschemaapi s:shard1  x:testschemaapi_shard1_replica1] o.a.s.c.SolrResourceLoader new SolrResourceLoader for directory: '/home/jenkins/workspace/Lucene-Solr-6.x-Linux/solr/build/solr-core/test/J1/temp/solr.schema.TestManagedSchemaAPI_B7650CA29295C2C9-001/tempDir-001/node2/testschemaapi_shard1_replica1'
   [junit4]   2> 466482 INFO  (qtp628113-71720) [n:127.0.0.1:36348_solr c:testschemaapi s:shard1  x:testschemaapi_shard1_replica2] o.a.s.c.SolrResourceLoader JNDI not configured for solr (NoInitialContextEx)
   [junit4]   2> 466482 INFO  (qtp628113-71720) [n:127.0.0.1:36348_solr c:testschemaapi s:shard1  x:testschemaapi_shard1_replica2] o.a.s.c.SolrResourceLoader solr home defaulted to 'solr/' (could not find system property or JNDI)
   [junit4]   2> 466482 INFO  (qtp7138856-71729) [n:127.0.0.1:38095_solr c:testschemaapi s:shard1  x:testschemaapi_shard1_replica1] o.a.s.c.SolrResourceLoader JNDI not configured for solr (NoInitialContextEx)
   [junit4]   2> 466482 INFO  (qtp7138856-71729) [n:127.0.0.1:38095_solr c:testschemaapi s:shard1  x:testschemaapi_shard1_replica1] o.a.s.c.SolrResourceLoader solr home defaulted to 'solr/' (could not find system property or JNDI)
   [junit4]   2> 466484 INFO  (qtp628113-71720) [n:127.0.0.1:36348_solr c:testschemaapi s:shard1  x:testschemaapi_shard1_replica2] o.a.s.c.Config loaded config solrconfig.xml with version 0 
   [junit4]   2> 466484 INFO  (qtp7138856-71729) [n:127.0.0.1:38095_solr c:testschemaapi s:shard1  x:testschemaapi_shard1_replica1] o.a.s.c.Config loaded config solrconfig.xml with version 0 
   [junit4]   2> 466491 INFO  (qtp628113-71720) [n:127.0.0.1:36348_solr c:testschemaapi s:shard1  x:testschemaapi_shard1_replica2] o.a.s.c.SolrConfig current version of requestparams : -1
   [junit4]   2> 466491 INFO  (qtp7138856-71729) [n:127.0.0.1:38095_solr c:testschemaapi s:shard1  x:testschemaapi_shard1_replica1] o.a.s.c.SolrConfig current version of requestparams : -1
   [junit4]   2> 466497 INFO  (qtp628113-71720) [n:127.0.0.1:36348_solr c:testschemaapi s:shard1  x:testschemaapi_shard1_replica2] o.a.s.c.SolrConfig Using Lucene MatchVersion: 6.1.0
   [junit4]   2> 466497 INFO  (qtp7138856-71729) [n:127.0.0.1:38095_solr c:testschemaapi s:shard1  x:testschemaapi_shard1_replica1] o.a.s.c.SolrConfig Using Lucene MatchVersion: 6.1.0
   [junit4]   2> 466509 INFO  (qtp628113-71720) [n:127.0.0.1:36348_solr c:testschemaapi s:shard1  x:testschemaapi_shard1_replica2] o.a.s.c.SolrConfig Loaded SolrConfig: solrconfig.xml
   [junit4]   2> 466509 INFO  (qtp7138856-71729) [n:127.0.0.1:38095_solr c:testschemaapi s:shard1  x:testschemaapi_shard1_replica1] o.a.s.c.SolrConfig Loaded SolrConfig: solrconfig.xml
   [junit4]   2> 466514 INFO  (qtp628113-71720) [n:127.0.0.1:36348_solr c:testschemaapi s:shard1  x:testschemaapi_shard1_replica2] o.a.s.s.IndexSchema [testschemaapi_shard1_replica2] Schema name=minimal
   [junit4]   2> 466517 INFO  (qtp7138856-71729) [n:127.0.0.1:38095_solr c:testschemaapi s:shard1  x:testschemaapi_shard1_replica1] o.a.s.s.IndexSchema [testschemaapi_shard1_replica1] Schema name=minimal
   [junit4]   2> 466521 INFO  (qtp7138856-71729) [n:127.0.0.1:38095_solr c:testschemaapi s:shard1  x:testschemaapi_shard1_replica1] o.a.s.s.IndexSchema unique key field: id
   [junit4]   2> 466523 INFO  (qtp7138856-71729) [n:127.0.0.1:38095_solr c:testschemaapi s:shard1  x:testschemaapi_shard1_replica1] o.a.s.c.ConfigSetProperties Did not find ConfigSet properties, assuming default properties: Can't find resource 'configsetprops.json' in classpath or '/configs/conf1', cwd=/home/jenkins/workspace/Lucene-Solr-6.x-Linux/solr/build/solr-core/test/J1
   [junit4]   2> 466523 INFO  (qtp7138856-71729) [n:127.0.0.1:38095_solr c:testschemaapi s:shard1  x:testschemaapi_shard1_replica1] o.a.s.c.CoreContainer Creating SolrCore 'testschemaapi_shard1_replica1' using configuration from collection testschemaapi
   [junit4]   2> 466523 INFO  (qtp628113-71720) [n:127.0.0.1:36348_solr c:testschemaapi s:shard1  x:testschemaapi_shard1_replica2] o.a.s.s.IndexSchema unique key field: id
   [junit4]   2> 466523 INFO  (qtp7138856-71729) [n:127.0.0.1:38095_solr c:testschemaapi s:shard1 r:core_node1 x:testschemaapi_shard1_replica1] o.a.s.c.SolrCore org.apache.solr.core.MockDirectoryFactory
   [junit4]   2> 466523 INFO  (qtp7138856-71729) [n:127.0.0.1:38095_solr c:testschemaapi s:shard1 r:core_node1 x:testschemaapi_shard1_replica1] o.a.s.c.SolrCore [[testschemaapi_shard1_replica1] ] Opening new SolrCore at [/home/jenkins/workspace/Lucene-Solr-6.x-Linux/solr/build/solr-core/test/J1/temp/solr.schema.TestManagedSchemaAPI_B7650CA29295C2C9-001/tempDir-001/node2/testschemaapi_shard1_replica1], dataDir=[/home/jenkins/workspace/Lucene-Solr-6.x-Linux/solr/build/solr-core/test/J1/temp/solr.schema.TestManagedSchemaAPI_B7650CA29295C2C9-001/tempDir-001/node2/./testschemaapi_shard1_replica1/data/]
   [junit4]   2> 466523 INFO  (qtp7138856-71729) [n:127.0.0.1:38095_solr c:testschemaapi s:shard1 r:core_node1 x:testschemaapi_shard1_replica1] o.a.s.c.SolrCore JMX monitoring not detected for core: testschemaapi_shard1_replica1
   [junit4]   2> 466524 INFO  (qtp7138856-71729) [n:127.0.0.1:38095_solr c:testschemaapi s:shard1 r:core_node1 x:testschemaapi_shard1_replica1] o.a.s.c.CachingDirectoryFactory return new directory for /home/jenkins/workspace/Lucene-Solr-6.x-Linux/solr/build/solr-core/test/J1/temp/solr.schema.TestManagedSchemaAPI_B7650CA29295C2C9-001/tempDir-001/node2/./testschemaapi_shard1_replica1/data
   [junit4]   2> 466524 INFO  (qtp628113-71720) [n:127.0.0.1:36348_solr c:testschemaapi s:shard1  x:testschemaapi_shard1_replica2] o.a.s.c.ConfigSetProperties Did not find ConfigSet properties, assuming default properties: Can't find resource 'configsetprops.json' in classpath or '/configs/conf1', cwd=/home/jenkins/workspace/Lucene-Solr-6.x-Linux/solr/build/solr-core/test/J1
   [junit4]   2> 466524 INFO  (qtp7138856-71729) [n:127.0.0.1:38095_solr c:testschemaapi s:shard1 r:core_node1 x:testschemaapi_shard1_replica1] o.a.s.c.SolrCore New index directory detected: old=null new=/home/jenkins/workspace/Lucene-Solr-6.x-Linux/solr/build/solr-core/test/J1/temp/solr.schema.TestManagedSchemaAPI_B7650CA29295C2C9-001/tempDir-001/node2/./testschemaapi_shard1_replica1/data/index/
   [junit4]   2> 466524 INFO  (qtp628113-71720) [n:127.0.0.1:36348_solr c:testschemaapi s:shard1  x:testschemaapi_shard1_replica2] o.a.s.c.CoreContainer Creating SolrCore 'testschemaapi_shard1_replica2' using configuration from collection testschemaapi
   [junit4]   2> 466524 WARN  (qtp7138856-71729) [n:127.0.0.1:38095_solr c:testschemaapi s:shard1 r:core_node1 x:testschemaapi_shard1_replica1] o.a.s.c.SolrCore [testschemaapi_shard1_replica1] Solr index directory '/home/jenkins/workspace/Lucene-Solr-6.x-Linux/solr/build/solr-core/test/J1/temp/solr.schema.TestManagedSchemaAPI_B7650CA29295C2C9-001/tempDir-001/node2/./testschemaapi_shard1_replica1/data/index' doesn't exist. Creating new index...
   [junit4]   2> 466525 INFO  (qtp628113-71720) [n:127.0.0.1:36348_solr c:testschemaapi s:shard1 r:core_node2 x:testschemaapi_shard1_replica2] o.a.s.c.SolrCore org.apache.solr.core.MockDirectoryFactory
   [junit4]   2> 466526 INFO  (qtp628113-71720) [n:127.0.0.1:36348_solr c:testschemaapi s:shard1 r:core_node2 x:testschemaapi_shard1_replica2] o.a.s.c.SolrCore [[testschemaapi_shard1_replica2] ] Opening new SolrCore at [/home/jenkins/workspace/Lucene-Solr-6.x-Linux/solr/build/solr-core/test/J1/temp/solr.schema.TestManagedSchemaAPI_B7650CA29295C2C9-001/tempDir-001/node1/testschemaapi_shard1_replica2], dataDir=[/home/jenkins/workspace/Lucene-Solr-6.x-Linux/solr/build/solr-core/test/J1/temp/solr.schema.TestManagedSchemaAPI_B7650CA29295C2C9-001/tempDir-001/node1/./testschemaapi_shard1_replica2/data/]
   [junit4]   2> 466526 INFO  (qtp7138856-71729) [n:127.0.0.1:38095_solr c:testschemaapi s:shard1 r:core_node1 x:testschemaapi_shard1_replica1] o.a.s.c.CachingDirectoryFactory return new directory for /home/jenkins/workspace/Lucene-Solr-6.x-Linux/solr/build/solr-core/test/J1/temp/solr.schema.TestManagedSchemaAPI_B7650CA29295C2C9-001/tempDir-001/node2/./testschemaapi_shard1_replica1/data/index
   [junit4]   2> 466526 INFO  (qtp628113-71720) [n:127.0.0.1:36348_solr c:testschemaapi s:shard1 r:core_node2 x:testschemaapi_shard1_replica2] o.a.s.c.SolrCore JMX monitoring not detected for core: testschemaapi_shard1_replica2
   [junit4]   2> 466527 INFO  (qtp7138856-71729) [n:127.0.0.1:38095_solr c:testschemaapi s:shard1 r:core_node1 x:testschemaapi_shard1_replica1] o.a.s.c.SolrDeletionPolicy SolrDeletionPolicy.onCommit: commits: num=1
   [junit4]   2> 	commit{dir=MockDirectoryWrapper(RAMDirectory@1295e00 lockFactory=org.apache.lucene.store.SingleInstanceLockFactory@1f5cbad),segFN=segments_1,generation=1}
   [junit4]   2> 466527 INFO  (qtp7138856-71729) [n:127.0.0.1:38095_solr c:testschemaapi s:shard1 r:core_node1 x:testschemaapi_shard1_replica1] o.a.s.c.SolrDeletionPolicy newest commit generation = 1
   [junit4]   2> 466527 INFO  (qtp628113-71720) [n:127.0.0.1:36348_solr c:testschemaapi s:shard1 r:core_node2 x:testschemaapi_shard1_replica2] o.a.s.c.CachingDirectoryFactory return new directory for /home/jenkins/workspace/Lucene-Solr-6.x-Linux/solr/build/solr-core/test/J1/temp/solr.schema.TestManagedSchemaAPI_B7650CA29295C2C9-001/tempDir-001/node1/./testschemaapi_shard1_replica2/data
   [junit4]   2> 466527 INFO  (qtp628113-71720) [n:127.0.0.1:36348_solr c:testschemaapi s:shard1 r:core_node2 x:testschemaapi_shard1_replica2] o.a.s.c.SolrCore New index directory detected: old=null new=/home/jenkins/workspace/Lucene-Solr-6.x-Linux/solr/build/solr-core/test/J1/temp/solr.schema.TestManagedSchemaAPI_B7650CA29295C2C9-001/tempDir-001/node1/./testschemaapi_shard1_replica2/data/index/
   [junit4]   2> 466527 WARN  (qtp628113-71720) [n:127.0.0.1:36348_solr c:testschemaapi s:shard1 r:core_node2 x:testschemaapi_shard1_replica2] o.a.s.c.SolrCore [testschemaapi_shard1_replica2] Solr index directory '/home/jenkins/workspace/Lucene-Solr-6.x-Linux/solr/build/solr-core/test/J1/temp/solr.schema.TestManagedSchemaAPI_B7650CA29295C2C9-001/tempDir-001/node1/./testschemaapi_shard1_replica2/data/index' doesn't exist. Creating new index...
   [junit4]   2> 466528 INFO  (qtp628113-71720) [n:127.0.0.1:36348_solr c:testschemaapi s:shard1 r:core_node2 x:testschemaapi_shard1_replica2] o.a.s.c.CachingDirectoryFactory return new directory for /home/jenkins/workspace/Lucene-Solr-6.x-Linux/solr/build/solr-core/test/J1/temp/solr.schema.TestManagedSchemaAPI_B7650CA29295C2C9-001/tempDir-001/node1/./testschemaapi_shard1_replica2/data/index
   [junit4]   2> 466528 INFO  (qtp628113-71720) [n:127.0.0.1:36348_solr c:testschemaapi s:shard1 r:core_node2 x:testschemaapi_shard1_replica2] o.a.s.c.SolrDeletionPolicy SolrDeletionPolicy.onCommit: commits: num=1
   [junit4]   2> 	commit{dir=MockDirectoryWrapper(RAMDirectory@155800d lockFactory=org.apache.lucene.store.SingleInstanceLockFactory@1eb7da3),segFN=segments_1,generation=1}
   [junit4]   2> 466528 INFO  (qtp628113-71720) [n:127.0.0.1:36348_solr c:testschemaapi s:shard1 r:core_node2 x:testschemaapi_shard1_replica2] o.a.s.c.SolrDeletionPolicy newest commit generation = 1
   [junit4]   2> 466528 INFO  (OldIndexDirectoryCleanupThreadForCore-testschemaapi_shard1_replica2) [n:127.0.0.1:36348_solr c:testschemaapi s:shard1 r:core_node2 x:testschemaapi_shard1_replica2] o.a.s.c.SolrCore Looking for old index directories to cleanup for core testschemaapi_shard1_replica2 in /home/jenkins/workspace/Lucene-Solr-6.x-Linux/solr/build/solr-core/test/J1/temp/solr.schema.TestManagedSchemaAPI_B7650CA29295C2C9-001/tempDir-001/node1/./testschemaapi_shard1_replica2/data/
   [junit4]   2> 466529 WARN  (OldIndexDirectoryCleanupThreadForCore-testschemaapi_shard1_replica2) [n:127.0.0.1:36348_solr c:testschemaapi s:shard1 r:core_node2 x:testschemaapi_shard1_replica2] o.a.s.c.DirectoryFactory /home/jenkins/workspace/Lucene-Solr-6.x-Linux/solr/build/solr-core/test/J1/temp/solr.schema.TestManagedSchemaAPI_B7650CA29295C2C9-001/tempDir-001/node1/./testschemaapi_shard1_replica2/data/ does not point to a valid data directory; skipping clean-up of old index directories.
   [junit4]   2> 466530 INFO  (qtp628113-71720) [n:127.0.0.1:36348_solr c:testschemaapi s:shard1 r:core_node2 x:testschemaapi_shard1_replica2] o.a.s.c.SolrCore no updateRequestProcessorChain defined as default, creating implicit default
   [junit4]   2> 466527 INFO  (OldIndexDirectoryCleanupThreadForCore-testschemaapi_shard1_replica1) [n:127.0.0.1:38095_solr c:testschemaapi s:shard1 r:core_node1 x:testschemaapi_shard1_replica1] o.a.s.c.SolrCore Looking for old index directories to cleanup for core testschemaapi_shard1_replica1 in /home/jenkins/workspace/Lucene-Solr-6.x-Linux/solr/build/solr-core/test/J1/temp/solr.schema.TestManagedSchemaAPI_B7650CA29295C2C9-001/tempDir-001/node2/./testschemaapi_shard1_replica1/data/
   [junit4]   2> 466531 WARN  (OldIndexDirectoryCleanupThreadForCore-testschemaapi_shard1_replica1) [n:127.0.0.1:38095_solr c:testschemaapi s:shard1 r:core_node1 x:testschemaapi_shard1_replica1] o.a.s.c.DirectoryFactory /home/jenkins/workspace/Lucene-Solr-6.x-Linux/solr/build/solr-core/test/J1/temp/solr.schema.TestManagedSchemaAPI_B7650CA29295C2C9-001/tempDir-001/node2/./testschemaapi_shard1_replica1/data/ does not point to a valid data directory; skipping clean-up of old index directories.
   [junit4]   2> 466532 INFO  (qtp7138856-71729) [n:127.0.0.1:38095_solr c:testschemaapi s:shard1 r:core_node1 x:testschemaapi_shard1_replica1] o.a.s.c.SolrCore no updateRequestProcessorChain defined as default, creating implicit default
   [junit4]   2> 466533 INFO  (qtp628113-71720) [n:127.0.0.1:36348_solr c:testschemaapi s:shard1 r:core_node2 x:testschemaapi_shard1_replica2] o.a.s.h.l.XMLLoader xsltCacheLifetimeSeconds=60
   [junit4]   2> 466533 INFO  (qtp7138856-71729) [n:127.0.0.1:38095_solr c:testschemaapi s:shard1 r:core_node1 x:testschemaapi_shard1_replica1] o.a.s.h.l.XMLLoader xsltCacheLifetimeSeconds=60
   [junit4]   2> 466534 INFO  (qtp7138856-71729) [n:127.0.0.1:38095_solr c:testschemaapi s:shard1 r:core_node1 x:testschemaapi_shard1_replica1] o.a.s.h.l.XMLLoader xsltCacheLifetimeSeconds=60
   [junit4]   2> 466534 INFO  (qtp628113-71720) [n:127.0.0.1:36348_solr c:testschemaapi s:shard1 r:core_node2 x:testschemaapi_shard1_replica2] o.a.s.h.l.XMLLoader xsltCacheLifetimeSeconds=60
   [junit4]   2> 466535 INFO  (qtp7138856-71729) [n:127.0.0.1:38095_solr c:testschemaapi s:shard1 r:core_node1 x:testschemaapi_shard1_replica1] o.a.s.h.l.XMLLoader xsltCacheLifetimeSeconds=60
   [junit4]   2> 466536 INFO  (qtp628113-71720) [n:127.0.0.1:36348_solr c:testschemaapi s:shard1 r:core_node2 x:testschemaapi_shard1_replica2] o.a.s.h.l.XMLLoader xsltCacheLifetimeSeconds=60
   [junit4]   2> 466536 INFO  (qtp7138856-71729) [n:127.0.0.1:38095_solr c:testschemaapi s:shard1 r:core_node1 x:testschemaapi_shard1_replica1] o.a.s.h.l.XMLLoader xsltCacheLifetimeSeconds=60
   [junit4]   2> 466537 INFO  (qtp628113-71720) [n:127.0.0.1:36348_solr c:testschemaapi s:shard1 r:core_node2 x:testschemaapi_shard1_replica2] o.a.s.h.l.XMLLoader xsltCacheLifetimeSeconds=60
   [junit4]   2> 466538 INFO  (qtp7138856-71729) [n:127.0.0.1:38095_solr c:testschemaapi s:shard1 r:core_node1 x:testschemaapi_shard1_replica1] o.a.s.c.RequestHandlers Registered paths: /admin/mbeans,/update/csv,/sql,/update/json/docs,/admin/luke,/graph,/export,/select,/admin/segments,/get,/admin/system,/replication,/admin/properties,/config,/stream,/schema,/admin/plugins,/admin/logging,/update/json,/admin/ping,/admin/threads,/update,/admin/file
   [junit4]   2> 466539 INFO  (qtp7138856-71729) [n:127.0.0.1:38095_solr c:testschemaapi s:shard1 r:core_node1 x:testschemaapi_shard1_replica1] o.a.s.c.SolrCore Using default statsCache cache: org.apache.solr.search.stats.LocalStatsCache
   [junit4]   2> 466539 INFO  (qtp628113-71720) [n:127.0.0.1:36348_solr c:testschemaapi s:shard1 r:core_node2 x:testschemaapi_shard1_replica2] o.a.s.c.RequestHandlers Registered paths: /admin/mbeans,/update/csv,/sql,/update/json/docs,/admin/luke,/graph,/export,/select,/admin/segments,/get,/admin/system,/replication,/admin/properties,/config,/stream,/schema,/admin/plugins,/admin/logging,/update/json,/admin/ping,/admin/threads,/update,/admin/file
   [junit4]   2> 466539 INFO  (qtp628113-71720) [n:127.0.0.1:36348_solr c:testschemaapi s:shard1 r:core_node2 x:testschemaapi_shard1_replica2] o.a.s.c.SolrCore Using default statsCache cache: org.apache.solr.search.stats.LocalStatsCache
   [junit4]   2> 466539 INFO  (qtp7138856-71729) [n:127.0.0.1:38095_solr c:testschemaapi s:shard1 r:core_node1 x:testschemaapi_shard1_replica1] o.a.s.u.UpdateHandler Using UpdateLog implementation: org.apache.solr.update.UpdateLog
   [junit4]   2> 466539 INFO  (qtp7138856-71729) [n:127.0.0.1:38095_solr c:testschemaapi s:shard1 r:core_node1 x:testschemaapi_shard1_replica1] o.a.s.u.UpdateLog Initializing UpdateLog: dataDir=null defaultSyncLevel=FLUSH numRecordsToKeep=100 maxNumLogsToKeep=10 numVersionBuckets=65536
   [junit4]   2> 466539 INFO  (qtp628113-71720) [n:127.0.0.1:36348_solr c:testschemaapi s:shard1 r:core_node2 x:testschemaapi_shard1_replica2] o.a.s.u.UpdateHandler Using UpdateLog implementation: org.apache.solr.update.UpdateLog
   [junit4]   2> 466539 INFO  (qtp628113-71720) [n:127.0.0.1:36348_solr c:testschemaapi s:shard1 r:core_node2 x:testschemaapi_shard1_replica2] o.a.s.u.UpdateLog Initializing UpdateLog: dataDir=null defaultSyncLevel=FLUSH numRecordsToKeep=100 maxNumLogsToKeep=10 numVersionBuckets=65536
   [junit4]   2> 466540 INFO  (qtp628113-71720) [n:127.0.0.1:36348_solr c:testschemaapi s:shard1 r:core_node2 x:testschemaapi_shard1_replica2] o.a.s.u.CommitTracker Hard AutoCommit: disabled
   [junit4]   2> 466541 INFO  (qtp628113-71720) [n:127.0.0.1:36348_solr c:testschemaapi s:shard1 r:core_node2 x:testschemaapi_shard1_replica2] o.a.s.u.CommitTracker Soft AutoCommit: disabled
   [junit4]   2> 466541 INFO  (qtp7138856-71729) [n:127.0.0.1:38095_solr c:testschemaapi s:shard1 r:core_node1 x:testschemaapi_shard1_replica1] o.a.s.u.CommitTracker Hard AutoCommit: disabled
   [junit4]   2> 466541 INFO  (qtp7138856-71729) [n:127.0.0.1:38095_solr c:testschemaapi s:shard1 r:core_node1 x:testschemaapi_shard1_replica1] o.a.s.u.CommitTracker Soft AutoCommit: disabled
   [junit4]   2> 466541 INFO  (qtp628113-71720) [n:127.0.0.1:36348_solr c:testschemaapi s:shard1 r:core_node2 x:testschemaapi_shard1_replica2] o.a.s.c.SolrDeletionPolicy SolrDeletionPolicy.onInit: commits: num=1
   [junit4]   2> 	commit{dir=MockDirectoryWrapper(RAMDirectory@155800d lockFactory=org.apache.lucene.store.SingleInstanceLockFactory@1eb7da3),segFN=segments_1,generation=1}
   [junit4]   2> 466541 INFO  (qtp628113-71720) [n:127.0.0.1:36348_solr c:testschemaapi s:shard1 r:core_node2 x:testschemaapi_shard1_replica2] o.a.s.c.SolrDeletionPolicy newest commit generation = 1
   [junit4]   2> 466541 INFO  (qtp628113-71720) [n:127.0.0.1:36348_solr c:testschemaapi s:shard1 r:core_node2 x:testschemaapi_shard1_replica2] o.a.s.s.SolrIndexSearcher Opening [Searcher@195861[testschemaapi_shard1_replica2] main]
   [junit4]   2> 466541 INFO  (qtp7138856-71729) [n:127.0.0.1:38095_solr c:testschemaapi s:shard1 r:core_node1 x:testschemaapi_shard1_replica1] o.a.s.c.SolrDeletionPolicy SolrDeletionPolicy.onInit: commits: num=1
   [junit4]   2> 	commit{dir=MockDirectoryWrapper(RAMDirectory@1295e00 lockFactory=org.apache.lucene.store.SingleInstanceLockFactory@1f5cbad),segFN=segments_1,generation=1}
   [junit4]   2> 466541 INFO  (qtp7138856-71729) [n:127.0.0.1:38095_solr c:testschemaapi s:shard1 r:core_node1 x:testschemaapi_shard1_replica1] o.a.s.c.SolrDeletionPolicy newest commit generation = 1
   [junit4]   2> 466541 INFO  (qtp628113-71720) [n:127.0.0.1:36348_solr c:testschemaapi s:shard1 r:core_node2 x:testschemaapi_shard1_replica2] o.a.s.c.c.ZkStateReader Load collection config from: [/collections/testschemaapi]
   [junit4]   2> 466542 INFO  (qtp7138856-71729) [n:127.0.0.1:38095_solr c:testschemaapi s:shard1 r:core_node1 x:testschemaapi_shard1_replica1] o.a.s.s.SolrIndexSearcher Opening [Searcher@1fef07b[testschemaapi_shard1_replica1] main]
   [junit4]   2> 466542 INFO  (qtp7138856-71729) [n:127.0.0.1:38095_solr c:testschemaapi s:shard1 r:core_node1 x:testschemaapi_shard1_replica1] o.a.s.c.c.ZkStateReader Load collection config from: [/collections/testschemaapi]
   [junit4]   2> 466542 INFO  (qtp628113-71720) [n:127.0.0.1:36348_solr c:testschemaapi s:shard1 r:core_node2 x:testschemaapi_shard1_replica2] o.a.s.c.c.ZkStateReader path=[/collections/testschemaapi] [configName]=[conf1] specified config exists in ZooKeeper
   [junit4]   2> 466542 INFO  (qtp628113-71720) [n:127.0.0.1:36348_solr c:testschemaapi s:shard1 r:core_node2 x:testschemaapi_shard1_replica2] o.a.s.r.ManagedResourceStorage Setting up ZooKeeper-based storage for the RestManager with znodeBase: /configs/conf1
   [junit4]   2> 466543 INFO  (qtp7138856-71729) [n:127.0.0.1:38095_solr c:testschemaapi s:shard1 r:core_node1 x:testschemaapi_shard1_replica1] o.a.s.c.c.ZkStateReader path=[/collections/testschemaapi] [configName]=[conf1] specified config exists in ZooKeeper
   [junit4]   2> 466543 INFO  (qtp7138856-71729) [n:127.0.0.1:38095_solr c:testschemaapi s:shard1 r:core_node1 x:testschemaapi_shard1_replica1] o.a.s.r.ManagedResourceStorage Setting up ZooKeeper-based storage for the RestManager with znodeBase: /configs/conf1
   [junit4]   2> 466543 INFO  (qtp628113-71720) [n:127.0.0.1:36348_solr c:testschemaapi s:shard1 r:core_node2 x:testschemaapi_shard1_replica2] o.a.s.r.ManagedResourceStorage Configured ZooKeeperStorageIO with znodeBase: /configs/conf1
   [junit4]   2> 466544 INFO  (qtp628113-71720) [n:127.0.0.1:36348_solr c:testschemaapi s:shard1 r:core_node2 x:testschemaapi_shard1_replica2] o.a.s.r.RestManager Initializing RestManager with initArgs: {}
   [junit4]   2> 466544 INFO  (qtp628113-71720) [n:127.0.0.1:36348_solr c:testschemaapi s:shard1 r:core_node2 x:testschemaapi_shard1_replica2] o.a.s.r.ManagedResourceStorage Reading _rest_managed.json using ZooKeeperStorageIO:path=/configs/conf1
   [junit4]   2> 466544 INFO  (qtp7138856-71729) [n:127.0.0.1:38095_solr c:testschemaapi s:shard1 r:core_node1 x:testschemaapi_shard1_replica1] o.a.s.r.ManagedResourceStorage Configured ZooKeeperStorageIO with znodeBase: /configs/conf1
   [junit4]   2> 466544 INFO  (qtp7138856-71729) [n:127.0.0.1:38095_solr c:testschemaapi s:shard1 r:core_node1 x:testschemaapi_shard1_replica1] o.a.s.r.RestManager Initializing RestManager with initArgs: {}
   [junit4]   2> 466544 INFO  (qtp7138856-71729) [n:127.0.0.1:38095_solr c:testschemaapi s:shard1 r:core_node1 x:testschemaapi_shard1_replica1] o.a.s.r.ManagedResourceStorage Reading _rest_managed.json using ZooKeeperStorageIO:path=/configs/conf1
   [junit4]   2> 466544 INFO  (qtp628113-71720) [n:127.0.0.1:36348_solr c:testschemaapi s:shard1 r:core_node2 x:testschemaapi_shard1_replica2] o.a.s.r.ManagedResourceStorage No data found for znode /configs/conf1/_rest_managed.json
   [junit4]   2> 466544 INFO  (qtp7138856-71729) [n:127.0.0.1:38095_solr c:testschemaapi s:shard1 r:core_node1 x:testschemaapi_shard1_replica1] o.a.s.r.ManagedResourceStorage No data found for znode /configs/conf1/_rest_managed.json
   [junit4]   2> 466544 INFO  (qtp628113-71720) [n:127.0.0.1:36348_solr c:testschemaapi s:shard1 r:core_node2 x:testschemaapi_shard1_replica2] o.a.s.r.ManagedResourceStorage Loaded null at path _rest_managed.json using ZooKeeperStorageIO:path=/configs/conf1
   [junit4]   2> 466544 INFO  (qtp7138856-71729) [n:127.0.0.1:38095_solr c:testschemaapi s:shard1 r:core_node1 x:testschemaapi_shard1_replica1] o.a.s.r.ManagedResourceStorage Loaded null at path _rest_managed.json using ZooKeeperStorageIO:path=/configs/conf1
   [junit4]   2> 466544 INFO  (qtp628113-71720) [n:127.0.0.1:36348_solr c:testschemaapi s:shard1 r:core_node2 x:testschemaapi_shard1_replica2] o.a.s.r.RestManager Initializing 0 registered ManagedResources
   [junit4]   2> 466544 INFO  (qtp7138856-71729) [n:127.0.0.1:38095_solr c:testschemaapi s:shard1 r:core_node1 x:testschemaapi_shard1_replica1] o.a.s.r.RestManager Initializing 0 registered ManagedResources
   [junit4]   2> 466544 INFO  (qtp628113-71720) [n:127.0.0.1:36348_solr c:testschemaapi s:shard1 r:core_node2 x:testschemaapi_shard1_replica2] o.a.s.s.ZkIndexSchemaReader Creating ZooKeeper watch for the managed schema at /configs/conf1/managed-schema
   [junit4]   2> 466544 INFO  (qtp7138856-71729) [n:127.0.0.1:38095_solr c:testschemaapi s:shard1 r:core_node1 x:testschemaapi_shard1_replica1] o.a.s.s.ZkIndexSchemaReader Creating ZooKeeper watch for the managed schema at /configs/conf1/managed-schema
   [junit4]   2> 466544 INFO  (qtp628113-71720) [n:127.0.0.1:36348_solr c:testschemaapi s:shard1 r:core_node2 x:testschemaapi_shard1_replica2] o.a.s.c.ZkController Added new OnReconnect listener ZkIndexSchemaReader: /configs/conf1/managed-schema, uniqueCoreId: testschemaapi_shard1_replica2:304626742388259
   [junit4]   2> 466544 INFO  (qtp7138856-71729) [n:127.0.0.1:38095_solr c:testschemaapi s:shard1 r:core_node1 x:testschemaapi_shard1_replica1] o.a.s.c.ZkController Added new OnReconnect listener ZkIndexSchemaReader: /configs/conf1/managed-schema, uniqueCoreId: testschemaapi_shard1_replica1:304626740643832
   [junit4]   2> 466545 INFO  (qtp628113-71720) [n:127.0.0.1:36348_solr c:testschemaapi s:shard1 r:core_node2 x:testschemaapi_shard1_replica2] o.a.s.h.ReplicationHandler Commits will be reserved for  10000
   [junit4]   2> 466545 INFO  (qtp7138856-71729) [n:127.0.0.1:38095_solr c:testschemaapi s:shard1 r:core_node1 x:testschemaapi_shard1_replica1] o.a.s.h.ReplicationHandler Commits will be reserved for  10000
   [junit4]   2> 466545 INFO  (searcherExecutor-4944-thread-1-processing-n:127.0.0.1:36348_solr x:testschemaapi_shard1_replica2 s:shard1 c:testschemaapi r:core_node2) [n:127.0.0.1:36348_solr c:testschemaapi s:shard1 r:core_node2 x:testschemaapi_shard1_replica2] o.a.s.c.SolrCore [testschemaapi_shard1_replica2] Registered new searcher Searcher@195861[testschemaapi_shard1_replica2] main{ExitableDirectoryReader(UninvertingDirectoryReader())}
   [junit4]   2> 466545 INFO  (searcherExecutor-4943-thread-1-processing-n:127.0.0.1:38095_solr x:testschemaapi_shard1_replica1 s:shard1 c:testschemaapi r:core_node1) [n:127.0.0.1:38095_solr c:testschemaapi s:shard1 r:core_node1 x:testschemaapi_shard1_replica1] o.a.s.c.SolrCore [testschemaapi_shard1_replica1] Registered new searcher Searcher@1fef07b[testschemaapi_shard1_replica1] main{ExitableDirectoryReader(UninvertingDirectoryReader())}
   [junit4]   2> 466545 INFO  (qtp628113-71720) [n:127.0.0.1:36348_solr c:testschemaapi s:shard1 r:core_node2 x:testschemaapi_shard1_replica2] o.a.s.u.UpdateLog Looking up max value of version field to seed version buckets
   [junit4]   2> 466545 INFO  (qtp7138856-71729) [n:127.0.0.1:38095_solr c:testschemaapi s:shard1 r:core_node1 x:testschemaapi_shard1_replica1] o.a.s.u.UpdateLog Looking up max value of version field to seed version buckets
   [junit4]   2> 466545 INFO  (qtp628113-71720) [n:127.0.0.1:36348_solr c:testschemaapi s:shard1 r:core_node2 x:testschemaapi_shard1_replica2] o.a.s.u.VersionInfo Refreshing highest value of _version_ for 65536 version buckets from index
   [junit4]   2> 466545 INFO  (qtp7138856-71729) [n:127.0.0.1:38095_solr c:testschemaapi s:shard1 r:core_node1 x:testschemaapi_shard1_replica1] o.a.s.u.VersionInfo Refreshing highest value of _version_ for 65536 version buckets from index
   [junit4]   2> 466545 INFO  (qtp628113-71720) [n:127.0.0.1:36348_solr c:testschemaapi s:shard1 r:core_node2 x:testschemaapi_shard1_replica2] o.a.s.u.VersionInfo No terms found for _version_, cannot seed version bucket highest value from index
   [junit4]   2> 466545 INFO  (qtp7138856-71729) [n:127.0.0.1:38095_solr c:testschemaapi s:shard1 r:core_node1 x:testschemaapi_shard1_replica1] o.a.s.u.VersionInfo No terms found for _version_, cannot seed version bucket highest value from index
   [junit4]   2> 466545 INFO  (qtp628113-71720) [n:127.0.0.1:36348_solr c:testschemaapi s:shard1 r:core_node2 x:testschemaapi_shard1_replica2] o.a.s.u.UpdateLog Could not find max version in index or recent updates, using new clock 1533905696764985344
   [junit4]   2> 466545 INFO  (qtp7138856-71729) [n:127.0.0.1:38095_solr c:testschemaapi s:shard1 r:core_node1 x:testschemaapi_shard1_replica1] o.a.s.u.UpdateLog Could not find max version in index or recent updates, using new clock 1533905696764985344
   [junit4]   2> 466547 INFO  (qtp7138856-71729) [n:127.0.0.1:38095_solr c:testschemaapi s:shard1 r:core_node1 x:testschemaapi_shard1_replica1] o.a.s.u.UpdateLog Took 1.0ms to seed version buckets with highest version 1533905696764985344
   [junit4]   2> 466547 INFO  (qtp628113-71720) [n:127.0.0.1:36348_solr c:testschemaapi s:shard1 r:core_node2 x:testschemaapi_shard1_replica2] o.a.s.u.UpdateLog Took 1.0ms to seed version buckets with highest version 1533905696764985344
   [junit4]   2> 466547 INFO  (qtp7138856-71729) [n:127.0.0.1:38095_solr c:testschemaapi s:shard1 r:core_node1 x:testschemaapi_shard1_replica1] o.a.s.c.ZkController watch zkdir /configs/conf1
   [junit4]   2> 466547 INFO  (qtp628113-71720) [n:127.0.0.1:36348_solr c:testschemaapi s:shard1 r:core_node2 x:testschemaapi_shard1_replica2] o.a.s.c.ZkController watch zkdir /configs/conf1
   [junit4]   2> 466547 INFO  (qtp7138856-71729) [n:127.0.0.1:38095_solr c:testschemaapi s:shard1 r:core_node1 x:testschemaapi_shard1_replica1] o.a.s.c.CoreContainer registering core: testschemaapi_shard1_replica1
   [junit4]   2> 466547 INFO  (qtp628113-71720) [n:127.0.0.1:36348_solr c:testschemaapi s:shard1 r:core_node2 x:testschemaapi_shard1_replica2] o.a.s.c.CoreContainer registering core: testschemaapi_shard1_replica2
   [junit4]   2> 466547 INFO  (qtp7138856-71729) [n:127.0.0.1:38095_solr c:testschemaapi s:shard1 r:core_node1 x:testschemaapi_shard1_replica1] o.a.s.c.ZkController Register replica - core:testschemaapi_shard1_replica1 address:http://127.0.0.1:38095/solr collection:testschemaapi shard:shard1
   [junit4]   2> 466548 INFO  (qtp628113-71720) [n:127.0.0.1:36348_solr c:testschemaapi s:shard1 r:core_node2 x:testschemaapi_shard1_replica2] o.a.s.c.ZkController Register replica - core:testschemaapi_shard1_replica2 address:http://127.0.0.1:36348/solr collection:testschemaapi shard:shard1
   [junit4]   2> 466548 INFO  (qtp7138856-71729) [n:127.0.0.1:38095_solr c:testschemaapi s:shard1 r:core_node1 x:testschemaapi_shard1_replica1] o.a.s.c.c.SolrZkClient makePath: /collections/testschemaapi/leader_elect/shard1/election
   [junit4]   2> 466548 INFO  (qtp628113-71720) [n:127.0.0.1:36348_solr c:testschemaapi s:shard1 r:core_node2 x:testschemaapi_shard1_replica2] o.a.s.c.c.SolrZkClient makePath: /collections/testschemaapi/leader_elect/shard1/election
   [junit4]   2> 466550 INFO  (qtp7138856-71729) [n:127.0.0.1:38095_solr c:testschemaapi s:shard1 r:core_node1 x:testschemaapi_shard1_replica1] o.a.s.c.LeaderElector Joined leadership election with path: /collections/testschemaapi/leader_elect/shard1/election/95869105886855174-core_node1-n_0000000000
   [junit4]   2> 466550 INFO  (qtp628113-71720) [n:127.0.0.1:36348_solr c:testschemaapi s:shard1 r:core_node2 x:testschemaapi_shard1_replica2] o.a.s.c.LeaderElector Joined leadership election with path: /collections/testschemaapi/leader_elect/shard1/election/95869105886855173-core_node2-n_0000000001
   [junit4]   2> 466550 INFO  (qtp7138856-71729) [n:127.0.0.1:38095_solr c:testschemaapi s:shard1 r:core_node1 x:testschemaapi_shard1_replica1] o.a.s.c.ShardLeaderElectionContext Running the leader process for shard=shard1 and weAreReplacement=false and leaderVoteWait=10000
   [junit4]   2> 466550 INFO  (qtp628113-71720) [n:127.0.0.1:36348_solr c:testschemaapi s:shard1 r:core_node2 x:testschemaapi_shard1_replica2] o.a.s.c.LeaderElector Watching path /collections/testschemaapi/leader_elect/shard1/election/95869105886855174-core_node1-n_0000000000 to know if I could be the leader
   [junit4]   2> 466551 INFO  (qtp7138856-71729) [n:127.0.0.1:38095_solr c:testschemaapi s:shard1 r:core_node1 x:testschemaapi_shard1_replica1] o.a.s.c.ShardLeaderElectionContext Enough replicas found to continue.
   [junit4]   2> 466551 INFO  (qtp7138856-71729) [n:127.0.0.1:38095_solr c:testschemaapi s:shard1 r:core_node1 x:testschemaapi_shard1_replica1] o.a.s.c.ShardLeaderElectionContext I may be the new leader - try and sync
   [junit4]   2> 466551 INFO  (qtp7138856-71729) [n:127.0.0.1:38095_solr c:testschemaapi s:shard1 r:core_node1 x:testschemaapi_shard1_replica1] o.a.s.c.SyncStrategy Sync replicas to http://127.0.0.1:38095/solr/testschemaapi_shard1_replica1/
   [junit4]   2> 466551 INFO  (qtp7138856-71729) [n:127.0.0.1:38095_solr c:testschemaapi s:shard1 r:core_node1 x:testschemaapi_shard1_replica1] o.a.s.u.PeerSync PeerSync: core=testschemaapi_shard1_replica1 url=http://127.0.0.1:38095/solr START replicas=[http://127.0.0.1:36348/solr/testschemaapi_shard1_replica2/] nUpdates=100
   [junit4]   2> 466551 INFO  (OverseerStateUpdate-95869105886855174-127.0.0.1:38095_solr-n_0000000000) [n:127.0.0.1:38095_solr    ] o.a.s.c.Overseer processMessage: queueSize: 1, message = {
   [junit4]   2>   "operation":"leader",
   [junit4]   2>   "shard":"shard1",
   [junit4]   2>   "collection":"testschemaapi"} current state version: 0
   [junit4]   2> 466551 INFO  (qtp7138856-71729) [n:127.0.0.1:38095_solr c:testschemaapi s:shard1 r:core_node1 x:testschemaapi_shard1_replica1] o.a.s.u.PeerSync PeerSync: core=testschemaapi_shard1_replica1 url=http://127.0.0.1:38095/solr DONE.  We have no versions.  sync failed.
   [junit4]   2> 466551 INFO  (qtp7138856-71729) [n:127.0.0.1:38095_solr c:testschemaapi s:shard1 r:core_node1 x:testschemaapi_shard1_replica1] o.a.s.c.SyncStrategy Leader's attempt to sync with shard failed, moving to the next candidate
   [junit4]   2> 466552 INFO  (qtp7138856-71729) [n:127.0.0.1:38095_solr c:testschemaapi s:shard1 r:core_node1 x:testschemaapi_shard1_replica1] o.a.s.c.ShardLeaderElectionContext We failed sync, but we have no versions - we can't sync in that case - we were active before, so become leader anyway
   [junit4]   2> 466553 INFO  (qtp7138856-71729) [n:127.0.0.1:38095_solr c:testschemaapi s:shard1 r:core_node1 x:testschemaapi_shard1_replica1] o.a.s.c.c.SolrZkClient makePath: /collections/testschemaapi/leaders/shard1
   [junit4]   2> 466554 INFO  (qtp628113-71716) [n:127.0.0.1:36348_solr c:testschemaapi s:shard1 r:core_node2 x:testschemaapi_shard1_replica2] o.a.s.c.S.Request [testschemaapi_shard1_replica2]  webapp=/solr path=/get params={distrib=false&qt=/get&fingerprint=false&getVersions=100&wt=javabin&version=2} status=0 QTime=0
   [junit4]   2> 466555 INFO  (qtp7138856-71729) [n:127.0.0.1:38095_solr c:testschemaapi s:shard1 r:core_node1 x:testschemaapi_shard1_replica1] o.a.s.c.ShardLeaderElectionContextBase Creating leader registration node /collections/testschemaapi/leaders/shard1/leader after winning as /collections/testschemaapi/leader_elect/shard1/election/95869105886855174-core_node1-n_0000000000
   [junit4]   2> 466557 INFO  (qtp7138856-71729) [n:127.0.0.1:38095_solr c:testschemaapi s:shard1 r:core_node1 x:testschemaapi_shard1_replica1] o.a.s.c.ShardLeaderElectionContext I am the new leader: http://127.0.0.1:38095/solr/testschemaapi_shard1_replica1/ shard1
   [junit4]   2> 466557 INFO  (OverseerStateUpdate-95869105886855174-127.0.0.1:38095_solr-n_0000000000) [n:127.0.0.1:38095_solr    ] o.a.s.c.Overseer processMessage: queueSize: 1, message = {
   [junit4]   2>   "operation":"leader",
   [junit4]   2>   "shard":"shard1",
   [junit4]   2>   "collection":"testschemaapi",
   [junit4]   2>   "base_url":"http://127.0.0.1:38095/solr",
   [junit4]   2>   "core":"testschemaapi_shard1_replica1",
   [junit4]   2>   "state":"active"} current state version: 0
   [junit4]   2> 466658 INFO  (OverseerStateUpdate-95869105886855174-127.0.0.1:38095_solr-n_0000000000) [n:127.0.0.1:38095_solr    ] o.a.s.c.o.ZkStateWriter going to update_collection /collections/testschemaapi/state.json version: 1
   [junit4]   2> 466659 INFO  (zkCallback-19324-thread-1-processing-n:127.0.0.1:38095_solr) [n:127.0.0.1:38095_solr    ] o.a.s.c.c.ZkStateReader A cluster state change: [WatchedEvent state:SyncConnected type:NodeDataChanged path:/collections/testschemaapi/state.json] for collection [testschemaapi] has occurred - updating... (live nodes size: [2])
   [junit4]   2> 466659 INFO  (zkCallback-19323-thread-1-processing-n:127.0.0.1:36348_solr) [n:127.0.0.1:36348_solr    ] o.a.s.c.c.ZkStateReader A cluster state change: [WatchedEvent state:SyncConnected type:NodeDataChanged path:/collections/testschemaapi/state.json] for collection [testschemaapi] has occurred - updating... (live nodes size: [2])
   [junit4]   2> 466659 INFO  (zkCallback-19324-thread-1-processing-n:127.0.0.1:38095_solr) [n:127.0.0.1:38095_solr    ] o.a.s.c.c.ZkStateReader Updating data for [testschemaapi] from [1] to [2]
   [junit4]   2> 466659 INFO  (zkCallback-19323-thread-1-processing-n:127.0.0.1:36348_solr) [n:127.0.0.1:36348_solr    ] o.a.s.c.c.ZkStateReader Updating data for [testschemaapi] from [1] to [2]
   [junit4]   2> 466707 INFO  (qtp7138856-71729) [n:127.0.0.1:38095_solr c:testschemaapi s:shard1 r:core_node1 x:testschemaapi_shard1_replica1] o.a.s.c.ZkController We are http://127.0.0.1:38095/solr/testschemaapi_shard1_replica1/ and leader is http://127.0.0.1:38095/solr/testschemaapi_shard1_replica1/
   [junit4]   2> 466707 INFO  (qtp7138856-71729) [n:127.0.0.1:38095_solr c:testschemaapi s:shard1 r:core_node1 x:testschemaapi_shard1_replica1] o.a.s.c.ZkController No LogReplay needed for core=testschemaapi_shard1_replica1 baseURL=http://127.0.0.1:38095/solr
   [junit4]   2> 466707 INFO  (qtp7138856-71729) [n:127.0.0.1:38095_solr c:testschemaapi s:shard1 r:core_node1 x:testschemaapi_shard1_replica1] o.a.s.c.ZkController I am the leader, no recovery necessary
   [junit4]   2> 466708 INFO  (qtp7138856-71729) [n:127.0.0.1:38095_solr c:testschemaapi s:shard1 r:core_node1 x:testschemaapi_shard1_replica1] o.a.s.c.ZkController publishing state=active
   [junit4]   2> 466709 INFO  (qtp7138856-71729) [n:127.0.0.1:38095_solr c:testschemaapi s:shard1 r:core_node1 x:testschemaapi_shard1_replica1] o.a.s.s.HttpSolrCall [admin] webapp=null path=/admin/cores params={qt=/admin/cores&collection.configName=conf1&name=testschemaapi_shard1_replica1&action=CREATE&numShards=1&collection=testschemaapi&shard=shard1&wt=javabin&version=2} status=0 QTime=1231
   [junit4]   2> 466711 INFO  (OverseerStateUpdate-95869105886855174-127.0.0.1:38095_solr-n_0000000000) [n:127.0.0.1:38095_solr    ] o.a.s.c.Overseer processMessage: queueSize: 1, message = {
   [junit4]   2>   "core":"testschemaapi_shard1_replica1",
   [junit4]   2>   "core_node_name":"core_node1",
   [junit4]   2>   "roles":null,
   [junit4]   2>   "base_url":"http://127.0.0.1:38095/solr",
   [junit4]   2>   "node_name":"127.0.0.1:38095_solr",
   [junit4]   2>   "numShards":"1",
   [junit4]   2>   "state":"active",
   [junit4]   2>   "shard":"shard1",
   [junit4]   2>   "collection":"testschemaapi",
   [junit4]   2>   "operation":"state"} current state version: 0
   [junit4]   2> 466711 INFO  (OverseerStateUpdate-95869105886855174-127.0.0.1:38095_solr-n_0000000000) [n:127.0.0.1:38095_solr    ] o.a.s.c.o.ReplicaMutator Update state numShards=1 message={
   [junit4]   2>   "core":"testschemaapi_shard1_replica1",
   [junit4]   2>   "core_node_name":"core_node1",
   [junit4]   2>   "roles":null,
   [junit4]   2>   "base_url":"http://127.0.0.1:38095/solr",
   [junit4]   2>   "node_name":"127.0.0.1:38095_solr",
   [junit4]   2>   "numShards":"1",
   [junit4]   2>   "state":"active",
   [junit4]   2>   "shard":"shard1",
   [junit4]   2>   "collection":"testschemaapi",
   [junit4]   2>   "operation":"state"}
   [junit4]   2> 466813 INFO  (OverseerStateUpdate-95869105886855174-127.0.0.1:38095_solr-n_0000000000) [n:127.0.0.1:38095_solr    ] o.a.s.c.o.ZkStateWriter going to update_collection /collections/testschemaapi/state.json version: 2
   [junit4]   2> 466813 INFO  (zkCallback-19324-thread-1-processing-n:127.0.0.1:38095_solr) [n:127.0.0.1:38095_solr    ] o.a.s.c.c.ZkStateReader A cluster state change: [WatchedEvent state:SyncConnected type:NodeDataChanged path:/collections/testschemaapi/state.json] for collection [testschemaapi] has occurred - updating... (live nodes size: [2])
   [junit4]   2> 466813 INFO  (zkCallback-19323-thread-1-processing-n:127.0.0.1:36348_solr) [n:127.0.0.1:36348_solr    ] o.a.s.c.c.ZkStateReader A cluster state change: [WatchedEvent state:SyncConnected type:NodeDataChanged path:/collections/testschemaapi/state.json] for collection [testschemaapi] has occurred - updating... (live nodes size: [2])
   [junit4]   2> 466813 INFO  (zkCallback-19324-thread-1-processing-n:127.0.0.1:38095_solr) [n:127.0.0.1:38095_solr    ] o.a.s.c.c.ZkStateReader Updating data for [testschemaapi] from [2] to [3]
   [junit4]   2> 466813 INFO  (zkCallback-19323-thread-1-processing-n:127.0.0.1:36348_solr) [n:127.0.0.1:36348_solr    ] o.a.s.c.c.ZkStateReader Updating data for [testschemaapi] from [2] to [3]
   [junit4]   2> 467551 INFO  (qtp628113-71720) [n:127.0.0.1:36348_solr c:testschemaapi s:shard1 r:core_node2 x:testschemaapi_shard1_replica2] o.a.s.c.ZkController We are http://127.0.0.1:36348/solr/testschemaapi_shard1_replica2/ and leader is http://127.0.0.1:38095/solr/testschemaapi_shard1_replica1/
   [junit4]   2> 467551 INFO  (qtp628113-71720) [n:127.0.0.1:36348_solr c:testschemaapi s:shard1 r:core_node2 x:testschemaapi_shard1_replica2] o.a.s.c.ZkController No LogReplay needed for core=testschemaapi_shard1_replica2 baseURL=http://127.0.0.1:36348/solr
   [junit4]   2> 467551 INFO  (qtp628113-71720) [n:127.0.0.1:36348_solr c:testschemaapi s:shard1 r:core_node2 x:testschemaapi_shard1_replica2] o.a.s.c.ZkController Core needs to recover:testschemaapi_shard1_replica2
   [junit4]   2> 467552 INFO  (updateExecutor-19317-thread-1-processing-n:127.0.0.1:36348_solr x:testschemaapi_shard1_replica2 s:shard1 c:testschemaapi r:core_node2) [n:127.0.0.1:36348_solr c:testschemaapi s:shard1 r:core_

[...truncated too long message...]

ngeDeletes=0,docsPending=0,adds=0,deletesById=0,deletesByQuery=0,errors=0,cumulative_adds=0,cumulative_deletesById=0,cumulative_deletesByQuery=0,cumulative_errors=0,transaction_logs_total_size=0,transaction_logs_total_number=0}
   [junit4]   2> 477017 INFO  (Thread-1149) [n:127.0.0.1:36348_solr c:testschemaapi s:shard1 r:core_node2 x:testschemaapi_shard1_replica2] o.a.s.u.SolrCoreState Closing SolrCoreState
   [junit4]   2> 477017 WARN  (Thread-1149) [n:127.0.0.1:36348_solr c:testschemaapi s:shard1 r:core_node2 x:testschemaapi_shard1_replica2] o.a.s.c.RecoveryStrategy Stopping recovery for core=[testschemaapi_shard1_replica2] coreNodeName=[core_node2]
   [junit4]   2> 477017 INFO  (Thread-1149) [n:127.0.0.1:36348_solr c:testschemaapi s:shard1 r:core_node2 x:testschemaapi_shard1_replica2] o.a.s.u.DefaultSolrCoreState SolrCoreState ref count has reached 0 - closing IndexWriter
   [junit4]   2> 477017 INFO  (Thread-1149) [n:127.0.0.1:36348_solr c:testschemaapi s:shard1 r:core_node2 x:testschemaapi_shard1_replica2] o.a.s.u.DefaultSolrCoreState closing IndexWriter with IndexWriterCloser
   [junit4]   2> 477017 INFO  (Thread-1149) [n:127.0.0.1:36348_solr c:testschemaapi s:shard1 r:core_node2 x:testschemaapi_shard1_replica2] o.a.s.u.DirectUpdateHandler2 Committing on IndexWriter close.
   [junit4]   2> 477017 INFO  (Thread-1149) [n:127.0.0.1:36348_solr c:testschemaapi s:shard1 r:core_node2 x:testschemaapi_shard1_replica2] o.a.s.c.SolrDeletionPolicy SolrDeletionPolicy.onCommit: commits: num=2
   [junit4]   2> 	commit{dir=MockDirectoryWrapper(RAMDirectory@155800d lockFactory=org.apache.lucene.store.SingleInstanceLockFactory@1eb7da3),segFN=segments_1,generation=1}
   [junit4]   2> 	commit{dir=MockDirectoryWrapper(RAMDirectory@155800d lockFactory=org.apache.lucene.store.SingleInstanceLockFactory@1eb7da3),segFN=segments_2,generation=2}
   [junit4]   2> 477018 INFO  (Thread-1149) [n:127.0.0.1:36348_solr c:testschemaapi s:shard1 r:core_node2 x:testschemaapi_shard1_replica2] o.a.s.c.SolrDeletionPolicy newest commit generation = 2
   [junit4]   2> 477019 INFO  (Thread-1149) [n:127.0.0.1:36348_solr c:testschemaapi s:shard1 r:core_node2 x:testschemaapi_shard1_replica2] o.a.s.c.SolrCore [testschemaapi_shard1_replica2] Closing main searcher on request.
   [junit4]   2> 477019 INFO  (Thread-1149) [n:127.0.0.1:36348_solr c:testschemaapi s:shard1 r:core_node2 x:testschemaapi_shard1_replica2] o.a.s.c.CachingDirectoryFactory Closing MockDirectoryFactory - 2 directories currently being tracked
   [junit4]   2> 477020 INFO  (Thread-1149) [n:127.0.0.1:36348_solr c:testschemaapi s:shard1 r:core_node2 x:testschemaapi_shard1_replica2] o.a.s.c.CachingDirectoryFactory looking to close /home/jenkins/workspace/Lucene-Solr-6.x-Linux/solr/build/solr-core/test/J1/temp/solr.schema.TestManagedSchemaAPI_B7650CA29295C2C9-001/tempDir-001/node1/./testschemaapi_shard1_replica2/data [CachedDir<<refCount=0;path=/home/jenkins/workspace/Lucene-Solr-6.x-Linux/solr/build/solr-core/test/J1/temp/solr.schema.TestManagedSchemaAPI_B7650CA29295C2C9-001/tempDir-001/node1/./testschemaapi_shard1_replica2/data;done=false>>]
   [junit4]   2> 477020 INFO  (Thread-1149) [n:127.0.0.1:36348_solr c:testschemaapi s:shard1 r:core_node2 x:testschemaapi_shard1_replica2] o.a.s.c.CachingDirectoryFactory Closing directory, CoreContainer#isShutdown=true
   [junit4]   2> 477020 INFO  (Thread-1149) [n:127.0.0.1:36348_solr c:testschemaapi s:shard1 r:core_node2 x:testschemaapi_shard1_replica2] o.a.s.c.CachingDirectoryFactory Closing directory: /home/jenkins/workspace/Lucene-Solr-6.x-Linux/solr/build/solr-core/test/J1/temp/solr.schema.TestManagedSchemaAPI_B7650CA29295C2C9-001/tempDir-001/node1/./testschemaapi_shard1_replica2/data
   [junit4]   2> 477020 INFO  (Thread-1149) [n:127.0.0.1:36348_solr c:testschemaapi s:shard1 r:core_node2 x:testschemaapi_shard1_replica2] o.a.s.c.CachingDirectoryFactory looking to close /home/jenkins/workspace/Lucene-Solr-6.x-Linux/solr/build/solr-core/test/J1/temp/solr.schema.TestManagedSchemaAPI_B7650CA29295C2C9-001/tempDir-001/node1/./testschemaapi_shard1_replica2/data/index [CachedDir<<refCount=0;path=/home/jenkins/workspace/Lucene-Solr-6.x-Linux/solr/build/solr-core/test/J1/temp/solr.schema.TestManagedSchemaAPI_B7650CA29295C2C9-001/tempDir-001/node1/./testschemaapi_shard1_replica2/data/index;done=false>>]
   [junit4]   2> 477020 INFO  (Thread-1149) [n:127.0.0.1:36348_solr c:testschemaapi s:shard1 r:core_node2 x:testschemaapi_shard1_replica2] o.a.s.c.CachingDirectoryFactory Closing directory, CoreContainer#isShutdown=true
   [junit4]   2> 477020 INFO  (Thread-1149) [n:127.0.0.1:36348_solr c:testschemaapi s:shard1 r:core_node2 x:testschemaapi_shard1_replica2] o.a.s.c.CachingDirectoryFactory Closing directory: /home/jenkins/workspace/Lucene-Solr-6.x-Linux/solr/build/solr-core/test/J1/temp/solr.schema.TestManagedSchemaAPI_B7650CA29295C2C9-001/tempDir-001/node1/./testschemaapi_shard1_replica2/data/index
   [junit4]   2> 477020 WARN  (Thread-1149) [n:127.0.0.1:36348_solr c:testschemaapi s:shard1 r:core_node2 x:testschemaapi_shard1_replica2] o.a.s.c.ZkController listener throws error
   [junit4]   2> org.apache.solr.common.SolrException: Unable to reload core [testschemaapi_shard1_replica2]
   [junit4]   2> 	at org.apache.solr.core.CoreContainer.reload(CoreContainer.java:921)
   [junit4]   2> 	at org.apache.solr.core.SolrCore.lambda$getConfListener$6(SolrCore.java:2490)
   [junit4]   2> 	at org.apache.solr.cloud.ZkController$4.run(ZkController.java:2423)
   [junit4]   2> Caused by: org.apache.solr.common.SolrException: Could not find config name for collection:testschemaapi
   [junit4]   2> 	at org.apache.solr.core.SolrCore.<init>(SolrCore.java:773)
   [junit4]   2> 	at org.apache.solr.core.SolrCore.reload(SolrCore.java:462)
   [junit4]   2> 	at org.apache.solr.core.CoreContainer.reload(CoreContainer.java:915)
   [junit4]   2> 	... 2 more
   [junit4]   2> Caused by: org.apache.solr.common.SolrException: Could not find config name for collection:testschemaapi
   [junit4]   2> 	at org.apache.solr.rest.ManagedResourceStorage.newStorageIO(ManagedResourceStorage.java:101)
   [junit4]   2> 	at org.apache.solr.core.SolrCore.initRestManager(SolrCore.java:2285)
   [junit4]   2> 	at org.apache.solr.core.SolrCore.<init>(SolrCore.java:749)
   [junit4]   2> 	... 4 more
   [junit4]   2> NOTE: test params are: codec=HighCompressionCompressingStoredFields(storedFieldsFormat=CompressingStoredFieldsFormat(compressionMode=HIGH_COMPRESSION, chunkSize=29385, maxDocsPerChunk=10, blockSize=8), termVectorsFormat=CompressingTermVectorsFormat(compressionMode=HIGH_COMPRESSION, chunkSize=29385, blockSize=8)), sim=ClassicSimilarity, locale=pl, timezone=Pacific/Johnston
   [junit4]   2> NOTE: Linux 4.4.0-21-generic i386/Oracle Corporation 1.8.0_92 (32-bit)/cpus=12,threads=1,free=86171808,total=323178496
   [junit4]   2> NOTE: All tests run in this JVM: [DocValuesTest, TestQueryTypes, TestStressLiveNodes, TestGeoJSONResponseWriter, TestDistribIDF, OutOfBoxZkACLAndCredentialsProvidersTest, TestFastLRUCache, DocumentBuilderTest, OverseerRolesTest, TestSolrCoreProperties, TestFieldTypeCollectionResource, ShardRoutingTest, TestUniqueKeyFieldResource, WordBreakSolrSpellCheckerTest, SpellCheckComponentTest, TestUpdate, ConvertedLegacyTest, TestQueryUtils, TestHashQParserPlugin, TestQueryWrapperFilter, LeaderInitiatedRecoveryOnShardRestartTest, TestConfigSetsAPIZkFailure, TestUseDocValuesAsStored2, ZkControllerTest, TestRandomRequestDistribution, HdfsLockFactoryTest, TestFreeTextSuggestions, SortByFunctionTest, TestChildDocTransformer, AddSchemaFieldsUpdateProcessorFactoryTest, UniqFieldsUpdateProcessorFactoryTest, BitVectorTest, MoreLikeThisHandlerTest, TestSerializedLuceneMatchVersion, TestSQLHandler, TestShortCircuitedRequests, LoggingHandlerTest, TestTrie, TestIntervalFaceting, TestBulkSchemaConcurrent, CustomCollectionTest, TestManagedSchemaAPI]
   [junit4]   2> NOTE: reproduce with: ant test  -Dtestcase=TestManagedSchemaAPI -Dtests.seed=B7650CA29295C2C9 -Dtests.multiplier=3 -Dtests.slow=true -Dtests.locale=pl -Dtests.timezone=Pacific/Johnston -Dtests.asserts=true -Dtests.file.encoding=US-ASCII
   [junit4] ERROR   0.00s J1 | TestManagedSchemaAPI (suite) <<<
   [junit4]    > Throwable #1: java.lang.AssertionError: ObjectTracker found 4 object(s) that were not released!!! [MDCAwareThreadPoolExecutor, MockDirectoryWrapper, MockDirectoryWrapper, TransactionLog]
   [junit4]    > 	at __randomizedtesting.SeedInfo.seed([B7650CA29295C2C9]:0)
   [junit4]    > 	at org.apache.solr.SolrTestCaseJ4.afterClass(SolrTestCaseJ4.java:256)
   [junit4]    > 	at java.lang.Thread.run(Thread.java:745)
   [junit4] Completed [108/598 (1!)] on J1 in 13.71s, 1 test, 1 failure <<< FAILURES!

[...truncated 1601 lines...]
BUILD FAILED
/home/jenkins/workspace/Lucene-Solr-6.x-Linux/build.xml:740: The following error occurred while executing this line:
/home/jenkins/workspace/Lucene-Solr-6.x-Linux/build.xml:684: The following error occurred while executing this line:
/home/jenkins/workspace/Lucene-Solr-6.x-Linux/build.xml:59: The following error occurred while executing this line:
/home/jenkins/workspace/Lucene-Solr-6.x-Linux/solr/build.xml:233: The following error occurred while executing this line:
/home/jenkins/workspace/Lucene-Solr-6.x-Linux/solr/common-build.xml:529: The following error occurred while executing this line:
/home/jenkins/workspace/Lucene-Solr-6.x-Linux/lucene/common-build.xml:1457: The following error occurred while executing this line:
/home/jenkins/workspace/Lucene-Solr-6.x-Linux/lucene/common-build.xml:1014: There were test failures: 598 suites (10 ignored), 2419 tests, 1 suite-level error, 115 ignored (71 assumptions) [seed: B7650CA29295C2C9]

Total time: 64 minutes 15 seconds
Build step 'Invoke Ant' marked build as failure
Archiving artifacts
[WARNINGS] Skipping publisher since build result is FAILURE
Recording test results
Email was triggered for: Failure - Any
Sending email for trigger: Failure - Any



Mime
View raw message