lucene-dev mailing list archives

Site index · List index
Message view « Date » · « Thread »
Top « Date » · « Thread »
From Policeman Jenkins Server <jenk...@thetaphi.de>
Subject [JENKINS-EA] Lucene-Solr-6.x-Linux (32bit/jdk-9-ea+116) - Build # 648 - Failure!
Date Sat, 14 May 2016 09:12:53 GMT
Build: http://jenkins.thetaphi.de/job/Lucene-Solr-6.x-Linux/648/
Java: 32bit/jdk-9-ea+116 -server -XX:+UseSerialGC

2 tests failed.
FAILED:  junit.framework.TestSuite.org.apache.solr.security.BasicAuthIntegrationTest

Error Message:
Suite timeout exceeded (>= 7200000 msec).

Stack Trace:
java.lang.Exception: Suite timeout exceeded (>= 7200000 msec).
	at __randomizedtesting.SeedInfo.seed([2380F557F096A2A9]:0)


FAILED:  org.apache.solr.security.BasicAuthIntegrationTest.testBasics

Error Message:
Test abandoned because suite timeout was reached.

Stack Trace:
java.lang.Exception: Test abandoned because suite timeout was reached.
	at __randomizedtesting.SeedInfo.seed([2380F557F096A2A9]:0)




Build Log:
[...truncated 12588 lines...]
   [junit4] Suite: org.apache.solr.security.BasicAuthIntegrationTest
   [junit4]   2> 2331353 INFO  (TEST-BasicAuthIntegrationTest.testBasics-seed#[2380F557F096A2A9]) [    ] o.a.s.c.ZkTestServer STARTING ZK TEST SERVER
   [junit4]   2> 2331354 INFO  (Thread-5999) [    ] o.a.s.c.ZkTestServer client port:0.0.0.0/0.0.0.0:0
   [junit4]   2> 2331354 INFO  (Thread-5999) [    ] o.a.s.c.ZkTestServer Starting server
   [junit4]   2> 2331454 INFO  (TEST-BasicAuthIntegrationTest.testBasics-seed#[2380F557F096A2A9]) [    ] o.a.s.c.ZkTestServer start zk server on port:42039
   [junit4]   2> 2331454 INFO  (TEST-BasicAuthIntegrationTest.testBasics-seed#[2380F557F096A2A9]) [    ] o.a.s.c.c.SolrZkClient Using default ZkCredentialsProvider
   [junit4]   2> 2331455 INFO  (TEST-BasicAuthIntegrationTest.testBasics-seed#[2380F557F096A2A9]) [    ] o.a.s.c.c.ConnectionManager Waiting for client to connect to ZooKeeper
   [junit4]   2> 2331536 INFO  (zkCallback-23289-thread-1) [    ] o.a.s.c.c.ConnectionManager Watcher org.apache.solr.common.cloud.ConnectionManager@d93b00 name:ZooKeeperConnection Watcher:127.0.0.1:42039 got event WatchedEvent state:SyncConnected type:None path:null path:null type:None
   [junit4]   2> 2331536 INFO  (TEST-BasicAuthIntegrationTest.testBasics-seed#[2380F557F096A2A9]) [    ] o.a.s.c.c.ConnectionManager Client is connected to ZooKeeper
   [junit4]   2> 2331537 INFO  (TEST-BasicAuthIntegrationTest.testBasics-seed#[2380F557F096A2A9]) [    ] o.a.s.c.c.SolrZkClient Using default ZkACLProvider
   [junit4]   2> 2331537 INFO  (TEST-BasicAuthIntegrationTest.testBasics-seed#[2380F557F096A2A9]) [    ] o.a.s.c.c.SolrZkClient makePath: /solr/solr.xml
   [junit4]   2> 2331611 INFO  (jetty-launcher-23288-thread-3) [    ] o.e.j.s.Server jetty-9.3.8.v20160314
   [junit4]   2> 2331611 INFO  (jetty-launcher-23288-thread-1) [    ] o.e.j.s.Server jetty-9.3.8.v20160314
   [junit4]   2> 2331611 INFO  (jetty-launcher-23288-thread-2) [    ] o.e.j.s.Server jetty-9.3.8.v20160314
   [junit4]   2> 2331611 INFO  (jetty-launcher-23288-thread-4) [    ] o.e.j.s.Server jetty-9.3.8.v20160314
   [junit4]   2> 2331611 INFO  (jetty-launcher-23288-thread-5) [    ] o.e.j.s.Server jetty-9.3.8.v20160314
   [junit4]   2> 2331613 INFO  (jetty-launcher-23288-thread-1) [    ] o.e.j.s.h.ContextHandler Started o.e.j.s.ServletContextHandler@711b{/solr,null,AVAILABLE}
   [junit4]   2> 2331614 INFO  (jetty-launcher-23288-thread-4) [    ] o.e.j.s.h.ContextHandler Started o.e.j.s.ServletContextHandler@e44c7c{/solr,null,AVAILABLE}
   [junit4]   2> 2331614 INFO  (jetty-launcher-23288-thread-3) [    ] o.e.j.s.h.ContextHandler Started o.e.j.s.ServletContextHandler@1c5f58b{/solr,null,AVAILABLE}
   [junit4]   2> 2331614 INFO  (jetty-launcher-23288-thread-5) [    ] o.e.j.s.h.ContextHandler Started o.e.j.s.ServletContextHandler@100cc14{/solr,null,AVAILABLE}
   [junit4]   2> 2331614 INFO  (jetty-launcher-23288-thread-1) [    ] o.e.j.s.ServerConnector Started ServerConnector@123279b{HTTP/1.1,[http/1.1]}{127.0.0.1:46771}
   [junit4]   2> 2331614 INFO  (jetty-launcher-23288-thread-2) [    ] o.e.j.s.h.ContextHandler Started o.e.j.s.ServletContextHandler@de8b47{/solr,null,AVAILABLE}
   [junit4]   2> 2331615 INFO  (jetty-launcher-23288-thread-4) [    ] o.e.j.s.ServerConnector Started ServerConnector@5f87d9{HTTP/1.1,[http/1.1]}{127.0.0.1:38066}
   [junit4]   2> 2331614 INFO  (jetty-launcher-23288-thread-3) [    ] o.e.j.s.ServerConnector Started ServerConnector@1f83c12{HTTP/1.1,[http/1.1]}{127.0.0.1:36563}
   [junit4]   2> 2331615 INFO  (jetty-launcher-23288-thread-5) [    ] o.e.j.s.ServerConnector Started ServerConnector@1c16c9a{HTTP/1.1,[http/1.1]}{127.0.0.1:40787}
   [junit4]   2> 2331615 INFO  (jetty-launcher-23288-thread-3) [    ] o.e.j.s.Server Started @2333398ms
   [junit4]   2> 2331615 INFO  (jetty-launcher-23288-thread-5) [    ] o.e.j.s.Server Started @2333398ms
   [junit4]   2> 2331615 INFO  (jetty-launcher-23288-thread-3) [    ] o.a.s.c.s.e.JettySolrRunner Jetty properties: {hostContext=/solr, hostPort=36563}
   [junit4]   2> 2331615 INFO  (jetty-launcher-23288-thread-5) [    ] o.a.s.c.s.e.JettySolrRunner Jetty properties: {hostContext=/solr, hostPort=40787}
   [junit4]   2> 2331615 INFO  (jetty-launcher-23288-thread-2) [    ] o.e.j.s.ServerConnector Started ServerConnector@1e3f4ec{HTTP/1.1,[http/1.1]}{127.0.0.1:40836}
   [junit4]   2> 2331615 INFO  (jetty-launcher-23288-thread-3) [    ] o.a.s.s.SolrDispatchFilter SolrDispatchFilter.init(): jdk.internal.loader.ClassLoaders$AppClassLoader@a4a92b
   [junit4]   2> 2331615 INFO  (jetty-launcher-23288-thread-2) [    ] o.e.j.s.Server Started @2333399ms
   [junit4]   2> 2331615 INFO  (jetty-launcher-23288-thread-3) [    ] o.a.s.c.SolrResourceLoader new SolrResourceLoader for directory: '/home/jenkins/workspace/Lucene-Solr-6.x-Linux/solr/build/solr-core/test/J0/temp/solr.security.BasicAuthIntegrationTest_2380F557F096A2A9-001/tempDir-001/node3'
   [junit4]   2> 2331615 INFO  (jetty-launcher-23288-thread-2) [    ] o.a.s.c.s.e.JettySolrRunner Jetty properties: {hostContext=/solr, hostPort=40836}
   [junit4]   2> 2331615 INFO  (jetty-launcher-23288-thread-3) [    ] o.a.s.c.SolrResourceLoader JNDI not configured for solr (NoInitialContextEx)
   [junit4]   2> 2331615 INFO  (jetty-launcher-23288-thread-4) [    ] o.e.j.s.Server Started @2333398ms
   [junit4]   2> 2331615 INFO  (jetty-launcher-23288-thread-2) [    ] o.a.s.s.SolrDispatchFilter SolrDispatchFilter.init(): jdk.internal.loader.ClassLoaders$AppClassLoader@a4a92b
   [junit4]   2> 2331615 INFO  (jetty-launcher-23288-thread-1) [    ] o.e.j.s.Server Started @2333398ms
   [junit4]   2> 2331616 INFO  (jetty-launcher-23288-thread-2) [    ] o.a.s.c.SolrResourceLoader new SolrResourceLoader for directory: '/home/jenkins/workspace/Lucene-Solr-6.x-Linux/solr/build/solr-core/test/J0/temp/solr.security.BasicAuthIntegrationTest_2380F557F096A2A9-001/tempDir-001/node2'
   [junit4]   2> 2331616 INFO  (jetty-launcher-23288-thread-1) [    ] o.a.s.c.s.e.JettySolrRunner Jetty properties: {hostContext=/solr, hostPort=46771}
   [junit4]   2> 2331616 INFO  (jetty-launcher-23288-thread-2) [    ] o.a.s.c.SolrResourceLoader JNDI not configured for solr (NoInitialContextEx)
   [junit4]   2> 2331615 INFO  (jetty-launcher-23288-thread-4) [    ] o.a.s.c.s.e.JettySolrRunner Jetty properties: {hostContext=/solr, hostPort=38066}
   [junit4]   2> 2331616 INFO  (jetty-launcher-23288-thread-1) [    ] o.a.s.s.SolrDispatchFilter SolrDispatchFilter.init(): jdk.internal.loader.ClassLoaders$AppClassLoader@a4a92b
   [junit4]   2> 2331616 INFO  (jetty-launcher-23288-thread-4) [    ] o.a.s.s.SolrDispatchFilter SolrDispatchFilter.init(): jdk.internal.loader.ClassLoaders$AppClassLoader@a4a92b
   [junit4]   2> 2331616 INFO  (jetty-launcher-23288-thread-1) [    ] o.a.s.c.SolrResourceLoader new SolrResourceLoader for directory: '/home/jenkins/workspace/Lucene-Solr-6.x-Linux/solr/build/solr-core/test/J0/temp/solr.security.BasicAuthIntegrationTest_2380F557F096A2A9-001/tempDir-001/node1'
   [junit4]   2> 2331615 INFO  (jetty-launcher-23288-thread-3) [    ] o.a.s.c.SolrResourceLoader solr home defaulted to 'solr/' (could not find system property or JNDI)
   [junit4]   2> 2331616 INFO  (jetty-launcher-23288-thread-1) [    ] o.a.s.c.SolrResourceLoader JNDI not configured for solr (NoInitialContextEx)
   [junit4]   2> 2331615 INFO  (jetty-launcher-23288-thread-5) [    ] o.a.s.s.SolrDispatchFilter SolrDispatchFilter.init(): jdk.internal.loader.ClassLoaders$AppClassLoader@a4a92b
   [junit4]   2> 2331616 INFO  (jetty-launcher-23288-thread-3) [    ] o.a.s.c.c.SolrZkClient Using default ZkCredentialsProvider
   [junit4]   2> 2331616 INFO  (jetty-launcher-23288-thread-5) [    ] o.a.s.c.SolrResourceLoader new SolrResourceLoader for directory: '/home/jenkins/workspace/Lucene-Solr-6.x-Linux/solr/build/solr-core/test/J0/temp/solr.security.BasicAuthIntegrationTest_2380F557F096A2A9-001/tempDir-001/node5'
   [junit4]   2> 2331616 INFO  (jetty-launcher-23288-thread-1) [    ] o.a.s.c.SolrResourceLoader solr home defaulted to 'solr/' (could not find system property or JNDI)
   [junit4]   2> 2331616 INFO  (jetty-launcher-23288-thread-3) [    ] o.a.s.c.c.ConnectionManager Waiting for client to connect to ZooKeeper
   [junit4]   2> 2331616 INFO  (jetty-launcher-23288-thread-4) [    ] o.a.s.c.SolrResourceLoader new SolrResourceLoader for directory: '/home/jenkins/workspace/Lucene-Solr-6.x-Linux/solr/build/solr-core/test/J0/temp/solr.security.BasicAuthIntegrationTest_2380F557F096A2A9-001/tempDir-001/node4'
   [junit4]   2> 2331617 INFO  (jetty-launcher-23288-thread-1) [    ] o.a.s.c.c.SolrZkClient Using default ZkCredentialsProvider
   [junit4]   2> 2331617 INFO  (jetty-launcher-23288-thread-4) [    ] o.a.s.c.SolrResourceLoader JNDI not configured for solr (NoInitialContextEx)
   [junit4]   2> 2331616 INFO  (jetty-launcher-23288-thread-2) [    ] o.a.s.c.SolrResourceLoader solr home defaulted to 'solr/' (could not find system property or JNDI)
   [junit4]   2> 2331617 INFO  (jetty-launcher-23288-thread-4) [    ] o.a.s.c.SolrResourceLoader solr home defaulted to 'solr/' (could not find system property or JNDI)
   [junit4]   2> 2331617 INFO  (jetty-launcher-23288-thread-1) [    ] o.a.s.c.c.ConnectionManager Waiting for client to connect to ZooKeeper
   [junit4]   2> 2331617 INFO  (jetty-launcher-23288-thread-2) [    ] o.a.s.c.c.SolrZkClient Using default ZkCredentialsProvider
   [junit4]   2> 2331617 INFO  (jetty-launcher-23288-thread-4) [    ] o.a.s.c.c.SolrZkClient Using default ZkCredentialsProvider
   [junit4]   2> 2331616 INFO  (jetty-launcher-23288-thread-5) [    ] o.a.s.c.SolrResourceLoader JNDI not configured for solr (NoInitialContextEx)
   [junit4]   2> 2331617 INFO  (jetty-launcher-23288-thread-5) [    ] o.a.s.c.SolrResourceLoader solr home defaulted to 'solr/' (could not find system property or JNDI)
   [junit4]   2> 2331617 INFO  (jetty-launcher-23288-thread-2) [    ] o.a.s.c.c.ConnectionManager Waiting for client to connect to ZooKeeper
   [junit4]   2> 2331617 INFO  (jetty-launcher-23288-thread-5) [    ] o.a.s.c.c.SolrZkClient Using default ZkCredentialsProvider
   [junit4]   2> 2331617 INFO  (jetty-launcher-23288-thread-4) [    ] o.a.s.c.c.ConnectionManager Waiting for client to connect to ZooKeeper
   [junit4]   2> 2331617 INFO  (jetty-launcher-23288-thread-5) [    ] o.a.s.c.c.ConnectionManager Waiting for client to connect to ZooKeeper
   [junit4]   2> 2331633 INFO  (zkCallback-23290-thread-1) [    ] o.a.s.c.c.ConnectionManager Watcher org.apache.solr.common.cloud.ConnectionManager@15bb36c name:ZooKeeperConnection Watcher:127.0.0.1:42039/solr got event WatchedEvent state:SyncConnected type:None path:null path:null type:None
   [junit4]   2> 2331633 INFO  (jetty-launcher-23288-thread-3) [    ] o.a.s.c.c.ConnectionManager Client is connected to ZooKeeper
   [junit4]   2> 2331633 INFO  (jetty-launcher-23288-thread-3) [    ] o.a.s.c.c.SolrZkClient Using default ZkACLProvider
   [junit4]   2> 2331656 INFO  (zkCallback-23291-thread-1) [    ] o.a.s.c.c.ConnectionManager Watcher org.apache.solr.common.cloud.ConnectionManager@3a1e0a name:ZooKeeperConnection Watcher:127.0.0.1:42039/solr got event WatchedEvent state:SyncConnected type:None path:null path:null type:None
   [junit4]   2> 2331656 INFO  (zkCallback-23292-thread-1) [    ] o.a.s.c.c.ConnectionManager Watcher org.apache.solr.common.cloud.ConnectionManager@17dd32 name:ZooKeeperConnection Watcher:127.0.0.1:42039/solr got event WatchedEvent state:SyncConnected type:None path:null path:null type:None
   [junit4]   2> 2331656 INFO  (jetty-launcher-23288-thread-3) [    ] o.a.s.s.SolrDispatchFilter solr.xml found in ZooKeeper. Loading...
   [junit4]   2> 2331656 INFO  (jetty-launcher-23288-thread-2) [    ] o.a.s.c.c.ConnectionManager Client is connected to ZooKeeper
   [junit4]   2> 2331656 INFO  (jetty-launcher-23288-thread-1) [    ] o.a.s.c.c.ConnectionManager Client is connected to ZooKeeper
   [junit4]   2> 2331657 INFO  (jetty-launcher-23288-thread-2) [    ] o.a.s.c.c.SolrZkClient Using default ZkACLProvider
   [junit4]   2> 2331657 INFO  (jetty-launcher-23288-thread-1) [    ] o.a.s.c.c.SolrZkClient Using default ZkACLProvider
   [junit4]   2> 2331657 INFO  (zkCallback-23293-thread-1) [    ] o.a.s.c.c.ConnectionManager Watcher org.apache.solr.common.cloud.ConnectionManager@14a6048 name:ZooKeeperConnection Watcher:127.0.0.1:42039/solr got event WatchedEvent state:SyncConnected type:None path:null path:null type:None
   [junit4]   2> 2331657 INFO  (jetty-launcher-23288-thread-4) [    ] o.a.s.c.c.ConnectionManager Client is connected to ZooKeeper
   [junit4]   2> 2331657 INFO  (jetty-launcher-23288-thread-1) [    ] o.a.s.s.SolrDispatchFilter solr.xml found in ZooKeeper. Loading...
   [junit4]   2> 2331657 INFO  (zkCallback-23294-thread-1) [    ] o.a.s.c.c.ConnectionManager Watcher org.apache.solr.common.cloud.ConnectionManager@e5b56d name:ZooKeeperConnection Watcher:127.0.0.1:42039/solr got event WatchedEvent state:SyncConnected type:None path:null path:null type:None
   [junit4]   2> 2331657 INFO  (jetty-launcher-23288-thread-4) [    ] o.a.s.c.c.SolrZkClient Using default ZkACLProvider
   [junit4]   2> 2331657 INFO  (jetty-launcher-23288-thread-2) [    ] o.a.s.s.SolrDispatchFilter solr.xml found in ZooKeeper. Loading...
   [junit4]   2> 2331657 INFO  (jetty-launcher-23288-thread-5) [    ] o.a.s.c.c.ConnectionManager Client is connected to ZooKeeper
   [junit4]   2> 2331657 INFO  (jetty-launcher-23288-thread-4) [    ] o.a.s.s.SolrDispatchFilter solr.xml found in ZooKeeper. Loading...
   [junit4]   2> 2331657 INFO  (jetty-launcher-23288-thread-5) [    ] o.a.s.c.c.SolrZkClient Using default ZkACLProvider
   [junit4]   2> 2331658 INFO  (jetty-launcher-23288-thread-5) [    ] o.a.s.s.SolrDispatchFilter solr.xml found in ZooKeeper. Loading...
   [junit4]   2> 2331675 WARN  (NIOServerCxn.Factory:0.0.0.0/0.0.0.0:0) [    ] o.a.z.s.NIOServerCnxn caught end of stream exception
   [junit4]   2> EndOfStreamException: Unable to read additional data from client sessionid 0x154ae1bd64f0002, likely client has closed socket
   [junit4]   2> 	at org.apache.zookeeper.server.NIOServerCnxn.doIO(NIOServerCnxn.java:228)
   [junit4]   2> 	at org.apache.zookeeper.server.NIOServerCnxnFactory.run(NIOServerCnxnFactory.java:208)
   [junit4]   2> 	at java.lang.Thread.run(java.base@9-ea/Thread.java:804)
   [junit4]   2> 2331675 INFO  (jetty-launcher-23288-thread-1) [    ] o.a.s.c.CorePropertiesLocator Config-defined core root directory: /home/jenkins/workspace/Lucene-Solr-6.x-Linux/solr/build/solr-core/test/J0/temp/solr.security.BasicAuthIntegrationTest_2380F557F096A2A9-001/tempDir-001/node1/.
   [junit4]   2> 2331675 WARN  (NIOServerCxn.Factory:0.0.0.0/0.0.0.0:0) [    ] o.a.z.s.NIOServerCnxn caught end of stream exception
   [junit4]   2> EndOfStreamException: Unable to read additional data from client sessionid 0x154ae1bd64f0001, likely client has closed socket
   [junit4]   2> 	at org.apache.zookeeper.server.NIOServerCnxn.doIO(NIOServerCnxn.java:228)
   [junit4]   2> 	at org.apache.zookeeper.server.NIOServerCnxnFactory.run(NIOServerCnxnFactory.java:208)
   [junit4]   2> 	at java.lang.Thread.run(java.base@9-ea/Thread.java:804)
   [junit4]   2> 2331675 INFO  (jetty-launcher-23288-thread-3) [    ] o.a.s.c.CorePropertiesLocator Config-defined core root directory: /home/jenkins/workspace/Lucene-Solr-6.x-Linux/solr/build/solr-core/test/J0/temp/solr.security.BasicAuthIntegrationTest_2380F557F096A2A9-001/tempDir-001/node3/.
   [junit4]   2> 2331675 INFO  (jetty-launcher-23288-thread-4) [    ] o.a.s.c.CorePropertiesLocator Config-defined core root directory: /home/jenkins/workspace/Lucene-Solr-6.x-Linux/solr/build/solr-core/test/J0/temp/solr.security.BasicAuthIntegrationTest_2380F557F096A2A9-001/tempDir-001/node4/.
   [junit4]   2> 2331675 INFO  (jetty-launcher-23288-thread-3) [    ] o.a.s.c.CoreContainer New CoreContainer 21563676
   [junit4]   2> 2331675 INFO  (jetty-launcher-23288-thread-4) [    ] o.a.s.c.CoreContainer New CoreContainer 11469889
   [junit4]   2> 2331675 INFO  (jetty-launcher-23288-thread-3) [    ] o.a.s.c.CoreContainer Loading cores into CoreContainer [instanceDir=/home/jenkins/workspace/Lucene-Solr-6.x-Linux/solr/build/solr-core/test/J0/temp/solr.security.BasicAuthIntegrationTest_2380F557F096A2A9-001/tempDir-001/node3]
   [junit4]   2> 2331675 INFO  (jetty-launcher-23288-thread-4) [    ] o.a.s.c.CoreContainer Loading cores into CoreContainer [instanceDir=/home/jenkins/workspace/Lucene-Solr-6.x-Linux/solr/build/solr-core/test/J0/temp/solr.security.BasicAuthIntegrationTest_2380F557F096A2A9-001/tempDir-001/node4]
   [junit4]   2> 2331675 INFO  (jetty-launcher-23288-thread-1) [    ] o.a.s.c.CoreContainer New CoreContainer 11785444
   [junit4]   2> 2331676 WARN  (jetty-launcher-23288-thread-4) [    ] o.a.s.c.CoreContainer Couldn't add files from /home/jenkins/workspace/Lucene-Solr-6.x-Linux/solr/build/solr-core/test/J0/temp/solr.security.BasicAuthIntegrationTest_2380F557F096A2A9-001/tempDir-001/node4/lib to classpath: /home/jenkins/workspace/Lucene-Solr-6.x-Linux/solr/build/solr-core/test/J0/temp/solr.security.BasicAuthIntegrationTest_2380F557F096A2A9-001/tempDir-001/node4/lib
   [junit4]   2> 2331676 INFO  (jetty-launcher-23288-thread-1) [    ] o.a.s.c.CoreContainer Loading cores into CoreContainer [instanceDir=/home/jenkins/workspace/Lucene-Solr-6.x-Linux/solr/build/solr-core/test/J0/temp/solr.security.BasicAuthIntegrationTest_2380F557F096A2A9-001/tempDir-001/node1]
   [junit4]   2> 2331676 WARN  (jetty-launcher-23288-thread-3) [    ] o.a.s.c.CoreContainer Couldn't add files from /home/jenkins/workspace/Lucene-Solr-6.x-Linux/solr/build/solr-core/test/J0/temp/solr.security.BasicAuthIntegrationTest_2380F557F096A2A9-001/tempDir-001/node3/lib to classpath: /home/jenkins/workspace/Lucene-Solr-6.x-Linux/solr/build/solr-core/test/J0/temp/solr.security.BasicAuthIntegrationTest_2380F557F096A2A9-001/tempDir-001/node3/lib
   [junit4]   2> 2331676 WARN  (jetty-launcher-23288-thread-1) [    ] o.a.s.c.CoreContainer Couldn't add files from /home/jenkins/workspace/Lucene-Solr-6.x-Linux/solr/build/solr-core/test/J0/temp/solr.security.BasicAuthIntegrationTest_2380F557F096A2A9-001/tempDir-001/node1/lib to classpath: /home/jenkins/workspace/Lucene-Solr-6.x-Linux/solr/build/solr-core/test/J0/temp/solr.security.BasicAuthIntegrationTest_2380F557F096A2A9-001/tempDir-001/node1/lib
   [junit4]   2> 2331676 INFO  (jetty-launcher-23288-thread-3) [    ] o.a.s.h.c.HttpShardHandlerFactory created with socketTimeout : 90000,urlScheme : ,connTimeout : 15000,maxConnectionsPerHost : 20,maxConnections : 10000,corePoolSize : 0,maximumPoolSize : 2147483647,maxThreadIdleTime : 5,sizeOfQueue : -1,fairnessPolicy : false,useRetries : false,
   [junit4]   2> 2331676 INFO  (jetty-launcher-23288-thread-1) [    ] o.a.s.h.c.HttpShardHandlerFactory created with socketTimeout : 90000,urlScheme : ,connTimeout : 15000,maxConnectionsPerHost : 20,maxConnections : 10000,corePoolSize : 0,maximumPoolSize : 2147483647,maxThreadIdleTime : 5,sizeOfQueue : -1,fairnessPolicy : false,useRetries : false,
   [junit4]   2> 2331676 INFO  (jetty-launcher-23288-thread-4) [    ] o.a.s.h.c.HttpShardHandlerFactory created with socketTimeout : 90000,urlScheme : ,connTimeout : 15000,maxConnectionsPerHost : 20,maxConnections : 10000,corePoolSize : 0,maximumPoolSize : 2147483647,maxThreadIdleTime : 5,sizeOfQueue : -1,fairnessPolicy : false,useRetries : false,
   [junit4]   2> 2331677 INFO  (jetty-launcher-23288-thread-4) [    ] o.a.s.u.UpdateShardHandler Creating UpdateShardHandler HTTP client with params: socketTimeout=340000&connTimeout=45000&retry=true
   [junit4]   2> 2331677 INFO  (jetty-launcher-23288-thread-1) [    ] o.a.s.u.UpdateShardHandler Creating UpdateShardHandler HTTP client with params: socketTimeout=340000&connTimeout=45000&retry=true
   [junit4]   2> 2331677 INFO  (jetty-launcher-23288-thread-3) [    ] o.a.s.u.UpdateShardHandler Creating UpdateShardHandler HTTP client with params: socketTimeout=340000&connTimeout=45000&retry=true
   [junit4]   2> 2331677 INFO  (jetty-launcher-23288-thread-4) [    ] o.a.s.l.LogWatcher SLF4J impl is org.slf4j.impl.Log4jLoggerFactory
   [junit4]   2> 2331677 INFO  (jetty-launcher-23288-thread-1) [    ] o.a.s.l.LogWatcher SLF4J impl is org.slf4j.impl.Log4jLoggerFactory
   [junit4]   2> 2331677 INFO  (jetty-launcher-23288-thread-3) [    ] o.a.s.l.LogWatcher SLF4J impl is org.slf4j.impl.Log4jLoggerFactory
   [junit4]   2> 2331677 INFO  (jetty-launcher-23288-thread-1) [    ] o.a.s.l.LogWatcher Registering Log Listener [Log4j (org.slf4j.impl.Log4jLoggerFactory)]
   [junit4]   2> 2331677 INFO  (jetty-launcher-23288-thread-3) [    ] o.a.s.l.LogWatcher Registering Log Listener [Log4j (org.slf4j.impl.Log4jLoggerFactory)]
   [junit4]   2> 2331677 INFO  (jetty-launcher-23288-thread-4) [    ] o.a.s.l.LogWatcher Registering Log Listener [Log4j (org.slf4j.impl.Log4jLoggerFactory)]
   [junit4]   2> 2331677 INFO  (jetty-launcher-23288-thread-3) [    ] o.a.s.c.ZkContainer Zookeeper client=127.0.0.1:42039/solr
   [junit4]   2> 2331677 INFO  (jetty-launcher-23288-thread-1) [    ] o.a.s.c.ZkContainer Zookeeper client=127.0.0.1:42039/solr
   [junit4]   2> 2331677 INFO  (jetty-launcher-23288-thread-4) [    ] o.a.s.c.ZkContainer Zookeeper client=127.0.0.1:42039/solr
   [junit4]   2> 2331678 INFO  (jetty-launcher-23288-thread-1) [    ] o.a.s.c.ZkController zkHost includes chroot
   [junit4]   2> 2331678 INFO  (jetty-launcher-23288-thread-4) [    ] o.a.s.c.ZkController zkHost includes chroot
   [junit4]   2> 2331678 INFO  (jetty-launcher-23288-thread-1) [    ] o.a.s.c.c.SolrZkClient Using default ZkCredentialsProvider
   [junit4]   2> 2331678 INFO  (jetty-launcher-23288-thread-4) [    ] o.a.s.c.c.SolrZkClient Using default ZkCredentialsProvider
   [junit4]   2> 2331677 INFO  (jetty-launcher-23288-thread-3) [    ] o.a.s.c.ZkController zkHost includes chroot
   [junit4]   2> 2331678 INFO  (jetty-launcher-23288-thread-3) [    ] o.a.s.c.c.SolrZkClient Using default ZkCredentialsProvider
   [junit4]   2> 2331678 INFO  (jetty-launcher-23288-thread-1) [    ] o.a.s.c.c.ConnectionManager Waiting for client to connect to ZooKeeper
   [junit4]   2> 2331679 INFO  (jetty-launcher-23288-thread-3) [    ] o.a.s.c.c.ConnectionManager Waiting for client to connect to ZooKeeper
   [junit4]   2> 2331679 INFO  (jetty-launcher-23288-thread-4) [    ] o.a.s.c.c.ConnectionManager Waiting for client to connect to ZooKeeper
   [junit4]   2> 2331701 INFO  (jetty-launcher-23288-thread-5) [    ] o.a.s.c.CorePropertiesLocator Config-defined core root directory: /home/jenkins/workspace/Lucene-Solr-6.x-Linux/solr/build/solr-core/test/J0/temp/solr.security.BasicAuthIntegrationTest_2380F557F096A2A9-001/tempDir-001/node5/.
   [junit4]   2> 2331701 INFO  (jetty-launcher-23288-thread-2) [    ] o.a.s.c.CorePropertiesLocator Config-defined core root directory: /home/jenkins/workspace/Lucene-Solr-6.x-Linux/solr/build/solr-core/test/J0/temp/solr.security.BasicAuthIntegrationTest_2380F557F096A2A9-001/tempDir-001/node2/.
   [junit4]   2> 2331702 INFO  (jetty-launcher-23288-thread-5) [    ] o.a.s.c.CoreContainer New CoreContainer 18638384
   [junit4]   2> 2331702 INFO  (jetty-launcher-23288-thread-2) [    ] o.a.s.c.CoreContainer New CoreContainer 9469134
   [junit4]   2> 2331702 INFO  (jetty-launcher-23288-thread-5) [    ] o.a.s.c.CoreContainer Loading cores into CoreContainer [instanceDir=/home/jenkins/workspace/Lucene-Solr-6.x-Linux/solr/build/solr-core/test/J0/temp/solr.security.BasicAuthIntegrationTest_2380F557F096A2A9-001/tempDir-001/node5]
   [junit4]   2> 2331702 INFO  (jetty-launcher-23288-thread-2) [    ] o.a.s.c.CoreContainer Loading cores into CoreContainer [instanceDir=/home/jenkins/workspace/Lucene-Solr-6.x-Linux/solr/build/solr-core/test/J0/temp/solr.security.BasicAuthIntegrationTest_2380F557F096A2A9-001/tempDir-001/node2]
   [junit4]   2> 2331701 WARN  (NIOServerCxn.Factory:0.0.0.0/0.0.0.0:0) [    ] o.a.z.s.NIOServerCnxn caught end of stream exception
   [junit4]   2> EndOfStreamException: Unable to read additional data from client sessionid 0x154ae1bd64f0005, likely client has closed socket
   [junit4]   2> 	at org.apache.zookeeper.server.NIOServerCnxn.doIO(NIOServerCnxn.java:228)
   [junit4]   2> 	at org.apache.zookeeper.server.NIOServerCnxnFactory.run(NIOServerCnxnFactory.java:208)
   [junit4]   2> 	at java.lang.Thread.run(java.base@9-ea/Thread.java:804)
   [junit4]   2> 2331702 WARN  (jetty-launcher-23288-thread-2) [    ] o.a.s.c.CoreContainer Couldn't add files from /home/jenkins/workspace/Lucene-Solr-6.x-Linux/solr/build/solr-core/test/J0/temp/solr.security.BasicAuthIntegrationTest_2380F557F096A2A9-001/tempDir-001/node2/lib to classpath: /home/jenkins/workspace/Lucene-Solr-6.x-Linux/solr/build/solr-core/test/J0/temp/solr.security.BasicAuthIntegrationTest_2380F557F096A2A9-001/tempDir-001/node2/lib
   [junit4]   2> 2331702 WARN  (jetty-launcher-23288-thread-5) [    ] o.a.s.c.CoreContainer Couldn't add files from /home/jenkins/workspace/Lucene-Solr-6.x-Linux/solr/build/solr-core/test/J0/temp/solr.security.BasicAuthIntegrationTest_2380F557F096A2A9-001/tempDir-001/node5/lib to classpath: /home/jenkins/workspace/Lucene-Solr-6.x-Linux/solr/build/solr-core/test/J0/temp/solr.security.BasicAuthIntegrationTest_2380F557F096A2A9-001/tempDir-001/node5/lib
   [junit4]   2> 2331702 INFO  (jetty-launcher-23288-thread-2) [    ] o.a.s.h.c.HttpShardHandlerFactory created with socketTimeout : 90000,urlScheme : ,connTimeout : 15000,maxConnectionsPerHost : 20,maxConnections : 10000,corePoolSize : 0,maximumPoolSize : 2147483647,maxThreadIdleTime : 5,sizeOfQueue : -1,fairnessPolicy : false,useRetries : false,
   [junit4]   2> 2331702 INFO  (jetty-launcher-23288-thread-5) [    ] o.a.s.h.c.HttpShardHandlerFactory created with socketTimeout : 90000,urlScheme : ,connTimeout : 15000,maxConnectionsPerHost : 20,maxConnections : 10000,corePoolSize : 0,maximumPoolSize : 2147483647,maxThreadIdleTime : 5,sizeOfQueue : -1,fairnessPolicy : false,useRetries : false,
   [junit4]   2> 2331703 INFO  (jetty-launcher-23288-thread-2) [    ] o.a.s.u.UpdateShardHandler Creating UpdateShardHandler HTTP client with params: socketTimeout=340000&connTimeout=45000&retry=true
   [junit4]   2> 2331703 INFO  (jetty-launcher-23288-thread-5) [    ] o.a.s.u.UpdateShardHandler Creating UpdateShardHandler HTTP client with params: socketTimeout=340000&connTimeout=45000&retry=true
   [junit4]   2> 2331703 INFO  (jetty-launcher-23288-thread-2) [    ] o.a.s.l.LogWatcher SLF4J impl is org.slf4j.impl.Log4jLoggerFactory
   [junit4]   2> 2331703 INFO  (jetty-launcher-23288-thread-2) [    ] o.a.s.l.LogWatcher Registering Log Listener [Log4j (org.slf4j.impl.Log4jLoggerFactory)]
   [junit4]   2> 2331703 INFO  (jetty-launcher-23288-thread-5) [    ] o.a.s.l.LogWatcher SLF4J impl is org.slf4j.impl.Log4jLoggerFactory
   [junit4]   2> 2331703 INFO  (jetty-launcher-23288-thread-5) [    ] o.a.s.l.LogWatcher Registering Log Listener [Log4j (org.slf4j.impl.Log4jLoggerFactory)]
   [junit4]   2> 2331703 INFO  (jetty-launcher-23288-thread-2) [    ] o.a.s.c.ZkContainer Zookeeper client=127.0.0.1:42039/solr
   [junit4]   2> 2331703 INFO  (jetty-launcher-23288-thread-2) [    ] o.a.s.c.ZkController zkHost includes chroot
   [junit4]   2> 2331703 INFO  (jetty-launcher-23288-thread-5) [    ] o.a.s.c.ZkContainer Zookeeper client=127.0.0.1:42039/solr
   [junit4]   2> 2331703 INFO  (jetty-launcher-23288-thread-2) [    ] o.a.s.c.c.SolrZkClient Using default ZkCredentialsProvider
   [junit4]   2> 2331703 INFO  (jetty-launcher-23288-thread-5) [    ] o.a.s.c.ZkController zkHost includes chroot
   [junit4]   2> 2331704 INFO  (jetty-launcher-23288-thread-5) [    ] o.a.s.c.c.SolrZkClient Using default ZkCredentialsProvider
   [junit4]   2> 2331704 INFO  (jetty-launcher-23288-thread-2) [    ] o.a.s.c.c.ConnectionManager Waiting for client to connect to ZooKeeper
   [junit4]   2> 2331704 INFO  (jetty-launcher-23288-thread-5) [    ] o.a.s.c.c.ConnectionManager Waiting for client to connect to ZooKeeper
   [junit4]   2> 2331728 INFO  (zkCallback-23301-thread-1) [    ] o.a.s.c.c.ConnectionManager Watcher org.apache.solr.common.cloud.ConnectionManager@1929ccb name:ZooKeeperConnection Watcher:127.0.0.1:42039 got event WatchedEvent state:SyncConnected type:None path:null path:null type:None
   [junit4]   2> 2331728 INFO  (zkCallback-23302-thread-1) [    ] o.a.s.c.c.ConnectionManager Watcher org.apache.solr.common.cloud.ConnectionManager@15a6e73 name:ZooKeeperConnection Watcher:127.0.0.1:42039 got event WatchedEvent state:SyncConnected type:None path:null path:null type:None
   [junit4]   2> 2331729 INFO  (zkCallback-23303-thread-1) [    ] o.a.s.c.c.ConnectionManager Watcher org.apache.solr.common.cloud.ConnectionManager@7d21be name:ZooKeeperConnection Watcher:127.0.0.1:42039 got event WatchedEvent state:SyncConnected type:None path:null path:null type:None
   [junit4]   2> 2331729 INFO  (jetty-launcher-23288-thread-4) [    ] o.a.s.c.c.ConnectionManager Client is connected to ZooKeeper
   [junit4]   2> 2331728 INFO  (jetty-launcher-23288-thread-1) [    ] o.a.s.c.c.ConnectionManager Client is connected to ZooKeeper
   [junit4]   2> 2331729 INFO  (jetty-launcher-23288-thread-3) [    ] o.a.s.c.c.ConnectionManager Client is connected to ZooKeeper
   [junit4]   2> 2331729 INFO  (jetty-launcher-23288-thread-3) [    ] o.a.s.c.c.SolrZkClient Using default ZkACLProvider
   [junit4]   2> 2331729 INFO  (jetty-launcher-23288-thread-1) [    ] o.a.s.c.c.SolrZkClient Using default ZkACLProvider
   [junit4]   2> 2331729 INFO  (jetty-launcher-23288-thread-4) [    ] o.a.s.c.c.SolrZkClient Using default ZkACLProvider
   [junit4]   2> 2331754 INFO  (zkCallback-23308-thread-1) [    ] o.a.s.c.c.ConnectionManager Watcher org.apache.solr.common.cloud.ConnectionManager@4e845e name:ZooKeeperConnection Watcher:127.0.0.1:42039 got event WatchedEvent state:SyncConnected type:None path:null path:null type:None
   [junit4]   2> 2331754 INFO  (zkCallback-23309-thread-1) [    ] o.a.s.c.c.ConnectionManager Watcher org.apache.solr.common.cloud.ConnectionManager@10912ea name:ZooKeeperConnection Watcher:127.0.0.1:42039 got event WatchedEvent state:SyncConnected type:None path:null path:null type:None
   [junit4]   2> 2331754 INFO  (jetty-launcher-23288-thread-2) [    ] o.a.s.c.c.ConnectionManager Client is connected to ZooKeeper
   [junit4]   2> 2331754 INFO  (jetty-launcher-23288-thread-5) [    ] o.a.s.c.c.ConnectionManager Client is connected to ZooKeeper
   [junit4]   2> 2331755 INFO  (jetty-launcher-23288-thread-2) [    ] o.a.s.c.c.SolrZkClient Using default ZkACLProvider
   [junit4]   2> 2331755 INFO  (jetty-launcher-23288-thread-5) [    ] o.a.s.c.c.SolrZkClient Using default ZkACLProvider
   [junit4]   2> 2331797 WARN  (NIOServerCxn.Factory:0.0.0.0/0.0.0.0:0) [    ] o.a.z.s.NIOServerCnxn caught end of stream exception
   [junit4]   2> EndOfStreamException: Unable to read additional data from client sessionid 0x154ae1bd64f0006, likely client has closed socket
   [junit4]   2> 	at org.apache.zookeeper.server.NIOServerCnxn.doIO(NIOServerCnxn.java:228)
   [junit4]   2> 	at org.apache.zookeeper.server.NIOServerCnxnFactory.run(NIOServerCnxnFactory.java:208)
   [junit4]   2> 	at java.lang.Thread.run(java.base@9-ea/Thread.java:804)
   [junit4]   2> 2331797 INFO  (jetty-launcher-23288-thread-4) [    ] o.a.s.c.ZkController Added new OnReconnect listener org.apache.solr.cloud.ZkController$$Lambda$143/10419767@1047d3f
   [junit4]   2> 2331797 INFO  (jetty-launcher-23288-thread-3) [    ] o.a.s.c.ZkController Added new OnReconnect listener org.apache.solr.cloud.ZkController$$Lambda$143/10419767@132feb6
   [junit4]   2> 2331797 INFO  (jetty-launcher-23288-thread-1) [    ] o.a.s.c.ZkController Added new OnReconnect listener org.apache.solr.cloud.ZkController$$Lambda$143/10419767@d25799
   [junit4]   2> 2331797 WARN  (NIOServerCxn.Factory:0.0.0.0/0.0.0.0:0) [    ] o.a.z.s.NIOServerCnxn caught end of stream exception
   [junit4]   2> EndOfStreamException: Unable to read additional data from client sessionid 0x154ae1bd64f0008, likely client has closed socket
   [junit4]   2> 	at org.apache.zookeeper.server.NIOServerCnxn.doIO(NIOServerCnxn.java:228)
   [junit4]   2> 	at org.apache.zookeeper.server.NIOServerCnxnFactory.run(NIOServerCnxnFactory.java:208)
   [junit4]   2> 	at java.lang.Thread.run(java.base@9-ea/Thread.java:804)
   [junit4]   2> 2331798 INFO  (jetty-launcher-23288-thread-4) [    ] o.a.s.c.c.ConnectionManager Waiting for client to connect to ZooKeeper
   [junit4]   2> 2331798 INFO  (jetty-launcher-23288-thread-3) [    ] o.a.s.c.c.ConnectionManager Waiting for client to connect to ZooKeeper
   [junit4]   2> 2331798 INFO  (jetty-launcher-23288-thread-1) [    ] o.a.s.c.c.ConnectionManager Waiting for client to connect to ZooKeeper
   [junit4]   2> 2331812 INFO  (jetty-launcher-23288-thread-5) [    ] o.a.s.c.ZkController Added new OnReconnect listener org.apache.solr.cloud.ZkController$$Lambda$143/10419767@2a0411
   [junit4]   2> 2331812 INFO  (jetty-launcher-23288-thread-5) [    ] o.a.s.c.c.ConnectionManager Waiting for client to connect to ZooKeeper
   [junit4]   2> 2331889 INFO  (jetty-launcher-23288-thread-2) [    ] o.a.s.c.ZkController Added new OnReconnect listener org.apache.solr.cloud.ZkController$$Lambda$143/10419767@1a908e6
   [junit4]   2> 2331889 INFO  (zkCallback-23310-thread-1) [    ] o.a.s.c.c.ConnectionManager Watcher org.apache.solr.common.cloud.ConnectionManager@995aba name:ZooKeeperConnection Watcher:127.0.0.1:42039/solr got event WatchedEvent state:SyncConnected type:None path:null path:null type:None
   [junit4]   2> 2331889 INFO  (zkCallback-23311-thread-1) [    ] o.a.s.c.c.ConnectionManager Watcher org.apache.solr.common.cloud.ConnectionManager@1817da6 name:ZooKeeperConnection Watcher:127.0.0.1:42039/solr got event WatchedEvent state:SyncConnected type:None path:null path:null type:None
   [junit4]   2> 2331889 INFO  (zkCallback-23312-thread-1) [    ] o.a.s.c.c.ConnectionManager Watcher org.apache.solr.common.cloud.ConnectionManager@2841d name:ZooKeeperConnection Watcher:127.0.0.1:42039/solr got event WatchedEvent state:SyncConnected type:None path:null path:null type:None
   [junit4]   2> 2331889 INFO  (jetty-launcher-23288-thread-3) [    ] o.a.s.c.c.ConnectionManager Client is connected to ZooKeeper
   [junit4]   2> 2331889 INFO  (jetty-launcher-23288-thread-1) [    ] o.a.s.c.c.ConnectionManager Client is connected to ZooKeeper
   [junit4]   2> 2331889 INFO  (jetty-launcher-23288-thread-4) [    ] o.a.s.c.c.ConnectionManager Client is connected to ZooKeeper
   [junit4]   2> 2331889 INFO  (jetty-launcher-23288-thread-2) [    ] o.a.s.c.c.ConnectionManager Waiting for client to connect to ZooKeeper
   [junit4]   2> 2331900 INFO  (zkCallback-23313-thread-1) [    ] o.a.s.c.c.ConnectionManager Watcher org.apache.solr.common.cloud.ConnectionManager@137c379 name:ZooKeeperConnection Watcher:127.0.0.1:42039/solr got event WatchedEvent state:SyncConnected type:None path:null path:null type:None
   [junit4]   2> 2331900 INFO  (jetty-launcher-23288-thread-5) [    ] o.a.s.c.c.ConnectionManager Client is connected to ZooKeeper
   [junit4]   2> 2331930 INFO  (zkCallback-23314-thread-1) [    ] o.a.s.c.c.ConnectionManager Watcher org.apache.solr.common.cloud.ConnectionManager@c47298 name:ZooKeeperConnection Watcher:127.0.0.1:42039/solr got event WatchedEvent state:SyncConnected type:None path:null path:null type:None
   [junit4]   2> 2331930 INFO  (jetty-launcher-23288-thread-2) [    ] o.a.s.c.c.ConnectionManager Client is connected to ZooKeeper
   [junit4]   2> 2331949 INFO  (jetty-launcher-23288-thread-1) [    ] o.a.s.c.c.SolrZkClient makePath: /overseer/queue
   [junit4]   2> 2331949 INFO  (jetty-launcher-23288-thread-4) [    ] o.a.s.c.c.SolrZkClient makePath: /overseer/queue
   [junit4]   2> 2331949 INFO  (jetty-launcher-23288-thread-3) [    ] o.a.s.c.c.SolrZkClient makePath: /overseer/queue
   [junit4]   2> 2331989 INFO  (jetty-launcher-23288-thread-5) [    ] o.a.s.c.c.SolrZkClient makePath: /overseer/queue
   [junit4]   2> 2331989 INFO  (jetty-launcher-23288-thread-2) [    ] o.a.s.c.c.SolrZkClient makePath: /overseer/queue
   [junit4]   2> 2332142 INFO  (jetty-launcher-23288-thread-3) [    ] o.a.s.c.c.SolrZkClient makePath: /overseer/collection-queue-work
   [junit4]   2> 2332165 INFO  (jetty-launcher-23288-thread-1) [    ] o.a.s.c.c.SolrZkClient makePath: /overseer/collection-queue-work
   [junit4]   2> 2332165 INFO  (jetty-launcher-23288-thread-4) [    ] o.a.s.c.c.SolrZkClient makePath: /overseer/collection-queue-work
   [junit4]   2> 2332173 INFO  (jetty-launcher-23288-thread-5) [    ] o.a.s.c.c.SolrZkClient makePath: /overseer/collection-queue-work
   [junit4]   2> 2332173 INFO  (jetty-launcher-23288-thread-2) [    ] o.a.s.c.c.SolrZkClient makePath: /overseer/collection-queue-work
   [junit4]   2> 2332400 INFO  (jetty-launcher-23288-thread-4) [    ] o.a.s.c.c.SolrZkClient makePath: /overseer/collection-map-running
   [junit4]   2> 2332443 INFO  (jetty-launcher-23288-thread-3) [    ] o.a.s.c.c.SolrZkClient makePath: /overseer/collection-map-running
   [junit4]   2> 2332443 INFO  (jetty-launcher-23288-thread-1) [    ] o.a.s.c.c.SolrZkClient makePath: /overseer/collection-map-running
   [junit4]   2> 2332443 INFO  (jetty-launcher-23288-thread-5) [    ] o.a.s.c.c.SolrZkClient makePath: /overseer/collection-map-running
   [junit4]   2> 2332443 INFO  (jetty-launcher-23288-thread-2) [    ] o.a.s.c.c.SolrZkClient makePath: /overseer/collection-map-running
   [junit4]   2> 2332544 INFO  (jetty-launcher-23288-thread-3) [    ] o.a.s.c.c.SolrZkClient makePath: /overseer/collection-map-completed
   [junit4]   2> 2332544 INFO  (jetty-launcher-23288-thread-4) [    ] o.a.s.c.c.SolrZkClient makePath: /overseer/collection-map-completed
   [junit4]   2> 2332560 INFO  (jetty-launcher-23288-thread-1) [    ] o.a.s.c.c.SolrZkClient makePath: /overseer/collection-map-completed
   [junit4]   2> 2332560 INFO  (jetty-launcher-23288-thread-5) [    ] o.a.s.c.c.SolrZkClient makePath: /overseer/collection-map-completed
   [junit4]   2> 2332560 INFO  (jetty-launcher-23288-thread-2) [    ] o.a.s.c.c.SolrZkClient makePath: /overseer/collection-map-completed
   [junit4]   2> 2332661 INFO  (jetty-launcher-23288-thread-5) [    ] o.a.s.c.c.SolrZkClient makePath: /overseer/collection-map-failure
   [junit4]   2> 2332661 INFO  (jetty-launcher-23288-thread-4) [    ] o.a.s.c.c.SolrZkClient makePath: /overseer/collection-map-failure
   [junit4]   2> 2332662 INFO  (jetty-launcher-23288-thread-3) [    ] o.a.s.c.c.SolrZkClient makePath: /overseer/collection-map-failure
   [junit4]   2> 2332688 INFO  (jetty-launcher-23288-thread-1) [    ] o.a.s.c.c.SolrZkClient makePath: /overseer/collection-map-failure
   [junit4]   2> 2332688 INFO  (jetty-launcher-23288-thread-2) [    ] o.a.s.c.c.SolrZkClient makePath: /overseer/collection-map-failure
   [junit4]   2> 2332811 INFO  (jetty-launcher-23288-thread-4) [    ] o.a.s.c.c.SolrZkClient makePath: /live_nodes
   [junit4]   2> 2332811 INFO  (jetty-launcher-23288-thread-5) [    ] o.a.s.c.c.SolrZkClient makePath: /live_nodes
   [junit4]   2> 2332812 INFO  (jetty-launcher-23288-thread-3) [    ] o.a.s.c.c.SolrZkClient makePath: /live_nodes
   [junit4]   2> 2332812 INFO  (jetty-launcher-23288-thread-1) [    ] o.a.s.c.c.SolrZkClient makePath: /live_nodes
   [junit4]   2> 2332812 INFO  (jetty-launcher-23288-thread-2) [    ] o.a.s.c.c.SolrZkClient makePath: /live_nodes
   [junit4]   2> 2332887 INFO  (jetty-launcher-23288-thread-4) [    ] o.a.s.c.c.SolrZkClient makePath: /collections
   [junit4]   2> 2332887 INFO  (jetty-launcher-23288-thread-3) [    ] o.a.s.c.c.SolrZkClient makePath: /collections
   [junit4]   2> 2332887 INFO  (jetty-launcher-23288-thread-2) [    ] o.a.s.c.c.SolrZkClient makePath: /collections
   [junit4]   2> 2332887 INFO  (jetty-launcher-23288-thread-5) [    ] o.a.s.c.c.SolrZkClient makePath: /collections
   [junit4]   2> 2332887 INFO  (jetty-launcher-23288-thread-1) [    ] o.a.s.c.c.SolrZkClient makePath: /collections
   [junit4]   2> 2332961 INFO  (jetty-launcher-23288-thread-3) [    ] o.a.s.c.c.SolrZkClient makePath: /aliases.json
   [junit4]   2> 2332961 INFO  (jetty-launcher-23288-thread-4) [    ] o.a.s.c.c.SolrZkClient makePath: /aliases.json
   [junit4]   2> 2332961 INFO  (jetty-launcher-23288-thread-2) [    ] o.a.s.c.c.SolrZkClient makePath: /aliases.json
   [junit4]   2> 2332961 INFO  (jetty-launcher-23288-thread-5) [    ] o.a.s.c.c.SolrZkClient makePath: /aliases.json
   [junit4]   2> 2332961 INFO  (jetty-launcher-23288-thread-1) [    ] o.a.s.c.c.SolrZkClient makePath: /aliases.json
   [junit4]   2> 2333039 INFO  (jetty-launcher-23288-thread-3) [    ] o.a.s.c.c.SolrZkClient makePath: /clusterstate.json
   [junit4]   2> 2333039 INFO  (jetty-launcher-23288-thread-2) [    ] o.a.s.c.c.SolrZkClient makePath: /clusterstate.json
   [junit4]   2> 2333039 INFO  (jetty-launcher-23288-thread-1) [    ] o.a.s.c.c.SolrZkClient makePath: /clusterstate.json
   [junit4]   2> 2333039 INFO  (jetty-launcher-23288-thread-4) [    ] o.a.s.c.c.SolrZkClient makePath: /clusterstate.json
   [junit4]   2> 2333039 INFO  (jetty-launcher-23288-thread-5) [    ] o.a.s.c.c.SolrZkClient makePath: /clusterstate.json
   [junit4]   2> 2333116 INFO  (jetty-launcher-23288-thread-4) [    ] o.a.s.c.c.SolrZkClient makePath: /security.json
   [junit4]   2> 2333116 INFO  (jetty-launcher-23288-thread-3) [    ] o.a.s.c.c.SolrZkClient makePath: /security.json
   [junit4]   2> 2333116 INFO  (jetty-launcher-23288-thread-5) [    ] o.a.s.c.c.SolrZkClient makePath: /security.json
   [junit4]   2> 2333116 INFO  (jetty-launcher-23288-thread-1) [    ] o.a.s.c.c.SolrZkClient makePath: /security.json
   [junit4]   2> 2333116 INFO  (jetty-launcher-23288-thread-2) [    ] o.a.s.c.c.SolrZkClient makePath: /security.json
   [junit4]   2> 2333157 INFO  (jetty-launcher-23288-thread-4) [    ] o.a.s.c.c.ZkStateReader Updating cluster state from ZooKeeper... 
   [junit4]   2> 2333157 INFO  (jetty-launcher-23288-thread-3) [    ] o.a.s.c.c.ZkStateReader Updating cluster state from ZooKeeper... 
   [junit4]   2> 2333171 INFO  (jetty-launcher-23288-thread-1) [    ] o.a.s.c.c.ZkStateReader Updating cluster state from ZooKeeper... 
   [junit4]   2> 2333171 INFO  (jetty-launcher-23288-thread-5) [    ] o.a.s.c.c.ZkStateReader Updating cluster state from ZooKeeper... 
   [junit4]   2> 2333197 INFO  (jetty-launcher-23288-thread-2) [    ] o.a.s.c.c.ZkStateReader Updating cluster state from ZooKeeper... 
   [junit4]   2> 2333197 INFO  (jetty-launcher-23288-thread-4) [    ] o.a.s.c.c.ZkStateReader Updated live nodes from ZooKeeper... (0) -> (0)
   [junit4]   2> 2333197 INFO  (jetty-launcher-23288-thread-3) [    ] o.a.s.c.c.ZkStateReader Updated live nodes from ZooKeeper... (0) -> (0)
   [junit4]   2> 2333197 INFO  (jetty-launcher-23288-thread-5) [    ] o.a.s.c.c.ZkStateReader Updated live nodes from ZooKeeper... (0) -> (0)
   [junit4]   2> 2333197 INFO  (jetty-launcher-23288-thread-1) [    ] o.a.s.c.c.ZkStateReader Updated live nodes from ZooKeeper... (0) -> (0)
   [junit4]   2> 2333197 INFO  (jetty-launcher-23288-thread-2) [    ] o.a.s.c.c.ZkStateReader Updated live nodes from ZooKeeper... (0) -> (0)
   [junit4]   2> 2333198 INFO  (jetty-launcher-23288-thread-4) [    ] o.a.s.c.c.SolrZkClient makePath: /overseer_elect
   [junit4]   2> 2333198 INFO  (jetty-launcher-23288-thread-5) [    ] o.a.s.c.c.SolrZkClient makePath: /overseer_elect
   [junit4]   2> 2333198 INFO  (jetty-launcher-23288-thread-1) [    ] o.a.s.c.c.SolrZkClient makePath: /overseer_elect
   [junit4]   2> 2333226 INFO  (jetty-launcher-23288-thread-3) [    ] o.a.s.c.c.SolrZkClient makePath: /overseer_elect/election
   [junit4]   2> 2333236 INFO  (jetty-launcher-23288-thread-2) [    ] o.a.s.c.c.SolrZkClient makePath: /overseer_elect/election
   [junit4]   2> 2333236 INFO  (jetty-launcher-23288-thread-4) [    ] o.a.s.c.c.SolrZkClient makePath: /overseer_elect/election
   [junit4]   2> 2333257 INFO  (jetty-launcher-23288-thread-1) [    ] o.a.s.c.c.SolrZkClient makePath: /overseer_elect/election
   [junit4]   2> 2333257 INFO  (jetty-launcher-23288-thread-5) [    ] o.a.s.c.c.SolrZkClient makePath: /overseer_elect/election
   [junit4]   2> 2333287 INFO  (jetty-launcher-23288-thread-4) [    ] o.a.s.c.Overseer Overseer (id=null) closing
   [junit4]   2> 2333287 INFO  (jetty-launcher-23288-thread-3) [    ] o.a.s.c.Overseer Overseer (id=null) closing
   [junit4]   2> 2333321 INFO  (jetty-launcher-23288-thread-2) [    ] o.a.s.c.Overseer Overseer (id=null) closing
   [junit4]   2> 2333321 INFO  (jetty-launcher-23288-thread-1) [    ] o.a.s.c.Overseer Overseer (id=null) closing
   [junit4]   2> 2333337 INFO  (jetty-launcher-23288-thread-4) [    ] o.a.s.c.LeaderElector Joined leadership election with path: /overseer_elect/election/95892926664474635-127.0.0.1:38066_solr-n_0000000000
   [junit4]   2> 2333337 INFO  (jetty-launcher-23288-thread-3) [    ] o.a.s.c.LeaderElector Joined leadership election with path: /overseer_elect/election/95892926664474636-127.0.0.1:36563_solr-n_0000000001
   [junit4]   2> 2333371 INFO  (jetty-launcher-23288-thread-2) [    ] o.a.s.c.LeaderElector Joined leadership election with path: /overseer_elect/election/95892926664474639-127.0.0.1:40836_solr-n_0000000002
   [junit4]   2> 2333371 INFO  (jetty-launcher-23288-thread-4) [    ] o.a.s.c.OverseerElectionContext I am going to be the leader 127.0.0.1:38066_solr
   [junit4]   2> 2333372 INFO  (jetty-launcher-23288-thread-1) [    ] o.a.s.c.LeaderElector Joined leadership election with path: /overseer_elect/election/95892926664474637-127.0.0.1:46771_solr-n_0000000003
   [junit4]   2> 2333371 INFO  (jetty-launcher-23288-thread-5) [    ] o.a.s.c.Overseer Overseer (id=null) closing
   [junit4]   2> 2333372 INFO  (jetty-launcher-23288-thread-4) [    ] o.a.s.c.c.SolrZkClient makePath: /overseer_elect/leader
   [junit4]   2> 2333372 INFO  (jetty-launcher-23288-thread-3) [    ] o.a.s.c.LeaderElector Watching path /overseer_elect/election/95892926664474635-127.0.0.1:38066_solr-n_0000000000 to know if I could be the leader
   [junit4]   2> 2333372 INFO  (jetty-launcher-23288-thread-2) [    ] o.a.s.c.LeaderElector Watching path /overseer_elect/election/95892926664474636-127.0.0.1:36563_solr-n_0000000001 to know if I could be the leader
   [junit4]   2> 2333382 INFO  (jetty-launcher-23288-thread-5) [    ] o.a.s.c.LeaderElector Joined leadership election with path: /overseer_elect/election/95892926664474638-127.0.0.1:40787_solr-n_0000000004
   [junit4]   2> 2333382 INFO  (jetty-launcher-23288-thread-1) [    ] o.a.s.c.LeaderElector Watching path /overseer_elect/election/95892926664474639-127.0.0.1:40836_solr-n_0000000002 to know if I could be the leader
   [junit4]   2> 2333382 INFO  (jetty-launcher-23288-thread-2) [    ] o.a.s.c.ZkController Register node as live in ZooKeeper:/live_nodes/127.0.0.1:40836_solr
   [junit4]   2> 2333382 INFO  (jetty-launcher-23288-thread-3) [    ] o.a.s.c.ZkController Register node as live in ZooKeeper:/live_nodes/127.0.0.1:36563_solr
   [junit4]   2> 2333383 INFO  (jetty-launcher-23288-thread-1) [    ] o.a.s.c.ZkController Register node as live in ZooKeeper:/live_nodes/127.0.0.1:46771_solr
   [junit4]   2> 2333391 INFO  (jetty-launcher-23288-thread-2) [    ] o.a.s.c.c.SolrZkClient makePath: /live_nodes/127.0.0.1:40836_solr
   [junit4]   2> 2333399 INFO  (jetty-launcher-23288-thread-3) [    ] o.a.s.c.c.SolrZkClient makePath: /live_nodes/127.0.0.1:36563_solr
   [junit4]   2> 2333399 INFO  (jetty-launcher-23288-thread-5) [    ] o.a.s.c.LeaderElector Watching path /overseer_elect/election/95892926664474637-127.0.0.1:46771_solr-n_0000000003 to know if I could be the leader
   [junit4]   2> 2333399 INFO  (jetty-launcher-23288-thread-1) [    ] o.a.s.c.c.SolrZkClient makePath: /live_nodes/127.0.0.1:46771_solr
   [junit4]   2> 2333399 INFO  (jetty-launcher-23288-thread-4) [    ] o.a.s.c.Overseer Overseer (id=95892926664474635-127.0.0.1:38066_solr-n_0000000000) starting
   [junit4]   2> 2333399 INFO  (jetty-launcher-23288-thread-5) [    ] o.a.s.c.ZkController Register node as live in ZooKeeper:/live_nodes/127.0.0.1:40787_solr
   [junit4]   2> 2333408 INFO  (zkCallback-23310-thread-1) [    ] o.a.s.c.c.ZkStateReader A live node change: [WatchedEvent state:SyncConnected type:NodeChildrenChanged path:/live_nodes], has occurred - updating... (live nodes size: [0])
   [junit4]   2> 2333408 INFO  (zkCallback-23314-thread-1) [    ] o.a.s.c.c.ZkStateReader A live node change: [WatchedEvent state:SyncConnected type:NodeChildrenChanged path:/live_nodes], has occurred - updating... (live nodes size: [0])
   [junit4]   2> 2333408 INFO  (zkCallback-23313-thread-1) [    ] o.a.s.c.c.ZkStateReader A live node change: [WatchedEvent state:SyncConnected type:NodeChildrenChanged path:/live_nodes], has occurred - updating... (live nodes size: [0])
   [junit4]   2> 2333408 INFO  (zkCallback-23311-thread-1) [    ] o.a.s.c.c.ZkStateReader A live node change: [WatchedEvent state:SyncConnected type:NodeChildrenChanged path:/live_nodes], has occurred - updating... (live nodes size: [0])
   [junit4]   2> 2333408 INFO  (zkCallback-23312-thread-1) [    ] o.a.s.c.c.ZkStateReader A live node change: [WatchedEvent state:SyncConnected type:NodeChildrenChanged path:/live_nodes], has occurred - updating... (live nodes size: [0])
   [junit4]   2> 2333419 INFO  (jetty-launcher-23288-thread-5) [    ] o.a.s.c.c.SolrZkClient makePath: /live_nodes/127.0.0.1:40787_solr
   [junit4]   2> 2333419 INFO  (zkCallback-23310-thread-1) [    ] o.a.s.c.c.ZkStateReader Updated live nodes from ZooKeeper... (0) -> (1)
   [junit4]   2> 2333420 INFO  (zkCallback-23314-thread-1) [    ] o.a.s.c.c.ZkStateReader Updated live nodes from ZooKeeper... (0) -> (1)
   [junit4]   2> 2333435 INFO  (jetty-launcher-23288-thread-2) [    ] o.a.s.c.CoreContainer Security conf doesn't exist. Skipping setup for authorization module.
   [junit4]   2> 2333435 INFO  (jetty-launcher-23288-thread-2) [    ] o.a.s.c.CoreContainer No authentication plugin used.
   [junit4]   2> 2333436 INFO  (jetty-launcher-23288-thread-2) [    ] o.a.s.c.CorePropertiesLocator Looking for core definitions underneath /home/jenkins/workspace/Lucene-Solr-6.x-Linux/solr/build/solr-core/test/J0/temp/solr.security.BasicAuthIntegrationTest_2380F557F096A2A9-001/tempDir-001/node2/.
   [junit4]   2> 2333436 INFO  (jetty-launcher-23288-thread-2) [    ] o.a.s.c.CorePropertiesLocator Found 0 core definitions
   [junit4]   2> 2333438 INFO  (zkCallback-23313-thread-1) [    ] o.a.s.c.c.ZkStateReader Updated live nodes from ZooKeeper... (0) -> (1)
   [junit4]   2> 2333438 INFO  (zkCallback-23310-thread-1) [    ] o.a.s.c.c.ZkStateReader A live node change: [WatchedEvent state:SyncConnected type:NodeChildrenChanged path:/live_nodes], has occurred - updating... (live nodes size: [1])
   [junit4]   2> 2333438 INFO  (zkCallback-23313-thread-2) [    ] o.a.s.c.c.ZkStateReader A live node change: [WatchedEvent state:SyncConnected type:NodeChildrenChanged path:/live_nodes], has occurred - updating... (live nodes size: [1])
   [junit4]   2> 2333439 INFO  (zkCallback-23311-thread-1) [    ] o.a.s.c.c.ZkStateReader Updated live nodes from ZooKeeper... (0) -> (2)
   [junit4]   2> 2333439 INFO  (zkCallback-23312-thread-1) [    ] o.a.s.c.c.ZkStateReader Updated live nodes from ZooKeeper... (0) -> (2)
   [junit4]   2> 2333438 INFO  (zkCallback-23314-thread-1) [    ] o.a.s.c.c.ZkStateReader A live node change: [WatchedEvent state:SyncConnected type:NodeChildrenChanged path:/live_nodes], has occurred - updating... (live nodes size: [1])
   [junit4]   2> 2333439 INFO  (jetty-launcher-23288-thread-2) [    ] o.a.s.s.SolrDispatchFilter user.dir=/home/jenkins/workspace/Lucene-Solr-6.x-Linux/solr/build/solr-core/test/J0
   [junit4]   2> 2333439 INFO  (jetty-launcher-23288-thread-2) [    ] o.a.s.s.SolrDispatchFilter SolrDispatchFilter.init() done
   [junit4]   2> 2333439 INFO  (zkCallback-23310-thread-1) [    ] o.a.s.c.c.ZkStateReader Updated live nodes from ZooKeeper... (1) -> (2)
   [junit4]   2> 2333449 INFO  (jetty-launcher-23288-thread-3) [    ] o.a.s.c.CoreContainer Security conf doesn't exist. Skipping setup for authorization module.
   [junit4]   2> 2333449 INFO  (jetty-launcher-23288-thread-3) [    ] o.a.s.c.CoreContainer No authentication plugin used.
   [junit4]   2> 2333449 INFO  (jetty-launcher-23288-thread-3) [    ] o.a.s.c.CorePropertiesLocator Looking for core definitions underneath /home/jenkins/workspace/Lucene-Solr-6.x-Linux/solr/build/solr-core/test/J0/temp/solr.security.BasicAuthIntegrationTest_2380F557F096A2A9-001/tempDir-001/node3/.
   [junit4]   2> 2333449 INFO  (jetty-launcher-23288-thread-3) [    ] o.a.s.c.CorePropertiesLocator Found 0 core definitions
   [junit4]   2> 2333463 INFO  (zkCallback-23310-thread-1) [    ] o.a.s.c.c.ZkStateReader A live node change: [WatchedEvent state:SyncConnected type:NodeChildrenChanged path:/live_nodes], has occurred - updating... (live nodes size: [2])
   [junit4]   2> 2333463 INFO  (zkCallback-23311-thread-1) [    ] o.a.s.c.c.ZkStateReader A live node change: [WatchedEvent state:SyncConnected type:NodeChildrenChanged path:/live_nodes], has occurred - updating... (live nodes size: [2])
   [junit4]   2> 2333463 INFO  (zkCallback-23313-thread-1) [    ] o.a.s.c.c.ZkStateReader A live node change: [WatchedEvent state:SyncConnected type:NodeChildrenChanged path:/live_nodes], has occurred - updating... (live nodes size: [3])
   [junit4]   2> 2333463 INFO  (jetty-launcher-23288-thread-4) [    ] o.a.s.c.c.SolrZkClient makePath: /overseer/queue-work
   [junit4]   2> 2333463 INFO  (zkCallback-23314-thread-1) [    ] o.a.s.c.c.ZkStateReader Updated live nodes from ZooKeeper... (1) -> (3)
   [junit4]   2> 2333463 INFO  (jetty-launcher-23288-thread-3) [    ] o.a.s.s.SolrDispatchFilter user.dir=/home/jenkins/workspace/Lucene-Solr-6.x-Linux/solr/build/solr-core/test/J0
   [junit4]   2> 2333463 INFO  (zkCallback-23311-thread-1) [    ] o.a.s.c.c.ZkStateReader Updated live nodes from ZooKeeper... (2) -> (4)
   [junit4]   2> 2333463 INFO  (zkCallback-23313-thread-2) [    ] o.a.s.c.c.ZkStateReader Updated live nodes from ZooKeeper... (1) -> (3)
   [junit4]   2> 2333466 INFO  (zkCallback-23313-thread-1) [    ] o.a.s.c.c.ZkStateReader Updated live nodes from ZooKeeper... (3) -> (4)
   [junit4]   2> 2333463 INFO  (zkCallback-23312-thread-1) [    ] o.a.s.c.c.ZkStateReader A live node change: [WatchedEvent state:SyncConnected type:NodeChildrenChanged path:/live_nodes], has occurred - updating... (live nodes size: [2])
   [junit4]   2> 2333463 INFO  (jetty-launcher-23288-thread-3) [    ] o.a.s.s.SolrDispatchFilter SolrDispatchFilter.init() done
   [junit4]   2> 2333463 INFO  (zkCallback-23314-thread-2) [    ] o.a.s.c.c.ZkStateReader A live node change: [WatchedEvent state:SyncConnected type:NodeChildrenChanged path:/live_nodes], has occurred - updating... (live nodes size: [3])
   [junit4]   2> 2333463 INFO  (zkCallback-23310-thread-1) [    ] o.a.s.c.c.ZkStateReader Updated live nodes from ZooKeeper... (2) -> (4)
   [junit4]   2> 2333472 INFO  (zkCallback-23312-thread-1) [    ] o.a.s.c.c.ZkStateReader Updated live nodes from ZooKeeper... (2) -> (4)
   [junit4]   2> 2333472 INFO  (zkCallback-23314-thread-2) [    ] o.a.s.c.c.ZkStateReader Updated live nodes from ZooKeeper... (3) -> (4)
   [junit4]   2> 2333475 INFO  (jetty-launcher-23288-thread-1) [    ] o.a.s.c.CoreContainer Security conf doesn't exist. Skipping setup for authorization module.
   [junit4]   2> 2333475 INFO  (jetty-launcher-23288-thread-1) [    ] o.a.s.c.CoreContainer No authentication plugin used.
   [junit4]   2> 2333475 INFO  (jetty-launcher-23288-thread-1) [    ] o.a.s.c.CorePropertiesLocator Looking for core definitions underneath /home/jenkins/workspace/Lucene-Solr-6.x-Linux/solr/build/solr-core/test/J0/temp/solr.security.BasicAuthIntegrationTest_2380F557F096A2A9-001/tempDir-001/node1/.
   [junit4]   2> 2333476 INFO  (jetty-launcher-23288-thread-1) [    ] o.a.s.c.CorePropertiesLocator Found 0 core definitions
   [junit4]   2> 2333480 INFO  (jetty-launcher-23288-thread-5) [    ] o.a.s.c.CoreContainer Security conf doesn't exist. Skipping setup for authorization module.
   [junit4]   2> 2333480 INFO  (jetty-launcher-23288-thread-5) [    ] o.a.s.c.CoreContainer No authentication plugin used.
   [junit4]   2> 2333480 INFO  (jetty-launcher-23288-thread-5) [    ] o.a.s.c.CorePropertiesLocator Looking for core definitions underneath /home/jenkins/workspace/Lucene-Solr-6.x-Linux/solr/build/solr-core/test/J0/temp/solr.security.BasicAuthIntegrationTest_2380F557F096A2A9-001/tempDir-001/node5/.
   [junit4]   2> 2333481 INFO  (jetty-launcher-23288-thread-5) [    ] o.a.s.c.CorePropertiesLocator Found 0 core definitions
   [junit4]   2> 2333485 INFO  (jetty-launcher-23288-thread-1) [    ] o.a.s.s.SolrDispatchFilter user.dir=/home/jenkins/workspace/Lucene-Solr-6.x-Linux/solr/build/solr-core/test/J0
   [junit4]   2> 2333485 INFO  (jetty-launcher-23288-thread-5) [    ] o.a.s.s.SolrDispatchFilter user.dir=/home/jenkins/workspace/Lucene-Solr-6.x-Linux/solr/build/solr-core/test/J0
   [junit4]   2> 2333485 INFO  (jetty-launcher-23288-thread-5) [    ] o.a.s.s.SolrDispatchFilter SolrDispatchFilter.init() done
   [junit4]   2> 2333485 INFO  (jetty-launcher-23288-thread-1) [    ] o.a.s.s.SolrDispatchFilter SolrDispatchFilter.init() done
   [junit4]   2> 2333570 INFO  (jetty-launcher-23288-thread-4) [    ] o.a.s.c.OverseerAutoReplicaFailoverThread Starting OverseerAutoReplicaFailoverThread autoReplicaFailoverWorkLoopDelay=10000 autoReplicaFailoverWaitAfterExpiration=30000 autoReplicaFailoverBadNodeExpiration=60000
   [junit4]   2> 2333571 INFO  (OverseerCollectionConfigSetProcessor-95892926664474635-127.0.0.1:38066_solr-n_0000000000) [    ] o.a.s.c.OverseerTaskProcessor Process current queue of overseer operations
   [junit4]   2> 2333571 INFO  (OverseerStateUpdate-95892926664474635-127.0.0.1:38066_solr-n_0000000000) [    ] o.a.s.c.Overseer Starting to work on the main queue
   [junit4]   2> 2333571 INFO  (jetty-launcher-23288-thread-4) [    ] o.a.s.c.ZkController Publish node=127.0.0.1:38066_solr as DOWN
   [junit4]   2> 2333587 INFO  (OverseerStateUpdate-95892926664474635-127.0.0.1:38066_solr-n_0000000000) [    ] o.a.s.c.c.ZkStateReader Updated live nodes from ZooKeeper... (4) -> (4)
   [junit4]   2> 2333603 INFO  (OverseerStateUpdate-95892926664474635-127.0.0.1:38066_solr-n_0000000000) [    ] o.a.s.c.Overseer processMessage: queueSize: 1, message = {
   [junit4]   2>   "operation":"downnode",
   [junit4]   2>   "node_name":"127.0.0.1:38066_solr"} current state version: 0
   [junit4]   2> 2333603 INFO  (OverseerStateUpdate-95892926664474635-127.0.0.1:38066_solr-n_0000000000) [    ] o.a.s.c.o.NodeMutator DownNode state invoked for node: 127.0.0.1:38066_solr
   [junit4]   2> 2334603 INFO  (jetty-launcher-23288-thread-4) [    ] o.a.s.c.ZkController Register node as live in ZooKeeper:/live_nodes/127.0.0.1:38066_solr
   [junit4]   2> 2334641 INFO  (jetty-launcher-23288-thread-4) [    ] o.a.s.c.c.SolrZkClient makePath: /live_nodes/127.0.0.1:38066_solr
   [junit4]   2> 2334667 INFO  (zkCallback-23313-thread-1) [    ] o.a.s.c.c.ZkStateReader A live node change: [WatchedEvent state:SyncConnected type:NodeChildrenChanged path:/live_nodes], has occurred - updating... (live nodes size: [4])
   [junit4]   2> 2334667 INFO  (zkCallback-23310-thread-1) [    ] o.a.s.c.c.ZkStateReader A live node change: [WatchedEvent state:SyncConnected type:NodeChildrenChanged path:/live_nodes], has occurred - updating... (live nodes size: [4])
   [junit4]   2> 2334667 INFO  (zkCallback-23314-thread-2) [    ] o.a.s.c.c.ZkStateReader A live node change: [WatchedEvent state:SyncConnected type:NodeChildrenChanged path:/live_nodes], has occurred - updating... (live nodes size: [4])
   [junit4]   2> 2334668 INFO  (zkCallback-23313-thread-1) [    ] o.a.s.c.c.ZkStateReader Updated live nodes from ZooKeeper... (4) -> (5)
   [junit4]   2> 2334668 INFO  (zkCallback-23310-thread-1) [    ] o.a.s.c.c.ZkStateReader Updated live nodes from ZooKeeper... (4) -> (5)
   [junit4]   2> 2334667 INFO  (zkCallback-23311-thread-1) [    ] o.a.s.c.c.ZkStateReader A live node change: [WatchedEvent state:SyncConnected type:NodeChildrenChanged path:/live_nodes], has occurred - updating... (live nodes size: [4])
   [junit4]   2> 2334667 INFO  (zkCallback-23312-thread-1) [    ] o.a.s.c.c.ZkStateReader A live node change: [WatchedEvent state:SyncConnected type:NodeChildrenChanged path:/live_nodes], has occurred - updating... (live nodes size: [4])
   [junit4]   2> 2334668 INFO  (zkCallback-23314-thread-2) [    ] o.a.s.c.c.ZkStateReader Updated live nodes from ZooKeeper... (4) -> (5)
   [junit4]   2> 2334668 INFO  (zkCallback-23311-thread-1) [    ] o.a.s.c.c.ZkStateReader Updated live nodes from ZooKeeper... (4) -> (5)
   [junit4]   2> 2334668 INFO  (zkCallback-23312-thread-1) [    ] o.a.s.c.c.ZkStateReader Updated live nodes from ZooKeeper... (4) -> (5)
   [junit4]   2> 2334680 INFO  (jetty-launcher-23288-thread-4) [    ] o.a.s.c.CoreContainer Security conf doesn't exist. Skipping setup for authorization module.
   [junit4]   2> 2334680 INFO  (jetty-launcher-23288-thread-4) [    ] o.a.s.c.CoreContainer No authentication plugin used.
   [junit4]   2> 2334680 INFO  (jetty-launcher-23288-thread-4) [    ] o.a.s.c.CorePropertiesLocator Looking for core definitions underneath /home/jenkins/workspace/Lucene-Solr-6.x-Linux/solr/build/solr-core/test/J0/temp/solr.security.BasicAuthIntegrationTest_2380F557F096A2A9-001/tempDir-001/node4/.
   [junit4]   2> 2334680 INFO  (jetty-launcher-23288-thread-4) [    ] o.a.s.c.CorePropertiesLocator Found 0 core definitions
   [junit4]   2> 2334681 INFO  (jetty-launcher-23288-thread-4) [    ] o.a.s.s.SolrDispatchFilter user.dir=/home/jenkins/workspace/Lucene-Solr-6.x-Linux/solr/build/solr-core/test/J0
   [junit4]   2> 2334681 INFO  (jetty-launcher-23288-thread-4) [    ] o.a.s.s.SolrDispatchFilter SolrDispatchFilter.init() done
   [junit4]   2> 2334681 INFO  (TEST-BasicAuthIntegrationTest.testBasics-seed#[2380F557F096A2A9]) [    ] o.a.s.c.c.SolrZkClient Using default ZkCredentialsProvider
   [junit4]   2> 2334682 INFO  (TEST-BasicAuthIntegrationTest.testBasics-seed#[2380F557F096A2A9]) [    ] o.a.s.c.c.ConnectionManager Waiting for client to connect to ZooKeeper
   [junit4]   2> 2334698 INFO  (zkCallback-23320-thread-1) [    ] o.a.s.c.c.ConnectionManager Watcher org.apache.solr.common.cloud.ConnectionManager@76be5f name:ZooKeeperConnection Watcher:127.0.0.1:42039 got event WatchedEvent state:SyncConnected type:None path:null path:null type:None
   [junit4]   2> 2334698 INFO  (TEST-BasicAuthIntegrationTest.testBasics-seed#[2380F557F096A2A9]) [    ] o.a.s.c.c.ConnectionManager Client is connected to ZooKeeper
   [junit4]   2> 2334699 INFO  (TEST-BasicAuthIntegrationTest.testBasics-seed#[2380F557F096A2A9]) [    ] o.a.s.c.c.SolrZkClient Using default ZkACLProvider
   [junit4]   2> 2334744 INFO  (TEST-BasicAuthIntegrationTest.testBasics-seed#[2380F557F096A2A9]) [    ] o.a.s.c.s.i.CloudSolrClient Final constructed zkHost string: 127.0.0.1:42039/solr
   [junit4]   2> 2334745 INFO  (TEST-BasicAuthIntegrationTest.testBasics-seed#[2380F557F096A2A9]) [    ] o.e.j.s.ServerConnector Stopped ServerConnector@1e3f4ec{HTTP/1.1,[http/1.1]}{127.0.0.1:0}
   [junit4]   2> 2334745 INFO  (TEST-BasicAuthIntegrationTest.testBasics-seed#[2380F557F096A2A9]) [    ] o.a.s.c.CoreContainer Shutting down CoreContainer instance=9469134
   [junit4]   2> 2334745 INFO  (TEST-BasicAuthIntegrationTest.testBasics-seed#[2380F557F096A2A9]) [    ] o.a.s.c.ZkController Publish node=127.0.0.1:40836_solr as DOWN
   [junit4]   2> 2334807 INFO  (OverseerStateUpdate-95892926664474635-127.0.0.1:38066_solr-n_0000000000) [    ] o.a.s.c.Overseer processMessage: queueSize: 1, message = {
   [junit4]   2>   "operation":"downnode",
   [junit4]   2>   "node_name":"127.0.0.1:40836_solr"} current state version: 0
   [junit4]   2> 2334807 INFO  (OverseerStateUpdate-95892926664474635-127.0.0.1:38066_solr-n_0000000000) [    ] o.a.s.c.o.NodeMutator DownNode state invoked for node: 127.0.0.1:40836_solr
   [junit4]   2> 2334840 INFO  (zkCallback-23313-thread-1) [    ] o.a.s.c.c.ZkStateReader A live node change: [WatchedEvent state:SyncConnected type:NodeChildrenChanged path:/live_nodes], has occurred - updating... (live nodes size: [5])
   [junit4]   2> 2334841 INFO  (zkCallback-23310-thread-1) [    ] o.a.s.c.c.ZkStateReader A live node change: [WatchedEvent state:SyncConnected type:NodeChildrenChanged path:/live_nodes], has occurred - updating... (live nodes size: [5])
   [junit4]   2> 2334841 INFO  (zkCallback-23314-thread-2) [    ] o.a.s.c.c.ZkStateReader A live node change: [WatchedEvent state:SyncConnected type:NodeChildrenChanged path:/live_nodes], has occurred - updating... (live nodes size: [5])
   [junit4]   2> 2334841 INFO  (zkCallback-23312-thread-1) [    ] o.a.s.c.c.ZkStateReader A live node change: [WatchedEvent state:SyncConnected type:NodeChildrenChanged path:/live_nodes], has occurred - updating... (live nodes size: [5])
   [junit4]   2> 2334840 INFO  (zkCallback-23311-thread-1) [    ] o.a.s.c.c.ZkStateReader A live node change: [WatchedEvent state:SyncConnected type:NodeChildrenChanged path:/live_nodes], has occurred - updating... (live nodes size: [5])
   [junit4]   2> 2334841 WARN  (zkCallback-23314-thread-2) [    ] o.a.s.c.c.ZkStateReader ZooKeeper watch triggered, but Solr cannot talk to ZK: [KeeperErrorCode = Session expired for /live_nodes]
   [junit4]   2> 2334842 INFO  (TEST-BasicAuthIntegrationTest.testBasics-seed#[2380F557F096A2A9]) [    ] o.e.j.s.h.ContextHandler Stopped o.e.j.s.ServletContextHandler@de8b47{/solr,null,UNAVAILABLE}
   [junit4]   2> 2334843 INFO  (TEST-BasicAuthIntegrationTest.testBasics-seed#[2380F557F096A2A9]) [    ] o.e.j.s.Server jetty-9.3.8.v20160314
   [junit4]   2> 2334843 INFO  (TEST-BasicAuthIntegrationTest.testBasics-seed#[2380F557F096A2A9]) [    ] o.e.j.s.h.ContextHandler Started o.e.j.s.ServletContextHandler@be0843{/solr,null,AVAILABLE}
   [junit4]   2> 2334844 INFO  (TEST-BasicAuthIntegrationTest.testBasics-seed#[2380F557F096A2A9]) [    ] o.e.j.s.ServerConnector Started ServerConnector@4e5a01{HTTP/1.1,[http/1.1]}{127.0.0.1:38775}
   [junit4]   2> 2334844 INFO  (TEST-BasicAuthIntegrationTest.testBasics-seed#[2380F557F096A2A9]) [    ] o.e.j.s.Server Started @2336627ms
   [junit4]   2> 2334844 INFO  (TEST-BasicAuthIntegrationTest.testBasics-seed#[2380F557F096A2A9]) [    ] o.a.s.c.s.e.JettySolrRunner Jetty properties: {hostContext=/solr, hostPort=38775}
   [junit4]   2> 2334844 INFO  (TEST-BasicAuthIntegrationTest.testBasics-seed#[2380F557F096A2A9]) [    ] o.a.s.s.SolrDispatchFilter SolrDispatchFilter.init(): jdk.internal.loader.ClassLoaders$AppClassLoader@a4a92b
   [junit4]   2> 2334844 INFO  (TEST-BasicAuthIntegrationTest.testBasics-seed#[2380F557F096A2A9]) [    ] o.a.s.c.SolrResourceLoader new SolrResourceLoader for directory: '/home/jenkins/workspace/Lucene-Solr-6.x-Linux/solr/build/solr-core/test/J0/temp/solr.security.BasicAuthIntegrationTest_2380F557F096A2A9-001/tempDir-001/node6'
   [junit4]   2> 2334844 INFO  (TEST-BasicAuthIntegrationTest.testBasics-seed#[2380F557F096A2A9]) [    ] o.a.s.c.SolrResourceLoader JNDI not configured for solr (NoInitialContextEx)
   [junit4]   2> 2334844 INFO  (TEST-BasicAuthIntegrationTest.testBasics-seed#[2380F557F096A2A9]) [    ] o.a.s.c.SolrResourceLoader solr home defaulted to 'solr/' (could not find system property or JNDI)
   [junit4]   2> 2334844 INFO  (TEST-BasicAuthIntegrationTest.testBasics-seed#[2380F557F096A2A9]) [    ] o.a.s.c.c.SolrZkClient Using default ZkCredentialsProvider
   [junit4]   2> 2334845 INFO  (TEST-BasicAuthIntegrationTest.testBasics-seed#[2380F557F096A2A9]) [    ] o.a.s.c.c.ConnectionManager Waiting for client to connect to ZooKeeper
   [junit4]   2> 2334884 INFO  (zkCallback-23310-thread-1) [    ] o.a.s.c.c.ZkStateReader Updated live nodes from ZooKeeper... (5) -> (4)
   [junit4]   2> 2334884 INFO  (zkCallback-23313-thread-1) [    ] o.a.s.c.c.ZkStateReader Updated live nodes from ZooKeeper... (5) -> (4)
   [junit4]   2> 2334884 INFO  (zkCallback-23311-thread-1) [    ] o.a.s.c.c.ZkStateReader Updated live nodes from ZooKeeper... (5) -> (4)
   [junit4]   2> 2334884 INFO  (zkCallback-23312-thread-1) [    ] o.a.s.c.c.ZkStateReader Updated live nodes from ZooKeeper... (5) -> (4)
   [junit4]   2> 2334927 INFO  (zkCallback-23312-thread-2) [    ] o.a.s.c.LeaderElector Watching path /overseer_elect/election/95892926664474636-127.0.0.1:36563_solr-n_0000000001 to know if I could be the leader
   [junit4]   2> 2334927 INFO  (zkCallback-23322-thread-1) [    ] o.a.s.c.c.ConnectionManager Watcher org.apache.solr.common.cloud.ConnectionManager@a06bbe name:ZooKeeperConnection Watcher:127.0.0.1:42039/solr got event WatchedEvent state:SyncConnected type:None path:null path:null type:None
   [junit4]   2> 2334927 INFO  (TEST-BasicAuthIntegrationTest.testBasics-seed#[2380F557F096A2A9]) [    ] o.a.s.c.c.ConnectionManager Client is connected to ZooKeeper
   [junit4]   2> 2334928 INFO  (TEST-BasicAuthIntegrationTest.testBasics-seed#[2380F557F096A2A9]) [    ] o.a.s.c.c.SolrZkClient Using default ZkACLProvider
   [junit4]   2> 2334928 INFO  (TEST-BasicAuthIntegrationTest.testBasics-seed#[2380F557F096A2A9]) [    ] o.a.s.s.SolrDispatchFilter solr.xml found in ZooKeeper. Loading...
   [junit4]   2> 2334956 INFO  (TEST-BasicAuthIntegrationTest.testBasics-seed#[2380F557F096A2A9]) [    ] o.a.s.c.CorePropertiesLocator Config-defined core root directory: /home/jenkins/workspace/Lucene-Solr-6.x-Linux/solr/build/solr-core/test/J0/temp/solr.security.BasicAuthIntegrationTest_2380F557F096A2A9-001/tempDir-001/node6/.
   [junit4]   2> 2334956 INFO  (TEST-BasicAuthIntegrationTest.testBasics-seed#[2380F557F096A2A9]) [    ] o.a.s.c.CoreContainer New CoreContainer 10067859
   [junit4]   2> 2334956 INFO  (TEST-BasicAuthIntegrationTest.testBasics-seed#[2380F557F096A2A9]) [    ] o.a.s.c.CoreContainer Loading cores into CoreContainer [instanceDir=/home/jenkins/workspace/Lucene-Solr-6.x-Linux/solr/build/solr-core/test/J0/temp/solr.security.BasicAuthIntegrationTest_2380F557F096A2A9-001/tempDir-001/node6]
   [junit4]   2> 2334956 WARN  (TEST-BasicAuthIntegrationTest.testBasics-seed#[2380F557F096A2A9]) [    ] o.a.s.c.CoreContainer Couldn't add files from /home/jenkins/workspace/Lucene-Solr-6.x-Linux/solr/build/solr-core/test/J0/temp/solr.security.BasicAuthIntegrationTest_2380F557F096A2A9-001/tempDir-001/node6/lib to classpath: /home/jenkins/workspace/Lucene-Solr-6.x-Linux/solr/build/solr-core/test/J0/temp/solr.security.BasicAuthIntegrationTest_2380F557F096A2A9-001/tempDir-001/node6/lib
   [junit4]   2> 2334956 INFO  (TEST-BasicAuthIntegrationTest.testBasics-seed#[2380F557F096A2A9]) [    ] o.a.s.h.c.HttpShardHandlerFactory created with socketTimeout : 90000,urlScheme : ,connTimeout : 15000,maxConnectionsPerHost : 20,maxConnections : 10000,corePoolSize : 0,maximumPoolSize : 2147483647,maxThreadIdleTime : 5,sizeOfQueue : -1,fairnessPolicy : false,useRetries : false,
   [junit4]   2> 2334957 INFO  (TEST-BasicAuthIntegrationTest.testBasics-seed#[2380F557F096A2A9]) [    ] o.a.s.u.UpdateShardHandler Creating UpdateShardHandler HTTP client with params: socketTimeout=340000&connTimeout=45000&retry=true
   [junit4]   2> 2334957 INFO  (TEST-BasicAuthIntegrationTest.testBasics-seed#[2380F557F096A2A9]) [    ] o.a.s.l.LogWatcher SLF4J impl is org.slf4j.impl.Log4jLoggerFactory
   [junit4]   2> 2334957 INFO  (TEST-BasicAuthIntegrationTest.testBasics-seed#[2380F557F096A2A9]) [    ] o.a.s.l.LogWatcher Registering Log Listener [Log4j (org.slf4j.impl.Log4jLoggerFactory)]
   [junit4]   2> 2334957 INFO  (TEST-BasicAuthIntegrationTest.testBasics-seed#[2380F557F096A2A9]) [    ] o.a.s.c.ZkContainer Zookeeper client=127.0.0.1:42039/solr
   [junit4]   2> 2334957 INFO  (TEST-BasicAuthIntegrationTest.testBasics-seed#[2380F557F096A2A9]) [    ] o.a.s.c.ZkController zkHost includes chroot
   [junit4]   2> 2334957 INFO  (TEST-BasicAuthIntegrationTest.testBasics-seed#[2380F557F096A2A9]) [    ] o.a.s.c.c.SolrZkClient Using default ZkCredentialsProvider
   [junit4]   2> 2334958 INFO  (TEST-BasicAuthIntegrationTest.testBasics-seed#[2380F557F096A2A9]) [    ] o.a.s.c.c.ConnectionManager Waiting for client to connect to ZooKeeper
   [junit4]   2> 2334985 INFO  (zkCallback-23325-thread-1) [    ] o.a.s.c.c.ConnectionManager Watcher org.apache.solr.common.cloud.ConnectionManager@8b9491 name:ZooKeeperConnection Watcher:127.0.0.1:42039 got event WatchedEvent state:SyncConnected type:None path:null path:null type:None
   [junit4]   2> 2334985 INFO  (TEST-BasicAuthIntegrationTest.testBasics-seed#[2380F557F096A2A9]) [    ] o.a.s.c.c.ConnectionManager Client is connected to ZooKeeper
   [junit4]   2> 2334986 INFO  (TEST-BasicAuthIntegrationTest.testBasics-seed#[2380F557F096A2A9]) [    ] o.a.s.c.c.SolrZkClient Using default ZkACLProvider
   [junit4]   2> 2335014 INFO  (TEST-BasicAuthIntegrationTest.testBasics-seed#[2380F557F096A2A9]) [    ] o.a.s.c.ZkController Added new OnReconnect listener org.apache.solr.cloud.ZkController$$Lambda$143/10419767@1a315ca
   [junit4]   2> 2335014 INFO  (TEST-BasicAuthIntegrationTest.testBasics-seed#[2380F557F096A2A9]) [    ] o.a.s.c.c.ConnectionManager Waiting for client to connect to ZooKeeper
   [junit4]   2> 2335043 INFO  (zkCallback-23326-thread-1) [    ] o.a.s.c.c.ConnectionManager Watcher org.apache.solr.common.cloud.ConnectionManager@1a43639 name:ZooKeeperConnection Watcher:127.0.0.1:42039/solr got event WatchedEvent state:SyncConnected type:None path:null path:null type:None
   [junit4]   2> 2335043 INFO  (TEST-BasicAuthIntegrationTest.testBasics-seed#[2380F557F096A2A9]) [    ] o.a.s.c.c.ConnectionManager Client is connected to ZooKeeper
   [junit4]   2> 2335232 INFO  (TEST-BasicAuthIntegrationTest.testBasics-seed#[2380F557F096A2A9]) [    ] o.a.s.c.c.ZkStateReader Updating cluster state from ZooKeeper... 
   [junit4]   2> 2335232 INFO  (TEST-BasicAuthIntegrationTest.testBasics-seed#[2380F557F096A2A9]) [    ] o.a.s.c.c.ZkStateReader Updated live nodes from ZooKeeper... (0) -> (4)
   [junit4]   2> 2335233 INFO  (TEST-BasicAuthIntegrationTest.testBasics-seed#[2380F557F096A2A9]) [    ] o.a.s.c.Overseer Overseer (id=null) closing
   [junit4]   2> 2335255 INFO  (TEST-BasicAuthIntegrationTest.testBasics-seed#[2380F557F096A2A9]) [    ] o.a.s.c.LeaderElector Joined leadership election with path: /overseer_elect/election/95892926664474643-127.0.0.1:38775_solr-n_0000000005
   [junit4]   2> 2335256 INFO  (TEST-BasicAuthIntegrationTest.testBasics-seed#[2380F557F096A2A9]) [    ] o.a.s.c.LeaderElector Watching path /overseer_elect/election/95892926664474638-127.0.0.1:40787_solr-n_0000000004 to know if I could be the leader
   [junit4]   2> 2335256 INFO  (TEST-BasicAuthIntegrationTest.testBasics-seed#[2380F557F096A2A9]) [    ] o.a.s.c.ZkController Publish node=127.0.0.1:38775_solr as DOWN
   [junit4]   2> 2335307 INFO  (OverseerStateUpdate-95892926664474635-127.0.0.1:38066_solr-n_0000000000) [    ] o.a.s.c.Overseer processMessage: queueSize: 1, message = {
   [junit4]   2>   "operation":"downnode",
   [junit4]   2>   "node_name":"127.0.0.1:38775_solr"} current state version: 0
   [junit4]   2> 2335307 INFO  (OverseerStateUpdate-95892926664474635-127.0.0.1:38066_solr-n_0000000000) [    ] o.a.s.c.o.NodeMutator DownNode state invoked for node: 127.0.0.1:38775_solr
   [junit4]   2> 2336306 INFO  (TEST-BasicAuthIntegrationTest.testBasics-seed#[2380F557F096A2A9]) [    ] o.a.s.c.ZkController Register node as live in ZooKeeper:/live_nodes/127.0.0.1:38775_solr
   [junit4]   2> 2336766 INFO  (TEST-BasicAuthIntegrationTest.testBasics-seed#[2380F557F096A2A9]) [    ] o.a.s.c.c.SolrZkClient makePath: /live_nodes/127.0.0.1:38775_solr
   [junit4]   2> 2336787 INFO  (zkCallback-23313-thread-1) [    ] o.a.s.c.c.ZkStateReader A live node change: [WatchedEvent state:SyncConnected type:NodeChildrenChanged path:/live_nodes], has occurred - updating... (live nodes size: [4])
   [junit4]   2> 2336787 INFO  (zkCallback-23326-thread-1) [    ] o.a.s.c.c.ZkStateReader A live node change: [WatchedEvent state:SyncConnected type:NodeChildrenChanged path:/live_nodes], has occurred - updating... (live nodes size: [4])
   [junit4]   2> 2336787 INFO  (zkCallback-23311-thread-1) [    ] o.a.s.c.c.ZkStateReader A live node change: [WatchedEvent state:SyncConnected type:NodeChildrenChanged path:/live_nodes], has occurred - updating... (live nodes size: [4])
   [junit4]   2> 2336787 INFO  (zkCallback-23313-thread-1) [    ] o.a.s.c.c.ZkStateReader Updated live nodes from ZooKeeper... (4) -> (5)
   [junit4]   2> 2336787 INFO  (zkCallback-23312-thread-2) [    ] o.a.s.c.c.ZkStateReader A live node change: [WatchedEvent state:SyncConnected type:NodeChildrenChanged path:/live_nodes], has occurred - updating... (live nodes size: [4])
   [junit4]   2> 2336787 INFO  (zkCallback-23310-thread-1) [    ] o.a.s.c.c.ZkStateReader A live node change: [WatchedEvent state:SyncConnected type:NodeChildrenChanged path:/live_nodes], has occurred - updating... (live nodes size: [4])
   [junit4]   2> 2336787 INFO  (zkCallback-23311-thread-1) [    ] o.a.s.c.c.ZkStateReader Updated live nodes from ZooKeeper... (4) -> (5)
   [junit4]   2> 2336788 INFO  (zkCallback-23326-thread-1) [    ] o.a.s.c.c.ZkStateReader Updated live nodes from ZooKeeper... (4) -> (5)
   [junit4]   2> 2336788 INFO  (zkCallback-23312-thread-2) [    ] o.a.s.c.c.ZkStateReader Updated live nodes from ZooKeeper... (4) -> (5)
   [junit4]   2> 2336788 INFO  (zkCallback-23310-thread-1) [    ] o.a.s.c.c.ZkStateReader Updated live nodes from ZooKeeper... (4) -> (5)
   [junit4]   2> 2336801 INFO  (TEST-BasicAuthIntegrationTest.testBasics-seed#[2380F557F096A2A9]) [    ] o.a.s.c.CoreContainer Security conf doesn't exist. Skipping setup for authorization module.
   [junit4]   2> 2336801 INFO  (TEST-BasicAuthIntegrationTest.testBasics-seed#[2380F557F096A2A9]) [    ] o.a.s.c.CoreContainer No authentication plugin used.
   [junit4]   2> 2336801 INFO  (TEST-BasicAuthIntegrationTest.testBasics-seed#[2380F557F096A2A9]) [    ] o.a.s.c.CorePropertiesLocator Looking for core definitions underneath /home/jenkins/workspace/Lucene-Solr-6.x-Linux/solr/build/solr-core/test/J0/temp/solr.security.BasicAuthIntegrationTest_2380F557F096A2A9-001/tempDir-001/node6/.
   [junit4]   2> 2336812 INFO  (TEST-BasicAuthIntegrationTest.testBasics-seed#[2380F557F096A2A9]) [    ] o.a.s.c.CorePropertiesLocator Found 0 core definitions
   [junit4]   2> 2336812 INFO  (TEST-BasicAuthIntegrationTest.testBasics-seed#[2380F557F096A2A9]) [    ] o.a.s.s.SolrDispatchFilter user.dir=/home/jenkins/workspace/Lucene-Solr-6.x-Linux/solr/build/solr-core/test/J0
   [junit4]   2> 2336812 INFO  (TEST-BasicAuthIntegrationTest.testBasics-seed#[2380F557F096A2A9]) [    ] o.a.s.s.SolrDispatchFilter SolrDispatchFilter.init() done
   [junit4]   2> 2336812 INFO  (TEST-BasicAuthIntegrationTest.testBasics-seed#[2380F557F096A2A9]) [    ] o.a.s.c.c.SolrZkClient Using default ZkCredentialsProvider
   [junit4]   2> 2336813 INFO  (TEST-BasicAuthIntegrationTest.testBasics-seed#[2380F557F096A2A9]) [    ] o.a.s.c.c.ConnectionManager Waiting for client to connect to ZooKeeper
   [junit4]   2> 2336869 INFO  (zkCallback-23328-thread-1) [    ] o.a.s.c.c.ConnectionManager Watcher org.apache.solr.common.cloud.ConnectionManager@40504b name:ZooKeeperConnection Watcher:127.0.0.1:42039/solr got event WatchedEvent state:SyncConnected type:None path:null path:null type:None
   [junit4]   2> 2336869 INFO  (TEST-BasicAuthIntegrationTest.testBasics-seed#[2380F557F096A2A9]) [    ] o.a.s.c.c.ConnectionManager Client is connected to ZooKeeper
   [junit4]   2> 2336869 INFO  (TEST-BasicAuthIntegrationTest.testBasics-seed#[2380F557F096A2A9]) [    ] o.a.s.c.c.SolrZkClient Using default ZkACLProvider
   [junit4]   2> 2336870 INFO  (TEST-BasicAuthIntegrationTest.testBasics-seed#[2380F557F096A2A9]) [    ] o.a.s.c.c.SolrZkClient makePath: /configs/solrCloudCollectionConfig/protwords.txt
   [junit4]   2> 2336934 INFO  (TEST-BasicAuthIntegrationTest.testBasics-seed#[2380F557F096A2A9]) [    ] o.a.s.c.c.SolrZkClient makePath: /configs/solrCloudCollectionConfig/solrconfig-delaying-component.xml
   [junit4]   2> 2336967 INFO  (TEST-BasicAuthIntegrationTest.testBasics-seed#[2380F557F096A2A9]) [    ] o.a.s.c.c.SolrZkClient makePath: /configs/solrCloudCollectionConfig/bad_solrconfig.xml
   [junit4]   2> 2337019 INFO  (TEST-BasicAuthIntegrationTest.testBasics-seed#[2380F557F096A2A9]) [    ] o.a.s.c.c.SolrZkClient makePath: /configs/solrCloudCollectionConfig/solrconfig-sortingmergepolicyfactory.xml
   [junit4]   2> 2337039 INFO  (TEST-BasicAuthIntegrationTest.testBasics-seed#[2380F557F096A2A9]) [    ] o.a.s.c.c.SolrZkClient makePath: /configs/solrCloudCollectionConfig/solrconfig-nocache.xml
   [junit4]   2> 2337084 INFO  (TEST-BasicAuthIntegrationTest.testBasics-seed#[2380F557F096A2A9]) [    ] o.a.s.c.c.SolrZkClient makePath: /configs/solrCloudCollectionConfig/solrconfig-implicitproperties.xml
   [junit4]   2> 2337092 INFO  (TEST-BasicAuthIntegrationTest.testBasics-seed#[2380F557F096A2A9]) [    ] o.a.s.c.c.SolrZkClient makePath: /configs/solrCloudCollectionConfig/solrconfig-mergepolicy-legacy.xml
   [junit4]   2> 2337118 INFO  (TEST-BasicAuthIntegrationTest.testBasics-seed#[2380F557F096A2A9]) [    ] o.a.s.c.c.SolrZkClient makePath: /configs/solrCloudCollectionConfig/bad-schema-uniquekey-uses-default.xml
   [junit4]   2> 2337132 INFO  (TEST-BasicAuthIntegrationTest.testBasics-seed#[2380F557F096A2A9]) [    ] o.a.s.c.c.SolrZkClient makePath: /configs/solrCloudCollectionConfig/bad-schema-sim-default-has-no-explicit-sim.xml
   [junit4]   2> 2337142 INFO  (TEST-BasicAuthIntegrationTest.testBasics-seed#[2380F557F096A2A9]) [    ] o.a.s.c.c.SolrZkClient makePath: /configs/solrCloudCollectionConfig/bad-schema-uniquekey-multivalued.xml
   [junit4]   2> 2337185 INFO  (TEST-BasicAuthIntegrationTest.testBasics-seed#[2380F557F096A2A9]) [    ] o.a.s.c.c.SolrZkClient makePath: /configs/solrCloudCollectionConfig/analyzingInfixSuggest.txt
   [junit4]   2> 2337196 INFO  (TEST-BasicAuthIntegrationTest.testBasics-seed#[2380F557F096A2A9]) [    ] o.a.s.c.c.SolrZkClient makePath: /configs/solrCloudCollectionConfig/missleading.extension.updateprocessor.js.txt
   [junit4]   2> 2337216 INFO  (TEST-BasicAuthIntegrationTest.testBasics-seed#[2380F557F096A2A9]) [    ] o.a.s.c.c.SolrZkClient makePath: /configs/solrCloudCollectionConfig/bad-schema-multiple-asterisk-copyfield-source-should-fail-test.xml
   [junit4]   2> 2337230 INFO  (TEST-BasicAuthIntegrationTest.testBasics-seed#[2380F557F096A2A9]) [    ] o.a.s.c.c.SolrZkClient makePath: /configs/solrCloudCollectionConfig/schema-replication2.xml
   [junit4]   2> 2337264 INFO  (TEST-BasicAuthIntegrationTest.testBasics-seed#[2380F557F096A2A9]) [    ] o.a.s.c.c.SolrZkClient makePath: /configs/solrCloudCollectionConfig/solrconfig-infostream-logging.xml
   [junit4]   2> 2337276 INFO  (TEST-BasicAuthIntegrationTest.testBasics-seed#[2380F557F096A2A9]) [    ] o.a.s.c.c.SolrZkClient makePath: /configs/solrCloudCollectionConfig/solrconfig-collapseqparser.xml
   [junit4]   2> 2337310 INFO  (TEST-BasicAuthIntegrationTest.testBasics-seed#[2380F557F096A2A9]) [    ] o.a.s.c.c.SolrZkClient makePath: /configs/solrCloudCollectionConfig/bad-schema-currency-ft-bogus-code-in-xml.xml
   [junit4]   2> 2337346 INFO  (TEST-BasicAuthIntegrationTest.testBasics-seed#[2380F557F096A2A9]) [    ] o.a.s.c.c.SolrZkClient makePath: /configs/solrCloudCollectionConfig/old_synonyms.txt
   [junit4]   2> 2337359 INFO  (TEST-BasicAuthIntegrationTest.testBasics-seed#[2380F557F096A2A9]) [    ] o.a.s.c.c.SolrZkClient makePath: /configs/solrCloudCollectionConfig/enumsConfig.xml
   [junit4]   2> 2337375 INFO  (TEST-BasicAuthIntegrationTest.testBasics-seed#[2380F557F096A2A9]) [    ] o.a.s.c.c.SolrZkClient makePath: /configs/solrCloudCollectionConfig/solrconfig-script-updateprocessor.xml
   [junit4]   2> 2337405 INFO  (TEST-BasicAuthIntegrationTest.testBasics-seed#[2380F557F096A2A9]) [    ] o.a.s.c.c.SolrZkClient makePath: /configs/solrCloudCollectionConfig/schema-add-schema-fields-update-processor.xml
   [junit4]   2> 2337416 INFO  (TEST-BasicAuthIntegrationTest.testBasics-seed#[2380F557F096A2A9]) [    ] o.a.s.c.c.SolrZkClient makePath: /configs/solrCloudCollectionConfig/solrconfig-mergepolicyfactory-nocfs.xml
   [junit4]   2> 2337455 INFO  (TEST-BasicAuthIntegrationTest.testBasics-seed#[2380F557F096A2A9]) [    ] o.a.s.c.c.SolrZkClient makePath: /configs/solrCloudCollectionConfig/bad-schema-sweetspot-both-tf.xml
   [junit4]   2> 2337471 INFO  (TEST-BasicAuthIntegrationTest.testBasics-seed#[2380F557F096A2A9]) [    ] o.a.s.c.c.SolrZkClient makePath: /configs/solrCloudCollectionConfig/schema-phrasesuggest.xml
   [junit4]   2> 2337511 INFO  (TEST-BasicAuthIntegrationTest.testBasics-seed#[2380F557F096A2A9]) [    ] o.a.s.c.c.SolrZkClient makePath: /configs/solrCloudCollectionConfig/solrconfig.xml
   [junit4]   2> 2337554 INFO  (TEST-BasicAuthIntegrationTest.testBasics-seed#[2380F557F096A2A9]) [    ] o.a.s.c.c.SolrZkClient makePath: /configs/solrCloudCollectionConfig/solrconfig-delpolicy1.xml
   [junit4]   2> 2337590 INFO  (TEST-BasicAuthIntegrationTest.testBasics-seed#[2380F557F096A2A9]) [    ] o.a.s.c.c.SolrZkClient makePath: /configs/solrCloudCollectionConfig/schema-sim.xml
   [junit4]   2> 2337625 INFO  (TEST-BasicAuthIntegrationTest.testBasics-seed#[2380F557F096A2A9]) [    ] o.a.s.c.c.SolrZkClient makePath: /configs/solrCloudCollectionConfig/schema15.xml
   [junit4]   2> 2337672 INFO  (TEST-BasicAuthIntegrationTest.testBasics-seed#[2380F557F096A2A9]) [    ] o.a.s.c.c.SolrZkClient makePath: /configs/solrCloudCollectionConfig/schema-sql.xml
   [junit4]   2> 2337728 INFO  (TEST-BasicAuthIntegrationTest.testBasics-seed#[2380F557F096A2A9]) [    ] o.a.s.c.c.SolrZkClient makePath: /configs/solrCloudCollectionConfig/bad-schema-misplaced-asterisk-copyfield-source-should-fail-test.xml
   [junit4]   2> 2337745 INFO  (TEST-BasicAuthIntegrationTest.testBasics-seed#[2380F557F096A2A9]) [    ] o.a.s.c.c.SolrZkClient makePath: /configs/solrCloudCollectionConfig/stemdict.txt
   [junit4]   2> 2337767 INFO  (TEST-BasicAuthIntegrationTest.testBasics-seed#[2380F557F096A2A9]) [    ] o.a.s.c.c.SolrZkClient makePath: /configs/solrCloudCollectionConfig/hunspell-test.aff
   [junit4]   2> 2337791 INFO  (TEST-BasicAuthIntegrationTest.testBasics-seed#[2380F557F096A2A9]) [    ] o.a.s.c.c.SolrZkClient makePath: /configs/solrCloudCollectionConfig/solrconfig-sql.xml
   [junit4]   2> 2337848 INFO  (TEST-BasicAuthIntegrationTest.testBasics-seed#[2380F557F096A2A9]) [    ] o.a.s.c.c.SolrZkClient makePath: /configs/solrCloudCollectionConfig/solrconfig-spatial.xml
   [junit4]   2> 2337866 INFO  (TEST-BasicAuthIntegrationTest.testBasics-seed#[2380F557F096A2A9]) [    ] o.a.s.c.c.SolrZkClient makePath: /configs/solrCloudCollectionConfig/solrconfig-slave1.xml
   [junit4]   2> 2337905 INFO  (TEST-BasicAuthIntegrationTest.testBasics-seed#[2380F557F096A2A9]) [    ] o.a.s.c.c.SolrZkClient makePath: /configs/solrCloudCollectionConfig/bad-schema-dup-fieldType.xml
   [junit4]   2> 2337916 INFO  (TEST-BasicAuthIntegrationTest.testBasics-seed#[2380F557F096A2A9]) [    ] o.a.s.c.c.SolrZkClient makePath: /configs/solrCloudCollectionConfig/bad-schema-external-filefield.xml
   [junit4]   2> 2337964 INFO  (TEST-BasicAuthIntegrationTest.testBasics-seed#[2380F557F096A2A9]) [    ] o.a.s.c.c.SolrZkClient makePath: /configs/solrCloudCollectionConfig/solrconfig-query-parser-init.xml
   [junit4]   2> 2337979 INFO  (TEST-BasicAuthIntegrationTest.testBasics-seed#[2380F557F096A2A9]) [    ] o.a.s.c.c.SolrZkClient makePath: /configs/solrCloudCollectionConfig/bad-solrconfig-nrtmode.xml
   [junit4]   2> 2337988 INFO  (TEST-BasicAuthIntegrationTest.testBasics-seed#[2380F557F096A2A9]) [    ] o.a.s.c.c.SolrZkClient makePath: /configs/solrCloudCollectionConfig/schema-complex-phrase.xml
   [junit4]   2> 2338027 INFO  (TEST-BasicAuthIntegrationTest.testBasics-seed#[2380F557F096A2A9]) [    ] o.a.s.c.c.SolrZkClient makePath: /configs/solrCloudCollectionConfig/conditional.updateprocessor.js
   [junit4]   2> 2338043 INFO  (TEST-BasicAuthIntegrationTest.testBasics-seed#[2380F557F096A2A9]) [    ] o.a.s.c.c.SolrZkClient makePath: /configs/solrCloudCollectionConfig/bad-schema-analyzer-class-and-nested.xml
   [junit4]   2> 2338055 INFO  (TEST-BasicAuthIntegrationTest.testBasics-seed#[2380F557F096A2A9]) [    ] o.a.s.c.c.SolrZkClient makePath: /configs/solrCloudCollectionConfig/schema-eff.xml
   [junit4]   2> 2338092 INFO  (TEST-BasicAuthIntegrationTest.testBasics-seed#[2380F557F096A2A9]) [    ] o.a.s.c.c.SolrZkClient makePath: /configs/solrCloudCollectionConfig/schema-folding.xml
   [junit4]   2> 2338119 INFO  (TEST-BasicAuthIntegrationTest.testBasics-seed#[2380F557F096A2A9]) [    ] o.a.s.c.c.SolrZkClient makePath: /configs/solrCloudCollectionConfig/solrconfig-tieredmergepolicyfactory.xml
   [junit4]   2> 2338129 INFO  (TEST-BasicAuthIntegrationTest.testBasics-seed#[2380F557F096A2A9]) [    ] o.a.s.c.c.SolrZkCl

[...truncated too long message...]

ng.RandomizedRunner.runSingleTest(RandomizedRunner.java:880)
   [junit4]   2>         at com.carrotsearch.randomizedtesting.RandomizedRunner$5.evaluate(RandomizedRunner.java:781)
   [junit4]   2>         at com.carrotsearch.randomizedtesting.RandomizedRunner$6.evaluate(RandomizedRunner.java:816)
   [junit4]   2>         at com.carrotsearch.randomizedtesting.RandomizedRunner$7.evaluate(RandomizedRunner.java:827)
   [junit4]   2>         at com.carrotsearch.randomizedtesting.rules.StatementAdapter.evaluate(StatementAdapter.java:36)
   [junit4]   2>         at com.carrotsearch.randomizedtesting.rules.SystemPropertiesRestoreRule$1.evaluate(SystemPropertiesRestoreRule.java:57)
   [junit4]   2>         at org.apache.lucene.util.AbstractBeforeAfterRule$1.evaluate(AbstractBeforeAfterRule.java:45)
   [junit4]   2>         at com.carrotsearch.randomizedtesting.rules.StatementAdapter.evaluate(StatementAdapter.java:36)
   [junit4]   2>         at org.apache.lucene.util.TestRuleStoreClassName$1.evaluate(TestRuleStoreClassName.java:41)
   [junit4]   2>         at com.carrotsearch.randomizedtesting.rules.NoShadowingOrOverridesOnMethodsRule$1.evaluate(NoShadowingOrOverridesOnMethodsRule.java:40)
   [junit4]   2>         at com.carrotsearch.randomizedtesting.rules.NoShadowingOrOverridesOnMethodsRule$1.evaluate(NoShadowingOrOverridesOnMethodsRule.java:40)
   [junit4]   2>         at com.carrotsearch.randomizedtesting.rules.StatementAdapter.evaluate(StatementAdapter.java:36)
   [junit4]   2>         at com.carrotsearch.randomizedtesting.rules.StatementAdapter.evaluate(StatementAdapter.java:36)
   [junit4]   2>         at com.carrotsearch.randomizedtesting.rules.StatementAdapter.evaluate(StatementAdapter.java:36)
   [junit4]   2>         at org.apache.lucene.util.TestRuleAssertionsRequired$1.evaluate(TestRuleAssertionsRequired.java:53)
   [junit4]   2>         at org.apache.lucene.util.TestRuleMarkFailure$1.evaluate(TestRuleMarkFailure.java:47)
   [junit4]   2>         at org.apache.lucene.util.TestRuleIgnoreAfterMaxFailures$1.evaluate(TestRuleIgnoreAfterMaxFailures.java:64)
   [junit4]   2>         at org.apache.lucene.util.TestRuleIgnoreTestSuites$1.evaluate(TestRuleIgnoreTestSuites.java:54)
   [junit4]   2>         at com.carrotsearch.randomizedtesting.rules.StatementAdapter.evaluate(StatementAdapter.java:36)
   [junit4]   2>         at com.carrotsearch.randomizedtesting.ThreadLeakControl$StatementRunner.run(ThreadLeakControl.java:367)
   [junit4]   2>         at java.lang.Thread.run(java.base@9-ea/Thread.java:804)
   [junit4]   2> NOTE: test params are: codec=Asserting(Lucene60): {range_facet_l_dv=Lucene50(blocksize=128), _version_=FST50, multiDefault=PostingsFormat(name=Memory doPackFST= false), intDefault=FST50, id=Lucene50(blocksize=128), range_facet_i_dv=FST50, range_facet_l=FST50, timestamp=FST50}, docValues:{range_facet_l_dv=DocValuesFormat(name=Lucene54), range_facet_i_dv=DocValuesFormat(name=Lucene54), timestamp=DocValuesFormat(name=Lucene54)}, maxPointsInLeafNode=342, maxMBSortInHeap=5.561701129936852, sim=RandomSimilarity(queryNorm=true,coord=no): {}, locale=pt-AO, timezone=Pacific/Tahiti
   [junit4]   2> NOTE: Linux 4.4.0-21-generic i386/Oracle Corporation 9-ea (32-bit)/cpus=12,threads=2,free=63198240,total=436310016
   [junit4]   2> NOTE: All tests run in this JVM: [TestRuleBasedAuthorizationPlugin, AnalysisAfterCoreReloadTest, HdfsTlogReplayBufferedWhileIndexingTest, TestFunctionQuery, ActionThrottleTest, TestPseudoReturnFields, TestValueSourceCache, TestCSVLoader, SolrCoreTest, TestXmlQParser, TestHighlightDedupGrouping, CloudExitableDirectoryReaderTest, TestLazyCores, TestSchemaNameResource, OverseerCollectionConfigSetProcessorTest, TestManagedResourceStorage, TestReloadDeadlock, LeaderInitiatedRecoveryOnCommitTest, DistributedFacetPivotSmallTest, TestOnReconnectListenerSupport, ZkStateWriterTest, PathHierarchyTokenizerFactoryTest, CreateCollectionCleanupTest, TestMergePolicyConfig, TestReplicaProperties, HdfsDirectoryTest, CachingDirectoryFactoryTest, DistributedSpellCheckComponentTest, QueryElevationComponentTest, PKIAuthenticationIntegrationTest, BasicDistributedZkTest, TestTrackingShardHandlerFactory, TestDocSet, PrimUtilsTest, TestComponentsName, TestSmileRequest, TestTolerantUpdateProcessorRandomCloud, PingRequestHandlerTest, WrapperMergePolicyFactoryTest, SystemInfoHandlerTest, SyncSliceTest, FileBasedSpellCheckerTest, DocumentAnalysisRequestHandlerTest, TestUseDocValuesAsStored, TestAtomicUpdateErrorCases, ConnectionReuseTest, DistributedFacetPivotLargeTest, VMParamsZkACLAndCredentialsProvidersTest, JsonLoaderTest, SegmentsInfoRequestHandlerTest, TestDynamicLoading, OverseerTaskQueueTest, SSLMigrationTest, TestSSLRandomization, BigEndianAscendingWordSerializerTest, TestSolr4Spatial, TestFoldingMultitermQuery, TestShardHandlerFactory, DisMaxRequestHandlerTest, TestClassicSimilarityFactory, TestDocBasedVersionConstraints, TestCloudBackupRestore, DateFieldTest, TestSolrConfigHandlerConcurrent, AnalysisErrorHandlingTest, TestFieldResource, TestRestoreCore, ConjunctionSolrSpellCheckerTest, ClassificationUpdateProcessorFactoryTest, CopyFieldTest, BlockJoinFacetDistribTest, PolyFieldTest, SolrCloudExampleTest, TestIBSimilarityFactory, TestOverriddenPrefixQueryForCustomFieldType, TestRemoteStreaming, ReplicationFactorTest, DefaultValueUpdateProcessorTest, TestRangeQuery, TestExactStatsCache, TestInitParams, SpatialHeatmapFacetsTest, PeerSyncTest, RulesTest, TestDynamicFieldCollectionResource, TestConfigReload, VersionInfoTest, CoreMergeIndexesAdminHandlerTest, TestJoin, TestRTGBase, SignatureUpdateProcessorFactoryTest, StandardRequestHandlerTest, TestJsonRequest, TestNamedUpdateProcessors, TestReplicationHandler, UnloadDistributedZkTest, ShardRoutingTest, ClusterStateUpdateTest, TestRandomFaceting, ZkSolrClientTest, AutoCommitTest, TestFaceting, TestRecovery, TestHashPartitioner, TermVectorComponentDistributedTest, TestRealTimeGet, TestReload, TestStressVersions, HardAutoCommitTest, DistributedTermsComponentTest, SpellCheckComponentTest, DirectUpdateHandlerTest, DistributedQueryElevationComponentTest, SuggesterTSTTest, TestTrie, SchemaVersionSpecificBehaviorTest, FieldMutatingUpdateProcessorTest, QueryEqualityTest, SolrInfoMBeanTest, CacheHeaderTest, TestOmitPositions, XmlUpdateRequestHandlerTest, TestIndexingPerformance, TestSolrQueryParser, IndexSchemaRuntimeFieldTest, TestJmxIntegration, JSONWriterTest, TestAnalyzedSuggestions, HighlighterConfigTest, SOLR749Test, UpdateParamsTest, AlternateDirectoryTest, TestSolrIndexConfig, ResponseLogComponentTest, SolrIndexConfigTest, TestStressRecovery, MultiTermTest, TestBinaryField, MinimalSchemaTest, TestElisionMultitermQuery, TestConfig, OutputWriterTest, ExternalFileFieldSortTest, TestPostingsSolrHighlighter, TestLuceneMatchVersion, TestPhraseSuggestions, SynonymTokenizerTest, EchoParamsTest, TestDFRSimilarityFactory, TestLMDirichletSimilarityFactory, TestFastWriter, ResourceLoaderTest, ScriptEngineTest, DateMathParserTest, PreAnalyzedFieldTest, TestSystemIdResolver, SpellingQueryConverterTest, DOMUtilTest, RAMDirectoryFactoryTest, TestSolrJ, TestLRUCache, ZkNodePropsTest, SliceStateTest, UUIDFieldTest, CircularListTest, CursorPagingTest, TestCrossCoreJoin, TestSimpleTrackingShardHandler, TestTolerantSearch, TestEmbeddedSolrServerConstructors, AssignTest, AsyncCallRequestStatusResponseTest, CdcrReplicationDistributedZkTest, CdcrVersionReplicationTest, CollectionsAPIAsyncDistributedZkTest, DeleteInactiveReplicaTest, DeleteStatusTest, DistribCursorPagingTest, ForceLeaderTest, RestartWhileUpdatingTest, SimpleCollectionCreateDeleteTest, TestCollectionAPI, TestExclusionRuleCollectionAccess, TestLeaderInitiatedRecoveryThread, TestRequestForwarding, TestRequestStatusCollectionAPI, TestSolrCloudWithKerberosAlt, TestStressLiveNodes, TestExpandComponent, TestPivotHelperCode, JavabinLoaderTest, HighlighterMaxOffsetTest, SmileWriterTest, TestIntervalFaceting, TestCustomDocTransformer, TestGraphMLResponseWriter, TestRawResponseWriter, TestSortingResponseWriter, TestChildDocTransformer, TestSubQueryTransformerDistrib, TestCloudSchemaless, BasicAuthIntegrationTest]
   [junit4]   2> NOTE: reproduce with: ant test  -Dtestcase=BasicAuthIntegrationTest -Dtests.seed=2380F557F096A2A9 -Dtests.multiplier=3 -Dtests.slow=true -Dtests.locale=pt-AO -Dtests.timezone=Pacific/Tahiti -Dtests.asserts=true -Dtests.file.encoding=US-ASCII
   [junit4] ERROR   0.00s J0 | BasicAuthIntegrationTest (suite) <<<
   [junit4]    > Throwable #1: java.lang.Exception: Suite timeout exceeded (>= 7200000 msec).
   [junit4]    > 	at __randomizedtesting.SeedInfo.seed([2380F557F096A2A9]:0)
   [junit4] Completed [598/598 (1!)] on J0 in 7223.42s, 1 test, 2 errors <<< FAILURES!

[...truncated 12 lines...]
BUILD FAILED
/home/jenkins/workspace/Lucene-Solr-6.x-Linux/build.xml:740: The following error occurred while executing this line:
/home/jenkins/workspace/Lucene-Solr-6.x-Linux/build.xml:684: The following error occurred while executing this line:
/home/jenkins/workspace/Lucene-Solr-6.x-Linux/build.xml:59: The following error occurred while executing this line:
/home/jenkins/workspace/Lucene-Solr-6.x-Linux/solr/build.xml:233: The following error occurred while executing this line:
/home/jenkins/workspace/Lucene-Solr-6.x-Linux/solr/common-build.xml:529: The following error occurred while executing this line:
/home/jenkins/workspace/Lucene-Solr-6.x-Linux/lucene/common-build.xml:1457: The following error occurred while executing this line:
/home/jenkins/workspace/Lucene-Solr-6.x-Linux/lucene/common-build.xml:1014: There were test failures: 598 suites (10 ignored), 2420 tests, 1 suite-level error, 1 error, 117 ignored (71 assumptions) [seed: 2380F557F096A2A9]

Total time: 184 minutes 59 seconds
Build step 'Invoke Ant' marked build as failure
Archiving artifacts
[WARNINGS] Skipping publisher since build result is FAILURE
Recording test results
Email was triggered for: Failure - Any
Sending email for trigger: Failure - Any



Mime
View raw message