lucene-dev mailing list archives

Site index · List index
Message view « Date » · « Thread »
Top « Date » · « Thread »
From Policeman Jenkins Server <jenk...@thetaphi.de>
Subject [JENKINS-EA] Lucene-Solr-master-Linux (64bit/jdk-9-ea+116) - Build # 16736 - Failure!
Date Sat, 14 May 2016 01:07:32 GMT
Build: http://jenkins.thetaphi.de/job/Lucene-Solr-master-Linux/16736/
Java: 64bit/jdk-9-ea+116 -XX:-UseCompressedOops -XX:+UseParallelGC

1 tests failed.
FAILED:  org.apache.solr.schema.TestManagedSchemaAPI.test

Error Message:
Error from server at http://127.0.0.1:44554/solr/testschemaapi_shard1_replica1: ERROR: [doc=2] unknown field 'myNewField1'

Stack Trace:
org.apache.solr.client.solrj.impl.CloudSolrClient$RouteException: Error from server at http://127.0.0.1:44554/solr/testschemaapi_shard1_replica1: ERROR: [doc=2] unknown field 'myNewField1'
	at __randomizedtesting.SeedInfo.seed([1E30BB4E7C3058D0:96648494D2CC3528]:0)
	at org.apache.solr.client.solrj.impl.CloudSolrClient.directUpdate(CloudSolrClient.java:697)
	at org.apache.solr.client.solrj.impl.CloudSolrClient.sendRequest(CloudSolrClient.java:1109)
	at org.apache.solr.client.solrj.impl.CloudSolrClient.requestWithRetryOnStaleState(CloudSolrClient.java:998)
	at org.apache.solr.client.solrj.impl.CloudSolrClient.request(CloudSolrClient.java:934)
	at org.apache.solr.schema.TestManagedSchemaAPI.testAddFieldAndDocument(TestManagedSchemaAPI.java:86)
	at org.apache.solr.schema.TestManagedSchemaAPI.test(TestManagedSchemaAPI.java:55)
	at jdk.internal.reflect.NativeMethodAccessorImpl.invoke0(java.base@9-ea/Native Method)
	at jdk.internal.reflect.NativeMethodAccessorImpl.invoke(java.base@9-ea/NativeMethodAccessorImpl.java:62)
	at jdk.internal.reflect.DelegatingMethodAccessorImpl.invoke(java.base@9-ea/DelegatingMethodAccessorImpl.java:43)
	at java.lang.reflect.Method.invoke(java.base@9-ea/Method.java:531)
	at com.carrotsearch.randomizedtesting.RandomizedRunner.invoke(RandomizedRunner.java:1764)
	at com.carrotsearch.randomizedtesting.RandomizedRunner$8.evaluate(RandomizedRunner.java:871)
	at com.carrotsearch.randomizedtesting.RandomizedRunner$9.evaluate(RandomizedRunner.java:907)
	at com.carrotsearch.randomizedtesting.RandomizedRunner$10.evaluate(RandomizedRunner.java:921)
	at com.carrotsearch.randomizedtesting.rules.SystemPropertiesRestoreRule$1.evaluate(SystemPropertiesRestoreRule.java:57)
	at org.apache.lucene.util.TestRuleSetupTeardownChained$1.evaluate(TestRuleSetupTeardownChained.java:49)
	at org.apache.lucene.util.AbstractBeforeAfterRule$1.evaluate(AbstractBeforeAfterRule.java:45)
	at org.apache.lucene.util.TestRuleThreadAndTestName$1.evaluate(TestRuleThreadAndTestName.java:48)
	at org.apache.lucene.util.TestRuleIgnoreAfterMaxFailures$1.evaluate(TestRuleIgnoreAfterMaxFailures.java:64)
	at org.apache.lucene.util.TestRuleMarkFailure$1.evaluate(TestRuleMarkFailure.java:47)
	at com.carrotsearch.randomizedtesting.rules.StatementAdapter.evaluate(StatementAdapter.java:36)
	at com.carrotsearch.randomizedtesting.ThreadLeakControl$StatementRunner.run(ThreadLeakControl.java:367)
	at com.carrotsearch.randomizedtesting.ThreadLeakControl.forkTimeoutingTask(ThreadLeakControl.java:809)
	at com.carrotsearch.randomizedtesting.ThreadLeakControl$3.evaluate(ThreadLeakControl.java:460)
	at com.carrotsearch.randomizedtesting.RandomizedRunner.runSingleTest(RandomizedRunner.java:880)
	at com.carrotsearch.randomizedtesting.RandomizedRunner$5.evaluate(RandomizedRunner.java:781)
	at com.carrotsearch.randomizedtesting.RandomizedRunner$6.evaluate(RandomizedRunner.java:816)
	at com.carrotsearch.randomizedtesting.RandomizedRunner$7.evaluate(RandomizedRunner.java:827)
	at com.carrotsearch.randomizedtesting.rules.StatementAdapter.evaluate(StatementAdapter.java:36)
	at com.carrotsearch.randomizedtesting.rules.SystemPropertiesRestoreRule$1.evaluate(SystemPropertiesRestoreRule.java:57)
	at org.apache.lucene.util.AbstractBeforeAfterRule$1.evaluate(AbstractBeforeAfterRule.java:45)
	at com.carrotsearch.randomizedtesting.rules.StatementAdapter.evaluate(StatementAdapter.java:36)
	at org.apache.lucene.util.TestRuleStoreClassName$1.evaluate(TestRuleStoreClassName.java:41)
	at com.carrotsearch.randomizedtesting.rules.NoShadowingOrOverridesOnMethodsRule$1.evaluate(NoShadowingOrOverridesOnMethodsRule.java:40)
	at com.carrotsearch.randomizedtesting.rules.NoShadowingOrOverridesOnMethodsRule$1.evaluate(NoShadowingOrOverridesOnMethodsRule.java:40)
	at com.carrotsearch.randomizedtesting.rules.StatementAdapter.evaluate(StatementAdapter.java:36)
	at com.carrotsearch.randomizedtesting.rules.StatementAdapter.evaluate(StatementAdapter.java:36)
	at com.carrotsearch.randomizedtesting.rules.StatementAdapter.evaluate(StatementAdapter.java:36)
	at org.apache.lucene.util.TestRuleAssertionsRequired$1.evaluate(TestRuleAssertionsRequired.java:53)
	at org.apache.lucene.util.TestRuleMarkFailure$1.evaluate(TestRuleMarkFailure.java:47)
	at org.apache.lucene.util.TestRuleIgnoreAfterMaxFailures$1.evaluate(TestRuleIgnoreAfterMaxFailures.java:64)
	at org.apache.lucene.util.TestRuleIgnoreTestSuites$1.evaluate(TestRuleIgnoreTestSuites.java:54)
	at com.carrotsearch.randomizedtesting.rules.StatementAdapter.evaluate(StatementAdapter.java:36)
	at com.carrotsearch.randomizedtesting.ThreadLeakControl$StatementRunner.run(ThreadLeakControl.java:367)
	at java.lang.Thread.run(java.base@9-ea/Thread.java:804)
Caused by: org.apache.solr.client.solrj.impl.HttpSolrClient$RemoteSolrException: Error from server at http://127.0.0.1:44554/solr/testschemaapi_shard1_replica1: ERROR: [doc=2] unknown field 'myNewField1'
	at org.apache.solr.client.solrj.impl.HttpSolrClient.executeMethod(HttpSolrClient.java:606)
	at org.apache.solr.client.solrj.impl.HttpSolrClient.request(HttpSolrClient.java:259)
	at org.apache.solr.client.solrj.impl.HttpSolrClient.request(HttpSolrClient.java:248)
	at org.apache.solr.client.solrj.impl.LBHttpSolrClient.doRequest(LBHttpSolrClient.java:413)
	at org.apache.solr.client.solrj.impl.LBHttpSolrClient.request(LBHttpSolrClient.java:366)
	at org.apache.solr.client.solrj.impl.CloudSolrClient.lambda$directUpdate$0(CloudSolrClient.java:674)
	at java.util.concurrent.FutureTask.run(java.base@9-ea/FutureTask.java:266)
	at org.apache.solr.common.util.ExecutorUtil$MDCAwareThreadPoolExecutor.lambda$execute$0(ExecutorUtil.java:229)
	at java.util.concurrent.ThreadPoolExecutor.runWorker(java.base@9-ea/ThreadPoolExecutor.java:1158)
	at java.util.concurrent.ThreadPoolExecutor$Worker.run(java.base@9-ea/ThreadPoolExecutor.java:632)
	... 1 more




Build Log:
[...truncated 12265 lines...]
   [junit4] Suite: org.apache.solr.schema.TestManagedSchemaAPI
   [junit4]   2> Creating dataDir: /home/jenkins/workspace/Lucene-Solr-master-Linux/solr/build/solr-core/test/J0/temp/solr.schema.TestManagedSchemaAPI_1E30BB4E7C3058D0-001/init-core-data-001
   [junit4]   2> 2081830 INFO  (SUITE-TestManagedSchemaAPI-seed#[1E30BB4E7C3058D0]-worker) [    ] o.a.s.SolrTestCaseJ4 Randomized ssl (false) and clientAuth (false)
   [junit4]   2> 2081832 INFO  (SUITE-TestManagedSchemaAPI-seed#[1E30BB4E7C3058D0]-worker) [    ] o.a.s.c.ZkTestServer STARTING ZK TEST SERVER
   [junit4]   2> 2081832 INFO  (Thread-5711) [    ] o.a.s.c.ZkTestServer client port:0.0.0.0/0.0.0.0:0
   [junit4]   2> 2081832 INFO  (Thread-5711) [    ] o.a.s.c.ZkTestServer Starting server
   [junit4]   2> 2081932 INFO  (SUITE-TestManagedSchemaAPI-seed#[1E30BB4E7C3058D0]-worker) [    ] o.a.s.c.ZkTestServer start zk server on port:32836
   [junit4]   2> 2081932 INFO  (SUITE-TestManagedSchemaAPI-seed#[1E30BB4E7C3058D0]-worker) [    ] o.a.s.c.c.SolrZkClient Using default ZkCredentialsProvider
   [junit4]   2> 2081932 INFO  (SUITE-TestManagedSchemaAPI-seed#[1E30BB4E7C3058D0]-worker) [    ] o.a.s.c.c.ConnectionManager Waiting for client to connect to ZooKeeper
   [junit4]   2> 2081934 INFO  (zkCallback-2655-thread-1) [    ] o.a.s.c.c.ConnectionManager Watcher org.apache.solr.common.cloud.ConnectionManager@36683c9 name:ZooKeeperConnection Watcher:127.0.0.1:32836 got event WatchedEvent state:SyncConnected type:None path:null path:null type:None
   [junit4]   2> 2081934 INFO  (SUITE-TestManagedSchemaAPI-seed#[1E30BB4E7C3058D0]-worker) [    ] o.a.s.c.c.ConnectionManager Client is connected to ZooKeeper
   [junit4]   2> 2081934 INFO  (SUITE-TestManagedSchemaAPI-seed#[1E30BB4E7C3058D0]-worker) [    ] o.a.s.c.c.SolrZkClient Using default ZkACLProvider
   [junit4]   2> 2081934 INFO  (SUITE-TestManagedSchemaAPI-seed#[1E30BB4E7C3058D0]-worker) [    ] o.a.s.c.c.SolrZkClient makePath: /solr/solr.xml
   [junit4]   2> 2081937 INFO  (jetty-launcher-2654-thread-1) [    ] o.e.j.s.Server jetty-9.3.8.v20160314
   [junit4]   2> 2081937 INFO  (jetty-launcher-2654-thread-2) [    ] o.e.j.s.Server jetty-9.3.8.v20160314
   [junit4]   2> 2081937 INFO  (jetty-launcher-2654-thread-1) [    ] o.e.j.s.h.ContextHandler Started o.e.j.s.ServletContextHandler@6184348f{/solr,null,AVAILABLE}
   [junit4]   2> 2081938 INFO  (jetty-launcher-2654-thread-2) [    ] o.e.j.s.h.ContextHandler Started o.e.j.s.ServletContextHandler@5df373a5{/solr,null,AVAILABLE}
   [junit4]   2> 2081939 INFO  (jetty-launcher-2654-thread-1) [    ] o.e.j.s.ServerConnector Started ServerConnector@46a22208{HTTP/1.1,[http/1.1]}{127.0.0.1:?????}
   [junit4]   2> 2081939 INFO  (jetty-launcher-2654-thread-2) [    ] o.e.j.s.ServerConnector Started ServerConnector@57f8f8a3{HTTP/1.1,[http/1.1]}{127.0.0.1:?????}
   [junit4]   2> 2081939 INFO  (jetty-launcher-2654-thread-1) [    ] o.e.j.s.Server Started @???????ms
   [junit4]   2> 2081939 INFO  (jetty-launcher-2654-thread-2) [    ] o.e.j.s.Server Started @???????ms
   [junit4]   2> 2081939 INFO  (jetty-launcher-2654-thread-1) [    ] o.a.s.c.s.e.JettySolrRunner Jetty properties: {hostContext=/solr, hostPort=42915}
   [junit4]   2> 2081939 INFO  (jetty-launcher-2654-thread-2) [    ] o.a.s.c.s.e.JettySolrRunner Jetty properties: {hostContext=/solr, hostPort=44554}
   [junit4]   2> 2081939 INFO  (jetty-launcher-2654-thread-1) [    ] o.a.s.s.SolrDispatchFilter SolrDispatchFilter.init(): jdk.internal.loader.ClassLoaders$AppClassLoader@2eee9593
   [junit4]   2> 2081940 INFO  (jetty-launcher-2654-thread-2) [    ] o.a.s.s.SolrDispatchFilter SolrDispatchFilter.init(): jdk.internal.loader.ClassLoaders$AppClassLoader@2eee9593
   [junit4]   2> 2081940 INFO  (jetty-launcher-2654-thread-1) [    ] o.a.s.c.SolrResourceLoader new SolrResourceLoader for directory: '/home/jenkins/workspace/Lucene-Solr-master-Linux/solr/build/solr-core/test/J0/temp/solr.schema.TestManagedSchemaAPI_1E30BB4E7C3058D0-001/tempDir-001/node1'
   [junit4]   2> 2081940 INFO  (jetty-launcher-2654-thread-2) [    ] o.a.s.c.SolrResourceLoader new SolrResourceLoader for directory: '/home/jenkins/workspace/Lucene-Solr-master-Linux/solr/build/solr-core/test/J0/temp/solr.schema.TestManagedSchemaAPI_1E30BB4E7C3058D0-001/tempDir-001/node2'
   [junit4]   2> 2081940 INFO  (jetty-launcher-2654-thread-1) [    ] o.a.s.c.SolrResourceLoader JNDI not configured for solr (NoInitialContextEx)
   [junit4]   2> 2081940 INFO  (jetty-launcher-2654-thread-1) [    ] o.a.s.c.SolrResourceLoader solr home defaulted to 'solr/' (could not find system property or JNDI)
   [junit4]   2> 2081940 INFO  (jetty-launcher-2654-thread-2) [    ] o.a.s.c.SolrResourceLoader JNDI not configured for solr (NoInitialContextEx)
   [junit4]   2> 2081940 INFO  (jetty-launcher-2654-thread-2) [    ] o.a.s.c.SolrResourceLoader solr home defaulted to 'solr/' (could not find system property or JNDI)
   [junit4]   2> 2081940 INFO  (jetty-launcher-2654-thread-1) [    ] o.a.s.c.c.SolrZkClient Using default ZkCredentialsProvider
   [junit4]   2> 2081940 INFO  (jetty-launcher-2654-thread-2) [    ] o.a.s.c.c.SolrZkClient Using default ZkCredentialsProvider
   [junit4]   2> 2081940 INFO  (jetty-launcher-2654-thread-1) [    ] o.a.s.c.c.ConnectionManager Waiting for client to connect to ZooKeeper
   [junit4]   2> 2081940 INFO  (jetty-launcher-2654-thread-2) [    ] o.a.s.c.c.ConnectionManager Waiting for client to connect to ZooKeeper
   [junit4]   2> 2081941 INFO  (zkCallback-2656-thread-1) [    ] o.a.s.c.c.ConnectionManager Watcher org.apache.solr.common.cloud.ConnectionManager@24ead59c name:ZooKeeperConnection Watcher:127.0.0.1:32836/solr got event WatchedEvent state:SyncConnected type:None path:null path:null type:None
   [junit4]   2> 2081941 INFO  (zkCallback-2657-thread-1) [    ] o.a.s.c.c.ConnectionManager Watcher org.apache.solr.common.cloud.ConnectionManager@672c2384 name:ZooKeeperConnection Watcher:127.0.0.1:32836/solr got event WatchedEvent state:SyncConnected type:None path:null path:null type:None
   [junit4]   2> 2081941 INFO  (jetty-launcher-2654-thread-1) [    ] o.a.s.c.c.ConnectionManager Client is connected to ZooKeeper
   [junit4]   2> 2081941 INFO  (jetty-launcher-2654-thread-2) [    ] o.a.s.c.c.ConnectionManager Client is connected to ZooKeeper
   [junit4]   2> 2081941 INFO  (jetty-launcher-2654-thread-1) [    ] o.a.s.c.c.SolrZkClient Using default ZkACLProvider
   [junit4]   2> 2081941 INFO  (jetty-launcher-2654-thread-2) [    ] o.a.s.c.c.SolrZkClient Using default ZkACLProvider
   [junit4]   2> 2081941 INFO  (jetty-launcher-2654-thread-1) [    ] o.a.s.s.SolrDispatchFilter solr.xml found in ZooKeeper. Loading...
   [junit4]   2> 2081941 INFO  (jetty-launcher-2654-thread-2) [    ] o.a.s.s.SolrDispatchFilter solr.xml found in ZooKeeper. Loading...
   [junit4]   2> 2081946 INFO  (jetty-launcher-2654-thread-1) [    ] o.a.s.c.CorePropertiesLocator Config-defined core root directory: /home/jenkins/workspace/Lucene-Solr-master-Linux/solr/build/solr-core/test/J0/temp/solr.schema.TestManagedSchemaAPI_1E30BB4E7C3058D0-001/tempDir-001/node1/.
   [junit4]   2> 2081946 WARN  (NIOServerCxn.Factory:0.0.0.0/0.0.0.0:0) [    ] o.a.z.s.NIOServerCnxn caught end of stream exception
   [junit4]   2> EndOfStreamException: Unable to read additional data from client sessionid 0x154accc3d110002, likely client has closed socket
   [junit4]   2> 	at org.apache.zookeeper.server.NIOServerCnxn.doIO(NIOServerCnxn.java:228)
   [junit4]   2> 	at org.apache.zookeeper.server.NIOServerCnxnFactory.run(NIOServerCnxnFactory.java:208)
   [junit4]   2> 	at java.lang.Thread.run(java.base@9-ea/Thread.java:804)
   [junit4]   2> 2081946 INFO  (jetty-launcher-2654-thread-2) [    ] o.a.s.c.CorePropertiesLocator Config-defined core root directory: /home/jenkins/workspace/Lucene-Solr-master-Linux/solr/build/solr-core/test/J0/temp/solr.schema.TestManagedSchemaAPI_1E30BB4E7C3058D0-001/tempDir-001/node2/.
   [junit4]   2> 2081946 INFO  (jetty-launcher-2654-thread-1) [    ] o.a.s.c.CoreContainer New CoreContainer 288917677
   [junit4]   2> 2081947 INFO  (jetty-launcher-2654-thread-2) [    ] o.a.s.c.CoreContainer New CoreContainer 813644435
   [junit4]   2> 2081947 INFO  (jetty-launcher-2654-thread-1) [    ] o.a.s.c.CoreContainer Loading cores into CoreContainer [instanceDir=/home/jenkins/workspace/Lucene-Solr-master-Linux/solr/build/solr-core/test/J0/temp/solr.schema.TestManagedSchemaAPI_1E30BB4E7C3058D0-001/tempDir-001/node1]
   [junit4]   2> 2081947 INFO  (jetty-launcher-2654-thread-2) [    ] o.a.s.c.CoreContainer Loading cores into CoreContainer [instanceDir=/home/jenkins/workspace/Lucene-Solr-master-Linux/solr/build/solr-core/test/J0/temp/solr.schema.TestManagedSchemaAPI_1E30BB4E7C3058D0-001/tempDir-001/node2]
   [junit4]   2> 2081947 WARN  (jetty-launcher-2654-thread-1) [    ] o.a.s.c.CoreContainer Couldn't add files from /home/jenkins/workspace/Lucene-Solr-master-Linux/solr/build/solr-core/test/J0/temp/solr.schema.TestManagedSchemaAPI_1E30BB4E7C3058D0-001/tempDir-001/node1/lib to classpath: /home/jenkins/workspace/Lucene-Solr-master-Linux/solr/build/solr-core/test/J0/temp/solr.schema.TestManagedSchemaAPI_1E30BB4E7C3058D0-001/tempDir-001/node1/lib
   [junit4]   2> 2081947 WARN  (jetty-launcher-2654-thread-2) [    ] o.a.s.c.CoreContainer Couldn't add files from /home/jenkins/workspace/Lucene-Solr-master-Linux/solr/build/solr-core/test/J0/temp/solr.schema.TestManagedSchemaAPI_1E30BB4E7C3058D0-001/tempDir-001/node2/lib to classpath: /home/jenkins/workspace/Lucene-Solr-master-Linux/solr/build/solr-core/test/J0/temp/solr.schema.TestManagedSchemaAPI_1E30BB4E7C3058D0-001/tempDir-001/node2/lib
   [junit4]   2> 2081947 INFO  (jetty-launcher-2654-thread-1) [    ] o.a.s.h.c.HttpShardHandlerFactory created with socketTimeout : 90000,urlScheme : ,connTimeout : 15000,maxConnectionsPerHost : 20,maxConnections : 10000,corePoolSize : 0,maximumPoolSize : 2147483647,maxThreadIdleTime : 5,sizeOfQueue : -1,fairnessPolicy : false,
   [junit4]   2> 2081947 INFO  (jetty-launcher-2654-thread-2) [    ] o.a.s.h.c.HttpShardHandlerFactory created with socketTimeout : 90000,urlScheme : ,connTimeout : 15000,maxConnectionsPerHost : 20,maxConnections : 10000,corePoolSize : 0,maximumPoolSize : 2147483647,maxThreadIdleTime : 5,sizeOfQueue : -1,fairnessPolicy : false,
   [junit4]   2> 2081948 INFO  (jetty-launcher-2654-thread-1) [    ] o.a.s.u.UpdateShardHandler Creating UpdateShardHandler HTTP client with params: 
   [junit4]   2> 2081948 INFO  (jetty-launcher-2654-thread-2) [    ] o.a.s.u.UpdateShardHandler Creating UpdateShardHandler HTTP client with params: 
   [junit4]   2> 2081948 INFO  (jetty-launcher-2654-thread-1) [    ] o.a.s.l.LogWatcher SLF4J impl is org.slf4j.impl.Log4jLoggerFactory
   [junit4]   2> 2081948 INFO  (jetty-launcher-2654-thread-2) [    ] o.a.s.l.LogWatcher SLF4J impl is org.slf4j.impl.Log4jLoggerFactory
   [junit4]   2> 2081948 INFO  (jetty-launcher-2654-thread-1) [    ] o.a.s.l.LogWatcher Registering Log Listener [Log4j (org.slf4j.impl.Log4jLoggerFactory)]
   [junit4]   2> 2081948 INFO  (jetty-launcher-2654-thread-2) [    ] o.a.s.l.LogWatcher Registering Log Listener [Log4j (org.slf4j.impl.Log4jLoggerFactory)]
   [junit4]   2> 2081949 INFO  (jetty-launcher-2654-thread-1) [    ] o.a.s.c.ZkContainer Zookeeper client=127.0.0.1:32836/solr
   [junit4]   2> 2081949 INFO  (jetty-launcher-2654-thread-2) [    ] o.a.s.c.ZkContainer Zookeeper client=127.0.0.1:32836/solr
   [junit4]   2> 2081949 INFO  (jetty-launcher-2654-thread-1) [    ] o.a.s.c.ZkController zkHost includes chroot
   [junit4]   2> 2081949 INFO  (jetty-launcher-2654-thread-2) [    ] o.a.s.c.ZkController zkHost includes chroot
   [junit4]   2> 2081949 INFO  (jetty-launcher-2654-thread-1) [    ] o.a.s.c.c.SolrZkClient Using default ZkCredentialsProvider
   [junit4]   2> 2081949 INFO  (jetty-launcher-2654-thread-2) [    ] o.a.s.c.c.SolrZkClient Using default ZkCredentialsProvider
   [junit4]   2> 2081949 INFO  (jetty-launcher-2654-thread-1) [    ] o.a.s.c.c.ConnectionManager Waiting for client to connect to ZooKeeper
   [junit4]   2> 2081949 INFO  (jetty-launcher-2654-thread-2) [    ] o.a.s.c.c.ConnectionManager Waiting for client to connect to ZooKeeper
   [junit4]   2> 2081949 INFO  (zkCallback-2662-thread-1) [    ] o.a.s.c.c.ConnectionManager Watcher org.apache.solr.common.cloud.ConnectionManager@73e2a26 name:ZooKeeperConnection Watcher:127.0.0.1:32836 got event WatchedEvent state:SyncConnected type:None path:null path:null type:None
   [junit4]   2> 2081950 INFO  (jetty-launcher-2654-thread-1) [    ] o.a.s.c.c.ConnectionManager Client is connected to ZooKeeper
   [junit4]   2> 2081950 INFO  (zkCallback-2663-thread-1) [    ] o.a.s.c.c.ConnectionManager Watcher org.apache.solr.common.cloud.ConnectionManager@162af4f3 name:ZooKeeperConnection Watcher:127.0.0.1:32836 got event WatchedEvent state:SyncConnected type:None path:null path:null type:None
   [junit4]   2> 2081950 INFO  (jetty-launcher-2654-thread-1) [    ] o.a.s.c.c.SolrZkClient Using default ZkACLProvider
   [junit4]   2> 2081950 INFO  (jetty-launcher-2654-thread-2) [    ] o.a.s.c.c.ConnectionManager Client is connected to ZooKeeper
   [junit4]   2> 2081950 INFO  (jetty-launcher-2654-thread-2) [    ] o.a.s.c.c.SolrZkClient Using default ZkACLProvider
   [junit4]   2> 2081950 INFO  (jetty-launcher-2654-thread-1) [    ] o.a.s.c.ZkController Added new OnReconnect listener org.apache.solr.cloud.ZkController$$Lambda$87/388558164@7d87fabc
   [junit4]   2> 2081950 INFO  (jetty-launcher-2654-thread-1) [    ] o.a.s.c.c.ConnectionManager Waiting for client to connect to ZooKeeper
   [junit4]   2> 2081950 INFO  (jetty-launcher-2654-thread-2) [    ] o.a.s.c.ZkController Added new OnReconnect listener org.apache.solr.cloud.ZkController$$Lambda$87/388558164@6fc84a67
   [junit4]   2> 2081951 INFO  (jetty-launcher-2654-thread-2) [    ] o.a.s.c.c.ConnectionManager Waiting for client to connect to ZooKeeper
   [junit4]   2> 2081951 INFO  (zkCallback-2664-thread-1) [    ] o.a.s.c.c.ConnectionManager Watcher org.apache.solr.common.cloud.ConnectionManager@2d26b6f5 name:ZooKeeperConnection Watcher:127.0.0.1:32836/solr got event WatchedEvent state:SyncConnected type:None path:null path:null type:None
   [junit4]   2> 2081951 INFO  (jetty-launcher-2654-thread-1) [    ] o.a.s.c.c.ConnectionManager Client is connected to ZooKeeper
   [junit4]   2> 2081951 INFO  (zkCallback-2665-thread-1) [    ] o.a.s.c.c.ConnectionManager Watcher org.apache.solr.common.cloud.ConnectionManager@2d329309 name:ZooKeeperConnection Watcher:127.0.0.1:32836/solr got event WatchedEvent state:SyncConnected type:None path:null path:null type:None
   [junit4]   2> 2081951 INFO  (jetty-launcher-2654-thread-2) [    ] o.a.s.c.c.ConnectionManager Client is connected to ZooKeeper
   [junit4]   2> 2081951 INFO  (jetty-launcher-2654-thread-1) [    ] o.a.s.c.c.SolrZkClient makePath: /overseer/queue
   [junit4]   2> 2081951 INFO  (jetty-launcher-2654-thread-2) [    ] o.a.s.c.c.SolrZkClient makePath: /overseer/queue
   [junit4]   2> 2081952 INFO  (jetty-launcher-2654-thread-1) [    ] o.a.s.c.c.SolrZkClient makePath: /overseer/collection-queue-work
   [junit4]   2> 2081952 INFO  (jetty-launcher-2654-thread-2) [    ] o.a.s.c.c.SolrZkClient makePath: /overseer/collection-queue-work
   [junit4]   2> 2081953 INFO  (jetty-launcher-2654-thread-1) [    ] o.a.s.c.c.SolrZkClient makePath: /overseer/collection-map-running
   [junit4]   2> 2081953 INFO  (jetty-launcher-2654-thread-2) [    ] o.a.s.c.c.SolrZkClient makePath: /overseer/collection-map-running
   [junit4]   2> 2081953 INFO  (jetty-launcher-2654-thread-2) [    ] o.a.s.c.c.SolrZkClient makePath: /overseer/collection-map-completed
   [junit4]   2> 2081953 INFO  (jetty-launcher-2654-thread-1) [    ] o.a.s.c.c.SolrZkClient makePath: /overseer/collection-map-completed
   [junit4]   2> 2081954 INFO  (jetty-launcher-2654-thread-2) [    ] o.a.s.c.c.SolrZkClient makePath: /overseer/collection-map-failure
   [junit4]   2> 2081954 INFO  (jetty-launcher-2654-thread-1) [    ] o.a.s.c.c.SolrZkClient makePath: /overseer/collection-map-failure
   [junit4]   2> 2081954 INFO  (jetty-launcher-2654-thread-2) [    ] o.a.s.c.c.SolrZkClient makePath: /live_nodes
   [junit4]   2> 2081954 INFO  (jetty-launcher-2654-thread-1) [    ] o.a.s.c.c.SolrZkClient makePath: /live_nodes
   [junit4]   2> 2081954 INFO  (jetty-launcher-2654-thread-1) [    ] o.a.s.c.c.SolrZkClient makePath: /collections
   [junit4]   2> 2081955 INFO  (jetty-launcher-2654-thread-2) [    ] o.a.s.c.c.SolrZkClient makePath: /collections
   [junit4]   2> 2081955 INFO  (jetty-launcher-2654-thread-1) [    ] o.a.s.c.c.SolrZkClient makePath: /aliases.json
   [junit4]   2> 2081955 INFO  (jetty-launcher-2654-thread-2) [    ] o.a.s.c.c.SolrZkClient makePath: /aliases.json
   [junit4]   2> 2081956 INFO  (jetty-launcher-2654-thread-1) [    ] o.a.s.c.c.SolrZkClient makePath: /clusterstate.json
   [junit4]   2> 2081956 INFO  (jetty-launcher-2654-thread-2) [    ] o.a.s.c.c.SolrZkClient makePath: /clusterstate.json
   [junit4]   2> 2081957 INFO  (jetty-launcher-2654-thread-2) [    ] o.a.s.c.c.SolrZkClient makePath: /security.json
   [junit4]   2> 2081957 INFO  (jetty-launcher-2654-thread-1) [    ] o.a.s.c.c.SolrZkClient makePath: /security.json
   [junit4]   2> 2081957 INFO  (jetty-launcher-2654-thread-2) [    ] o.a.s.c.c.ZkStateReader Updating cluster state from ZooKeeper... 
   [junit4]   2> 2081957 INFO  (jetty-launcher-2654-thread-1) [    ] o.a.s.c.c.ZkStateReader Updating cluster state from ZooKeeper... 
   [junit4]   2> 2081957 INFO  (jetty-launcher-2654-thread-2) [    ] o.a.s.c.c.ZkStateReader Updated live nodes from ZooKeeper... (0) -> (0)
   [junit4]   2> 2081957 INFO  (jetty-launcher-2654-thread-1) [    ] o.a.s.c.c.ZkStateReader Updated live nodes from ZooKeeper... (0) -> (0)
   [junit4]   2> 2081958 INFO  (jetty-launcher-2654-thread-2) [    ] o.a.s.c.c.SolrZkClient makePath: /overseer_elect
   [junit4]   2> 2081958 INFO  (jetty-launcher-2654-thread-1) [    ] o.a.s.c.c.SolrZkClient makePath: /overseer_elect
   [junit4]   2> 2081958 INFO  (jetty-launcher-2654-thread-1) [    ] o.a.s.c.c.SolrZkClient makePath: /overseer_elect/election
   [junit4]   2> 2081958 INFO  (jetty-launcher-2654-thread-2) [    ] o.a.s.c.c.SolrZkClient makePath: /overseer_elect/election
   [junit4]   2> 2081958 INFO  (jetty-launcher-2654-thread-1) [    ] o.a.s.c.Overseer Overseer (id=null) closing
   [junit4]   2> 2081958 INFO  (jetty-launcher-2654-thread-2) [    ] o.a.s.c.Overseer Overseer (id=null) closing
   [junit4]   2> 2081959 INFO  (jetty-launcher-2654-thread-1) [    ] o.a.s.c.LeaderElector Joined leadership election with path: /overseer_elect/election/95891485279453189-127.0.0.1:42915_solr-n_0000000000
   [junit4]   2> 2081959 INFO  (jetty-launcher-2654-thread-2) [    ] o.a.s.c.LeaderElector Joined leadership election with path: /overseer_elect/election/95891485279453190-127.0.0.1:44554_solr-n_0000000001
   [junit4]   2> 2081959 INFO  (jetty-launcher-2654-thread-1) [    ] o.a.s.c.OverseerElectionContext I am going to be the leader 127.0.0.1:42915_solr
   [junit4]   2> 2081959 INFO  (jetty-launcher-2654-thread-1) [    ] o.a.s.c.c.SolrZkClient makePath: /overseer_elect/leader
   [junit4]   2> 2081959 INFO  (jetty-launcher-2654-thread-2) [    ] o.a.s.c.LeaderElector Watching path /overseer_elect/election/95891485279453189-127.0.0.1:42915_solr-n_0000000000 to know if I could be the leader
   [junit4]   2> 2081959 INFO  (jetty-launcher-2654-thread-2) [    ] o.a.s.c.ZkController Register node as live in ZooKeeper:/live_nodes/127.0.0.1:44554_solr
   [junit4]   2> 2081959 INFO  (jetty-launcher-2654-thread-2) [    ] o.a.s.c.c.SolrZkClient makePath: /live_nodes/127.0.0.1:44554_solr
   [junit4]   2> 2081959 INFO  (jetty-launcher-2654-thread-1) [    ] o.a.s.c.Overseer Overseer (id=95891485279453189-127.0.0.1:42915_solr-n_0000000000) starting
   [junit4]   2> 2081960 INFO  (zkCallback-2664-thread-1) [    ] o.a.s.c.c.ZkStateReader A live node change: [WatchedEvent state:SyncConnected type:NodeChildrenChanged path:/live_nodes], has occurred - updating... (live nodes size: [0])
   [junit4]   2> 2081960 INFO  (zkCallback-2665-thread-1) [    ] o.a.s.c.c.ZkStateReader A live node change: [WatchedEvent state:SyncConnected type:NodeChildrenChanged path:/live_nodes], has occurred - updating... (live nodes size: [0])
   [junit4]   2> 2081960 INFO  (zkCallback-2664-thread-1) [    ] o.a.s.c.c.ZkStateReader Updated live nodes from ZooKeeper... (0) -> (1)
   [junit4]   2> 2081960 INFO  (zkCallback-2665-thread-1) [    ] o.a.s.c.c.ZkStateReader Updated live nodes from ZooKeeper... (0) -> (1)
   [junit4]   2> 2081960 INFO  (jetty-launcher-2654-thread-1) [    ] o.a.s.c.c.SolrZkClient makePath: /overseer/queue-work
   [junit4]   2> 2081961 INFO  (jetty-launcher-2654-thread-1) [    ] o.a.s.c.OverseerAutoReplicaFailoverThread Starting OverseerAutoReplicaFailoverThread autoReplicaFailoverWorkLoopDelay=10000 autoReplicaFailoverWaitAfterExpiration=30000 autoReplicaFailoverBadNodeExpiration=60000
   [junit4]   2> 2081962 INFO  (OverseerCollectionConfigSetProcessor-95891485279453189-127.0.0.1:42915_solr-n_0000000000) [    ] o.a.s.c.OverseerTaskProcessor Process current queue of overseer operations
   [junit4]   2> 2081962 INFO  (OverseerStateUpdate-95891485279453189-127.0.0.1:42915_solr-n_0000000000) [    ] o.a.s.c.Overseer Starting to work on the main queue
   [junit4]   2> 2081962 INFO  (jetty-launcher-2654-thread-1) [    ] o.a.s.c.ZkController Publish node=127.0.0.1:42915_solr as DOWN
   [junit4]   2> 2081962 INFO  (OverseerStateUpdate-95891485279453189-127.0.0.1:42915_solr-n_0000000000) [    ] o.a.s.c.c.ZkStateReader Updated live nodes from ZooKeeper... (1) -> (1)
   [junit4]   2> 2081963 INFO  (OverseerStateUpdate-95891485279453189-127.0.0.1:42915_solr-n_0000000000) [    ] o.a.s.c.Overseer processMessage: queueSize: 1, message = {
   [junit4]   2>   "operation":"downnode",
   [junit4]   2>   "node_name":"127.0.0.1:42915_solr"} current state version: 0
   [junit4]   2> 2081963 INFO  (OverseerStateUpdate-95891485279453189-127.0.0.1:42915_solr-n_0000000000) [    ] o.a.s.c.o.NodeMutator DownNode state invoked for node: 127.0.0.1:42915_solr
   [junit4]   2> 2081966 INFO  (jetty-launcher-2654-thread-2) [    ] o.a.s.c.CoreContainer Security conf doesn't exist. Skipping setup for authorization module.
   [junit4]   2> 2081966 INFO  (jetty-launcher-2654-thread-2) [    ] o.a.s.c.CoreContainer No authentication plugin used.
   [junit4]   2> 2081967 INFO  (jetty-launcher-2654-thread-2) [    ] o.a.s.c.CorePropertiesLocator Looking for core definitions underneath /home/jenkins/workspace/Lucene-Solr-master-Linux/solr/build/solr-core/test/J0/temp/solr.schema.TestManagedSchemaAPI_1E30BB4E7C3058D0-001/tempDir-001/node2/.
   [junit4]   2> 2081967 INFO  (jetty-launcher-2654-thread-2) [    ] o.a.s.c.CorePropertiesLocator Found 0 core definitions
   [junit4]   2> 2081968 INFO  (jetty-launcher-2654-thread-2) [    ] o.a.s.s.SolrDispatchFilter user.dir=/home/jenkins/workspace/Lucene-Solr-master-Linux/solr/build/solr-core/test/J0
   [junit4]   2> 2081968 INFO  (jetty-launcher-2654-thread-2) [    ] o.a.s.s.SolrDispatchFilter SolrDispatchFilter.init() done
   [junit4]   2> 2082962 INFO  (jetty-launcher-2654-thread-1) [    ] o.a.s.c.ZkController Register node as live in ZooKeeper:/live_nodes/127.0.0.1:42915_solr
   [junit4]   2> 2082963 INFO  (jetty-launcher-2654-thread-1) [    ] o.a.s.c.c.SolrZkClient makePath: /live_nodes/127.0.0.1:42915_solr
   [junit4]   2> 2082964 INFO  (zkCallback-2665-thread-1) [    ] o.a.s.c.c.ZkStateReader A live node change: [WatchedEvent state:SyncConnected type:NodeChildrenChanged path:/live_nodes], has occurred - updating... (live nodes size: [1])
   [junit4]   2> 2082964 INFO  (zkCallback-2664-thread-1) [    ] o.a.s.c.c.ZkStateReader A live node change: [WatchedEvent state:SyncConnected type:NodeChildrenChanged path:/live_nodes], has occurred - updating... (live nodes size: [1])
   [junit4]   2> 2082964 INFO  (zkCallback-2665-thread-1) [    ] o.a.s.c.c.ZkStateReader Updated live nodes from ZooKeeper... (1) -> (2)
   [junit4]   2> 2082964 INFO  (zkCallback-2664-thread-1) [    ] o.a.s.c.c.ZkStateReader Updated live nodes from ZooKeeper... (1) -> (2)
   [junit4]   2> 2082972 INFO  (jetty-launcher-2654-thread-1) [    ] o.a.s.c.CoreContainer Security conf doesn't exist. Skipping setup for authorization module.
   [junit4]   2> 2082972 INFO  (jetty-launcher-2654-thread-1) [    ] o.a.s.c.CoreContainer No authentication plugin used.
   [junit4]   2> 2082972 INFO  (jetty-launcher-2654-thread-1) [    ] o.a.s.c.CorePropertiesLocator Looking for core definitions underneath /home/jenkins/workspace/Lucene-Solr-master-Linux/solr/build/solr-core/test/J0/temp/solr.schema.TestManagedSchemaAPI_1E30BB4E7C3058D0-001/tempDir-001/node1/.
   [junit4]   2> 2082973 INFO  (jetty-launcher-2654-thread-1) [    ] o.a.s.c.CorePropertiesLocator Found 0 core definitions
   [junit4]   2> 2082973 INFO  (jetty-launcher-2654-thread-1) [    ] o.a.s.s.SolrDispatchFilter user.dir=/home/jenkins/workspace/Lucene-Solr-master-Linux/solr/build/solr-core/test/J0
   [junit4]   2> 2082973 INFO  (jetty-launcher-2654-thread-1) [    ] o.a.s.s.SolrDispatchFilter SolrDispatchFilter.init() done
   [junit4]   2> 2082973 INFO  (SUITE-TestManagedSchemaAPI-seed#[1E30BB4E7C3058D0]-worker) [    ] o.a.s.c.c.SolrZkClient Using default ZkCredentialsProvider
   [junit4]   2> 2082973 INFO  (SUITE-TestManagedSchemaAPI-seed#[1E30BB4E7C3058D0]-worker) [    ] o.a.s.c.c.ConnectionManager Waiting for client to connect to ZooKeeper
   [junit4]   2> 2082974 INFO  (zkCallback-2668-thread-1) [    ] o.a.s.c.c.ConnectionManager Watcher org.apache.solr.common.cloud.ConnectionManager@31b3ac98 name:ZooKeeperConnection Watcher:127.0.0.1:32836 got event WatchedEvent state:SyncConnected type:None path:null path:null type:None
   [junit4]   2> 2082974 INFO  (SUITE-TestManagedSchemaAPI-seed#[1E30BB4E7C3058D0]-worker) [    ] o.a.s.c.c.ConnectionManager Client is connected to ZooKeeper
   [junit4]   2> 2082974 INFO  (SUITE-TestManagedSchemaAPI-seed#[1E30BB4E7C3058D0]-worker) [    ] o.a.s.c.c.SolrZkClient Using default ZkACLProvider
   [junit4]   2> 2082975 INFO  (SUITE-TestManagedSchemaAPI-seed#[1E30BB4E7C3058D0]-worker) [    ] o.a.s.c.s.i.CloudSolrClient Final constructed zkHost string: 127.0.0.1:32836/solr
   [junit4]   2> 2082976 INFO  (SUITE-TestManagedSchemaAPI-seed#[1E30BB4E7C3058D0]-worker) [    ] o.a.s.c.c.SolrZkClient Using default ZkCredentialsProvider
   [junit4]   2> 2082976 INFO  (SUITE-TestManagedSchemaAPI-seed#[1E30BB4E7C3058D0]-worker) [    ] o.a.s.c.c.ConnectionManager Waiting for client to connect to ZooKeeper
   [junit4]   2> 2082977 INFO  (zkCallback-2671-thread-1) [    ] o.a.s.c.c.ConnectionManager Watcher org.apache.solr.common.cloud.ConnectionManager@3fe4e564 name:ZooKeeperConnection Watcher:127.0.0.1:32836/solr got event WatchedEvent state:SyncConnected type:None path:null path:null type:None
   [junit4]   2> 2082977 INFO  (SUITE-TestManagedSchemaAPI-seed#[1E30BB4E7C3058D0]-worker) [    ] o.a.s.c.c.ConnectionManager Client is connected to ZooKeeper
   [junit4]   2> 2082977 INFO  (SUITE-TestManagedSchemaAPI-seed#[1E30BB4E7C3058D0]-worker) [    ] o.a.s.c.c.SolrZkClient Using default ZkACLProvider
   [junit4]   2> 2082977 INFO  (SUITE-TestManagedSchemaAPI-seed#[1E30BB4E7C3058D0]-worker) [    ] o.a.s.c.c.ZkStateReader Updating cluster state from ZooKeeper... 
   [junit4]   2> 2082978 INFO  (SUITE-TestManagedSchemaAPI-seed#[1E30BB4E7C3058D0]-worker) [    ] o.a.s.c.c.ZkStateReader Updated live nodes from ZooKeeper... (0) -> (2)
   [junit4]   2> 2082978 INFO  (SUITE-TestManagedSchemaAPI-seed#[1E30BB4E7C3058D0]-worker) [    ] o.a.s.c.c.SolrZkClient makePath: /configs/conf1/solrconfig.xml
   [junit4]   2> 2082980 INFO  (SUITE-TestManagedSchemaAPI-seed#[1E30BB4E7C3058D0]-worker) [    ] o.a.s.c.c.SolrZkClient makePath: /configs/conf1/managed-schema
   [junit4]   2> 2082997 INFO  (TEST-TestManagedSchemaAPI.test-seed#[1E30BB4E7C3058D0]) [    ] o.a.s.SolrTestCaseJ4 ###Starting test
   [junit4]   2> 2083001 INFO  (qtp76370326-16592) [    ] o.a.s.h.a.CollectionsHandler Invoked Collection Action :create with params replicationFactor=2&collection.configName=conf1&name=testschemaapi&action=CREATE&numShards=1&wt=javabin&version=2 and sendToOCPQueue=true
   [junit4]   2> 2083006 INFO  (OverseerCollectionConfigSetProcessor-95891485279453189-127.0.0.1:42915_solr-n_0000000000) [    ] o.a.s.c.OverseerTaskProcessor Overseer Collection Message Handler: Get the message id:/overseer/collection-queue-work/qn-0000000000 message:{
   [junit4]   2>   "name":"testschemaapi",
   [junit4]   2>   "fromApi":"true",
   [junit4]   2>   "replicationFactor":"2",
   [junit4]   2>   "collection.configName":"conf1",
   [junit4]   2>   "numShards":"1",
   [junit4]   2>   "stateFormat":"2",
   [junit4]   2>   "operation":"create"}
   [junit4]   2> 2083006 INFO  (OverseerThreadFactory-7964-thread-1) [    ] o.a.s.c.OverseerCollectionMessageHandler OverseerCollectionMessageHandler.processMessage : create , {
   [junit4]   2>   "name":"testschemaapi",
   [junit4]   2>   "fromApi":"true",
   [junit4]   2>   "replicationFactor":"2",
   [junit4]   2>   "collection.configName":"conf1",
   [junit4]   2>   "numShards":"1",
   [junit4]   2>   "stateFormat":"2",
   [junit4]   2>   "operation":"create"}
   [junit4]   2> 2083007 INFO  (OverseerThreadFactory-7964-thread-1) [    ] o.a.s.c.OverseerCollectionMessageHandler Create collection testschemaapi
   [junit4]   2> 2083007 INFO  (OverseerThreadFactory-7964-thread-1) [    ] o.a.s.c.OverseerCollectionMessageHandler creating collections conf node /collections/testschemaapi 
   [junit4]   2> 2083007 INFO  (OverseerThreadFactory-7964-thread-1) [    ] o.a.s.c.c.SolrZkClient makePath: /collections/testschemaapi
   [junit4]   2> 2083020 INFO  (zkCallback-2664-thread-1) [    ] o.a.s.c.c.ZkStateReader A collections change: [WatchedEvent state:SyncConnected type:NodeChildrenChanged path:/collections], has occurred - updating...
   [junit4]   2> 2083020 INFO  (zkCallback-2665-thread-1) [    ] o.a.s.c.c.ZkStateReader A collections change: [WatchedEvent state:SyncConnected type:NodeChildrenChanged path:/collections], has occurred - updating...
   [junit4]   2> 2083020 INFO  (zkCallback-2671-thread-1) [    ] o.a.s.c.c.ZkStateReader A collections change: [WatchedEvent state:SyncConnected type:NodeChildrenChanged path:/collections], has occurred - updating...
   [junit4]   2> 2083021 INFO  (OverseerStateUpdate-95891485279453189-127.0.0.1:42915_solr-n_0000000000) [    ] o.a.s.c.Overseer processMessage: queueSize: 1, message = {
   [junit4]   2>   "name":"testschemaapi",
   [junit4]   2>   "fromApi":"true",
   [junit4]   2>   "replicationFactor":"2",
   [junit4]   2>   "collection.configName":"conf1",
   [junit4]   2>   "numShards":"1",
   [junit4]   2>   "stateFormat":"2",
   [junit4]   2>   "operation":"create"} current state version: 0
   [junit4]   2> 2083022 INFO  (OverseerStateUpdate-95891485279453189-127.0.0.1:42915_solr-n_0000000000) [    ] o.a.s.c.o.ClusterStateMutator building a new cName: testschemaapi
   [junit4]   2> 2083022 INFO  (OverseerStateUpdate-95891485279453189-127.0.0.1:42915_solr-n_0000000000) [    ] o.a.s.c.o.ZkStateWriter going to create_collection /collections/testschemaapi/state.json
   [junit4]   2> 2083121 INFO  (OverseerThreadFactory-7964-thread-1) [    ] o.a.s.c.OverseerCollectionMessageHandler Creating SolrCores for new collection testschemaapi, shardNames [shard1] , replicationFactor : 2
   [junit4]   2> 2083122 INFO  (OverseerThreadFactory-7964-thread-1) [    ] o.a.s.c.OverseerCollectionMessageHandler Creating core testschemaapi_shard1_replica1 as part of shard shard1 of collection testschemaapi on 127.0.0.1:44554_solr
   [junit4]   2> 2083122 INFO  (OverseerThreadFactory-7964-thread-1) [    ] o.a.s.c.OverseerCollectionMessageHandler Creating core testschemaapi_shard1_replica2 as part of shard shard1 of collection testschemaapi on 127.0.0.1:42915_solr
   [junit4]   2> 2083123 INFO  (qtp76370326-16594) [    ] o.a.s.h.a.CoreAdminOperation core create command qt=/admin/cores&collection.configName=conf1&name=testschemaapi_shard1_replica1&action=CREATE&numShards=1&collection=testschemaapi&shard=shard1&wt=javabin&version=2
   [junit4]   2> 2083123 INFO  (qtp1342801254-16583) [    ] o.a.s.h.a.CoreAdminOperation core create command qt=/admin/cores&collection.configName=conf1&name=testschemaapi_shard1_replica2&action=CREATE&numShards=1&collection=testschemaapi&shard=shard1&wt=javabin&version=2
   [junit4]   2> 2083123 INFO  (qtp76370326-16594) [    ] o.a.s.c.CoreDescriptor Created CoreDescriptor: {name=testschemaapi_shard1_replica1, collection.configName=conf1, config=solrconfig.xml, transient=false, schema=schema.xml, loadOnStartup=true, configSetProperties=configsetprops.json, collection=testschemaapi, numShards=1, dataDir=data/, shard=shard1}
   [junit4]   2> 2083123 INFO  (qtp1342801254-16583) [    ] o.a.s.c.CoreDescriptor Created CoreDescriptor: {name=testschemaapi_shard1_replica2, collection.configName=conf1, config=solrconfig.xml, transient=false, schema=schema.xml, loadOnStartup=true, configSetProperties=configsetprops.json, collection=testschemaapi, numShards=1, dataDir=data/, shard=shard1}
   [junit4]   2> 2083124 INFO  (qtp76370326-16594) [    ] o.a.s.c.ZkController publishing state=down
   [junit4]   2> 2083124 INFO  (qtp76370326-16594) [    ] o.a.s.c.ZkController Registering watch for collection testschemaapi
   [junit4]   2> 2083124 INFO  (qtp1342801254-16583) [    ] o.a.s.c.ZkController publishing state=down
   [junit4]   2> 2083124 INFO  (OverseerStateUpdate-95891485279453189-127.0.0.1:42915_solr-n_0000000000) [    ] o.a.s.c.Overseer processMessage: queueSize: 1, message = {
   [junit4]   2>   "core":"testschemaapi_shard1_replica1",
   [junit4]   2>   "roles":null,
   [junit4]   2>   "base_url":"http://127.0.0.1:44554/solr",
   [junit4]   2>   "node_name":"127.0.0.1:44554_solr",
   [junit4]   2>   "numShards":"1",
   [junit4]   2>   "state":"down",
   [junit4]   2>   "shard":"shard1",
   [junit4]   2>   "collection":"testschemaapi",
   [junit4]   2>   "operation":"state"} current state version: 0
   [junit4]   2> 2083124 INFO  (qtp76370326-16594) [    ] o.a.s.c.c.ZkStateReader Add data for [testschemaapi] ver [0]
   [junit4]   2> 2083124 INFO  (OverseerStateUpdate-95891485279453189-127.0.0.1:42915_solr-n_0000000000) [    ] o.a.s.c.o.ReplicaMutator Update state numShards=1 message={
   [junit4]   2>   "core":"testschemaapi_shard1_replica1",
   [junit4]   2>   "roles":null,
   [junit4]   2>   "base_url":"http://127.0.0.1:44554/solr",
   [junit4]   2>   "node_name":"127.0.0.1:44554_solr",
   [junit4]   2>   "numShards":"1",
   [junit4]   2>   "state":"down",
   [junit4]   2>   "shard":"shard1",
   [junit4]   2>   "collection":"testschemaapi",
   [junit4]   2>   "operation":"state"}
   [junit4]   2> 2083124 INFO  (qtp76370326-16594) [    ] o.a.s.c.ZkController look for our core node name
   [junit4]   2> 2083124 INFO  (qtp1342801254-16583) [    ] o.a.s.c.ZkController Registering watch for collection testschemaapi
   [junit4]   2> 2083125 INFO  (qtp1342801254-16583) [    ] o.a.s.c.c.ZkStateReader Add data for [testschemaapi] ver [0]
   [junit4]   2> 2083125 INFO  (qtp1342801254-16583) [    ] o.a.s.c.ZkController look for our core node name
   [junit4]   2> 2083125 INFO  (OverseerStateUpdate-95891485279453189-127.0.0.1:42915_solr-n_0000000000) [    ] o.a.s.c.Overseer processMessage: queueSize: 1, message = {
   [junit4]   2>   "core":"testschemaapi_shard1_replica2",
   [junit4]   2>   "roles":null,
   [junit4]   2>   "base_url":"http://127.0.0.1:42915/solr",
   [junit4]   2>   "node_name":"127.0.0.1:42915_solr",
   [junit4]   2>   "numShards":"1",
   [junit4]   2>   "state":"down",
   [junit4]   2>   "shard":"shard1",
   [junit4]   2>   "collection":"testschemaapi",
   [junit4]   2>   "operation":"state"} current state version: 0
   [junit4]   2> 2083125 INFO  (OverseerStateUpdate-95891485279453189-127.0.0.1:42915_solr-n_0000000000) [    ] o.a.s.c.o.ReplicaMutator Update state numShards=1 message={
   [junit4]   2>   "core":"testschemaapi_shard1_replica2",
   [junit4]   2>   "roles":null,
   [junit4]   2>   "base_url":"http://127.0.0.1:42915/solr",
   [junit4]   2>   "node_name":"127.0.0.1:42915_solr",
   [junit4]   2>   "numShards":"1",
   [junit4]   2>   "state":"down",
   [junit4]   2>   "shard":"shard1",
   [junit4]   2>   "collection":"testschemaapi",
   [junit4]   2>   "operation":"state"}
   [junit4]   2> 2083226 INFO  (OverseerStateUpdate-95891485279453189-127.0.0.1:42915_solr-n_0000000000) [    ] o.a.s.c.o.ZkStateWriter going to update_collection /collections/testschemaapi/state.json version: 0
   [junit4]   2> 2083227 INFO  (zkCallback-2665-thread-1) [    ] o.a.s.c.c.ZkStateReader A cluster state change: [WatchedEvent state:SyncConnected type:NodeDataChanged path:/collections/testschemaapi/state.json] for collection [testschemaapi] has occurred - updating... (live nodes size: [2])
   [junit4]   2> 2083227 INFO  (zkCallback-2664-thread-1) [    ] o.a.s.c.c.ZkStateReader A cluster state change: [WatchedEvent state:SyncConnected type:NodeDataChanged path:/collections/testschemaapi/state.json] for collection [testschemaapi] has occurred - updating... (live nodes size: [2])
   [junit4]   2> 2083227 INFO  (zkCallback-2665-thread-1) [    ] o.a.s.c.c.ZkStateReader Updating data for [testschemaapi] from [0] to [1]
   [junit4]   2> 2083228 INFO  (zkCallback-2664-thread-1) [    ] o.a.s.c.c.ZkStateReader Updating data for [testschemaapi] from [0] to [1]
   [junit4]   2> 2084125 INFO  (qtp76370326-16594) [    ] o.a.s.c.ZkController waiting to find shard id in clusterstate for testschemaapi_shard1_replica1
   [junit4]   2> 2084125 INFO  (qtp76370326-16594) [    ] o.a.s.c.ZkController Check for collection zkNode:testschemaapi
   [junit4]   2> 2084125 INFO  (qtp76370326-16594) [    ] o.a.s.c.ZkController Collection zkNode exists
   [junit4]   2> 2084125 INFO  (qtp76370326-16594) [    ] o.a.s.c.c.ZkStateReader Load collection config from: [/collections/testschemaapi]
   [junit4]   2> 2084125 INFO  (qtp1342801254-16583) [    ] o.a.s.c.ZkController waiting to find shard id in clusterstate for testschemaapi_shard1_replica2
   [junit4]   2> 2084125 INFO  (qtp1342801254-16583) [    ] o.a.s.c.ZkController Check for collection zkNode:testschemaapi
   [junit4]   2> 2084125 INFO  (qtp76370326-16594) [    ] o.a.s.c.c.ZkStateReader path=[/collections/testschemaapi] [configName]=[conf1] specified config exists in ZooKeeper
   [junit4]   2> 2084125 INFO  (qtp1342801254-16583) [    ] o.a.s.c.ZkController Collection zkNode exists
   [junit4]   2> 2084125 INFO  (qtp1342801254-16583) [    ] o.a.s.c.c.ZkStateReader Load collection config from: [/collections/testschemaapi]
   [junit4]   2> 2084125 INFO  (qtp76370326-16594) [    ] o.a.s.c.SolrResourceLoader new SolrResourceLoader for directory: '/home/jenkins/workspace/Lucene-Solr-master-Linux/solr/build/solr-core/test/J0/temp/solr.schema.TestManagedSchemaAPI_1E30BB4E7C3058D0-001/tempDir-001/node2/testschemaapi_shard1_replica1'
   [junit4]   2> 2084126 INFO  (qtp1342801254-16583) [    ] o.a.s.c.c.ZkStateReader path=[/collections/testschemaapi] [configName]=[conf1] specified config exists in ZooKeeper
   [junit4]   2> 2084126 INFO  (qtp76370326-16594) [    ] o.a.s.c.SolrResourceLoader JNDI not configured for solr (NoInitialContextEx)
   [junit4]   2> 2084126 INFO  (qtp1342801254-16583) [    ] o.a.s.c.SolrResourceLoader new SolrResourceLoader for directory: '/home/jenkins/workspace/Lucene-Solr-master-Linux/solr/build/solr-core/test/J0/temp/solr.schema.TestManagedSchemaAPI_1E30BB4E7C3058D0-001/tempDir-001/node1/testschemaapi_shard1_replica2'
   [junit4]   2> 2084126 INFO  (qtp76370326-16594) [    ] o.a.s.c.SolrResourceLoader solr home defaulted to 'solr/' (could not find system property or JNDI)
   [junit4]   2> 2084126 INFO  (qtp1342801254-16583) [    ] o.a.s.c.SolrResourceLoader JNDI not configured for solr (NoInitialContextEx)
   [junit4]   2> 2084126 INFO  (qtp1342801254-16583) [    ] o.a.s.c.SolrResourceLoader solr home defaulted to 'solr/' (could not find system property or JNDI)
   [junit4]   2> 2084126 INFO  (qtp76370326-16594) [    ] o.a.s.c.Config loaded config solrconfig.xml with version 0 
   [junit4]   2> 2084126 INFO  (qtp1342801254-16583) [    ] o.a.s.c.Config loaded config solrconfig.xml with version 0 
   [junit4]   2> 2084129 INFO  (qtp1342801254-16583) [    ] o.a.s.c.SolrConfig current version of requestparams : -1
   [junit4]   2> 2084129 INFO  (qtp76370326-16594) [    ] o.a.s.c.SolrConfig current version of requestparams : -1
   [junit4]   2> 2084133 INFO  (qtp76370326-16594) [    ] o.a.s.c.SolrConfig Using Lucene MatchVersion: 7.0.0
   [junit4]   2> 2084133 INFO  (qtp1342801254-16583) [    ] o.a.s.c.SolrConfig Using Lucene MatchVersion: 7.0.0
   [junit4]   2> 2084140 INFO  (qtp76370326-16594) [    ] o.a.s.c.SolrConfig Loaded SolrConfig: solrconfig.xml
   [junit4]   2> 2084140 INFO  (qtp1342801254-16583) [    ] o.a.s.c.SolrConfig Loaded SolrConfig: solrconfig.xml
   [junit4]   2> 2084142 INFO  (qtp76370326-16594) [    ] o.a.s.s.IndexSchema [testschemaapi_shard1_replica1] Schema name=minimal
   [junit4]   2> 2084142 INFO  (qtp1342801254-16583) [    ] o.a.s.s.IndexSchema [testschemaapi_shard1_replica2] Schema name=minimal
   [junit4]   2> 2084150 INFO  (qtp76370326-16594) [    ] o.a.s.s.IndexSchema unique key field: id
   [junit4]   2> 2084150 INFO  (qtp1342801254-16583) [    ] o.a.s.s.IndexSchema unique key field: id
   [junit4]   2> 2084150 INFO  (qtp76370326-16594) [    ] o.a.s.c.ConfigSetProperties Did not find ConfigSet properties, assuming default properties: Can't find resource 'configsetprops.json' in classpath or '/configs/conf1', cwd=/home/jenkins/workspace/Lucene-Solr-master-Linux/solr/build/solr-core/test/J0
   [junit4]   2> 2084150 INFO  (qtp1342801254-16583) [    ] o.a.s.c.ConfigSetProperties Did not find ConfigSet properties, assuming default properties: Can't find resource 'configsetprops.json' in classpath or '/configs/conf1', cwd=/home/jenkins/workspace/Lucene-Solr-master-Linux/solr/build/solr-core/test/J0
   [junit4]   2> 2084150 INFO  (qtp76370326-16594) [    ] o.a.s.c.CoreContainer Creating SolrCore 'testschemaapi_shard1_replica1' using configuration from collection testschemaapi
   [junit4]   2> 2084150 INFO  (qtp1342801254-16583) [    ] o.a.s.c.CoreContainer Creating SolrCore 'testschemaapi_shard1_replica2' using configuration from collection testschemaapi
   [junit4]   2> 2084151 INFO  (qtp76370326-16594) [    ] o.a.s.c.SolrCore org.apache.solr.core.MockDirectoryFactory
   [junit4]   2> 2084151 INFO  (qtp1342801254-16583) [    ] o.a.s.c.SolrCore org.apache.solr.core.MockDirectoryFactory
   [junit4]   2> 2084151 INFO  (qtp76370326-16594) [    ] o.a.s.c.SolrCore [[testschemaapi_shard1_replica1] ] Opening new SolrCore at [/home/jenkins/workspace/Lucene-Solr-master-Linux/solr/build/solr-core/test/J0/temp/solr.schema.TestManagedSchemaAPI_1E30BB4E7C3058D0-001/tempDir-001/node2/testschemaapi_shard1_replica1], dataDir=[/home/jenkins/workspace/Lucene-Solr-master-Linux/solr/build/solr-core/test/J0/temp/solr.schema.TestManagedSchemaAPI_1E30BB4E7C3058D0-001/tempDir-001/node2/./testschemaapi_shard1_replica1/data/]
   [junit4]   2> 2084151 INFO  (qtp1342801254-16583) [    ] o.a.s.c.SolrCore [[testschemaapi_shard1_replica2] ] Opening new SolrCore at [/home/jenkins/workspace/Lucene-Solr-master-Linux/solr/build/solr-core/test/J0/temp/solr.schema.TestManagedSchemaAPI_1E30BB4E7C3058D0-001/tempDir-001/node1/testschemaapi_shard1_replica2], dataDir=[/home/jenkins/workspace/Lucene-Solr-master-Linux/solr/build/solr-core/test/J0/temp/solr.schema.TestManagedSchemaAPI_1E30BB4E7C3058D0-001/tempDir-001/node1/./testschemaapi_shard1_replica2/data/]
   [junit4]   2> 2084151 INFO  (qtp76370326-16594) [    ] o.a.s.c.SolrCore JMX monitoring not detected for core: testschemaapi_shard1_replica1
   [junit4]   2> 2084151 INFO  (qtp1342801254-16583) [    ] o.a.s.c.SolrCore JMX monitoring not detected for core: testschemaapi_shard1_replica2
   [junit4]   2> 2084152 INFO  (qtp76370326-16594) [    ] o.a.s.c.CachingDirectoryFactory return new directory for /home/jenkins/workspace/Lucene-Solr-master-Linux/solr/build/solr-core/test/J0/temp/solr.schema.TestManagedSchemaAPI_1E30BB4E7C3058D0-001/tempDir-001/node2/./testschemaapi_shard1_replica1/data
   [junit4]   2> 2084152 INFO  (qtp76370326-16594) [    ] o.a.s.c.SolrCore New index directory detected: old=null new=/home/jenkins/workspace/Lucene-Solr-master-Linux/solr/build/solr-core/test/J0/temp/solr.schema.TestManagedSchemaAPI_1E30BB4E7C3058D0-001/tempDir-001/node2/./testschemaapi_shard1_replica1/data/index/
   [junit4]   2> 2084152 INFO  (qtp1342801254-16583) [    ] o.a.s.c.CachingDirectoryFactory return new directory for /home/jenkins/workspace/Lucene-Solr-master-Linux/solr/build/solr-core/test/J0/temp/solr.schema.TestManagedSchemaAPI_1E30BB4E7C3058D0-001/tempDir-001/node1/./testschemaapi_shard1_replica2/data
   [junit4]   2> 2084152 WARN  (qtp76370326-16594) [    ] o.a.s.c.SolrCore [testschemaapi_shard1_replica1] Solr index directory '/home/jenkins/workspace/Lucene-Solr-master-Linux/solr/build/solr-core/test/J0/temp/solr.schema.TestManagedSchemaAPI_1E30BB4E7C3058D0-001/tempDir-001/node2/./testschemaapi_shard1_replica1/data/index' doesn't exist. Creating new index...
   [junit4]   2> 2084152 INFO  (qtp1342801254-16583) [    ] o.a.s.c.SolrCore New index directory detected: old=null new=/home/jenkins/workspace/Lucene-Solr-master-Linux/solr/build/solr-core/test/J0/temp/solr.schema.TestManagedSchemaAPI_1E30BB4E7C3058D0-001/tempDir-001/node1/./testschemaapi_shard1_replica2/data/index/
   [junit4]   2> 2084152 WARN  (qtp1342801254-16583) [    ] o.a.s.c.SolrCore [testschemaapi_shard1_replica2] Solr index directory '/home/jenkins/workspace/Lucene-Solr-master-Linux/solr/build/solr-core/test/J0/temp/solr.schema.TestManagedSchemaAPI_1E30BB4E7C3058D0-001/tempDir-001/node1/./testschemaapi_shard1_replica2/data/index' doesn't exist. Creating new index...
   [junit4]   2> 2084152 INFO  (qtp76370326-16594) [    ] o.a.s.c.CachingDirectoryFactory return new directory for /home/jenkins/workspace/Lucene-Solr-master-Linux/solr/build/solr-core/test/J0/temp/solr.schema.TestManagedSchemaAPI_1E30BB4E7C3058D0-001/tempDir-001/node2/./testschemaapi_shard1_replica1/data/index
   [junit4]   2> 2084153 INFO  (qtp1342801254-16583) [    ] o.a.s.c.CachingDirectoryFactory return new directory for /home/jenkins/workspace/Lucene-Solr-master-Linux/solr/build/solr-core/test/J0/temp/solr.schema.TestManagedSchemaAPI_1E30BB4E7C3058D0-001/tempDir-001/node1/./testschemaapi_shard1_replica2/data/index
   [junit4]   2> 2084153 INFO  (qtp76370326-16594) [    ] o.a.s.c.SolrDeletionPolicy SolrDeletionPolicy.onCommit: commits: num=1
   [junit4]   2> 	commit{dir=MockDirectoryWrapper(RAMDirectory@4d9d007d lockFactory=org.apache.lucene.store.SingleInstanceLockFactory@62c91c9e),segFN=segments_1,generation=1}
   [junit4]   2> 2084153 INFO  (qtp76370326-16594) [    ] o.a.s.c.SolrDeletionPolicy newest commit generation = 1
   [junit4]   2> 2084153 INFO  (qtp1342801254-16583) [    ] o.a.s.c.SolrDeletionPolicy SolrDeletionPolicy.onCommit: commits: num=1
   [junit4]   2> 	commit{dir=MockDirectoryWrapper(RAMDirectory@2913c013 lockFactory=org.apache.lucene.store.SingleInstanceLockFactory@34504769),segFN=segments_1,generation=1}
   [junit4]   2> 2084153 INFO  (qtp1342801254-16583) [    ] o.a.s.c.SolrDeletionPolicy newest commit generation = 1
   [junit4]   2> 2084153 INFO  (OldIndexDirectoryCleanupThreadForCore-testschemaapi_shard1_replica1) [    ] o.a.s.c.SolrCore Looking for old index directories to cleanup for core testschemaapi_shard1_replica1 in /home/jenkins/workspace/Lucene-Solr-master-Linux/solr/build/solr-core/test/J0/temp/solr.schema.TestManagedSchemaAPI_1E30BB4E7C3058D0-001/tempDir-001/node2/./testschemaapi_shard1_replica1/data/
   [junit4]   2> 2084153 INFO  (OldIndexDirectoryCleanupThreadForCore-testschemaapi_shard1_replica2) [    ] o.a.s.c.SolrCore Looking for old index directories to cleanup for core testschemaapi_shard1_replica2 in /home/jenkins/workspace/Lucene-Solr-master-Linux/solr/build/solr-core/test/J0/temp/solr.schema.TestManagedSchemaAPI_1E30BB4E7C3058D0-001/tempDir-001/node1/./testschemaapi_shard1_replica2/data/
   [junit4]   2> 2084153 WARN  (OldIndexDirectoryCleanupThreadForCore-testschemaapi_shard1_replica1) [    ] o.a.s.c.DirectoryFactory /home/jenkins/workspace/Lucene-Solr-master-Linux/solr/build/solr-core/test/J0/temp/solr.schema.TestManagedSchemaAPI_1E30BB4E7C3058D0-001/tempDir-001/node2/./testschemaapi_shard1_replica1/data/ does not point to a valid data directory; skipping clean-up of old index directories.
   [junit4]   2> 2084153 WARN  (OldIndexDirectoryCleanupThreadForCore-testschemaapi_shard1_replica2) [    ] o.a.s.c.DirectoryFactory /home/jenkins/workspace/Lucene-Solr-master-Linux/solr/build/solr-core/test/J0/temp/solr.schema.TestManagedSchemaAPI_1E30BB4E7C3058D0-001/tempDir-001/node1/./testschemaapi_shard1_replica2/data/ does not point to a valid data directory; skipping clean-up of old index directories.
   [junit4]   2> 2084154 INFO  (qtp76370326-16594) [    ] o.a.s.c.SolrCore no updateRequestProcessorChain defined as default, creating implicit default
   [junit4]   2> 2084154 INFO  (qtp1342801254-16583) [    ] o.a.s.c.SolrCore no updateRequestProcessorChain defined as default, creating implicit default
   [junit4]   2> 2084155 INFO  (qtp76370326-16594) [    ] o.a.s.h.l.XMLLoader xsltCacheLifetimeSeconds=60
   [junit4]   2> 2084155 INFO  (qtp1342801254-16583) [    ] o.a.s.h.l.XMLLoader xsltCacheLifetimeSeconds=60
   [junit4]   2> 2084156 INFO  (qtp76370326-16594) [    ] o.a.s.h.l.XMLLoader xsltCacheLifetimeSeconds=60
   [junit4]   2> 2084156 INFO  (qtp1342801254-16583) [    ] o.a.s.h.l.XMLLoader xsltCacheLifetimeSeconds=60
   [junit4]   2> 2084156 INFO  (qtp76370326-16594) [    ] o.a.s.h.l.XMLLoader xsltCacheLifetimeSeconds=60
   [junit4]   2> 2084156 INFO  (qtp1342801254-16583) [    ] o.a.s.h.l.XMLLoader xsltCacheLifetimeSeconds=60
   [junit4]   2> 2084157 INFO  (qtp76370326-16594) [    ] o.a.s.h.l.XMLLoader xsltCacheLifetimeSeconds=60
   [junit4]   2> 2084157 INFO  (qtp1342801254-16583) [    ] o.a.s.h.l.XMLLoader xsltCacheLifetimeSeconds=60
   [junit4]   2> 2084157 INFO  (qtp76370326-16594) [    ] o.a.s.c.RequestHandlers Registered paths: /admin/mbeans,/update/csv,/sql,/update/json/docs,/admin/luke,/graph,/export,/select,/admin/segments,/get,/admin/system,/replication,/admin/properties,/config,/stream,/schema,/admin/plugins,/admin/logging,/update/json,/admin/ping,/admin/threads,/update,/admin/file
   [junit4]   2> 2084157 INFO  (qtp76370326-16594) [    ] o.a.s.c.SolrCore Using default statsCache cache: org.apache.solr.search.stats.LocalStatsCache
   [junit4]   2> 2084157 INFO  (qtp1342801254-16583) [    ] o.a.s.c.RequestHandlers Registered paths: /admin/mbeans,/update/csv,/sql,/update/json/docs,/admin/luke,/graph,/export,/select,/admin/segments,/get,/admin/system,/replication,/admin/properties,/config,/stream,/schema,/admin/plugins,/admin/logging,/update/json,/admin/ping,/admin/threads,/update,/admin/file
   [junit4]   2> 2084157 INFO  (qtp1342801254-16583) [    ] o.a.s.c.SolrCore Using default statsCache cache: org.apache.solr.search.stats.LocalStatsCache
   [junit4]   2> 2084157 INFO  (qtp76370326-16594) [    ] o.a.s.u.UpdateHandler Using UpdateLog implementation: org.apache.solr.update.UpdateLog
   [junit4]   2> 2084158 INFO  (qtp76370326-16594) [    ] o.a.s.u.UpdateLog Initializing UpdateLog: dataDir=null defaultSyncLevel=FLUSH numRecordsToKeep=100 maxNumLogsToKeep=10 numVersionBuckets=65536
   [junit4]   2> 2084158 INFO  (qtp1342801254-16583) [    ] o.a.s.u.UpdateHandler Using UpdateLog implementation: org.apache.solr.update.UpdateLog
   [junit4]   2> 2084158 INFO  (qtp1342801254-16583) [    ] o.a.s.u.UpdateLog Initializing UpdateLog: dataDir=null defaultSyncLevel=FLUSH numRecordsToKeep=100 maxNumLogsToKeep=10 numVersionBuckets=65536
   [junit4]   2> 2084158 INFO  (qtp76370326-16594) [    ] o.a.s.u.CommitTracker Hard AutoCommit: disabled
   [junit4]   2> 2084158 INFO  (qtp76370326-16594) [    ] o.a.s.u.CommitTracker Soft AutoCommit: disabled
   [junit4]   2> 2084158 INFO  (qtp76370326-16594) [    ] o.a.s.c.SolrDeletionPolicy SolrDeletionPolicy.onInit: commits: num=1
   [junit4]   2> 	commit{dir=MockDirectoryWrapper(RAMDirectory@4d9d007d lockFactory=org.apache.lucene.store.SingleInstanceLockFactory@62c91c9e),segFN=segments_1,generation=1}
   [junit4]   2> 2084159 INFO  (qtp76370326-16594) [    ] o.a.s.c.SolrDeletionPolicy newest commit generation = 1
   [junit4]   2> 2084158 INFO  (qtp1342801254-16583) [    ] o.a.s.u.CommitTracker Hard AutoCommit: disabled
   [junit4]   2> 2084159 INFO  (qtp76370326-16594) [    ] o.a.s.s.SolrIndexSearcher Opening [Searcher@6a28a20a[testschemaapi_shard1_replica1] main]
   [junit4]   2> 2084159 INFO  (qtp1342801254-16583) [    ] o.a.s.u.CommitTracker Soft AutoCommit: disabled
   [junit4]   2> 2084159 INFO  (qtp76370326-16594) [    ] o.a.s.c.c.ZkStateReader Load collection config from: [/collections/testschemaapi]
   [junit4]   2> 2084159 INFO  (qtp1342801254-16583) [    ] o.a.s.c.SolrDeletionPolicy SolrDeletionPolicy.onInit: commits: num=1
   [junit4]   2> 	commit{dir=MockDirectoryWrapper(RAMDirectory@2913c013 lockFactory=org.apache.lucene.store.SingleInstanceLockFactory@34504769),segFN=segments_1,generation=1}
   [junit4]   2> 2084159 INFO  (qtp1342801254-16583) [    ] o.a.s.c.SolrDeletionPolicy newest commit generation = 1
   [junit4]   2> 2084159 INFO  (qtp76370326-16594) [    ] o.a.s.c.c.ZkStateReader path=[/collections/testschemaapi] [configName]=[conf1] specified config exists in ZooKeeper
   [junit4]   2> 2084159 INFO  (qtp1342801254-16583) [    ] o.a.s.s.SolrIndexSearcher Opening [Searcher@63f66374[testschemaapi_shard1_replica2] main]
   [junit4]   2> 2084159 INFO  (qtp76370326-16594) [    ] o.a.s.r.ManagedResourceStorage Setting up ZooKeeper-based storage for the RestManager with znodeBase: /configs/conf1
   [junit4]   2> 2084159 INFO  (qtp1342801254-16583) [    ] o.a.s.c.c.ZkStateReader Load collection config from: [/collections/testschemaapi]
   [junit4]   2> 2084159 INFO  (qtp76370326-16594) [    ] o.a.s.r.ManagedResourceStorage Configured ZooKeeperStorageIO with znodeBase: /configs/conf1
   [junit4]   2> 2084159 INFO  (qtp76370326-16594) [    ] o.a.s.r.RestManager Initializing RestManager with initArgs: {}
   [junit4]   2> 2084159 INFO  (qtp76370326-16594) [    ] o.a.s.r.ManagedResourceStorage Reading _rest_managed.json using ZooKeeperStorageIO:path=/configs/conf1
   [junit4]   2> 2084159 INFO  (qtp1342801254-16583) [    ] o.a.s.c.c.ZkStateReader path=[/collections/testschemaapi] [configName]=[conf1] specified config exists in ZooKeeper
   [junit4]   2> 2084159 INFO  (qtp1342801254-16583) [    ] o.a.s.r.ManagedResourceStorage Setting up ZooKeeper-based storage for the RestManager with znodeBase: /configs/conf1
   [junit4]   2> 2084159 INFO  (qtp76370326-16594) [    ] o.a.s.r.ManagedResourceStorage No data found for znode /configs/conf1/_rest_managed.json
   [junit4]   2> 2084160 INFO  (qtp76370326-16594) [    ] o.a.s.r.ManagedResourceStorage Loaded null at path _rest_managed.json using ZooKeeperStorageIO:path=/configs/conf1
   [junit4]   2> 2084160 INFO  (qtp1342801254-16583) [    ] o.a.s.r.ManagedResourceStorage Configured ZooKeeperStorageIO with znodeBase: /configs/conf1
   [junit4]   2> 2084160 INFO  (qtp76370326-16594) [    ] o.a.s.r.RestManager Initializing 0 registered ManagedResources
   [junit4]   2> 2084160 INFO  (qtp1342801254-16583) [    ] o.a.s.r.RestManager Initializing RestManager with initArgs: {}
   [junit4]   2> 2084160 INFO  (qtp76370326-16594) [    ] o.a.s.s.ZkIndexSchemaReader Creating ZooKeeper watch for the managed schema at /configs/conf1/managed-schema
   [junit4]   2> 2084160 INFO  (qtp1342801254-16583) [    ] o.a.s.r.ManagedResourceStorage Reading _rest_managed.json using ZooKeeperStorageIO:path=/configs/conf1
   [junit4]   2> 2084160 INFO  (qtp76370326-16594) [    ] o.a.s.c.ZkController Added new OnReconnect listener ZkIndexSchemaReader: /configs/conf1/managed-schema, uniqueCoreId: testschemaapi_shard1_replica1:646109055464100
   [junit4]   2> 2084160 INFO  (qtp1342801254-16583) [    ] o.a.s.r.ManagedResourceStorage No data found for znode /configs/conf1/_rest_managed.json
   [junit4]   2> 2084160 INFO  (qtp76370326-16594) [    ] o.a.s.h.ReplicationHandler Commits will be reserved for  10000
   [junit4]   2> 2084160 INFO  (qtp1342801254-16583) [    ] o.a.s.r.ManagedResourceStorage Loaded null at path _rest_managed.json using ZooKeeperStorageIO:path=/configs/conf1
   [junit4]   2> 2084160 INFO  (searcherExecutor-7969-thread-1) [    ] o.a.s.c.SolrCore [testschemaapi_shard1_replica1] Registered new searcher Searcher@6a28a20a[testschemaapi_shard1_replica1] main{ExitableDirectoryReader(UninvertingDirectoryReader())}
   [junit4]   2> 2084160 INFO  (qtp1342801254-16583) [    ] o.a.s.r.RestManager Initializing 0 registered ManagedResources
   [junit4]   2> 2084160 INFO  (qtp76370326-16594) [    ] o.a.s.u.UpdateLog Looking up max value of version field to seed version buckets
   [junit4]   2> 2084160 INFO  (qtp1342801254-16583) [    ] o.a.s.s.ZkIndexSchemaReader Creating ZooKeeper watch for the managed schema at /configs/conf1/managed-schema
   [junit4]   2> 2084160 INFO  (qtp76370326-16594) [    ] o.a.s.u.VersionInfo Refreshing highest value of _version_ for 65536 version buckets from index
   [junit4]   2> 2084160 INFO  (qtp76370326-16594) [    ] o.a.s.u.VersionInfo No terms found for _version_, cannot seed version bucket highest value from index
   [junit4]   2> 2084160 INFO  (qtp1342801254-16583) [    ] o.a.s.c.ZkController Added new OnReconnect listener ZkIndexSchemaReader: /configs/conf1/managed-schema, uniqueCoreId: testschemaapi_shard1_replica2:646109055519866
   [junit4]   2> 2084160 INFO  (qtp76370326-16594) [    ] o.a.s.u.UpdateLog Could not find max version in index or recent updates, using new clock 1534263766911287296
   [junit4]   2> 2084161 INFO  (qtp1342801254-16583) [    ] o.a.s.h.ReplicationHandler Commits will be reserved for  10000
   [junit4]   2> 2084161 INFO  (searcherExecutor-7970-thread-1) [    ] o.a.s.c.SolrCore [testschemaapi_shard1_replica2] Registered new searcher Searcher@63f66374[testschemaapi_shard1_replica2] main{ExitableDirectoryReader(UninvertingDirectoryReader())}
   [junit4]   2> 2084161 INFO  (qtp1342801254-16583) [    ] o.a.s.u.UpdateLog Looking up max value of version field to seed version buckets
   [junit4]   2> 2084161 INFO  (qtp1342801254-16583) [    ] o.a.s.u.VersionInfo Refreshing highest value of _version_ for 65536 version buckets from index
   [junit4]   2> 2084161 INFO  (qtp1342801254-16583) [    ] o.a.s.u.VersionInfo No terms found for _version_, cannot seed version bucket highest value from index
   [junit4]   2> 2084161 INFO  (qtp1342801254-16583) [    ] o.a.s.u.UpdateLog Could not find max version in index or recent updates, using new clock 1534263766912335872
   [junit4]   2> 2084162 INFO  (qtp76370326-16594) [    ] o.a.s.u.UpdateLog Took 2.0ms to seed version buckets with highest version 1534263766911287296
   [junit4]   2> 2084163 INFO  (qtp76370326-16594) [    ] o.a.s.c.ZkController watch zkdir /configs/conf1
   [junit4]   2> 2084163 INFO  (qtp1342801254-16583) [    ] o.a.s.u.UpdateLog Took 1.0ms to seed version buckets with highest version 1534263766912335872
   [junit4]   2> 2084163 INFO  (qtp1342801254-16583) [    ] o.a.s.c.ZkController watch zkdir /configs/conf1
   [junit4]   2> 2084163 INFO  (qtp76370326-16594) [    ] o.a.s.c.CoreContainer registering core: testschemaapi_shard1_replica1
   [junit4]   2> 2084163 INFO  (qtp76370326-16594) [    ] o.a.s.c.ZkController Register replica - core:testschemaapi_shard1_replica1 address:http://127.0.0.1:44554/solr collection:testschemaapi shard:shard1
   [junit4]   2> 2084163 INFO  (qtp1342801254-16583) [    ] o.a.s.c.CoreContainer registering core: testschemaapi_shard1_replica2
   [junit4]   2> 2084164 INFO  (qtp1342801254-16583) [    ] o.a.s.c.ZkController Register replica - core:testschemaapi_shard1_replica2 address:http://127.0.0.1:42915/solr collection:testschemaapi shard:shard1
   [junit4]   2> 2084164 INFO  (qtp76370326-16594) [    ] o.a.s.c.c.SolrZkClient makePath: /collections/testschemaapi/leader_elect/shard1/election
   [junit4]   2> 2084164 INFO  (qtp1342801254-16583) [    ] o.a.s.c.c.SolrZkClient makePath: /collections/testschemaapi/leader_elect/shard1/election
   [junit4]   2> 2084165 INFO  (qtp76370326-16594) [    ] o.a.s.c.LeaderElector Joined leadership election with path: /collections/testschemaapi/leader_elect/shard1/election/95891485279453190-core_node1-n_0000000000
   [junit4]   2> 2084165 INFO  (qtp1342801254-16583) [    ] o.a.s.c.LeaderElector Joined leadership election with path: /collections/testschemaapi/leader_elect/shard1/election/95891485279453189-core_node2-n_0000000001
   [junit4]   2> 2084165 INFO  (qtp76370326-16594) [    ] o.a.s.c.ShardLeaderElectionContext Running the leader process for shard=shard1 and weAreReplacement=false and leaderVoteWait=10000
   [junit4]   2> 2084165 INFO  (qtp1342801254-16583) [    ] o.a.s.c.LeaderElector Watching path /collections/testschemaapi/leader_elect/shard1/election/95891485279453190-core_node1-n_0000000000 to know if I could be the leader
   [junit4]   2> 2084166 INFO  (qtp76370326-16594) [    ] o.a.s.c.ShardLeaderElectionContext Enough replicas found to continue.
   [junit4]   2> 2084166 INFO  (qtp76370326-16594) [    ] o.a.s.c.ShardLeaderElectionContext I may be the new leader - try and sync
   [junit4]   2> 2084166 INFO  (OverseerStateUpdate-95891485279453189-127.0.0.1:42915_solr-n_0000000000) [    ] o.a.s.c.Overseer processMessage: queueSize: 1, message = {
   [junit4]   2>   "operation":"leader",
   [junit4]   2>   "shard":"shard1",
   [junit4]   2>   "collection":"testschemaapi"} current state version: 0
   [junit4]   2> 2084166 INFO  (qtp76370326-16594) [    ] o.a.s.c.SyncStrategy Sync replicas to http://127.0.0.1:44554/solr/testschemaapi_shard1_replica1/
   [junit4]   2> 2084166 INFO  (qtp76370326-16594) [    ] o.a.s.u.PeerSync PeerSync: core=testschemaapi_shard1_replica1 url=http://127.0.0.1:44554/solr START replicas=[http://127.0.0.1:42915/solr/testschemaapi_shard1_replica2/] nUpdates=100
   [junit4]   2> 2084166 INFO  (qtp76370326-16594) [    ] o.a.s.u.PeerSync PeerSync: core=testschemaapi_shard1_replica1 url=http://127.0.0.1:44554/solr DONE.  We have no versions.  sync failed.
   [junit4]   2> 2084166 INFO  (qtp76370326-16594) [    ] o.a.s.c.SyncStrategy Leader's attempt to sync with shard failed, moving to the next candidate
   [junit4]   2> 2084166 INFO  (qtp76370326-16594) [    ] o.a.s.c.ShardLeaderElectionContext We failed sync, but we have no versions - we can't sync in that case - we were active before, so become leader anyway
   [junit4]   2> 2084166 INFO  (qtp76370326-16594) [    ] o.a.s.c.c.SolrZkClient makePath: /collections/testschemaapi/leaders/shard1
   [junit4]   2> 2084167 INFO  (qtp1342801254-16585) [    ] o.a.s.c.S.Request [testschemaapi_shard1_replica2]  webapp=/solr path=/get params={distrib=false&qt=/get&fingerprint=false&getVersions=100&wt=javabin&version=2} status=0 QTime=0
   [junit4]   2> 2084167 INFO  (qtp76370326-16594) [    ] o.a.s.c.ShardLeaderElectionContextBase Creating leader registration node /collections/testschemaapi/leaders/shard1/leader after winning as /collections/testschemaapi/leader_elect/shard1/election/95891485279453190-core_node1-n_0000000000
   [junit4]   2> 2084168 INFO  (qtp76370326-16594) [    ] o.a.s.c.ShardLeaderElectionContext I am the new leader: http://127.0.0.1:44554/solr/testschemaapi_shard1_replica1/ shard1
   [junit4]   2> 2084168 INFO  (OverseerStateUpdate-95891485279453189-127.0.0.1:42915_solr-n_0000000000) [    ] o.a.s.c.Overseer processMessage: queueSize: 1, message = {
   [junit4]   2>   "operation":"leader",
   [junit4]   2>   "shard":"shard1",
   [junit4]   2>   "collection":"testschemaapi",
   [junit4]   2>   "base_url":"http://127.0.0.1:44554/solr",
   [junit4]   2>   "core":"testschemaapi_shard1_replica1",
   [junit4]   2>   "state":"active"} current state version: 0
   [junit4]   2> 2084268 INFO  (OverseerStateUpdate-95891485279453189-127.0.0.1:42915_solr-n_0000000000) [    ] o.a.s.c.o.ZkStateWriter going to update_collection /collections/testschemaapi/state.json version: 1
   [junit4]   2> 2084269 INFO  (zkCallback-2664-thread-1) [    ] o.a.s.c.c.ZkStateReader A cluster state change: [WatchedEvent state:SyncConnected type:NodeDataChanged path:/collections/testschemaapi/state.json] for collection [testschemaapi] has occurred - updating... (live nodes size: [2])
   [junit4]   2> 2084269 INFO  (zkCallback-2665-thread-1) [    ] o.a.s.c.c.ZkStateReader A cluster state change: [WatchedEvent state:SyncConnected type:NodeDataChanged path:/collections/testschemaapi/state.json] for collection [testschemaapi] has occurred - updating... (live nodes size: [2])
   [junit4]   2> 2084269 INFO  (zkCallback-2664-thread-1) [    ] o.a.s.c.c.ZkStateReader Updating data for [testschemaapi] from [1] to [2]
   [junit4]   2> 2084269 INFO  (zkCallback-2665-thread-1) [    ] o.a.s.c.c.ZkStateReader Updating data for [testschemaapi] from [1] to [2]
   [junit4]   2> 2084318 INFO  (qtp76370326-16594) [    ] o.a.s.c.ZkController We are http://127.0.0.1:44554/solr/testschemaapi_shard1_replica1/ and leader is http://127.0.0.1:44554/solr/testschemaapi_shard1_replica1/
   [junit4]   2> 2084318 INFO  (qtp76370326-16594) [    ] o.a.s.c.ZkController No LogReplay needed for core=testschemaapi_shard1_replica1 baseURL=http://127.0.0.1:44554/solr
   [junit4]   2> 2084318 INFO  (qtp76370326-16594) [    ] o.a.s.c.ZkController I am the leader, no recovery necessary
   [junit4]   2> 2084318 INFO  (qtp76370326-16594) [    ] o.a.s.c.ZkController publishing state=active
   [junit4]   2> 2084320 INFO  (OverseerStateUpdate-95891485279453189-127.0.0.1:42915_solr-n_0000000000) [    ] o.a.s.c.Overseer processMessage: queueSize: 1, message = {
   [junit4]   2>   "core":"testschemaapi_shard1_replica1",
   [junit4]   2>   "core_node_name":"core_node1",
   [junit4]   2>   "roles":null,
   [junit4]   2>   "base_url":"http://127.0.0.1:44554/solr",
   [junit4]   2>   "node_name":"127.0.0.1:44554_solr",
   [junit4]   2>   "numShards":"1",
   [junit4]   2>   "state":"active",
   [junit4]   2>   "shard":"shard1",
   [junit4]   2>   "collection":"testschemaapi",
   [junit4]   2>   "operation":"state"} current state version: 0
   [junit4]   2> 2084320 INFO  (OverseerStateUpdate-95891485279453189-127.0.0.1:42915_solr-n_0000000000) [    ] o.a.s.c.o.ReplicaMutator Update state numShards=1 message={
   [junit4]   2>   "core":"testschemaapi_shard1_replica1",
   [junit4]   2>   "core_node_name":"core_node1",
   [junit4]   2>   "roles":null,
   [junit4]   2>   "base_url":"http://127.0.0.1:44554/solr",
   [junit4]   2>   "node_name":"127.0.0.1:44554_solr",
   [junit4]   2>   "numShards":"1",
   [junit4]   2>   "state":"active",
   [junit4]   2>   "shard":"shard1",
   [junit4]   2>   "collection":"testschemaapi",
   [junit4]   2>   "operation":"state"}
   [junit4]   2> 2084320 INFO  (qtp76370326-16594) [    ] o.a.s.s.HttpSolrCall [admin] webapp=null path=/admin/cores params={qt=/admin/cores&collection.configName=conf1&name=testschemaapi_shard1_replica1&action=CREATE&numShards=1&collection=testschemaapi&shard=shard1&wt=javabin&version=2} status=0 QTime=1198
   [junit4]   2> 2084421 INFO  (OverseerStateUpdate-95891485279453189-127.0.0.1:42915_solr-n_0000000000) [    ] o.a.s.c.o.ZkStateWriter going to update_collection /collections/testschemaapi/state.json version: 2
   [junit4]   2> 2084421 INFO  (zkCallback-2664-thread-1) [    ] o.a.s.c.c.ZkStateReader A cluster state change: [WatchedEvent state:SyncConnected type:NodeDataChanged path:/collections/testschemaapi/state.json] for collection [testschemaapi] has occurred - updating... (live nodes size: [2])
   [junit4]   2> 2084421 INFO  (zkCallback-2665-thread-1) [    ] o.a.s.c.c.ZkStateReader A cluster state change: [WatchedEvent state:SyncConnected type:NodeDataChanged path:/collections/testschemaapi/state.json] for collection [testschemaapi] has occurred - updating... (live nodes size: [2])
   [junit4]   2> 2084422 INFO  (zkCallback-2664-thread-1) [    ] o.a.s.c.c.ZkStateReader Updating data for [testschemaapi] from [2] to [3]
   [junit4]   2> 2084422 INFO  (zkCallback-2665-thread-1) [    ] o.a.s.c.c.ZkStateReader Updating data for [testschemaapi] from [2] to [3]
   [junit4]   2> 2085166 INFO  (qtp1342801254-16583) [    ] o.a.s.c.ZkController We are http://127.0.0.1:42915/solr/testschemaapi_shard1_replica2/ and leader is http://127.0.0.1:44554/solr/testschemaapi_shard1_replica1/
   [junit4]   2> 2085166 INFO  (qtp1342801254-16583) [    ] o.a.s.c.ZkController No LogReplay needed for core=testschemaapi_shard1_replica2 baseURL=http://127.0.0.1:42915/solr
   [junit4]   2> 2085166 INFO  (qtp1342801254-16583) [    ] o.a.s.c.ZkController Core needs to recover:testschemaapi_shard1_replica2
   [junit4]   2> 2085166 INFO  (updateExecutor-2658-thread-1) [    ] o.a.s.u.DefaultSolrCoreState Running recovery
   [junit4]   2> 2085166 INFO  (recoveryExecutor-2659-thread-1) [    ] o.a.s.c.RecoveryStrategy Starting recovery process. recoveringAfterStartup=true
   [junit4]   2> 2085166 INFO  (recoveryExecutor-2659-thread-1) [    ] o.a.s.c.RecoveryStrategy ###### startupVersions=[[]]
   [junit4]   2> 2085166 INFO  (recoveryExecutor-2659-thread-1) [    ] o.a.s.c.RecoveryStrategy Begin buffering updates. core=[testschemaapi_shard1_replica2]
   [junit4]   2> 2085166 INFO  (recoveryExecutor-2659-thread-1) [    ] o.a.s.u.UpdateLog Starting to buffer updates. FSUpdateLog{state=ACTIVE, tlog=null}
   [junit4]   2> 2085166 INFO  (qtp1342801254-16583) [    ] o.a.s.s.HttpSolrCall [admin] webapp=null path=/admin/cores params={qt=/admin/cores&collection.configName=conf1&name=testschemaapi_shard1_replica2&action=CREATE&numShards=1&collection=testschemaapi&shard=shard1&wt=javabin&version=2} status=0 QTime=2043
   [junit4]   2> 2085166 INFO  (recoveryExecutor-2659-thread-1) [    ] o.a.s.c.RecoveryStrategy Publishing state of core [testschemaapi_shard1_replica2] as recovering, leader is [http://127.0.0.1:44554/solr/testschemaapi_shard1_replica1/] and I am [http://127.0.0.1:42915/solr/testschemaapi_shard1_replica2/]
   [junit4]   2> 2085167 INFO  (recoveryExecutor-2659-thread-1) [    ] o.a.s.c.ZkController publishing state=recovering
   [junit4]   2> 2085168 INFO  (OverseerThreadFactory-7964-thread-1) [    ] o.a.s.c.OverseerTaskProcessor Overseer Collection Message Handler: Message id:/overseer/collection-queue-work/qn-0000000000 complete, response:{success={127.0.0.1:44554_solr={responseHeader={status=0,QTime=1198},core=testschemaapi_shard1_replica1},127.0.0.1:42915_solr={responseHeader={status=0,QTime=2043},core=testschemaapi_shard1_replica2}}}
   [junit4]   2> 2085168 INFO  (zkCallback-2665-thread-1) [    ] o.a.s.c.OverseerTaskQueue NodeDataChanged fired on path /overseer/collection-queue-work/qnr-0000000000 state SyncConnected latchEventType null
   [junit4]   2> 2085168 INFO  (OverseerStateUpdate-95891485279453189-127.0.0.1:42915_solr-n_0000000000) [    ] o.a.s.c.Overseer processMessage: queueSize: 1, message = {
   [junit4]   2>   "core":"testschemaapi_shard1_replica2",
   [junit4]   2>   "core_node_name":"core_node2",
   [junit4]   2>   "roles":null,
   [junit4]   2>   "base_url":"http://127.0.0.1:42915/solr",
   [junit4]   2>   "node_name":"127.0.0.1:42915_solr",
   [junit4]   2>   "numShards":"1",
   [junit4]   2>   "state":"recovering",
   [junit4]   2>   "shard":"shard1",
   [junit4]   2>   "collection":"testschemaapi",
   [junit4]   2>   "operation":"state"} current state version: 0
   [junit4]   2> 2085168 INFO  (OverseerStateUpdate-95891485279453189-127.0.0.1:42915_solr-n_0000000000) [    ] o.a.s.c.o.ReplicaMutator Update state numShards=1 message={
   [junit4]   2>   "core":"testschemaapi_shard1_replica2",
   [junit4]   2>   "core_node_name":"core_node2",
   [junit4]   2>   "roles":null,
   [junit4]   2>   "base_url":"http://127.0.0.1:42915/solr",
   [junit4]   2>   "node_name":"127.0.0.1:42915_solr",
   [junit4]   2>   "numShards":"1",
   [junit4]   2>   "state":"recovering",
   [junit4]   2>   "shard":"shard1",
   [junit4]   2>   "collection":"testschemaapi",
   [junit4]   2>   "operation":"state"}
   [junit4]   2> 2085169 INFO  (qtp76370326-16592) [    ] o.a.s.h.a.CollectionsHandler Wait for new collection to be active for at most 30 seconds. Check all shard replicas
   [junit4]   2> 2085169 INFO  (recoveryExecutor-2659-thread-1) [    ] o.a.s.c.RecoveryStrategy Sending prep recovery command to [http://127.0.0.1:44554/solr]; [WaitForState: action=PREPRECOVERY&core=testschemaapi_shard1_replica1&nodeName=127.0.0.1:42915_solr&coreNodeName=core_node2&state=recovering&checkLive=true&onlyIfLeader=true&onlyIfLeaderActive=true]
   [junit4]   2> 2085170 INFO  (qtp76370326-16588) [    ] o.a.s.h.a.CoreAdminOperation Going to wait for coreNodeName: core_node2, state: recovering, checkLive: true, onlyIfLeader: true, onlyIfLeaderActive: true
   [junit4]   2> 2085170 INFO  (qtp76370326-16588) [    ] o.a.s.h.a.CoreAdminOperation Will wait a max of 183 seconds to see testschemaapi_shard1_replica1 (shard1 of testschemaapi) have state: recovering
   [junit4]   2> 2085170 INFO  (qtp76370326-16588) [    ] o.a.s.h.a.CoreAdminOperation In WaitForState(recovering): collection=testschemaapi, shard=shard1, thisCore=testschemaapi_shard1_replica1, leaderDoesNotNeedRecovery=false, isLeader? true, live=true, checkLive=true, currentState=down, localState=active, nodeName=127.0.0.1:42915_solr, coreNodeName=core_node2, onlyIfActiveCheckResult=false, nodeProps: core_node2:{"core":"testschemaapi_shard1_replica2","base_url":"http://127.0.0.1:42915/solr","node_name":"127.0.0.1:42915_solr","state":"down"}
   [junit4]   2> 2085269 INFO  (OverseerStateUpdate-95891485279453189-127.0.0.1:42915_solr-n_0000000000) [    ] o.a.s.c.o.ZkStateWriter going to update_collection /collections/testschemaapi/state.json version: 3
   [junit4]   2> 2085270 INFO  (zkCallback-2664-thread-1) [    ] o.a.s.c.c.ZkStateReader A cluster state change: [WatchedEvent state:SyncConnected type:NodeDataChanged path:/collections/testschemaapi/state.json] for collection [testschemaapi] has occurred - updating... (live nodes size: [2])
   [junit4]   2> 2085270 INFO  (zkCallback-2665-thread-1) [    ] o.a.s.c.c.ZkStateReader A cluster state change: [WatchedEvent state:SyncConnected type:NodeDataChanged path:/collections/testschemaapi/state.json] for collection [testschemaapi] has occurred - updating... (live nodes size: [2])
   [junit4]   2> 2085270 INFO  (zkCallback-2664-thread-1) [    ] o.a.s.c.c.ZkStateReader Updating data for [testschemaapi] from [3] to [4]
   [junit4]   2> 2085270 INFO  (zkCallback-2665-thread-1) [    ] o.a.s.c.c.ZkStateReader Updating data for [testschemaapi] from [3] to [4]
   [junit4]   2> 2086170 INFO  (qtp76370326-16588) [    ] o.a.s.h.a.CoreAdminOperation In WaitForState(recovering): collection=testschemaapi, shard=shard1, thisCore=testschemaapi_shard1_replica1, leaderDoesNotNeedRecovery=false, isLeader? true, live=true, checkLive=true, currentState=recovering, localState=active, nodeName=127.0.0.1:42915_solr, coreNodeName=core_node2, onlyIfActiveCheckResult=false, nodeProps: core_node2:{"core":"testschemaapi_shard1_replica2","base_url":"http://127.0.0.1:42915/solr","node_name":"127.0.0.1:42915_solr","state":"recovering"}
   [junit4]   2> 2086170 INFO  (qtp76370326-16588) [    ] o.a.s.h.a.CoreAdminOperation Waited coreNodeName: core_node2, state: recovering, checkLive: true, onlyIfLeader: true for: 1 seconds.
   [junit4]   2> 2086170 INFO  (qtp76370326-16588) [    ] o.a.s.s.HttpSolrCall [admin] webapp=null path=/admin/cores params={nodeName=127.0.0.1:42915_solr&onlyIfLeaderActive=true&core=testschemaapi_shard1_replica1&coreNodeName=core_node2&action=PREPRECOVERY&checkLive=true&state=recovering&onlyIfLeader=true&wt=javabin&version=2} status=0 QTime=1000
   [junit4]   2> 2093171 INFO  (recoveryExecutor-2659-thread-1) [    ] o.a.s.c.RecoveryStrategy Attempting to PeerSync from [http://127.0.0.1:44554/solr/testschemaapi_shard1_replica1/] - recoveringAfterStartup=[true]
   [junit4]   2> 2093171 INFO  (recoveryExecutor-2659-thread-1) [    ] o.a.s.u.PeerSync PeerSync: core=testschemaapi_shard1_replica2 url=http://127.0.0.1:42915/solr START replicas=[http://127.0.0.1:44554/solr/testschemaapi_shard1_replica1/] nUpdates=100
   [junit4]   2> 2093171 WARN  (recoveryExecutor-2659-thread-1) [    ] o.a.s.u.PeerSync no frame of reference to tell if we've missed updates
   [junit4]   2> 2093171 INFO  (recoveryExecutor-2659-thread-1) [    ] o.a.s.c.RecoveryStrategy PeerSync Recovery was not successful - trying replication.
   [junit4]   2> 2093171 INFO  (recoveryExecutor-2659-thread-1) [    ] o.a.s.c.RecoveryStrategy Starting Replication Recovery.
   [junit4]   2> 2093171 INFO  (recoveryExecutor-2659-thread-1) [    ] o.a.s.c.RecoveryStrategy Attempting to replicate from [http://127.0.0.1:44554/solr/testschemaapi_shard1_replica1/].
   [junit4]   2> 2093172 INFO  (qtp76370326-16594) [    ] o.a.s.u.IndexFingerprint IndexFingerprint millis:0.0 result:{maxVersionSpecified=9223372036854775807, maxVersionEncountered=0, maxInHash=0, versionsHash=0, numVersions=0, numDocs=0, maxDoc=0}
   [junit4]   2> 2093172 INFO  (qtp76370326-16594) [    ] o.a.s.c.S.Request [testschemaapi_shard1_replica1]  webapp=/solr path=/get params={distrib=false&qt=/get&fingerprint=true&getVersions=100&wt=javabin&version=2} status=0 QTime=0
   [junit4]   2> 2093172 INFO  (qtp76370326-16587) [    ] o.a.s.u.DirectUpdateHandler2 start commit{,optimize=false,openSearcher=false,waitSearcher=true,expungeDeletes=false,softCommit=false,prepareCommit=false}
   [junit4]   2> 2093172 INFO  (qtp76370326-16587) [    ] o.a.s.u.DirectUpdateHandler2 No uncommitted changes. Skipping IW.commit.
   [junit4]   2> 2093172 INFO  (qtp76370326-16587) [    ] o.a.s.u.DirectUpdateHandler2 end_commit_flush
   [junit4]   2> 2093172 INFO  (qtp76370326-16587) [    ] o.a.s.u.p.LogUpdateProcessorFactory [testschemaapi_shard1_replica1]  webapp=/solr path=/update params={waitSearcher=true&openSearcher=false&commit=true&softCommit=false&commit_end_point=true&wt=javabin&version=2}{commit=} 0 0
   [junit4]   2> 2093173 INFO  (qtp76370326-16588) [    ] o.a.s.c.S.Request [testschemaapi_shard1_replica1]  webapp=/solr path=/replication params={qt=/replication&wt=javabin&version=2&command=indexversion} status=0 QTime=0
   [junit4]   2> 2093173 INFO  (recoveryExecutor-2659-thread-1) [    ] o.a.s.c.RecoveryStrategy No replay needed.
   [junit4]   2> 2093173 INFO  (recoveryExecutor-2659-thread-1) [    ] o.a.s.c.RecoveryStrategy Replication Recovery was successful.
   [junit4]   2> 2093173 INFO  (recoveryExecutor-2659-thread-1) [    ] o.a.s.c.RecoveryStrategy Registering as Active after recovery.
   [junit4]   2> 2093173 INFO  (recoveryExecutor-2659-thread-1) [    ] o.a.s.c.ZkController publishing state=active
   [junit4]   2> 2093174 INFO  (recoveryExecutor-2659-thread-1) [    ] o.a.s.c.RecoveryStrategy Updating version bucket highest from index after successful recovery.
   [junit4]   2> 2093174 INFO  (recoveryExecutor-2659-thread-1) [    ] o.a.s.u.UpdateLog Looking up max value of version field to seed version buckets
   [junit4]   2> 2093174 INFO  (recoveryExecutor-2659-thread-1) [    ] o.a.s.u.VersionInfo Refreshing highest value of _version_ for 65536 version buckets from index
   [junit4]   2> 2093174 INFO  (recoveryExecutor-2659-thread-1) [    ] o.a.s.u.VersionInfo No terms found for _version_, cannot seed version bucket highest value from index
   [junit4]   2> 2093174 INFO  (recoveryExecutor-2659-thread-1) [    ] o.a.s.u.UpdateLog Could not find max version in index or recent updates, using new clock 1534263776363151360
   [junit4]   2> 2093174 INFO  (OverseerStateUpdate-95891485279453189-127.0.0.1:42915_solr-n_0000000000) [    ] o.a.s.c.Overseer processMessage: queueSize: 1, message = {
   [junit4]   2>   "core":"testschemaapi_shard1_replica2",
   [junit4]   2>   "core_node_name":"core_node2",
   [junit4]   2>   "roles":null,
   [junit4]   2>   "base_url":"http://127.0.0.1:42915/solr",
   [junit4]   2>   "node_name":"127.0.0.1:42915_solr",
   [junit4]   2>   "numShards":"1",
   [junit4]   2>   "state":"active",
   [junit4]   2>   "shard":"shard1",
   [junit4]   2>   "collection":"testschemaapi",
   [junit4]   2>   "operation":"state"} current state version: 0
   [junit4]   2> 2093174 INFO  (OverseerStateUpdate-95891485279453189-127.0.0.1:42915_solr-n_0000000000) [    ] o.a.s.c.o.ReplicaMutator Update state numShards=1 message={
   [junit4]   2>   "core":"testschemaapi_shard1_replica2",
   [junit4]   2>   "core_node_name":"core_node2",
   [junit4]   2>   "roles":null,
   [junit4]   2>   "base_url":"http://127.0.0.1:42915/solr",
   [junit4]   2>   "node_name":"127.0.0.1:42915_solr",
   [junit4]   2>   "numShards":"1",
   [junit4]   2>   "state":"active",
   [junit4]   2>   "shard":"shard1",
   [junit4]   2>   "collection":"testschemaapi",
   [junit4]   2>   "operation":"state"}
   [junit4]   2> 2093175 INFO  (OverseerStateUpdate-95891485279453189-127.0.0.1:42915_solr-n_0000000000) [    ] o.a.s.c.o.ZkStateWriter going to update_collection /collections/testschemaapi/state.json version: 4
   [junit4]   2> 2093175 INFO  (zkCallback-2664-thread-2) [    ] o.a.s.c.c.ZkStateReader A cluster state change: [WatchedEvent state:SyncConnected type:NodeDataChanged path:/collections/testschemaapi/state.json] for collection [testschemaapi] has occurred - updating... (live nodes size: [2])
   [junit4]   2> 2093175 INFO  (zkCallback-2665-thread-1) [    ] o.a.s.c.c.ZkStateReader A cluster state change: [WatchedEvent state:SyncConnected type:NodeDataChanged path:/collections/testschemaapi/state.json] for collection [testschemaapi] has occurred - updating... (live nodes size: [2])
   [junit4]   2> 2093176 INFO  (zkCallback-2664-thread-2) [    ] o.a.s.c.c.ZkStateReader Updating data for [testschemaapi] from [4] to [5]
   [junit4]   2> 2093176 INFO  (zkCallback-2665-thread-1) [    ] o.a.s.c.c.ZkStateReader Updating data for [testschemaapi] from [4] to [5]
   [junit4]   2> 2093177 INFO  (recoveryExecutor-2659-thread-1) [    ] o.a.s.u.UpdateLog Took 2.0ms to seed version buckets with highest version 1534263776363151360
   [junit4]   2> 2093177 INFO  (recoveryExecutor-2659-thread-1) [    ] o.a.s.c.RecoveryStrategy Finished recovery process, successful=[true]
   [junit4]   2> 2094170 INFO  (qtp76370326-16592) [    ] o.a.s.s.HttpSolrCall [admin] webapp=null path=/admin/collections params={replicationFactor=2&collection.configName=conf1&name=testschemaapi&action=CREATE&numShards=1&wt=javabin&version=2} status=0 QTime=11169
   [junit4]   2> 2094190 INFO  (qtp1342801254-16579) [    ] o.a.s.s.SchemaManager managed schema loaded . version : 0 
   [junit4]   2> 2094193 INFO  (qtp1342801254-16579) [    ] o.a.s.s.IndexSchema [testschemaapi_shard1_replica2] Schema name=minimal
   [junit4]   2> 2094198 INFO  (qtp1342801254-16579) [    ] o.a.s.s.IndexSchema unique key field: id
   [junit4]   2> 2094209 INFO  (zkCallback-2665-thread-1) [    ] o.a.s.s.ZkIndexSchemaReader A schema change: WatchedEvent state:SyncConnected type:NodeDataChanged path:/configs/

[...truncated too long message...]

32836 32836
   [junit4]   2> 2105968 WARN  (Thread-5746) [    ] o.a.s.c.ZkController listener throws error
   [junit4]   2> org.apache.solr.common.SolrException: Unable to reload core [testschemaapi_shard1_replica1]
   [junit4]   2> 	at org.apache.solr.core.CoreContainer.reload(CoreContainer.java:945)
   [junit4]   2> 	at org.apache.solr.core.SolrCore.lambda$getConfListener$6(SolrCore.java:2490)
   [junit4]   2> 	at org.apache.solr.cloud.ZkController$4.run(ZkController.java:2410)
   [junit4]   2> Caused by: org.apache.solr.common.SolrException: Could not load conf for core testschemaapi_shard1_replica1: Unable to load reader for ConfigSet properties: configsetprops.json
   [junit4]   2> 	at org.apache.solr.core.ConfigSetService.getConfig(ConfigSetService.java:86)
   [junit4]   2> 	at org.apache.solr.core.CoreContainer.reload(CoreContainer.java:937)
   [junit4]   2> 	... 2 more
   [junit4]   2> Caused by: org.apache.solr.common.SolrException: Unable to load reader for ConfigSet properties: configsetprops.json
   [junit4]   2> 	at org.apache.solr.core.ConfigSetProperties.readFromResourceLoader(ConfigSetProperties.java:57)
   [junit4]   2> 	at org.apache.solr.core.ConfigSetService.createConfigSetProperties(ConfigSetService.java:118)
   [junit4]   2> 	at org.apache.solr.core.ConfigSetService.getConfig(ConfigSetService.java:80)
   [junit4]   2> 	... 3 more
   [junit4]   2> Caused by: java.io.IOException: We re-tried 10 times but was still unable to fetch resource=configsetprops.json from ZK
   [junit4]   2> 	at org.apache.solr.cloud.ZkSolrResourceLoader.openResource(ZkSolrResourceLoader.java:116)
   [junit4]   2> 	at org.apache.solr.core.ConfigSetProperties.readFromResourceLoader(ConfigSetProperties.java:52)
   [junit4]   2> 	... 5 more
   [junit4]   2> Caused by: org.apache.zookeeper.KeeperException$SessionExpiredException: KeeperErrorCode = Session expired for /configs/conf1/configsetprops.json
   [junit4]   2> 	at org.apache.zookeeper.KeeperException.create(KeeperException.java:127)
   [junit4]   2> 	at org.apache.zookeeper.KeeperException.create(KeeperException.java:51)
   [junit4]   2> 	at org.apache.zookeeper.ZooKeeper.exists(ZooKeeper.java:1045)
   [junit4]   2> 	at org.apache.solr.common.cloud.SolrZkClient$5.execute(SolrZkClient.java:314)
   [junit4]   2> 	at org.apache.solr.common.cloud.SolrZkClient$5.execute(SolrZkClient.java:311)
   [junit4]   2> 	at org.apache.solr.common.cloud.ZkCmdExecutor.retryOperation(ZkCmdExecutor.java:60)
   [junit4]   2> 	at org.apache.solr.common.cloud.SolrZkClient.exists(SolrZkClient.java:311)
   [junit4]   2> 	at org.apache.solr.cloud.ZkController.pathExists(ZkController.java:798)
   [junit4]   2> 	at org.apache.solr.cloud.ZkSolrResourceLoader.openResource(ZkSolrResourceLoader.java:89)
   [junit4]   2> 	... 6 more
   [junit4]   2> 2105985 INFO  (Thread-5711) [    ] o.a.s.c.ZkTestServer connecting to 127.0.0.1:32836 32836
   [junit4]   2> 2105986 WARN  (Thread-5711) [    ] o.a.s.c.ZkTestServer Watch limit violations: 
   [junit4]   2> Maximum concurrent create/delete watches above limit:
   [junit4]   2> 
   [junit4]   2> 	6	/solr/configs/conf1/managed-schema
   [junit4]   2> 	6	/solr/configs/conf1
   [junit4]   2> 	3	/solr/aliases.json
   [junit4]   2> 	2	/solr/security.json
   [junit4]   2> 
   [junit4]   2> Maximum concurrent data watches above limit:
   [junit4]   2> 
   [junit4]   2> 	3	/solr/clusterstate.json
   [junit4]   2> 	2	/solr/collections/testschemaapi/state.json
   [junit4]   2> 
   [junit4]   2> Maximum concurrent children watches above limit:
   [junit4]   2> 
   [junit4]   2> 	3	/solr/live_nodes
   [junit4]   2> 	3	/solr/collections
   [junit4]   2> 
   [junit4]   2> 2105987 INFO  (SUITE-TestManagedSchemaAPI-seed#[1E30BB4E7C3058D0]-worker) [    ] o.a.s.SolrTestCaseJ4 ###deleteCore
   [junit4]   2> NOTE: leaving temporary files on disk at: /home/jenkins/workspace/Lucene-Solr-master-Linux/solr/build/solr-core/test/J0/temp/solr.schema.TestManagedSchemaAPI_1E30BB4E7C3058D0-001
   [junit4]   2> NOTE: test params are: codec=Asserting(Lucene62): {_version_=FST50, id=TestBloomFilteredLucenePostings(BloomFilteringPostingsFormat(Lucene50(blocksize=128))), myNewField=PostingsFormat(name=MockRandom)}, docValues:{}, maxPointsInLeafNode=155, maxMBSortInHeap=5.86079090868704, sim=RandomSimilarity(queryNorm=false,coord=crazy): {}, locale=uz-Latn, timezone=Pacific/Enderbury
   [junit4]   2> NOTE: Linux 4.4.0-21-generic amd64/Oracle Corporation 9-ea (64-bit)/cpus=12,threads=1,free=144763840,total=531628032
   [junit4]   2> NOTE: All tests run in this JVM: [BasicZkTest, SolrCoreTest, DistribJoinFromCollectionTest, CreateCollectionCleanupTest, TestConfigSetsAPIExclusivity, PingRequestHandlerTest, TestPhraseSuggestions, OverseerTaskQueueTest, JsonLoaderTest, TestSolrConfigHandlerConcurrent, SyncSliceTest, SmileWriterTest, TestFieldResource, TestPerFieldSimilarityWithDefaultOverride, TestRandomFaceting, WrapperMergePolicyFactoryTest, CursorPagingTest, TestRemoteStreaming, TestExceedMaxTermLength, HdfsLockFactoryTest, StandardRequestHandlerTest, ZkNodePropsTest, EchoParamsTest, TestGraphTermsQParserPlugin, TestManagedResourceStorage, ParsingFieldUpdateProcessorsTest, TestAnalyzeInfixSuggestions, TestMergePolicyConfig, TestStandardQParsers, PreAnalyzedFieldTest, TestManagedSchema, TestFastOutputStream, DeleteLastCustomShardedReplicaTest, HdfsDirectoryFactoryTest, ResponseLogComponentTest, TestRestoreCore, MultiThreadedOCPTest, SharedFSAutoReplicaFailoverTest, CollectionTooManyReplicasTest, TestOverriddenPrefixQueryForCustomFieldType, TestBinaryField, PrimUtilsTest, TestFreeTextSuggestions, TestInitParams, CloneFieldUpdateProcessorFactoryTest, DateRangeFieldTest, TestUseDocValuesAsStored, TestTestInjection, TestReplicaProperties, SegmentsInfoRequestHandlerTest, ReturnFieldsTest, BlockJoinFacetDistribTest, TestIBSimilarityFactory, SolrCloudExampleTest, TestCloudPivotFacet, TestOmitPositions, PathHierarchyTokenizerFactoryTest, TestSmileRequest, CloudExitableDirectoryReaderTest, TestHighlightDedupGrouping, SolrRequestParserTest, QueryElevationComponentTest, OverseerCollectionConfigSetProcessorTest, TestTrackingShardHandlerFactory, DocumentAnalysisRequestHandlerTest, SpatialRPTFieldTypeTest, TestSolr4Spatial, URLClassifyProcessorTest, TestRandomDVFaceting, TestSolrQueryParserResource, FileBasedSpellCheckerTest, DisMaxRequestHandlerTest, CurrencyFieldOpenExchangeTest, TestStressLucene, TestOnReconnectListenerSupport, TestMaxScoreQueryParser, LeaderElectionIntegrationTest, TestCrossCoreJoin, DateFieldTest, TestCloudBackupRestore, TestRTGBase, TestObjectReleaseTracker, DistributedQueryComponentOptimizationTest, TestRangeQuery, SignatureUpdateProcessorFactoryTest, UUIDFieldTest, ActionThrottleTest, ResourceLoaderTest, OutputWriterTest, TestConfigReload, DistributedFacetPivotLargeTest, HLLSerializationTest, TestTolerantUpdateProcessorRandomCloud, ReplicationFactorTest, TestLRUStatsCache, TestAnalyzedSuggestions, TestComponentsName, GraphQueryTest, BasicDistributedZkTest, UnloadDistributedZkTest, OpenCloseCoreStressTest, OverseerTest, TestReplicationHandler, ZkSolrClientTest, TestDistributedGrouping, TestFaceting, TestRecovery, DistributedSpellCheckComponentTest, TestJoin, StatsComponentTest, PeerSyncTest, BadIndexSchemaTest, TestFunctionQuery, BasicFunctionalityTest, TestLazyCores, HighlighterTest, SimplePostToolTest, AnalysisAfterCoreReloadTest, SuggesterFSTTest, SuggesterWFSTTest, StatelessScriptUpdateProcessorFactoryTest, TestQueryUtils, TestReversedWildcardFilterFactory, TermsComponentTest, TermVectorComponentTest, FastVectorHighlighterTest, LoggingHandlerTest, JSONWriterTest, TestPHPSerializedResponseWriter, TestLFUCache, TestEmbeddedSolrServerConstructors, AliasIntegrationTest, CollectionsAPISolrJTest, DistribDocExpirationUpdateProcessorTest, LeaderInitiatedRecoveryOnShardRestartTest, OverriddenZkACLAndCredentialsProvidersTest, SSLMigrationTest, SaslZkACLProviderTest, TestAuthenticationFramework, CachingDirectoryFactoryTest, TestConfigSetProperties, TestConfigSets, TestDynamicLoading, CoreAdminCreateDiscoverTest, CoreMergeIndexesAdminHandlerTest, DistributedExpandComponentTest, DistributedFacetPivotLongTailTest, DistributedFacetPivotSmallAdvancedTest, DistributedFacetPivotSmallTest, DistributedFacetPivotWhiteBoxTest, FacetPivotSmallTest, SpatialHeatmapFacetsTest, TestPivotHelperCode, TestCustomDocTransformer, TestGeoJSONResponseWriter, TestRawResponseWriter, TestRawTransformer, TestSolrQueryResponse, TestSortingResponseWriter, TestChildDocTransformer, TestSubQueryTransformer, TestSubQueryTransformerCrossCore, TestSubQueryTransformerDistrib, TestManagedSchemaAPI]
   [junit4] Completed [541/597 (1!)] on J0 in 24.17s, 1 test, 1 error <<< FAILURES!

[...truncated 204 lines...]
BUILD FAILED
/home/jenkins/workspace/Lucene-Solr-master-Linux/build.xml:740: The following error occurred while executing this line:
/home/jenkins/workspace/Lucene-Solr-master-Linux/build.xml:684: The following error occurred while executing this line:
/home/jenkins/workspace/Lucene-Solr-master-Linux/build.xml:59: The following error occurred while executing this line:
/home/jenkins/workspace/Lucene-Solr-master-Linux/solr/build.xml:233: The following error occurred while executing this line:
/home/jenkins/workspace/Lucene-Solr-master-Linux/solr/common-build.xml:529: The following error occurred while executing this line:
/home/jenkins/workspace/Lucene-Solr-master-Linux/lucene/common-build.xml:1457: The following error occurred while executing this line:
/home/jenkins/workspace/Lucene-Solr-master-Linux/lucene/common-build.xml:1014: There were test failures: 597 suites (10 ignored), 2413 tests, 1 error, 117 ignored (71 assumptions) [seed: 1E30BB4E7C3058D0]

Total time: 59 minutes 46 seconds
Build step 'Invoke Ant' marked build as failure
Archiving artifacts
[WARNINGS] Skipping publisher since build result is FAILURE
Recording test results
Email was triggered for: Failure - Any
Sending email for trigger: Failure - Any



Mime
View raw message