lucene-dev mailing list archives

Site index · List index
Message view « Date » · « Thread »
Top « Date » · « Thread »
From Policeman Jenkins Server <jenk...@thetaphi.de>
Subject [JENKINS] Lucene-Solr-master-Solaris (64bit/jdk1.8.0) - Build # 554 - Still Failing!
Date Mon, 02 May 2016 05:34:15 GMT
Build: http://jenkins.thetaphi.de/job/Lucene-Solr-master-Solaris/554/
Java: 64bit/jdk1.8.0 -XX:+UseCompressedOops -XX:+UseSerialGC

2 tests failed.
FAILED:  org.apache.solr.cloud.DeleteInactiveReplicaTest.deleteInactiveReplicaTest

Error Message:
Error from server at https://127.0.0.1:37080: Invalid replica : core_node4 in shard/collection : shard1/delDeadColl available replicas are core_node1

Stack Trace:
org.apache.solr.client.solrj.impl.HttpSolrClient$RemoteSolrException: Error from server at https://127.0.0.1:37080: Invalid replica : core_node4 in shard/collection : shard1/delDeadColl available replicas are core_node1
	at __randomizedtesting.SeedInfo.seed([4A1ABB138364B094:872420E0CCC5C676]:0)
	at org.apache.solr.client.solrj.impl.HttpSolrClient.executeMethod(HttpSolrClient.java:606)
	at org.apache.solr.client.solrj.impl.HttpSolrClient.request(HttpSolrClient.java:259)
	at org.apache.solr.client.solrj.impl.HttpSolrClient.request(HttpSolrClient.java:248)
	at org.apache.solr.client.solrj.impl.LBHttpSolrClient.doRequest(LBHttpSolrClient.java:413)
	at org.apache.solr.client.solrj.impl.LBHttpSolrClient.request(LBHttpSolrClient.java:366)
	at org.apache.solr.client.solrj.impl.CloudSolrClient.sendRequest(CloudSolrClient.java:1192)
	at org.apache.solr.client.solrj.impl.CloudSolrClient.requestWithRetryOnStaleState(CloudSolrClient.java:962)
	at org.apache.solr.client.solrj.impl.CloudSolrClient.request(CloudSolrClient.java:898)
	at org.apache.solr.client.solrj.SolrClient.request(SolrClient.java:1219)
	at org.apache.solr.cloud.DeleteReplicaTest.removeAndWaitForReplicaGone(DeleteReplicaTest.java:143)
	at org.apache.solr.cloud.DeleteInactiveReplicaTest.deleteInactiveReplicaTest(DeleteInactiveReplicaTest.java:124)
	at sun.reflect.NativeMethodAccessorImpl.invoke0(Native Method)
	at sun.reflect.NativeMethodAccessorImpl.invoke(NativeMethodAccessorImpl.java:62)
	at sun.reflect.DelegatingMethodAccessorImpl.invoke(DelegatingMethodAccessorImpl.java:43)
	at java.lang.reflect.Method.invoke(Method.java:498)
	at com.carrotsearch.randomizedtesting.RandomizedRunner.invoke(RandomizedRunner.java:1764)
	at com.carrotsearch.randomizedtesting.RandomizedRunner$8.evaluate(RandomizedRunner.java:871)
	at com.carrotsearch.randomizedtesting.RandomizedRunner$9.evaluate(RandomizedRunner.java:907)
	at com.carrotsearch.randomizedtesting.RandomizedRunner$10.evaluate(RandomizedRunner.java:921)
	at org.apache.solr.BaseDistributedSearchTestCase$ShardsRepeatRule$ShardsFixedStatement.callStatement(BaseDistributedSearchTestCase.java:985)
	at org.apache.solr.BaseDistributedSearchTestCase$ShardsRepeatRule$ShardsStatement.evaluate(BaseDistributedSearchTestCase.java:960)
	at com.carrotsearch.randomizedtesting.rules.SystemPropertiesRestoreRule$1.evaluate(SystemPropertiesRestoreRule.java:57)
	at org.apache.lucene.util.TestRuleSetupTeardownChained$1.evaluate(TestRuleSetupTeardownChained.java:49)
	at org.apache.lucene.util.AbstractBeforeAfterRule$1.evaluate(AbstractBeforeAfterRule.java:45)
	at org.apache.lucene.util.TestRuleThreadAndTestName$1.evaluate(TestRuleThreadAndTestName.java:48)
	at org.apache.lucene.util.TestRuleIgnoreAfterMaxFailures$1.evaluate(TestRuleIgnoreAfterMaxFailures.java:64)
	at org.apache.lucene.util.TestRuleMarkFailure$1.evaluate(TestRuleMarkFailure.java:47)
	at com.carrotsearch.randomizedtesting.rules.StatementAdapter.evaluate(StatementAdapter.java:36)
	at com.carrotsearch.randomizedtesting.ThreadLeakControl$StatementRunner.run(ThreadLeakControl.java:367)
	at com.carrotsearch.randomizedtesting.ThreadLeakControl.forkTimeoutingTask(ThreadLeakControl.java:809)
	at com.carrotsearch.randomizedtesting.ThreadLeakControl$3.evaluate(ThreadLeakControl.java:460)
	at com.carrotsearch.randomizedtesting.RandomizedRunner.runSingleTest(RandomizedRunner.java:880)
	at com.carrotsearch.randomizedtesting.RandomizedRunner$5.evaluate(RandomizedRunner.java:781)
	at com.carrotsearch.randomizedtesting.RandomizedRunner$6.evaluate(RandomizedRunner.java:816)
	at com.carrotsearch.randomizedtesting.RandomizedRunner$7.evaluate(RandomizedRunner.java:827)
	at com.carrotsearch.randomizedtesting.rules.StatementAdapter.evaluate(StatementAdapter.java:36)
	at com.carrotsearch.randomizedtesting.rules.SystemPropertiesRestoreRule$1.evaluate(SystemPropertiesRestoreRule.java:57)
	at org.apache.lucene.util.AbstractBeforeAfterRule$1.evaluate(AbstractBeforeAfterRule.java:45)
	at com.carrotsearch.randomizedtesting.rules.StatementAdapter.evaluate(StatementAdapter.java:36)
	at org.apache.lucene.util.TestRuleStoreClassName$1.evaluate(TestRuleStoreClassName.java:41)
	at com.carrotsearch.randomizedtesting.rules.NoShadowingOrOverridesOnMethodsRule$1.evaluate(NoShadowingOrOverridesOnMethodsRule.java:40)
	at com.carrotsearch.randomizedtesting.rules.NoShadowingOrOverridesOnMethodsRule$1.evaluate(NoShadowingOrOverridesOnMethodsRule.java:40)
	at com.carrotsearch.randomizedtesting.rules.StatementAdapter.evaluate(StatementAdapter.java:36)
	at com.carrotsearch.randomizedtesting.rules.StatementAdapter.evaluate(StatementAdapter.java:36)
	at com.carrotsearch.randomizedtesting.rules.StatementAdapter.evaluate(StatementAdapter.java:36)
	at org.apache.lucene.util.TestRuleAssertionsRequired$1.evaluate(TestRuleAssertionsRequired.java:53)
	at org.apache.lucene.util.TestRuleMarkFailure$1.evaluate(TestRuleMarkFailure.java:47)
	at org.apache.lucene.util.TestRuleIgnoreAfterMaxFailures$1.evaluate(TestRuleIgnoreAfterMaxFailures.java:64)
	at org.apache.lucene.util.TestRuleIgnoreTestSuites$1.evaluate(TestRuleIgnoreTestSuites.java:54)
	at com.carrotsearch.randomizedtesting.rules.StatementAdapter.evaluate(StatementAdapter.java:36)
	at com.carrotsearch.randomizedtesting.ThreadLeakControl$StatementRunner.run(ThreadLeakControl.java:367)
	at java.lang.Thread.run(Thread.java:745)


FAILED:  org.apache.solr.handler.component.SpellCheckComponentTest.testThresholdTokenFrequency

Error Message:
Path not found: /spellcheck/suggestions/[1]/suggestion

Stack Trace:
java.lang.RuntimeException: Path not found: /spellcheck/suggestions/[1]/suggestion
	at __randomizedtesting.SeedInfo.seed([4A1ABB138364B094:C0BD34E20C8F89EF]:0)
	at org.apache.solr.SolrTestCaseJ4.assertJQ(SolrTestCaseJ4.java:873)
	at org.apache.solr.SolrTestCaseJ4.assertJQ(SolrTestCaseJ4.java:820)
	at org.apache.solr.handler.component.SpellCheckComponentTest.testThresholdTokenFrequency(SpellCheckComponentTest.java:277)
	at sun.reflect.NativeMethodAccessorImpl.invoke0(Native Method)
	at sun.reflect.NativeMethodAccessorImpl.invoke(NativeMethodAccessorImpl.java:62)
	at sun.reflect.DelegatingMethodAccessorImpl.invoke(DelegatingMethodAccessorImpl.java:43)
	at java.lang.reflect.Method.invoke(Method.java:498)
	at com.carrotsearch.randomizedtesting.RandomizedRunner.invoke(RandomizedRunner.java:1764)
	at com.carrotsearch.randomizedtesting.RandomizedRunner$8.evaluate(RandomizedRunner.java:871)
	at com.carrotsearch.randomizedtesting.RandomizedRunner$9.evaluate(RandomizedRunner.java:907)
	at com.carrotsearch.randomizedtesting.RandomizedRunner$10.evaluate(RandomizedRunner.java:921)
	at com.carrotsearch.randomizedtesting.rules.SystemPropertiesRestoreRule$1.evaluate(SystemPropertiesRestoreRule.java:57)
	at org.apache.lucene.util.TestRuleSetupTeardownChained$1.evaluate(TestRuleSetupTeardownChained.java:49)
	at org.apache.lucene.util.AbstractBeforeAfterRule$1.evaluate(AbstractBeforeAfterRule.java:45)
	at org.apache.lucene.util.TestRuleThreadAndTestName$1.evaluate(TestRuleThreadAndTestName.java:48)
	at org.apache.lucene.util.TestRuleIgnoreAfterMaxFailures$1.evaluate(TestRuleIgnoreAfterMaxFailures.java:64)
	at org.apache.lucene.util.TestRuleMarkFailure$1.evaluate(TestRuleMarkFailure.java:47)
	at com.carrotsearch.randomizedtesting.rules.StatementAdapter.evaluate(StatementAdapter.java:36)
	at com.carrotsearch.randomizedtesting.ThreadLeakControl$StatementRunner.run(ThreadLeakControl.java:367)
	at com.carrotsearch.randomizedtesting.ThreadLeakControl.forkTimeoutingTask(ThreadLeakControl.java:809)
	at com.carrotsearch.randomizedtesting.ThreadLeakControl$3.evaluate(ThreadLeakControl.java:460)
	at com.carrotsearch.randomizedtesting.RandomizedRunner.runSingleTest(RandomizedRunner.java:880)
	at com.carrotsearch.randomizedtesting.RandomizedRunner$5.evaluate(RandomizedRunner.java:781)
	at com.carrotsearch.randomizedtesting.RandomizedRunner$6.evaluate(RandomizedRunner.java:816)
	at com.carrotsearch.randomizedtesting.RandomizedRunner$7.evaluate(RandomizedRunner.java:827)
	at com.carrotsearch.randomizedtesting.rules.StatementAdapter.evaluate(StatementAdapter.java:36)
	at com.carrotsearch.randomizedtesting.rules.SystemPropertiesRestoreRule$1.evaluate(SystemPropertiesRestoreRule.java:57)
	at org.apache.lucene.util.AbstractBeforeAfterRule$1.evaluate(AbstractBeforeAfterRule.java:45)
	at com.carrotsearch.randomizedtesting.rules.StatementAdapter.evaluate(StatementAdapter.java:36)
	at org.apache.lucene.util.TestRuleStoreClassName$1.evaluate(TestRuleStoreClassName.java:41)
	at com.carrotsearch.randomizedtesting.rules.NoShadowingOrOverridesOnMethodsRule$1.evaluate(NoShadowingOrOverridesOnMethodsRule.java:40)
	at com.carrotsearch.randomizedtesting.rules.NoShadowingOrOverridesOnMethodsRule$1.evaluate(NoShadowingOrOverridesOnMethodsRule.java:40)
	at com.carrotsearch.randomizedtesting.rules.StatementAdapter.evaluate(StatementAdapter.java:36)
	at com.carrotsearch.randomizedtesting.rules.StatementAdapter.evaluate(StatementAdapter.java:36)
	at com.carrotsearch.randomizedtesting.rules.StatementAdapter.evaluate(StatementAdapter.java:36)
	at org.apache.lucene.util.TestRuleAssertionsRequired$1.evaluate(TestRuleAssertionsRequired.java:53)
	at org.apache.lucene.util.TestRuleMarkFailure$1.evaluate(TestRuleMarkFailure.java:47)
	at org.apache.lucene.util.TestRuleIgnoreAfterMaxFailures$1.evaluate(TestRuleIgnoreAfterMaxFailures.java:64)
	at org.apache.lucene.util.TestRuleIgnoreTestSuites$1.evaluate(TestRuleIgnoreTestSuites.java:54)
	at com.carrotsearch.randomizedtesting.rules.StatementAdapter.evaluate(StatementAdapter.java:36)
	at com.carrotsearch.randomizedtesting.ThreadLeakControl$StatementRunner.run(ThreadLeakControl.java:367)
	at java.lang.Thread.run(Thread.java:745)




Build Log:
[...truncated 11213 lines...]
   [junit4] Suite: org.apache.solr.cloud.DeleteInactiveReplicaTest
   [junit4]   2> Creating dataDir: /export/home/jenkins/workspace/Lucene-Solr-master-Solaris/solr/build/solr-core/test/J1/temp/solr.cloud.DeleteInactiveReplicaTest_4A1ABB138364B094-001/init-core-data-001
   [junit4]   2> 1229429 INFO  (SUITE-DeleteInactiveReplicaTest-seed#[4A1ABB138364B094]-worker) [    ] o.a.s.SolrTestCaseJ4 Randomized ssl (true) and clientAuth (false)
   [junit4]   2> 1229430 INFO  (SUITE-DeleteInactiveReplicaTest-seed#[4A1ABB138364B094]-worker) [    ] o.a.s.BaseDistributedSearchTestCase Setting hostContext system property: /
   [junit4]   2> 1229433 INFO  (TEST-DeleteInactiveReplicaTest.deleteInactiveReplicaTest-seed#[4A1ABB138364B094]) [    ] o.a.s.c.ZkTestServer STARTING ZK TEST SERVER
   [junit4]   2> 1229433 INFO  (Thread-4048) [    ] o.a.s.c.ZkTestServer client port:0.0.0.0/0.0.0.0:0
   [junit4]   2> 1229433 INFO  (Thread-4048) [    ] o.a.s.c.ZkTestServer Starting server
   [junit4]   2> 1229533 INFO  (TEST-DeleteInactiveReplicaTest.deleteInactiveReplicaTest-seed#[4A1ABB138364B094]) [    ] o.a.s.c.ZkTestServer start zk server on port:39447
   [junit4]   2> 1229533 INFO  (TEST-DeleteInactiveReplicaTest.deleteInactiveReplicaTest-seed#[4A1ABB138364B094]) [    ] o.a.s.c.c.SolrZkClient Using default ZkCredentialsProvider
   [junit4]   2> 1229534 INFO  (TEST-DeleteInactiveReplicaTest.deleteInactiveReplicaTest-seed#[4A1ABB138364B094]) [    ] o.a.s.c.c.ConnectionManager Waiting for client to connect to ZooKeeper
   [junit4]   2> 1229537 INFO  (zkCallback-1545-thread-1) [    ] o.a.s.c.c.ConnectionManager Watcher org.apache.solr.common.cloud.ConnectionManager@2321b6e8 name:ZooKeeperConnection Watcher:127.0.0.1:39447 got event WatchedEvent state:SyncConnected type:None path:null path:null type:None
   [junit4]   2> 1229537 INFO  (TEST-DeleteInactiveReplicaTest.deleteInactiveReplicaTest-seed#[4A1ABB138364B094]) [    ] o.a.s.c.c.ConnectionManager Client is connected to ZooKeeper
   [junit4]   2> 1229537 INFO  (TEST-DeleteInactiveReplicaTest.deleteInactiveReplicaTest-seed#[4A1ABB138364B094]) [    ] o.a.s.c.c.SolrZkClient Using default ZkACLProvider
   [junit4]   2> 1229537 INFO  (TEST-DeleteInactiveReplicaTest.deleteInactiveReplicaTest-seed#[4A1ABB138364B094]) [    ] o.a.s.c.c.SolrZkClient makePath: /solr
   [junit4]   2> 1229540 INFO  (TEST-DeleteInactiveReplicaTest.deleteInactiveReplicaTest-seed#[4A1ABB138364B094]) [    ] o.a.s.c.c.SolrZkClient Using default ZkCredentialsProvider
   [junit4]   2> 1229542 INFO  (TEST-DeleteInactiveReplicaTest.deleteInactiveReplicaTest-seed#[4A1ABB138364B094]) [    ] o.a.s.c.c.ConnectionManager Waiting for client to connect to ZooKeeper
   [junit4]   2> 1229544 INFO  (zkCallback-1546-thread-1) [    ] o.a.s.c.c.ConnectionManager Watcher org.apache.solr.common.cloud.ConnectionManager@3f2c5466 name:ZooKeeperConnection Watcher:127.0.0.1:39447/solr got event WatchedEvent state:SyncConnected type:None path:null path:null type:None
   [junit4]   2> 1229544 INFO  (TEST-DeleteInactiveReplicaTest.deleteInactiveReplicaTest-seed#[4A1ABB138364B094]) [    ] o.a.s.c.c.ConnectionManager Client is connected to ZooKeeper
   [junit4]   2> 1229544 INFO  (TEST-DeleteInactiveReplicaTest.deleteInactiveReplicaTest-seed#[4A1ABB138364B094]) [    ] o.a.s.c.c.SolrZkClient Using default ZkACLProvider
   [junit4]   2> 1229544 INFO  (TEST-DeleteInactiveReplicaTest.deleteInactiveReplicaTest-seed#[4A1ABB138364B094]) [    ] o.a.s.c.c.SolrZkClient makePath: /collections/collection1
   [junit4]   2> 1229547 INFO  (TEST-DeleteInactiveReplicaTest.deleteInactiveReplicaTest-seed#[4A1ABB138364B094]) [    ] o.a.s.c.c.SolrZkClient makePath: /collections/collection1/shards
   [junit4]   2> 1229550 INFO  (TEST-DeleteInactiveReplicaTest.deleteInactiveReplicaTest-seed#[4A1ABB138364B094]) [    ] o.a.s.c.c.SolrZkClient makePath: /collections/control_collection
   [junit4]   2> 1229553 INFO  (TEST-DeleteInactiveReplicaTest.deleteInactiveReplicaTest-seed#[4A1ABB138364B094]) [    ] o.a.s.c.c.SolrZkClient makePath: /collections/control_collection/shards
   [junit4]   2> 1229556 INFO  (TEST-DeleteInactiveReplicaTest.deleteInactiveReplicaTest-seed#[4A1ABB138364B094]) [    ] o.a.s.c.AbstractZkTestCase put /export/home/jenkins/workspace/Lucene-Solr-master-Solaris/solr/core/src/test-files/solr/collection1/conf/solrconfig-tlog.xml to /configs/conf1/solrconfig.xml
   [junit4]   2> 1229556 INFO  (TEST-DeleteInactiveReplicaTest.deleteInactiveReplicaTest-seed#[4A1ABB138364B094]) [    ] o.a.s.c.c.SolrZkClient makePath: /configs/conf1/solrconfig.xml
   [junit4]   2> 1229561 INFO  (TEST-DeleteInactiveReplicaTest.deleteInactiveReplicaTest-seed#[4A1ABB138364B094]) [    ] o.a.s.c.AbstractZkTestCase put /export/home/jenkins/workspace/Lucene-Solr-master-Solaris/solr/core/src/test-files/solr/collection1/conf/schema.xml to /configs/conf1/schema.xml
   [junit4]   2> 1229561 INFO  (TEST-DeleteInactiveReplicaTest.deleteInactiveReplicaTest-seed#[4A1ABB138364B094]) [    ] o.a.s.c.c.SolrZkClient makePath: /configs/conf1/schema.xml
   [junit4]   2> 1229564 INFO  (TEST-DeleteInactiveReplicaTest.deleteInactiveReplicaTest-seed#[4A1ABB138364B094]) [    ] o.a.s.c.AbstractZkTestCase put /export/home/jenkins/workspace/Lucene-Solr-master-Solaris/solr/core/src/test-files/solr/collection1/conf/solrconfig.snippet.randomindexconfig.xml to /configs/conf1/solrconfig.snippet.randomindexconfig.xml
   [junit4]   2> 1229565 INFO  (TEST-DeleteInactiveReplicaTest.deleteInactiveReplicaTest-seed#[4A1ABB138364B094]) [    ] o.a.s.c.c.SolrZkClient makePath: /configs/conf1/solrconfig.snippet.randomindexconfig.xml
   [junit4]   2> 1229568 INFO  (TEST-DeleteInactiveReplicaTest.deleteInactiveReplicaTest-seed#[4A1ABB138364B094]) [    ] o.a.s.c.AbstractZkTestCase put /export/home/jenkins/workspace/Lucene-Solr-master-Solaris/solr/core/src/test-files/solr/collection1/conf/stopwords.txt to /configs/conf1/stopwords.txt
   [junit4]   2> 1229568 INFO  (TEST-DeleteInactiveReplicaTest.deleteInactiveReplicaTest-seed#[4A1ABB138364B094]) [    ] o.a.s.c.c.SolrZkClient makePath: /configs/conf1/stopwords.txt
   [junit4]   2> 1229571 INFO  (TEST-DeleteInactiveReplicaTest.deleteInactiveReplicaTest-seed#[4A1ABB138364B094]) [    ] o.a.s.c.AbstractZkTestCase put /export/home/jenkins/workspace/Lucene-Solr-master-Solaris/solr/core/src/test-files/solr/collection1/conf/protwords.txt to /configs/conf1/protwords.txt
   [junit4]   2> 1229571 INFO  (TEST-DeleteInactiveReplicaTest.deleteInactiveReplicaTest-seed#[4A1ABB138364B094]) [    ] o.a.s.c.c.SolrZkClient makePath: /configs/conf1/protwords.txt
   [junit4]   2> 1229574 INFO  (TEST-DeleteInactiveReplicaTest.deleteInactiveReplicaTest-seed#[4A1ABB138364B094]) [    ] o.a.s.c.AbstractZkTestCase put /export/home/jenkins/workspace/Lucene-Solr-master-Solaris/solr/core/src/test-files/solr/collection1/conf/currency.xml to /configs/conf1/currency.xml
   [junit4]   2> 1229575 INFO  (TEST-DeleteInactiveReplicaTest.deleteInactiveReplicaTest-seed#[4A1ABB138364B094]) [    ] o.a.s.c.c.SolrZkClient makePath: /configs/conf1/currency.xml
   [junit4]   2> 1229578 INFO  (TEST-DeleteInactiveReplicaTest.deleteInactiveReplicaTest-seed#[4A1ABB138364B094]) [    ] o.a.s.c.AbstractZkTestCase put /export/home/jenkins/workspace/Lucene-Solr-master-Solaris/solr/core/src/test-files/solr/collection1/conf/enumsConfig.xml to /configs/conf1/enumsConfig.xml
   [junit4]   2> 1229579 INFO  (TEST-DeleteInactiveReplicaTest.deleteInactiveReplicaTest-seed#[4A1ABB138364B094]) [    ] o.a.s.c.c.SolrZkClient makePath: /configs/conf1/enumsConfig.xml
   [junit4]   2> 1229582 INFO  (TEST-DeleteInactiveReplicaTest.deleteInactiveReplicaTest-seed#[4A1ABB138364B094]) [    ] o.a.s.c.AbstractZkTestCase put /export/home/jenkins/workspace/Lucene-Solr-master-Solaris/solr/core/src/test-files/solr/collection1/conf/open-exchange-rates.json to /configs/conf1/open-exchange-rates.json
   [junit4]   2> 1229582 INFO  (TEST-DeleteInactiveReplicaTest.deleteInactiveReplicaTest-seed#[4A1ABB138364B094]) [    ] o.a.s.c.c.SolrZkClient makePath: /configs/conf1/open-exchange-rates.json
   [junit4]   2> 1229585 INFO  (TEST-DeleteInactiveReplicaTest.deleteInactiveReplicaTest-seed#[4A1ABB138364B094]) [    ] o.a.s.c.AbstractZkTestCase put /export/home/jenkins/workspace/Lucene-Solr-master-Solaris/solr/core/src/test-files/solr/collection1/conf/mapping-ISOLatin1Accent.txt to /configs/conf1/mapping-ISOLatin1Accent.txt
   [junit4]   2> 1229585 INFO  (TEST-DeleteInactiveReplicaTest.deleteInactiveReplicaTest-seed#[4A1ABB138364B094]) [    ] o.a.s.c.c.SolrZkClient makePath: /configs/conf1/mapping-ISOLatin1Accent.txt
   [junit4]   2> 1229588 INFO  (TEST-DeleteInactiveReplicaTest.deleteInactiveReplicaTest-seed#[4A1ABB138364B094]) [    ] o.a.s.c.AbstractZkTestCase put /export/home/jenkins/workspace/Lucene-Solr-master-Solaris/solr/core/src/test-files/solr/collection1/conf/old_synonyms.txt to /configs/conf1/old_synonyms.txt
   [junit4]   2> 1229588 INFO  (TEST-DeleteInactiveReplicaTest.deleteInactiveReplicaTest-seed#[4A1ABB138364B094]) [    ] o.a.s.c.c.SolrZkClient makePath: /configs/conf1/old_synonyms.txt
   [junit4]   2> 1229592 INFO  (TEST-DeleteInactiveReplicaTest.deleteInactiveReplicaTest-seed#[4A1ABB138364B094]) [    ] o.a.s.c.AbstractZkTestCase put /export/home/jenkins/workspace/Lucene-Solr-master-Solaris/solr/core/src/test-files/solr/collection1/conf/synonyms.txt to /configs/conf1/synonyms.txt
   [junit4]   2> 1229592 INFO  (TEST-DeleteInactiveReplicaTest.deleteInactiveReplicaTest-seed#[4A1ABB138364B094]) [    ] o.a.s.c.c.SolrZkClient makePath: /configs/conf1/synonyms.txt
   [junit4]   2> 1229596 INFO  (TEST-DeleteInactiveReplicaTest.deleteInactiveReplicaTest-seed#[4A1ABB138364B094]) [    ] o.a.s.c.c.SolrZkClient Using default ZkCredentialsProvider
   [junit4]   2> 1229597 INFO  (TEST-DeleteInactiveReplicaTest.deleteInactiveReplicaTest-seed#[4A1ABB138364B094]) [    ] o.a.s.c.c.ConnectionManager Waiting for client to connect to ZooKeeper
   [junit4]   2> 1229599 INFO  (zkCallback-1547-thread-1) [    ] o.a.s.c.c.ConnectionManager Watcher org.apache.solr.common.cloud.ConnectionManager@61cedd6f name:ZooKeeperConnection Watcher:127.0.0.1:39447/solr got event WatchedEvent state:SyncConnected type:None path:null path:null type:None
   [junit4]   2> 1229599 INFO  (TEST-DeleteInactiveReplicaTest.deleteInactiveReplicaTest-seed#[4A1ABB138364B094]) [    ] o.a.s.c.c.ConnectionManager Client is connected to ZooKeeper
   [junit4]   2> 1229599 INFO  (TEST-DeleteInactiveReplicaTest.deleteInactiveReplicaTest-seed#[4A1ABB138364B094]) [    ] o.a.s.c.c.SolrZkClient Using default ZkACLProvider
   [junit4]   2> 1229746 INFO  (TEST-DeleteInactiveReplicaTest.deleteInactiveReplicaTest-seed#[4A1ABB138364B094]) [    ] o.a.s.SolrTestCaseJ4 Writing core.properties file to /export/home/jenkins/workspace/Lucene-Solr-master-Solaris/solr/build/solr-core/test/J1/temp/solr.cloud.DeleteInactiveReplicaTest_4A1ABB138364B094-001/control-001/cores/collection1
   [junit4]   2> 1229748 INFO  (TEST-DeleteInactiveReplicaTest.deleteInactiveReplicaTest-seed#[4A1ABB138364B094]) [    ] o.e.j.s.Server jetty-9.3.8.v20160314
   [junit4]   2> 1229749 INFO  (TEST-DeleteInactiveReplicaTest.deleteInactiveReplicaTest-seed#[4A1ABB138364B094]) [    ] o.e.j.s.h.ContextHandler Started o.e.j.s.ServletContextHandler@134025e0{/,null,AVAILABLE}
   [junit4]   2> 1229756 INFO  (TEST-DeleteInactiveReplicaTest.deleteInactiveReplicaTest-seed#[4A1ABB138364B094]) [    ] o.e.j.u.s.SslContextFactory x509=X509@11d719d1(solrtest,h=[],w=[]) for SslContextFactory@aca63b0(file:///export/home/jenkins/workspace/Lucene-Solr-master-Solaris/solr/server/etc/test/solrtest.keystore,null)
   [junit4]   2> 1229768 INFO  (TEST-DeleteInactiveReplicaTest.deleteInactiveReplicaTest-seed#[4A1ABB138364B094]) [    ] o.e.j.s.ServerConnector Started ServerConnector@237afaa9{SSL,[ssl, http/1.1]}{127.0.0.1:37575}
   [junit4]   2> 1229768 INFO  (TEST-DeleteInactiveReplicaTest.deleteInactiveReplicaTest-seed#[4A1ABB138364B094]) [    ] o.e.j.s.Server Started @1234346ms
   [junit4]   2> 1229769 INFO  (TEST-DeleteInactiveReplicaTest.deleteInactiveReplicaTest-seed#[4A1ABB138364B094]) [    ] o.a.s.c.s.e.JettySolrRunner Jetty properties: {solr.data.dir=/export/home/jenkins/workspace/Lucene-Solr-master-Solaris/solr/build/solr-core/test/J1/temp/solr.cloud.DeleteInactiveReplicaTest_4A1ABB138364B094-001/tempDir-001/control/data, hostContext=/, hostPort=37575, coreRootDirectory=/export/home/jenkins/workspace/Lucene-Solr-master-Solaris/solr/build/solr-core/test/J1/temp/solr.cloud.DeleteInactiveReplicaTest_4A1ABB138364B094-001/control-001/cores}
   [junit4]   2> 1229769 INFO  (TEST-DeleteInactiveReplicaTest.deleteInactiveReplicaTest-seed#[4A1ABB138364B094]) [    ] o.a.s.s.SolrDispatchFilter SolrDispatchFilter.init(): sun.misc.Launcher$AppClassLoader@6d06d69c
   [junit4]   2> 1229769 INFO  (TEST-DeleteInactiveReplicaTest.deleteInactiveReplicaTest-seed#[4A1ABB138364B094]) [    ] o.a.s.c.SolrResourceLoader new SolrResourceLoader for directory: '/export/home/jenkins/workspace/Lucene-Solr-master-Solaris/solr/build/solr-core/test/J1/temp/solr.cloud.DeleteInactiveReplicaTest_4A1ABB138364B094-001/control-001'
   [junit4]   2> 1229770 INFO  (TEST-DeleteInactiveReplicaTest.deleteInactiveReplicaTest-seed#[4A1ABB138364B094]) [    ] o.a.s.c.SolrResourceLoader JNDI not configured for solr (NoInitialContextEx)
   [junit4]   2> 1229770 INFO  (TEST-DeleteInactiveReplicaTest.deleteInactiveReplicaTest-seed#[4A1ABB138364B094]) [    ] o.a.s.c.SolrResourceLoader solr home defaulted to 'solr/' (could not find system property or JNDI)
   [junit4]   2> 1229771 INFO  (TEST-DeleteInactiveReplicaTest.deleteInactiveReplicaTest-seed#[4A1ABB138364B094]) [    ] o.a.s.c.c.SolrZkClient Using default ZkCredentialsProvider
   [junit4]   2> 1229773 INFO  (TEST-DeleteInactiveReplicaTest.deleteInactiveReplicaTest-seed#[4A1ABB138364B094]) [    ] o.a.s.c.c.ConnectionManager Waiting for client to connect to ZooKeeper
   [junit4]   2> 1229776 INFO  (zkCallback-1548-thread-1) [    ] o.a.s.c.c.ConnectionManager Watcher org.apache.solr.common.cloud.ConnectionManager@340e87b5 name:ZooKeeperConnection Watcher:127.0.0.1:39447/solr got event WatchedEvent state:SyncConnected type:None path:null path:null type:None
   [junit4]   2> 1229776 INFO  (TEST-DeleteInactiveReplicaTest.deleteInactiveReplicaTest-seed#[4A1ABB138364B094]) [    ] o.a.s.c.c.ConnectionManager Client is connected to ZooKeeper
   [junit4]   2> 1229777 INFO  (TEST-DeleteInactiveReplicaTest.deleteInactiveReplicaTest-seed#[4A1ABB138364B094]) [    ] o.a.s.c.c.SolrZkClient Using default ZkACLProvider
   [junit4]   2> 1229779 INFO  (TEST-DeleteInactiveReplicaTest.deleteInactiveReplicaTest-seed#[4A1ABB138364B094]) [    ] o.a.s.s.SolrDispatchFilter Loading solr.xml from SolrHome (not found in ZooKeeper)
   [junit4]   2> 1229779 INFO  (TEST-DeleteInactiveReplicaTest.deleteInactiveReplicaTest-seed#[4A1ABB138364B094]) [    ] o.a.s.c.SolrXmlConfig Loading container configuration from /export/home/jenkins/workspace/Lucene-Solr-master-Solaris/solr/build/solr-core/test/J1/temp/solr.cloud.DeleteInactiveReplicaTest_4A1ABB138364B094-001/control-001/solr.xml
   [junit4]   2> 1229789 INFO  (TEST-DeleteInactiveReplicaTest.deleteInactiveReplicaTest-seed#[4A1ABB138364B094]) [    ] o.a.s.c.CorePropertiesLocator Config-defined core root directory: /export/home/jenkins/workspace/Lucene-Solr-master-Solaris/solr/build/solr-core/test/J1/temp/solr.cloud.DeleteInactiveReplicaTest_4A1ABB138364B094-001/control-001/cores
   [junit4]   2> 1229789 INFO  (TEST-DeleteInactiveReplicaTest.deleteInactiveReplicaTest-seed#[4A1ABB138364B094]) [    ] o.a.s.c.CoreContainer New CoreContainer 669306324
   [junit4]   2> 1229789 INFO  (TEST-DeleteInactiveReplicaTest.deleteInactiveReplicaTest-seed#[4A1ABB138364B094]) [    ] o.a.s.c.CoreContainer Loading cores into CoreContainer [instanceDir=/export/home/jenkins/workspace/Lucene-Solr-master-Solaris/solr/build/solr-core/test/J1/temp/solr.cloud.DeleteInactiveReplicaTest_4A1ABB138364B094-001/control-001]
   [junit4]   2> 1229790 WARN  (TEST-DeleteInactiveReplicaTest.deleteInactiveReplicaTest-seed#[4A1ABB138364B094]) [    ] o.a.s.c.CoreContainer Couldn't add files from /export/home/jenkins/workspace/Lucene-Solr-master-Solaris/solr/build/solr-core/test/J1/temp/solr.cloud.DeleteInactiveReplicaTest_4A1ABB138364B094-001/control-001/lib to classpath: /export/home/jenkins/workspace/Lucene-Solr-master-Solaris/solr/build/solr-core/test/J1/temp/solr.cloud.DeleteInactiveReplicaTest_4A1ABB138364B094-001/control-001/lib
   [junit4]   2> 1229790 INFO  (TEST-DeleteInactiveReplicaTest.deleteInactiveReplicaTest-seed#[4A1ABB138364B094]) [    ] o.a.s.h.c.HttpShardHandlerFactory created with socketTimeout : 90000,urlScheme : ,connTimeout : 15000,maxConnectionsPerHost : 20,maxConnections : 10000,corePoolSize : 0,maximumPoolSize : 2147483647,maxThreadIdleTime : 5,sizeOfQueue : -1,fairnessPolicy : false,
   [junit4]   2> 1229792 INFO  (TEST-DeleteInactiveReplicaTest.deleteInactiveReplicaTest-seed#[4A1ABB138364B094]) [    ] o.a.s.u.UpdateShardHandler Creating UpdateShardHandler HTTP client with params: 
   [junit4]   2> 1229793 INFO  (TEST-DeleteInactiveReplicaTest.deleteInactiveReplicaTest-seed#[4A1ABB138364B094]) [    ] o.a.s.l.LogWatcher SLF4J impl is org.slf4j.impl.Log4jLoggerFactory
   [junit4]   2> 1229793 INFO  (TEST-DeleteInactiveReplicaTest.deleteInactiveReplicaTest-seed#[4A1ABB138364B094]) [    ] o.a.s.l.LogWatcher Registering Log Listener [Log4j (org.slf4j.impl.Log4jLoggerFactory)]
   [junit4]   2> 1229793 INFO  (TEST-DeleteInactiveReplicaTest.deleteInactiveReplicaTest-seed#[4A1ABB138364B094]) [    ] o.a.s.c.ZkContainer Zookeeper client=127.0.0.1:39447/solr
   [junit4]   2> 1229793 INFO  (TEST-DeleteInactiveReplicaTest.deleteInactiveReplicaTest-seed#[4A1ABB138364B094]) [    ] o.a.s.c.ZkController zkHost includes chroot
   [junit4]   2> 1229793 INFO  (TEST-DeleteInactiveReplicaTest.deleteInactiveReplicaTest-seed#[4A1ABB138364B094]) [    ] o.a.s.c.c.SolrZkClient Using default ZkCredentialsProvider
   [junit4]   2> 1229794 INFO  (TEST-DeleteInactiveReplicaTest.deleteInactiveReplicaTest-seed#[4A1ABB138364B094]) [    ] o.a.s.c.c.ConnectionManager Waiting for client to connect to ZooKeeper
   [junit4]   2> 1229795 INFO  (zkCallback-1551-thread-1) [    ] o.a.s.c.c.ConnectionManager Watcher org.apache.solr.common.cloud.ConnectionManager@1af8c8 name:ZooKeeperConnection Watcher:127.0.0.1:39447 got event WatchedEvent state:SyncConnected type:None path:null path:null type:None
   [junit4]   2> 1229796 INFO  (TEST-DeleteInactiveReplicaTest.deleteInactiveReplicaTest-seed#[4A1ABB138364B094]) [    ] o.a.s.c.c.ConnectionManager Client is connected to ZooKeeper
   [junit4]   2> 1229796 INFO  (TEST-DeleteInactiveReplicaTest.deleteInactiveReplicaTest-seed#[4A1ABB138364B094]) [    ] o.a.s.c.c.SolrZkClient Using default ZkACLProvider
   [junit4]   2> 1229798 INFO  (TEST-DeleteInactiveReplicaTest.deleteInactiveReplicaTest-seed#[4A1ABB138364B094]) [n:127.0.0.1:37575_    ] o.a.s.c.ZkController Added new OnReconnect listener org.apache.solr.cloud.ZkController$$Lambda$11/1131684808@180219ea
   [junit4]   2> 1229798 INFO  (TEST-DeleteInactiveReplicaTest.deleteInactiveReplicaTest-seed#[4A1ABB138364B094]) [n:127.0.0.1:37575_    ] o.a.s.c.c.ConnectionManager Waiting for client to connect to ZooKeeper
   [junit4]   2> 1229800 INFO  (zkCallback-1552-thread-1-processing-n:127.0.0.1:37575_) [n:127.0.0.1:37575_    ] o.a.s.c.c.ConnectionManager Watcher org.apache.solr.common.cloud.ConnectionManager@229dd9ee name:ZooKeeperConnection Watcher:127.0.0.1:39447/solr got event WatchedEvent state:SyncConnected type:None path:null path:null type:None
   [junit4]   2> 1229800 INFO  (TEST-DeleteInactiveReplicaTest.deleteInactiveReplicaTest-seed#[4A1ABB138364B094]) [n:127.0.0.1:37575_    ] o.a.s.c.c.ConnectionManager Client is connected to ZooKeeper
   [junit4]   2> 1229802 INFO  (TEST-DeleteInactiveReplicaTest.deleteInactiveReplicaTest-seed#[4A1ABB138364B094]) [n:127.0.0.1:37575_    ] o.a.s.c.c.SolrZkClient makePath: /overseer/queue
   [junit4]   2> 1229805 INFO  (TEST-DeleteInactiveReplicaTest.deleteInactiveReplicaTest-seed#[4A1ABB138364B094]) [n:127.0.0.1:37575_    ] o.a.s.c.c.SolrZkClient makePath: /overseer/collection-queue-work
   [junit4]   2> 1229810 INFO  (TEST-DeleteInactiveReplicaTest.deleteInactiveReplicaTest-seed#[4A1ABB138364B094]) [n:127.0.0.1:37575_    ] o.a.s.c.c.SolrZkClient makePath: /overseer/collection-map-running
   [junit4]   2> 1229813 INFO  (TEST-DeleteInactiveReplicaTest.deleteInactiveReplicaTest-seed#[4A1ABB138364B094]) [n:127.0.0.1:37575_    ] o.a.s.c.c.SolrZkClient makePath: /overseer/collection-map-completed
   [junit4]   2> 1229816 INFO  (TEST-DeleteInactiveReplicaTest.deleteInactiveReplicaTest-seed#[4A1ABB138364B094]) [n:127.0.0.1:37575_    ] o.a.s.c.c.SolrZkClient makePath: /overseer/collection-map-failure
   [junit4]   2> 1229820 INFO  (TEST-DeleteInactiveReplicaTest.deleteInactiveReplicaTest-seed#[4A1ABB138364B094]) [n:127.0.0.1:37575_    ] o.a.s.c.c.SolrZkClient makePath: /live_nodes
   [junit4]   2> 1229824 INFO  (TEST-DeleteInactiveReplicaTest.deleteInactiveReplicaTest-seed#[4A1ABB138364B094]) [n:127.0.0.1:37575_    ] o.a.s.c.c.SolrZkClient makePath: /aliases.json
   [junit4]   2> 1229827 INFO  (TEST-DeleteInactiveReplicaTest.deleteInactiveReplicaTest-seed#[4A1ABB138364B094]) [n:127.0.0.1:37575_    ] o.a.s.c.c.SolrZkClient makePath: /clusterstate.json
   [junit4]   2> 1229829 INFO  (TEST-DeleteInactiveReplicaTest.deleteInactiveReplicaTest-seed#[4A1ABB138364B094]) [n:127.0.0.1:37575_    ] o.a.s.c.c.SolrZkClient makePath: /security.json
   [junit4]   2> 1229831 INFO  (TEST-DeleteInactiveReplicaTest.deleteInactiveReplicaTest-seed#[4A1ABB138364B094]) [n:127.0.0.1:37575_    ] o.a.s.c.c.ZkStateReader Updating cluster state from ZooKeeper... 
   [junit4]   2> 1229834 INFO  (TEST-DeleteInactiveReplicaTest.deleteInactiveReplicaTest-seed#[4A1ABB138364B094]) [n:127.0.0.1:37575_    ] o.a.s.c.c.ZkStateReader Updated live nodes from ZooKeeper... (0) -> (0)
   [junit4]   2> 1229838 INFO  (TEST-DeleteInactiveReplicaTest.deleteInactiveReplicaTest-seed#[4A1ABB138364B094]) [n:127.0.0.1:37575_    ] o.a.s.c.c.SolrZkClient makePath: /overseer_elect
   [junit4]   2> 1229840 INFO  (TEST-DeleteInactiveReplicaTest.deleteInactiveReplicaTest-seed#[4A1ABB138364B094]) [n:127.0.0.1:37575_    ] o.a.s.c.c.SolrZkClient makePath: /overseer_elect/election
   [junit4]   2> 1229843 INFO  (TEST-DeleteInactiveReplicaTest.deleteInactiveReplicaTest-seed#[4A1ABB138364B094]) [n:127.0.0.1:37575_    ] o.a.s.c.Overseer Overseer (id=null) closing
   [junit4]   2> 1229843 INFO  (TEST-DeleteInactiveReplicaTest.deleteInactiveReplicaTest-seed#[4A1ABB138364B094]) [n:127.0.0.1:37575_    ] o.a.s.c.LeaderElector Joined leadership election with path: /overseer_elect/election/95824435900317701-127.0.0.1:37575_-n_0000000000
   [junit4]   2> 1229844 INFO  (TEST-DeleteInactiveReplicaTest.deleteInactiveReplicaTest-seed#[4A1ABB138364B094]) [n:127.0.0.1:37575_    ] o.a.s.c.OverseerElectionContext I am going to be the leader 127.0.0.1:37575_
   [junit4]   2> 1229844 INFO  (TEST-DeleteInactiveReplicaTest.deleteInactiveReplicaTest-seed#[4A1ABB138364B094]) [n:127.0.0.1:37575_    ] o.a.s.c.c.SolrZkClient makePath: /overseer_elect/leader
   [junit4]   2> 1229847 INFO  (TEST-DeleteInactiveReplicaTest.deleteInactiveReplicaTest-seed#[4A1ABB138364B094]) [n:127.0.0.1:37575_    ] o.a.s.c.Overseer Overseer (id=95824435900317701-127.0.0.1:37575_-n_0000000000) starting
   [junit4]   2> 1229850 INFO  (TEST-DeleteInactiveReplicaTest.deleteInactiveReplicaTest-seed#[4A1ABB138364B094]) [n:127.0.0.1:37575_    ] o.a.s.c.c.SolrZkClient makePath: /overseer/queue-work
   [junit4]   2> 1229860 INFO  (TEST-DeleteInactiveReplicaTest.deleteInactiveReplicaTest-seed#[4A1ABB138364B094]) [n:127.0.0.1:37575_    ] o.a.s.c.OverseerAutoReplicaFailoverThread Starting OverseerAutoReplicaFailoverThread autoReplicaFailoverWorkLoopDelay=10000 autoReplicaFailoverWaitAfterExpiration=30000 autoReplicaFailoverBadNodeExpiration=60000
   [junit4]   2> 1229861 INFO  (TEST-DeleteInactiveReplicaTest.deleteInactiveReplicaTest-seed#[4A1ABB138364B094]) [n:127.0.0.1:37575_    ] o.a.s.c.ZkController Register node as live in ZooKeeper:/live_nodes/127.0.0.1:37575_
   [junit4]   2> 1229862 INFO  (TEST-DeleteInactiveReplicaTest.deleteInactiveReplicaTest-seed#[4A1ABB138364B094]) [n:127.0.0.1:37575_    ] o.a.s.c.c.SolrZkClient makePath: /live_nodes/127.0.0.1:37575_
   [junit4]   2> 1229865 INFO  (OverseerCollectionConfigSetProcessor-95824435900317701-127.0.0.1:37575_-n_0000000000) [n:127.0.0.1:37575_    ] o.a.s.c.OverseerTaskProcessor Process current queue of overseer operations
   [junit4]   2> 1229865 INFO  (zkCallback-1552-thread-1-processing-n:127.0.0.1:37575_) [n:127.0.0.1:37575_    ] o.a.s.c.c.ZkStateReader A live node change: [WatchedEvent state:SyncConnected type:NodeChildrenChanged path:/live_nodes], has occurred - updating... (live nodes size: [0])
   [junit4]   2> 1229867 INFO  (OverseerStateUpdate-95824435900317701-127.0.0.1:37575_-n_0000000000) [n:127.0.0.1:37575_    ] o.a.s.c.Overseer Starting to work on the main queue
   [junit4]   2> 1229875 INFO  (OverseerStateUpdate-95824435900317701-127.0.0.1:37575_-n_0000000000) [n:127.0.0.1:37575_    ] o.a.s.c.c.ZkStateReader Updated live nodes from ZooKeeper... (0) -> (1)
   [junit4]   2> 1229889 INFO  (TEST-DeleteInactiveReplicaTest.deleteInactiveReplicaTest-seed#[4A1ABB138364B094]) [n:127.0.0.1:37575_    ] o.a.s.c.CoreContainer Security conf doesn't exist. Skipping setup for authorization module.
   [junit4]   2> 1229890 INFO  (TEST-DeleteInactiveReplicaTest.deleteInactiveReplicaTest-seed#[4A1ABB138364B094]) [n:127.0.0.1:37575_    ] o.a.s.c.CoreContainer No authentication plugin used.
   [junit4]   2> 1229891 INFO  (TEST-DeleteInactiveReplicaTest.deleteInactiveReplicaTest-seed#[4A1ABB138364B094]) [n:127.0.0.1:37575_    ] o.a.s.c.CorePropertiesLocator Looking for core definitions underneath /export/home/jenkins/workspace/Lucene-Solr-master-Solaris/solr/build/solr-core/test/J1/temp/solr.cloud.DeleteInactiveReplicaTest_4A1ABB138364B094-001/control-001/cores
   [junit4]   2> 1229892 INFO  (TEST-DeleteInactiveReplicaTest.deleteInactiveReplicaTest-seed#[4A1ABB138364B094]) [n:127.0.0.1:37575_    ] o.a.s.c.CoreDescriptor Created CoreDescriptor: {name=collection1, config=solrconfig.xml, transient=false, schema=schema.xml, loadOnStartup=true, configSetProperties=configsetprops.json, collection=control_collection, coreNodeName=, dataDir=data/, shard=}
   [junit4]   2> 1229892 INFO  (TEST-DeleteInactiveReplicaTest.deleteInactiveReplicaTest-seed#[4A1ABB138364B094]) [n:127.0.0.1:37575_    ] o.a.s.c.CorePropertiesLocator Found core collection1 in /export/home/jenkins/workspace/Lucene-Solr-master-Solaris/solr/build/solr-core/test/J1/temp/solr.cloud.DeleteInactiveReplicaTest_4A1ABB138364B094-001/control-001/cores/collection1
   [junit4]   2> 1229892 INFO  (TEST-DeleteInactiveReplicaTest.deleteInactiveReplicaTest-seed#[4A1ABB138364B094]) [n:127.0.0.1:37575_    ] o.a.s.c.CorePropertiesLocator Found 1 core definitions
   [junit4]   2> 1229893 INFO  (TEST-DeleteInactiveReplicaTest.deleteInactiveReplicaTest-seed#[4A1ABB138364B094]) [n:127.0.0.1:37575_    ] o.a.s.s.SolrDispatchFilter user.dir=/export/home/jenkins/workspace/Lucene-Solr-master-Solaris/solr/build/solr-core/test/J1
   [junit4]   2> 1229894 INFO  (TEST-DeleteInactiveReplicaTest.deleteInactiveReplicaTest-seed#[4A1ABB138364B094]) [n:127.0.0.1:37575_    ] o.a.s.s.SolrDispatchFilter SolrDispatchFilter.init() done
   [junit4]   2> 1229899 INFO  (coreLoadExecutor-4403-thread-1-processing-n:127.0.0.1:37575_) [n:127.0.0.1:37575_ c:control_collection   x:collection1] o.a.s.c.ZkController publishing state=down
   [junit4]   2> 1229899 INFO  (coreLoadExecutor-4403-thread-1-processing-n:127.0.0.1:37575_) [n:127.0.0.1:37575_ c:control_collection   x:collection1] o.a.s.c.ZkController numShards not found on descriptor - reading it from system property
   [junit4]   2> 1229902 INFO  (coreLoadExecutor-4403-thread-1-processing-n:127.0.0.1:37575_) [n:127.0.0.1:37575_ c:control_collection   x:collection1] o.a.s.c.ZkController Collection control_collection not visible yet, but flagging it so a watch is registered when it becomes visible
   [junit4]   2> 1229902 INFO  (coreLoadExecutor-4403-thread-1-processing-n:127.0.0.1:37575_) [n:127.0.0.1:37575_ c:control_collection   x:collection1] o.a.s.c.c.ZkStateReader addZkWatch [control_collection]
   [junit4]   2> 1229902 INFO  (OverseerStateUpdate-95824435900317701-127.0.0.1:37575_-n_0000000000) [n:127.0.0.1:37575_    ] o.a.s.c.Overseer processMessage: queueSize: 1, message = {
   [junit4]   2>   "core":"collection1",
   [junit4]   2>   "roles":null,
   [junit4]   2>   "base_url":"https://127.0.0.1:37575",
   [junit4]   2>   "node_name":"127.0.0.1:37575_",
   [junit4]   2>   "numShards":"1",
   [junit4]   2>   "state":"down",
   [junit4]   2>   "shard":null,
   [junit4]   2>   "collection":"control_collection",
   [junit4]   2>   "operation":"state"} current state version: 0
   [junit4]   2> 1229905 INFO  (coreLoadExecutor-4403-thread-1-processing-n:127.0.0.1:37575_) [n:127.0.0.1:37575_ c:control_collection   x:collection1] o.a.s.c.c.ZkStateReader Deleting data for [control_collection]
   [junit4]   2> 1229905 INFO  (OverseerStateUpdate-95824435900317701-127.0.0.1:37575_-n_0000000000) [n:127.0.0.1:37575_    ] o.a.s.c.o.ReplicaMutator Update state numShards=1 message={
   [junit4]   2>   "core":"collection1",
   [junit4]   2>   "roles":null,
   [junit4]   2>   "base_url":"https://127.0.0.1:37575",
   [junit4]   2>   "node_name":"127.0.0.1:37575_",
   [junit4]   2>   "numShards":"1",
   [junit4]   2>   "state":"down",
   [junit4]   2>   "shard":null,
   [junit4]   2>   "collection":"control_collection",
   [junit4]   2>   "operation":"state"}
   [junit4]   2> 1229907 INFO  (OverseerStateUpdate-95824435900317701-127.0.0.1:37575_-n_0000000000) [n:127.0.0.1:37575_    ] o.a.s.c.o.ClusterStateMutator building a new cName: control_collection
   [junit4]   2> 1229909 INFO  (OverseerStateUpdate-95824435900317701-127.0.0.1:37575_-n_0000000000) [n:127.0.0.1:37575_    ] o.a.s.c.o.ReplicaMutator Assigning new node to shard shard=shard1
   [junit4]   2> 1229909 INFO  (coreLoadExecutor-4403-thread-1-processing-n:127.0.0.1:37575_) [n:127.0.0.1:37575_ c:control_collection   x:collection1] o.a.s.c.ZkController look for our core node name
   [junit4]   2> 1229912 INFO  (zkCallback-1552-thread-1-processing-n:127.0.0.1:37575_) [n:127.0.0.1:37575_    ] o.a.s.c.c.ZkStateReader A cluster state change: [WatchedEvent state:SyncConnected type:NodeDataChanged path:/clusterstate.json], has occurred - updating... (live nodes size: [1])
   [junit4]   2> 1230912 INFO  (coreLoadExecutor-4403-thread-1-processing-n:127.0.0.1:37575_) [n:127.0.0.1:37575_ c:control_collection   x:collection1] o.a.s.c.ZkController waiting to find shard id in clusterstate for collection1
   [junit4]   2> 1230912 INFO  (coreLoadExecutor-4403-thread-1-processing-n:127.0.0.1:37575_) [n:127.0.0.1:37575_ c:control_collection   x:collection1] o.a.s.c.ZkController Check for collection zkNode:control_collection
   [junit4]   2> 1230913 INFO  (coreLoadExecutor-4403-thread-1-processing-n:127.0.0.1:37575_) [n:127.0.0.1:37575_ c:control_collection   x:collection1] o.a.s.c.ZkController Collection zkNode exists
   [junit4]   2> 1230913 INFO  (coreLoadExecutor-4403-thread-1-processing-n:127.0.0.1:37575_) [n:127.0.0.1:37575_ c:control_collection   x:collection1] o.a.s.c.c.ZkStateReader Load collection config from: [/collections/control_collection]
   [junit4]   2> 1230914 INFO  (coreLoadExecutor-4403-thread-1-processing-n:127.0.0.1:37575_) [n:127.0.0.1:37575_ c:control_collection   x:collection1] o.a.s.c.c.ZkStateReader path=[/collections/control_collection] [configName]=[conf1] specified config exists in ZooKeeper
   [junit4]   2> 1230914 INFO  (coreLoadExecutor-4403-thread-1-processing-n:127.0.0.1:37575_) [n:127.0.0.1:37575_ c:control_collection   x:collection1] o.a.s.c.SolrResourceLoader new SolrResourceLoader for directory: '/export/home/jenkins/workspace/Lucene-Solr-master-Solaris/solr/build/solr-core/test/J1/temp/solr.cloud.DeleteInactiveReplicaTest_4A1ABB138364B094-001/control-001/cores/collection1'
   [junit4]   2> 1230914 INFO  (coreLoadExecutor-4403-thread-1-processing-n:127.0.0.1:37575_) [n:127.0.0.1:37575_ c:control_collection   x:collection1] o.a.s.c.SolrResourceLoader JNDI not configured for solr (NoInitialContextEx)
   [junit4]   2> 1230914 INFO  (coreLoadExecutor-4403-thread-1-processing-n:127.0.0.1:37575_) [n:127.0.0.1:37575_ c:control_collection   x:collection1] o.a.s.c.SolrResourceLoader solr home defaulted to 'solr/' (could not find system property or JNDI)
   [junit4]   2> 1230918 INFO  (coreLoadExecutor-4403-thread-1-processing-n:127.0.0.1:37575_) [n:127.0.0.1:37575_ c:control_collection   x:collection1] o.a.s.c.Config loaded config solrconfig.xml with version 0 
   [junit4]   2> 1230931 INFO  (coreLoadExecutor-4403-thread-1-processing-n:127.0.0.1:37575_) [n:127.0.0.1:37575_ c:control_collection   x:collection1] o.a.s.c.SolrConfig current version of requestparams : -1
   [junit4]   2> 1230935 WARN  (coreLoadExecutor-4403-thread-1-processing-n:127.0.0.1:37575_) [n:127.0.0.1:37575_ c:control_collection   x:collection1] o.a.s.c.Config Beginning with Solr 5.5, <mergePolicy> is deprecated, use <mergePolicyFactory> instead.
   [junit4]   2> 1230936 INFO  (coreLoadExecutor-4403-thread-1-processing-n:127.0.0.1:37575_) [n:127.0.0.1:37575_ c:control_collection   x:collection1] o.a.s.c.SolrConfig Using Lucene MatchVersion: 7.0.0
   [junit4]   2> 1230951 INFO  (coreLoadExecutor-4403-thread-1-processing-n:127.0.0.1:37575_) [n:127.0.0.1:37575_ c:control_collection   x:collection1] o.a.s.c.SolrConfig Loaded SolrConfig: solrconfig.xml
   [junit4]   2> 1230959 INFO  (coreLoadExecutor-4403-thread-1-processing-n:127.0.0.1:37575_) [n:127.0.0.1:37575_ c:control_collection   x:collection1] o.a.s.s.IndexSchema [collection1] Schema name=test
   [junit4]   2> 1231080 INFO  (coreLoadExecutor-4403-thread-1-processing-n:127.0.0.1:37575_) [n:127.0.0.1:37575_ c:control_collection   x:collection1] o.a.s.s.OpenExchangeRatesOrgProvider Initialized with rates=open-exchange-rates.json, refreshInterval=1440.
   [junit4]   2> 1231088 INFO  (coreLoadExecutor-4403-thread-1-processing-n:127.0.0.1:37575_) [n:127.0.0.1:37575_ c:control_collection   x:collection1] o.a.s.s.IndexSchema default search field in schema is text
   [junit4]   2> 1231090 INFO  (coreLoadExecutor-4403-thread-1-processing-n:127.0.0.1:37575_) [n:127.0.0.1:37575_ c:control_collection   x:collection1] o.a.s.s.IndexSchema unique key field: id
   [junit4]   2> 1231138 INFO  (coreLoadExecutor-4403-thread-1-processing-n:127.0.0.1:37575_) [n:127.0.0.1:37575_ c:control_collection   x:collection1] o.a.s.s.FileExchangeRateProvider Reloading exchange rates from file currency.xml
   [junit4]   2> 1231144 INFO  (coreLoadExecutor-4403-thread-1-processing-n:127.0.0.1:37575_) [n:127.0.0.1:37575_ c:control_collection   x:collection1] o.a.s.s.FileExchangeRateProvider Reloading exchange rates from file currency.xml
   [junit4]   2> 1231149 INFO  (coreLoadExecutor-4403-thread-1-processing-n:127.0.0.1:37575_) [n:127.0.0.1:37575_ c:control_collection   x:collection1] o.a.s.s.OpenExchangeRatesOrgProvider Reloading exchange rates from open-exchange-rates.json
   [junit4]   2> 1231151 INFO  (coreLoadExecutor-4403-thread-1-processing-n:127.0.0.1:37575_) [n:127.0.0.1:37575_ c:control_collection   x:collection1] o.a.s.s.OpenExchangeRatesOrgProvider Reloading exchange rates from open-exchange-rates.json
   [junit4]   2> 1231155 INFO  (coreLoadExecutor-4403-thread-1-processing-n:127.0.0.1:37575_) [n:127.0.0.1:37575_ c:control_collection   x:collection1] o.a.s.c.ConfigSetProperties Did not find ConfigSet properties, assuming default properties: Can't find resource 'configsetprops.json' in classpath or '/configs/conf1', cwd=/export/home/jenkins/workspace/Lucene-Solr-master-Solaris/solr/build/solr-core/test/J1
   [junit4]   2> 1231155 INFO  (coreLoadExecutor-4403-thread-1-processing-n:127.0.0.1:37575_) [n:127.0.0.1:37575_ c:control_collection   x:collection1] o.a.s.c.CoreContainer Creating SolrCore 'collection1' using configuration from collection control_collection
   [junit4]   2> 1231155 INFO  (coreLoadExecutor-4403-thread-1-processing-n:127.0.0.1:37575_) [n:127.0.0.1:37575_ c:control_collection s:shard1 r:core_node1 x:collection1] o.a.s.c.SolrCore org.apache.solr.core.MockDirectoryFactory
   [junit4]   2> 1231156 INFO  (coreLoadExecutor-4403-thread-1-processing-n:127.0.0.1:37575_) [n:127.0.0.1:37575_ c:control_collection s:shard1 r:core_node1 x:collection1] o.a.s.c.SolrCore [[collection1] ] Opening new SolrCore at [/export/home/jenkins/workspace/Lucene-Solr-master-Solaris/solr/build/solr-core/test/J1/temp/solr.cloud.DeleteInactiveReplicaTest_4A1ABB138364B094-001/control-001/cores/collection1], dataDir=[/export/home/jenkins/workspace/Lucene-Solr-master-Solaris/solr/build/solr-core/test/J1/temp/solr.cloud.DeleteInactiveReplicaTest_4A1ABB138364B094-001/control-001/cores/collection1/data/]
   [junit4]   2> 1231156 INFO  (coreLoadExecutor-4403-thread-1-processing-n:127.0.0.1:37575_) [n:127.0.0.1:37575_ c:control_collection s:shard1 r:core_node1 x:collection1] o.a.s.c.JmxMonitoredMap JMX monitoring is enabled. Adding Solr mbeans to JMX Server: com.sun.jmx.mbeanserver.JmxMBeanServer@bd19013
   [junit4]   2> 1231156 INFO  (coreLoadExecutor-4403-thread-1-processing-n:127.0.0.1:37575_) [n:127.0.0.1:37575_ c:control_collection s:shard1 r:core_node1 x:collection1] o.a.s.c.CachingDirectoryFactory return new directory for /export/home/jenkins/workspace/Lucene-Solr-master-Solaris/solr/build/solr-core/test/J1/temp/solr.cloud.DeleteInactiveReplicaTest_4A1ABB138364B094-001/control-001/cores/collection1/data
   [junit4]   2> 1231156 INFO  (coreLoadExecutor-4403-thread-1-processing-n:127.0.0.1:37575_) [n:127.0.0.1:37575_ c:control_collection s:shard1 r:core_node1 x:collection1] o.a.s.c.SolrCore New index directory detected: old=null new=/export/home/jenkins/workspace/Lucene-Solr-master-Solaris/solr/build/solr-core/test/J1/temp/solr.cloud.DeleteInactiveReplicaTest_4A1ABB138364B094-001/control-001/cores/collection1/data/index/
   [junit4]   2> 1231156 WARN  (coreLoadExecutor-4403-thread-1-processing-n:127.0.0.1:37575_) [n:127.0.0.1:37575_ c:control_collection s:shard1 r:core_node1 x:collection1] o.a.s.c.SolrCore [collection1] Solr index directory '/export/home/jenkins/workspace/Lucene-Solr-master-Solaris/solr/build/solr-core/test/J1/temp/solr.cloud.DeleteInactiveReplicaTest_4A1ABB138364B094-001/control-001/cores/collection1/data/index' doesn't exist. Creating new index...
   [junit4]   2> 1231157 INFO  (coreLoadExecutor-4403-thread-1-processing-n:127.0.0.1:37575_) [n:127.0.0.1:37575_ c:control_collection s:shard1 r:core_node1 x:collection1] o.a.s.c.CachingDirectoryFactory return new directory for /export/home/jenkins/workspace/Lucene-Solr-master-Solaris/solr/build/solr-core/test/J1/temp/solr.cloud.DeleteInactiveReplicaTest_4A1ABB138364B094-001/control-001/cores/collection1/data/index
   [junit4]   2> 1231157 INFO  (coreLoadExecutor-4403-thread-1-processing-n:127.0.0.1:37575_) [n:127.0.0.1:37575_ c:control_collection s:shard1 r:core_node1 x:collection1] o.a.s.u.RandomMergePolicy RandomMergePolicy wrapping class org.apache.lucene.index.TieredMergePolicy: [TieredMergePolicy: maxMergeAtOnce=33, maxMergeAtOnceExplicit=30, maxMergedSegmentMB=67.1640625, floorSegmentMB=2.107421875, forceMergeDeletesPctAllowed=16.5103762420879, segmentsPerTier=47.0, maxCFSSegmentSizeMB=8.796093022207999E12, noCFSRatio=0.596116614201022
   [junit4]   2> 1231157 INFO  (coreLoadExecutor-4403-thread-1-processing-n:127.0.0.1:37575_) [n:127.0.0.1:37575_ c:control_collection s:shard1 r:core_node1 x:collection1] o.a.s.c.SolrDeletionPolicy SolrDeletionPolicy.onCommit: commits: num=1
   [junit4]   2> 	commit{dir=MockDirectoryWrapper(RAMDirectory@79f635b3 lockFactory=org.apache.lucene.store.SingleInstanceLockFactory@5fa9b078),segFN=segments_1,generation=1}
   [junit4]   2> 1231157 INFO  (coreLoadExecutor-4403-thread-1-processing-n:127.0.0.1:37575_) [n:127.0.0.1:37575_ c:control_collection s:shard1 r:core_node1 x:collection1] o.a.s.c.SolrDeletionPolicy newest commit generation = 1
   [junit4]   2> 1231158 INFO  (OldIndexDirectoryCleanupThreadForCore-collection1) [n:127.0.0.1:37575_ c:control_collection s:shard1 r:core_node1 x:collection1] o.a.s.c.SolrCore Looking for old index directories to cleanup for core collection1 in /export/home/jenkins/workspace/Lucene-Solr-master-Solaris/solr/build/solr-core/test/J1/temp/solr.cloud.DeleteInactiveReplicaTest_4A1ABB138364B094-001/control-001/cores/collection1/data/
   [junit4]   2> 1231160 INFO  (coreLoadExecutor-4403-thread-1-processing-n:127.0.0.1:37575_) [n:127.0.0.1:37575_ c:control_collection s:shard1 r:core_node1 x:collection1] o.a.s.u.p.UpdateRequestProcessorChain creating updateRequestProcessorChain "nodistrib"
   [junit4]   2> 1231161 INFO  (coreLoadExecutor-4403-thread-1-processing-n:127.0.0.1:37575_) [n:127.0.0.1:37575_ c:control_collection s:shard1 r:core_node1 x:collection1] o.a.s.u.p.UpdateRequestProcessorChain creating updateRequestProcessorChain "dedupe"
   [junit4]   2> 1231161 INFO  (coreLoadExecutor-4403-thread-1-processing-n:127.0.0.1:37575_) [n:127.0.0.1:37575_ c:control_collection s:shard1 r:core_node1 x:collection1] o.a.s.u.p.UpdateRequestProcessorChain inserting DistributedUpdateProcessorFactory into updateRequestProcessorChain "dedupe"
   [junit4]   2> 1231161 INFO  (coreLoadExecutor-4403-thread-1-processing-n:127.0.0.1:37575_) [n:127.0.0.1:37575_ c:control_collection s:shard1 r:core_node1 x:collection1] o.a.s.u.p.UpdateRequestProcessorChain creating updateRequestProcessorChain "stored_sig"
   [junit4]   2> 1231161 INFO  (coreLoadExecutor-4403-thread-1-processing-n:127.0.0.1:37575_) [n:127.0.0.1:37575_ c:control_collection s:shard1 r:core_node1 x:collection1] o.a.s.u.p.UpdateRequestProcessorChain inserting DistributedUpdateProcessorFactory into updateRequestProcessorChain "stored_sig"
   [junit4]   2> 1231161 INFO  (coreLoadExecutor-4403-thread-1-processing-n:127.0.0.1:37575_) [n:127.0.0.1:37575_ c:control_collection s:shard1 r:core_node1 x:collection1] o.a.s.u.p.UpdateRequestProcessorChain creating updateRequestProcessorChain "distrib-dup-test-chain-explicit"
   [junit4]   2> 1231161 INFO  (coreLoadExecutor-4403-thread-1-processing-n:127.0.0.1:37575_) [n:127.0.0.1:37575_ c:control_collection s:shard1 r:core_node1 x:collection1] o.a.s.u.p.UpdateRequestProcessorChain creating updateRequestProcessorChain "distrib-dup-test-chain-implicit"
   [junit4]   2> 1231161 INFO  (coreLoadExecutor-4403-thread-1-processing-n:127.0.0.1:37575_) [n:127.0.0.1:37575_ c:control_collection s:shard1 r:core_node1 x:collection1] o.a.s.u.p.UpdateRequestProcessorChain inserting DistributedUpdateProcessorFactory into updateRequestProcessorChain "distrib-dup-test-chain-implicit"
   [junit4]   2> 1231161 INFO  (coreLoadExecutor-4403-thread-1-processing-n:127.0.0.1:37575_) [n:127.0.0.1:37575_ c:control_collection s:shard1 r:core_node1 x:collection1] o.a.s.c.SolrCore no updateRequestProcessorChain defined as default, creating implicit default
   [junit4]   2> 1231161 WARN  (coreLoadExecutor-4403-thread-1-processing-n:127.0.0.1:37575_) [n:127.0.0.1:37575_ c:control_collection s:shard1 r:core_node1 x:collection1] o.a.s.c.RequestHandlers INVALID paramSet a in requestHandler {type = requestHandler,name = /dump,class = DumpRequestHandler,args = {defaults={a=A,b=B}}}
   [junit4]   2> 1231163 INFO  (coreLoadExecutor-4403-thread-1-processing-n:127.0.0.1:37575_) [n:127.0.0.1:37575_ c:control_collection s:shard1 r:core_node1 x:collection1] o.a.s.h.l.XMLLoader xsltCacheLifetimeSeconds=60
   [junit4]   2> 1231164 INFO  (coreLoadExecutor-4403-thread-1-processing-n:127.0.0.1:37575_) [n:127.0.0.1:37575_ c:control_collection s:shard1 r:core_node1 x:collection1] o.a.s.h.l.XMLLoader xsltCacheLifetimeSeconds=60
   [junit4]   2> 1231165 INFO  (coreLoadExecutor-4403-thread-1-processing-n:127.0.0.1:37575_) [n:127.0.0.1:37575_ c:control_collection s:shard1 r:core_node1 x:collection1] o.a.s.h.l.XMLLoader xsltCacheLifetimeSeconds=60
   [junit4]   2> 1231167 INFO  (coreLoadExecutor-4403-thread-1-processing-n:127.0.0.1:37575_) [n:127.0.0.1:37575_ c:control_collection s:shard1 r:core_node1 x:collection1] o.a.s.h.l.XMLLoader xsltCacheLifetimeSeconds=60
   [junit4]   2> 1231169 WARN  (OldIndexDirectoryCleanupThreadForCore-collection1) [n:127.0.0.1:37575_ c:control_collection s:shard1 r:core_node1 x:collection1] o.a.s.c.DirectoryFactory /export/home/jenkins/workspace/Lucene-Solr-master-Solaris/solr/build/solr-core/test/J1/temp/solr.cloud.DeleteInactiveReplicaTest_4A1ABB138364B094-001/control-001/cores/collection1/data/ does not point to a valid data directory; skipping clean-up of old index directories.
   [junit4]   2> 1231172 INFO  (coreLoadExecutor-4403-thread-1-processing-n:127.0.0.1:37575_) [n:127.0.0.1:37575_ c:control_collection s:shard1 r:core_node1 x:collection1] o.a.s.c.RequestHandlers Registered paths: /admin/mbeans,standard,/dump,/update/csv,/sql,/update/json/docs,/admin/luke,/export,/admin/segments,/get,/admin/system,/replication,/admin/properties,/config,/stream,/schema,/admin/plugins,/admin/logging,/update/json,/admin/ping,/admin/threads,/update,/admin/file
   [junit4]   2> 1231172 INFO  (coreLoadExecutor-4403-thread-1-processing-n:127.0.0.1:37575_) [n:127.0.0.1:37575_ c:control_collection s:shard1 r:core_node1 x:collection1] o.a.s.c.SolrCore Using default statsCache cache: org.apache.solr.search.stats.LocalStatsCache
   [junit4]   2> 1231173 INFO  (coreLoadExecutor-4403-thread-1-processing-n:127.0.0.1:37575_) [n:127.0.0.1:37575_ c:control_collection s:shard1 r:core_node1 x:collection1] o.a.s.u.UpdateHandler Using UpdateLog implementation: org.apache.solr.update.UpdateLog
   [junit4]   2> 1231173 INFO  (coreLoadExecutor-4403-thread-1-processing-n:127.0.0.1:37575_) [n:127.0.0.1:37575_ c:control_collection s:shard1 r:core_node1 x:collection1] o.a.s.u.UpdateLog Initializing UpdateLog: dataDir= defaultSyncLevel=FLUSH numRecordsToKeep=100 maxNumLogsToKeep=10 numVersionBuckets=65536
   [junit4]   2> 1231173 INFO  (coreLoadExecutor-4403-thread-1-processing-n:127.0.0.1:37575_) [n:127.0.0.1:37575_ c:control_collection s:shard1 r:core_node1 x:collection1] o.a.s.u.CommitTracker Hard AutoCommit: disabled
   [junit4]   2> 1231173 INFO  (coreLoadExecutor-4403-thread-1-processing-n:127.0.0.1:37575_) [n:127.0.0.1:37575_ c:control_collection s:shard1 r:core_node1 x:collection1] o.a.s.u.CommitTracker Soft AutoCommit: disabled
   [junit4]   2> 1231174 INFO  (coreLoadExecutor-4403-thread-1-processing-n:127.0.0.1:37575_) [n:127.0.0.1:37575_ c:control_collection s:shard1 r:core_node1 x:collection1] o.a.s.u.RandomMergePolicy RandomMergePolicy wrapping class org.apache.lucene.index.LogByteSizeMergePolicy: [LogByteSizeMergePolicy: minMergeSize=1677721, mergeFactor=39, maxMergeSize=2147483648, maxMergeSizeForForcedMerge=9223372036854775807, calibrateSizeByDeletes=true, maxMergeDocs=2147483647, maxCFSSegmentSizeMB=8.796093022207999E12, noCFSRatio=0.4597293876201455]
   [junit4]   2> 1231174 INFO  (coreLoadExecutor-4403-thread-1-processing-n:127.0.0.1:37575_) [n:127.0.0.1:37575_ c:control_collection s:shard1 r:core_node1 x:collection1] o.a.s.c.SolrDeletionPolicy SolrDeletionPolicy.onInit: commits: num=1
   [junit4]   2> 	commit{dir=MockDirectoryWrapper(RAMDirectory@79f635b3 lockFactory=org.apache.lucene.store.SingleInstanceLockFactory@5fa9b078),segFN=segments_1,generation=1}
   [junit4]   2> 1231174 INFO  (coreLoadExecutor-4403-thread-1-processing-n:127.0.0.1:37575_) [n:127.0.0.1:37575_ c:control_collection s:shard1 r:core_node1 x:collection1] o.a.s.c.SolrDeletionPolicy newest commit generation = 1
   [junit4]   2> 1231174 INFO  (coreLoadExecutor-4403-thread-1-processing-n:127.0.0.1:37575_) [n:127.0.0.1:37575_ c:control_collection s:shard1 r:core_node1 x:collection1] o.a.s.s.SolrIndexSearcher Opening [Searcher@65c3b0cf[collection1] main]
   [junit4]   2> 1231174 INFO  (coreLoadExecutor-4403-thread-1-processing-n:127.0.0.1:37575_) [n:127.0.0.1:37575_ c:control_collection s:shard1 r:core_node1 x:collection1] o.a.s.c.c.ZkStateReader Load collection config from: [/collections/control_collection]
   [junit4]   2> 1231183 INFO  (coreLoadExecutor-4403-thread-1-processing-n:127.0.0.1:37575_) [n:127.0.0.1:37575_ c:control_collection s:shard1 r:core_node1 x:collection1] o.a.s.c.c.ZkStateReader path=[/collections/control_collection] [configName]=[conf1] specified config exists in ZooKeeper
   [junit4]   2> 1231183 INFO  (coreLoadExecutor-4403-thread-1-processing-n:127.0.0.1:37575_) [n:127.0.0.1:37575_ c:control_collection s:shard1 r:core_node1 x:collection1] o.a.s.r.ManagedResourceStorage Setting up ZooKeeper-based storage for the RestManager with znodeBase: /configs/conf1
   [junit4]   2> 1231186 INFO  (coreLoadExecutor-4403-thread-1-processing-n:127.0.0.1:37575_) [n:127.0.0.1:37575_ c:control_collection s:shard1 r:core_node1 x:collection1] o.a.s.r.ManagedResourceStorage Configured ZooKeeperStorageIO with znodeBase: /configs/conf1
   [junit4]   2> 1231187 INFO  (coreLoadExecutor-4403-thread-1-processing-n:127.0.0.1:37575_) [n:127.0.0.1:37575_ c:control_collection s:shard1 r:core_node1 x:collection1] o.a.s.r.RestManager Initializing RestManager with initArgs: {}
   [junit4]   2> 1231187 INFO  (coreLoadExecutor-4403-thread-1-processing-n:127.0.0.1:37575_) [n:127.0.0.1:37575_ c:control_collection s:shard1 r:core_node1 x:collection1] o.a.s.r.ManagedResourceStorage Reading _rest_managed.json using ZooKeeperStorageIO:path=/configs/conf1
   [junit4]   2> 1231194 INFO  (coreLoadExecutor-4403-thread-1-processing-n:127.0.0.1:37575_) [n:127.0.0.1:37575_ c:control_collection s:shard1 r:core_node1 x:collection1] o.a.s.r.ManagedResourceStorage No data found for znode /configs/conf1/_rest_managed.json
   [junit4]   2> 1231194 INFO  (coreLoadExecutor-4403-thread-1-processing-n:127.0.0.1:37575_) [n:127.0.0.1:37575_ c:control_collection s:shard1 r:core_node1 x:collection1] o.a.s.r.ManagedResourceStorage Loaded null at path _rest_managed.json using ZooKeeperStorageIO:path=/configs/conf1
   [junit4]   2> 1231194 INFO  (coreLoadExecutor-4403-thread-1-processing-n:127.0.0.1:37575_) [n:127.0.0.1:37575_ c:control_collection s:shard1 r:core_node1 x:collection1] o.a.s.r.RestManager Initializing 0 registered ManagedResources
   [junit4]   2> 1231194 INFO  (coreLoadExecutor-4403-thread-1-processing-n:127.0.0.1:37575_) [n:127.0.0.1:37575_ c:control_collection s:shard1 r:core_node1 x:collection1] o.a.s.h.ReplicationHandler Commits will be reserved for  10000
   [junit4]   2> 1231195 INFO  (coreLoadExecutor-4403-thread-1-processing-n:127.0.0.1:37575_) [n:127.0.0.1:37575_ c:control_collection s:shard1 r:core_node1 x:collection1] o.a.s.u.UpdateLog Looking up max value of version field to seed version buckets
   [junit4]   2> 1231195 INFO  (coreLoadExecutor-4403-thread-1-processing-n:127.0.0.1:37575_) [n:127.0.0.1:37575_ c:control_collection s:shard1 r:core_node1 x:collection1] o.a.s.u.VersionInfo Refreshing highest value of _version_ for 65536 version buckets from index
   [junit4]   2> 1231195 INFO  (coreLoadExecutor-4403-thread-1-processing-n:127.0.0.1:37575_) [n:127.0.0.1:37575_ c:control_collection s:shard1 r:core_node1 x:collection1] o.a.s.u.VersionInfo No terms found for _version_, cannot seed version bucket highest value from index
   [junit4]   2> 1231195 INFO  (coreLoadExecutor-4403-thread-1-processing-n:127.0.0.1:37575_) [n:127.0.0.1:37575_ c:control_collection s:shard1 r:core_node1 x:collection1] o.a.s.u.UpdateLog Could not find max version in index or recent updates, using new clock 1533190976250576896
   [junit4]   2> 1231196 INFO  (searcherExecutor-4404-thread-1-processing-n:127.0.0.1:37575_ x:collection1 s:shard1 c:control_collection r:core_node1) [n:127.0.0.1:37575_ c:control_collection s:shard1 r:core_node1 x:collection1] o.a.s.c.SolrCore [collection1] Registered new searcher Searcher@65c3b0cf[collection1] main{ExitableDirectoryReader(UninvertingDirectoryReader())}
   [junit4]   2> 1231197 INFO  (coreLoadExecutor-4403-thread-1-processing-n:127.0.0.1:37575_) [n:127.0.0.1:37575_ c:control_collection s:shard1 r:core_node1 x:collection1] o.a.s.u.UpdateLog Took 2.0ms to seed version buckets with highest version 1533190976250576896
   [junit4]   2> 1231197 INFO  (coreLoadExecutor-4403-thread-1-processing-n:127.0.0.1:37575_) [n:127.0.0.1:37575_ c:control_collection s:shard1 r:core_node1 x:collection1] o.a.s.c.ZkController watch zkdir /configs/conf1
   [junit4]   2> 1231207 INFO  (coreLoadExecutor-4403-thread-1-processing-n:127.0.0.1:37575_) [n:127.0.0.1:37575_ c:control_collection s:shard1 r:core_node1 x:collection1] o.a.s.c.CoreContainer registering core: collection1
   [junit4]   2> 1231208 INFO  (coreZkRegister-4397-thread-1-processing-n:127.0.0.1:37575_ x:collection1 s:shard1 c:control_collection r:core_node1) [n:127.0.0.1:37575_ c:control_collection s:shard1 r:core_node1 x:collection1] o.a.s.c.ZkController Register replica - core:collection1 address:https://127.0.0.1:37575 collection:control_collection shard:shard1
   [junit4]   2> 1231212 INFO  (coreZkRegister-4397-thread-1-processing-n:127.0.0.1:37575_ x:collection1 s:shard1 c:control_collection r:core_node1) [n:127.0.0.1:37575_ c:control_collection s:shard1 r:core_node1 x:collection1] o.a.s.c.c.SolrZkClient makePath: /collections/control_collection/leader_elect/shard1/election
   [junit4]   2> 1231226 INFO  (coreZkRegister-4397-thread-1-processing-n:127.0.0.1:37575_ x:collection1 s:shard1 c:control_collection r:core_node1) [n:127.0.0.1:37575_ c:control_collection s:shard1 r:core_node1 x:collection1] o.a.s.c.LeaderElector Joined leadership election with path: /collections/control_collection/leader_elect/shard1/election/95824435900317701-core_node1-n_0000000000
   [junit4]   2> 1231228 INFO  (coreZkRegister-4397-thread-1-processing-n:127.0.0.1:37575_ x:collection1 s:shard1 c:control_collection r:core_node1) [n:127.0.0.1:37575_ c:control_collection s:shard1 r:core_node1 x:collection1] o.a.s.c.ShardLeaderElectionContext Running the leader process for shard=shard1 and weAreReplacement=false and leaderVoteWait=10000
   [junit4]   2> 1231237 INFO  (coreZkRegister-4397-thread-1-processing-n:127.0.0.1:37575_ x:collection1 s:shard1 c:control_collection r:core_node1) [n:127.0.0.1:37575_ c:control_collection s:shard1 r:core_node1 x:collection1] o.a.s.c.ShardLeaderElectionContext Enough replicas found to continue.
   [junit4]   2> 1231237 INFO  (coreZkRegister-4397-thread-1-processing-n:127.0.0.1:37575_ x:collection1 s:shard1 c:control_collection r:core_node1) [n:127.0.0.1:37575_ c:control_collection s:shard1 r:core_node1 x:collection1] o.a.s.c.ShardLeaderElectionContext I may be the new leader - try and sync
   [junit4]   2> 1231237 INFO  (coreZkRegister-4397-thread-1-processing-n:127.0.0.1:37575_ x:collection1 s:shard1 c:control_collection r:core_node1) [n:127.0.0.1:37575_ c:control_collection s:shard1 r:core_node1 x:collection1] o.a.s.c.SyncStrategy Sync replicas to https://127.0.0.1:37575/collection1/
   [junit4]   2> 1231237 INFO  (coreZkRegister-4397-thread-1-processing-n:127.0.0.1:37575_ x:collection1 s:shard1 c:control_collection r:core_node1) [n:127.0.0.1:37575_ c:control_collection s:shard1 r:core_node1 x:collection1] o.a.s.c.SyncStrategy Sync Success - now sync replicas to me
   [junit4]   2> 1231237 INFO  (coreZkRegister-4397-thread-1-processing-n:127.0.0.1:37575_ x:collection1 s:shard1 c:control_collection r:core_node1) [n:127.0.0.1:37575_ c:control_collection s:shard1 r:core_node1 x:collection1] o.a.s.c.SyncStrategy https://127.0.0.1:37575/collection1/ has no replicas
   [junit4]   2> 1231238 INFO  (OverseerStateUpdate-95824435900317701-127.0.0.1:37575_-n_0000000000) [n:127.0.0.1:37575_    ] o.a.s.c.Overseer processMessage: queueSize: 1, message = {
   [junit4]   2>   "operation":"leader",
   [junit4]   2>   "shard":"shard1",
   [junit4]   2>   "collection":"control_collection"} current state version: 1
   [junit4]   2> 1231241 INFO  (coreZkRegister-4397-thread-1-processing-n:127.0.0.1:37575_ x:collection1 s:shard1 c:control_collection r:core_node1) [n:127.0.0.1:37575_ c:control_collection s:shard1 r:core_node1 x:collection1] o.a.s.c.c.SolrZkClient makePath: /collections/control_collection/leaders/shard1
   [junit4]   2> 1231247 INFO  (coreZkRegister-4397-thread-1-processing-n:127.0.0.1:37575_ x:collection1 s:shard1 c:control_collection r:core_node1) [n:127.0.0.1:37575_ c:control_collection s:shard1 r:core_node1 x:collection1] o.a.s.c.ShardLeaderElectionContextBase Creating leader registration node /collections/control_collection/leaders/shard1/leader after winning as /collections/control_collection/leader_elect/shard1/election/95824435900317701-core_node1-n_0000000000
   [junit4]   2> 1231259 INFO  (coreZkRegister-4397-thread-1-processing-n:127.0.0.1:37575_ x:collection1 s:shard1 c:control_collection r:core_node1) [n:127.0.0.1:37575_ c:control_collection s:shard1 r:core_node1 x:collection1] o.a.s.c.ShardLeaderElectionContext I am the new leader: https://127.0.0.1:37575/collection1/ shard1
   [junit4]   2> 1231264 INFO  (OverseerStateUpdate-95824435900317701-127.0.0.1:37575_-n_0000000000) [n:127.0.0.1:37575_    ] o.a.s.c.Overseer processMessage: queueSize: 1, message = {
   [junit4]   2>   "operation":"leader",
   [junit4]   2>   "shard":"shard1",
   [junit4]   2>   "collection":"control_collection",
   [junit4]   2>   "base_url":"https://127.0.0.1:37575",
   [junit4]   2>   "core":"collection1",
   [junit4]   2>   "state":"active"} current state version: 1
   [junit4]   2> 1231369 INFO  (zkCallback-1552-thread-1-processing-n:127.0.0.1:37575_) [n:127.0.0.1:37575_    ] o.a.s.c.c.ZkStateReader A cluster state change: [WatchedEvent state:SyncConnected type:NodeDataChanged path:/clusterstate.json], has occurred - updating... (live nodes size: [1])
   [junit4]   2> 1231409 INFO  (TEST-DeleteInactiveReplicaTest.deleteInactiveReplicaTest-seed#[4A1ABB138364B094]) [    ] o.a.s.c.c.SolrZkClient Using default ZkCredentialsProvider
   [junit4]   2> 1231410 INFO  (TEST-DeleteInactiveReplicaTest.deleteInactiveReplicaTest-seed#[4A1ABB138364B094]) [    ] o.a.s.c.c.ConnectionManager Waiting for client to connect to ZooKeeper
   [junit4]   2> 1231412 INFO  (zkCallback-1554-thread-1) [    ] o.a.s.c.c.ConnectionManager Watcher org.apache.solr.common.cloud.ConnectionManager@8ac8797 name:ZooKeeperConnection Watcher:127.0.0.1:39447/solr got event WatchedEvent state:SyncConnected type:None path:null path:null type:None
   [junit4]   2> 1231412 INFO  (TEST-DeleteInactiveReplicaTest.deleteInactiveReplicaTest-seed#[4A1ABB138364B094]) [    ] o.a.s.c.c.ConnectionManager Client is connected to ZooKeeper
   [junit4]   2> 1231412 INFO  (TEST-DeleteInactiveReplicaTest.deleteInactiveReplicaTest-seed#[4A1ABB138364B094]) [    ] o.a.s.c.c.SolrZkClient Using default ZkACLProvider
   [junit4]   2> 1231413 INFO  (TEST-DeleteInactiveReplicaTest.deleteInactiveReplicaTest-seed#[4A1ABB138364B094]) [    ] o.a.s.c.c.ZkStateReader Updating cluster state from ZooKeeper... 
   [junit4]   2> 1231415 INFO  (TEST-DeleteInactiveReplicaTest.deleteInactiveReplicaTest-seed#[4A1ABB138364B094]) [    ] o.a.s.c.c.ZkStateReader Updated live nodes from ZooKeeper... (0) -> (1)
   [junit4]   2> 1231417 INFO  (TEST-DeleteInactiveReplicaTest.deleteInactiveReplicaTest-seed#[4A1ABB138364B094]) [    ] o.a.s.c.ChaosMonkey monkey: init - expire sessions:false cause connection loss:false
   [junit4]   2> 1231417 INFO  (TEST-DeleteInactiveReplicaTest.deleteInactiveReplicaTest-seed#[4A1ABB138364B094]) [    ] o.a.s.c.AbstractFullDistribZkTestBase Creating collection1 with stateFormat=2
   [junit4]   2> 1231417 INFO  (TEST-DeleteInactiveReplicaTest.deleteInactiveReplicaTest-seed#[4A1ABB138364B094]) [    ] o.a.s.c.c.SolrZkClient Using default ZkCredentialsProvider
   [junit4]   2> 1231418 INFO  (TEST-DeleteInactiveReplicaTest.deleteInactiveReplicaTest-seed#[4A1ABB138364B094]) [    ] o.a.s.c.c.ConnectionManager Waiting for client to connect to ZooKeeper
   [junit4]   2> 1231419 INFO  (zkCallback-1555-thread-1) [    ] o.a.s.c.c.ConnectionManager Watcher org.apache.solr.common.cloud.ConnectionManager@7bbcb4b3 name:ZooKeeperConnection Watcher:127.0.0.1:39447/solr got event WatchedEvent state:SyncConnected type:None path:null path:null type:None
   [junit4]   2> 1231420 INFO  (coreZkRegister-4397-thread-1-processing-n:127.0.0.1:37575_ x:collection1 s:shard1 c:control_collection r:core_node1) [n:127.0.0.1:37575_ c:control_collection s:shard1 r:core_node1 x:collection1] o.a.s.c.ZkController We are https://127.0.0.1:37575/collection1/ and leader is https://127.0.0.1:37575/collection1/
   [junit4]   2> 1231420 INFO  (coreZkRegister-4397-thread-1-processing-n:127.0.0.1:37575_ x:collection1 s:shard1 c:control_collection r:core_node1) [n:127.0.0.1:37575_ c:control_collection s:shard1 r:core_node1 x:collection1] o.a.s.c.ZkController No LogReplay needed for core=collection1 baseURL=https://127.0.0.1:37575
   [junit4]   2> 1231420 INFO  (coreZkRegister-4397-thread-1-processing-n:127.0.0.1:37575_ x:collection1 s:shard1 c:control_collection r:core_node1) [n:127.0.0.1:37575_ c:control_collection s:shard1 r:core_node1 x:collection1] o.a.s.c.ZkController I am the leader, no recovery necessary
   [junit4]   2> 1231420 INFO  (TEST-DeleteInactiveReplicaTest.deleteInactiveReplicaTest-seed#[4A1ABB138364B094]) [    ] o.a.s.c.c.ConnectionManager Client is connected to ZooKeeper
   [junit4]   2> 1231420 INFO  (coreZkRegister-4397-thread-1-processing-n:127.0.0.1:37575_ x:collection1 s:shard1 c:control_collection r:core_node1) [n:127.0.0.1:37575_ c:control_collection s:shard1 r:core_node1 x:collection1] o.a.s.c.ZkController publishing state=active
   [junit4]   2> 1231420 INFO  (coreZkRegister-4397-thread-1-processing-n:127.0.0.1:37575_ x:collection1 s:shard1 c:control_collection r:core_node1) [n:127.0.0.1:37575_ c:control_collection s:shard1 r:core_node1 x:collection1] o.a.s.c.ZkController numShards not found on descriptor - reading it from system property
   [junit4]   2> 1231420 INFO  (TEST-DeleteInactiveReplicaTest.deleteInactiveReplicaTest-seed#[4A1ABB138364B094]) [    ] o.a.s.c.c.SolrZkClient Using default ZkACLProvider
   [junit4]   2> 1231424 INFO  (OverseerStateUpdate-95824435900317701-127.0.0.1:37575_-n_0000000000) [n:127.0.0.1:37575_    ] o.a.s.c.Overseer processMessage: queueSize: 1, message = {
   [junit4]   2>   "core":"collection1",
   [junit4]   2>   "core_node_name":"core_node1",
   [junit4]   2>   "roles":null,
   [junit4]   2>   "base_url":"https://127.0.0.1:37575",
   [junit4]   2>   "node_name":"127.0.0.1:37575_",
   [junit4]   2>   "numShards":"2",
   [junit4]   2>   "state":"active",
   [junit4]   2>   "shard":"shard1",
   [junit4]   2>   "collection":"control_collection",
   [junit4]   2>   "operation":"state"} current state version: 2
   [junit4]   2> 1231425 INFO  (OverseerStateUpdate-95824435900317701-127.0.0.1:37575_-n_0000000000) [n:127.0.0.1:37575_    ] o.a.s.c.o.ReplicaMutator Update state numShards=2 message={
   [junit4]   2>   "core":"collection1",
   [junit4]   2>   "core_node_name":"core_node1",
   [junit4]   2>   "roles":null,
   [junit4]   2>   "base_url":"https://127.0.0.1:37575",
   [junit4]   2>   "node_name":"127.0.0.1:37575_",
   [junit4]   2>   "numShards":"2",
   [junit4]   2>   "state":"active",
   [junit4]   2>   "shard":"shard1",
   [junit4]   2>   "collection":"control_collection",
   [junit4]   2>   "operation":"state"}
   [junit4]   2> 1231429 INFO  (OverseerStateUpdate-95824435900317701-127.0.0.1:37575_-n_0000000000) [n:127.0.0.1:37575_    ] o.a.s.c.Overseer processMessage: queueSize: 1, message = {
   [junit4]   2>   "operation":"create",
   [junit4]   2>   "name":"collection1",
   [junit4]   2>   "numShards":"2",
   [junit4]   2>   "stateFormat":"2"} current state version: 2
   [junit4]   2> 1231429 INFO  (OverseerStateUpdate-95824435900317701-127.0.0.1:37575_-n_0000000000) [n:127.0.0.1:37575_    ] o.a.s.c.o.ClusterStateMutator building a new cName: collection1
   [junit4]   2> 1231430 INFO  (zkCallback-1552-thread-1-processing-n:127.0.0.1:37575_) [n:127.0.0.1:37575_    ] o.a.s.c.c.ZkStateReader A cluster state change: [WatchedEvent state:SyncConnected type:NodeDataChanged path:/clusterstate.json], has occurred - updating... (live nodes size: [1])
   [junit4]   2> 1231433 INFO  (zkCallback-1554-thread-1) [    ] o.a.s.c.c.ZkStateReader A cluster state change: [WatchedEvent state:SyncConnected type:NodeDataChanged path:/clusterstate.json], has occurred - updating... (live nodes size: [1])
   [junit4]   2> 1231542 INFO  (OverseerStateUpdate-95824435900317701-127.0.0.1:37575_-n_0000000000) [n:127.0.0.1:37575_    ] o.a.s.c.o.ZkStateWriter going to create_collection /collections/collection1/state.json
   [junit4]   2> 1231601 INFO  (TEST-DeleteInactiveReplicaTest.deleteInactiveReplicaTest-seed#[4A1ABB138364B094]) [    ] o.a.s.SolrTestCaseJ4 Writing core.properties file to /export/home/jenkins/workspace/Lucene-Solr-master-Solaris/solr/build/solr-core/test/J1/temp/solr.cloud.DeleteInactiveReplicaTest_4A1ABB138364B094-001/shard-1-001/cores/collection1
   [junit4]   2> 1231602 INFO  (TEST-DeleteInactiveReplicaTest.deleteInactiveReplicaTest-seed#[4A1ABB138364B094]) [    ] o.a.s.c.AbstractFullDistribZkTestBase create jetty 1 in directory /export/home/jenkins/workspace/Lucene-Solr-master-Solaris/solr/build/solr-core/test/J1/temp/solr.cloud.DeleteInactiveReplicaTest_4A1ABB138364B094-001/shard-1-001
   [junit4]   2> 1231603 INFO  (TEST-DeleteInactiveReplicaTest.deleteInactiveReplicaTest-seed#[4A1ABB138364B094]) [    ] o.e.j.s.Server jetty-9.3.8.v20160314
   [junit4]   2> 1231606 INFO  (TEST-DeleteInactiveReplicaTest.deleteInactiveReplicaTest-seed#[4A1ABB138364B094]) [    ] o.e.j.s.h.ContextHandler Started o.e.j.s.ServletContextHandler@eefec44{/,null,AVAILABLE}
   [junit4]   2> 1231607 INFO  (TEST-DeleteInactiveReplicaTest.deleteInactiveReplicaTest-seed#[4A1ABB138364B094]) [    ] o.e.j.u.s.SslContextFactory x509=X509@3bc65a14(solrtest,h=[],w=[]) for SslContextFactory@79cfc577(file:///export/home/jenkins/workspace/Lucene-Solr-master-Solaris/solr/server/etc/test/solrtest.keystore,null)
   [junit4]   2> 1231611 INFO  (TEST-DeleteInactiveReplicaTest.deleteInactiveReplicaTest-seed#[4A1ABB138364B094]) [    ] o.e.j.s.ServerConnector Started ServerConnector@652054d3{SSL,[ssl, http/1.1]}{127.0.0.1:65247}
   [junit4]   2> 1231611 INFO  (TEST-DeleteInactiveReplicaTest.deleteInactiveReplicaTest-seed#[4A1ABB138364B094]) [    ] o.e.j.s.Server Started @1236190ms
   [junit4]   2> 1231611 INFO  (TEST-DeleteInactiveReplicaTest.deleteInactiveReplicaTest-seed#[4A1ABB138364B094]) [    ] o.a.s.c.s.e.JettySolrRunner Jetty properties: {solr.data.dir=/export/home/jenkins/workspace/Lucene-Solr-master-Solaris/solr/build/solr-core/test/J1/temp/solr.cloud.DeleteInactiveReplicaTest_4A1ABB138364B094-001/tempDir-001/jetty1, solrconfig=solrconfig.xml, hostContext=/, hostPort=65247, coreRootDirectory=/export/home/jenkins/workspace/Lucene-Solr-master-Solaris/solr/build/solr-core/test/J1/../../../../../../../../../../export/home/jenkins/workspace/Lucene-Solr-master-Solaris/solr/build/solr-core/test/J1/temp/solr.cloud.DeleteInactiveReplicaTest_4A1ABB138364B094-001/shard-1-001/cores}
   [junit4]   2> 1231612 INFO  (TEST-DeleteInactiveReplicaTest.deleteInactiveReplicaTest-seed#[4A1ABB138364B094]) [    ] o.a.s.s.SolrDispatchFilter SolrDispatchFilter.init(): sun.misc.Launcher$AppClassLoader@6d06d69c
   [junit4]   2> 1231612 INFO  (TEST-DeleteInactiveReplicaTest.deleteInactiveReplicaTest-seed#[4A1ABB138364B094]) [    ] o.a.s.c.SolrResourceLoader new SolrResourceLoader for directory: '/export/home/jenkins/workspace/Lucene-Solr-master-Solaris/solr/build/solr-core/test/J1/temp/solr.cloud.DeleteInactiveReplicaTest_4A1ABB138364B094-001/shard-1-001'
   [junit4]   2> 1231612 INFO  (TEST-DeleteInactiveReplicaTest.deleteInactiveReplicaTest-seed#[4A1ABB138364B094]) [    ] o.a.s.c.SolrResourceLoader JNDI not configured for solr (NoInitialContextEx)
   [junit4]   2> 1231612 INFO  (TEST-DeleteInactiveReplicaTest.deleteInactiveReplicaTest-seed#[4A1ABB138364B094]) [    ] o.a.s.c.SolrResourceLoader solr home defaulted to 'solr/' (could not find system property or JNDI)
   [junit4]   2> 1231614 INFO  (TEST-DeleteInactiveReplicaTest.deleteInactiveReplicaTest-seed#[4A1ABB138364B094]) [    ] o.a.s.c.c.SolrZkClient Using default ZkCredentialsProvider
   [junit4]   2> 1231615 INFO  (TEST-DeleteInactiveReplicaTest.deleteInactiveReplicaTest-seed#[4A1ABB138364B094]) [    ] o.a.s.c.c.ConnectionManager Waiting for client to connect to ZooKeeper
   [junit4]   2> 1231617 INFO  (zkCallback-1556-thread-1) [    ] o.a.s.c.c.ConnectionManager Watcher org.apache.solr.common.cloud.ConnectionManager@4ab2a57e name:ZooKeeperConnection Watcher:127.0.0.1:39447/solr got event WatchedEvent state:SyncConnected type:None path:null path:null type:None
   [junit4]   2> 1231617 INFO  (TEST-DeleteInactiveReplicaTest.deleteInactiveReplicaTest-seed#[4A1ABB138364B094]) [    ] o.a.s.c.c.ConnectionManager Client is connected to ZooKeeper
   [junit4]   2> 1231617 INFO  (TEST-DeleteInactiveReplicaTest.deleteInactiveReplicaTest-seed#[4A1ABB138364B094]) [    ] o.a.s.c.c.SolrZkClient Using default ZkACLProvider
   [junit4]   2> 1231619 INFO  (TEST-DeleteInactiveReplicaTest.deleteInactiveReplicaTest-seed#[4A1ABB138364B094]) [    ] o.a.s.s.SolrDispatchFilter Loading solr.xml from SolrHome (not found in ZooKeeper)
   [junit4]   2> 1231619 INFO  (TEST-DeleteInactiveReplicaTest.deleteInactiveReplicaTest-seed#[4A1ABB138364B094]) [    ] o.a.s.c.SolrXmlConfig Loading container configuration from /export/home/jenkins/workspace/Lucene-Solr-master-Solaris/solr/build/solr-core/test/J1/temp/solr.cloud.DeleteInactiveReplicaTest_4A1ABB138364B094-001/shard-1-001/solr.xml
   [junit4]   2> 1231627 INFO  (TEST-DeleteInactiveReplicaTest.deleteInactiveReplicaTest-seed#[4A1ABB138364B094]) [    ] o.a.s.c.CorePropertiesLocator Config-defined core root directory: /export/home/jenkins/workspace/Lucene-Solr-master-Solaris/solr/build/solr-core/test/J1/../../../../../../../../../../export/home/jenkins/workspace/Lucene-Solr-master-Solaris/solr/build/solr-core/test/J1/temp/solr.cloud.DeleteInactiveReplicaTest_4A1ABB138364B094-001/shard-1-001/cores
   [junit4]   2> 1231627 INFO  (TEST-DeleteInactiveReplicaTest.deleteInactiveReplicaTest-seed#[4A1ABB138364B094]) [    ] o.a.s.c.CoreContainer New CoreContainer 1931004934
   [junit4]   2> 1231627 INFO  (TEST-DeleteInactiveReplicaTest.deleteInactiveReplicaTest-seed#[4A1ABB138364B094]) [    ] o.a.s.c.CoreContainer Loading cores into CoreContainer [instanceDir=/export/home/jenkins/workspace/Lucene-Solr-master-Solaris/solr/build/solr-core/test/J1/temp/solr.cloud.DeleteInactiveReplicaTest_4A1ABB138364B094-001/shard-1-001]
   [junit4]   2> 1231628 WARN  (TEST-DeleteInactiveReplicaTest.deleteInactiveReplicaTest-seed#[4A1ABB138364B094]) [    ] o.a.s.c.CoreContainer Couldn't add files from /export/home/jenkins/workspace/Lucene-Solr-master-Solaris/solr/build/solr-core/test/J1/temp/solr.cloud.DeleteInactiveReplicaTest_4A1ABB138364B094-001/shard-1-001/lib to classpath: /export/home/jenkins/workspace/Lucene-Solr-master-Solaris/solr/build/solr-core/test/J1/temp/solr.cloud.DeleteInactiveReplicaTest_4A1ABB138364B094-001/shard-1-001/lib
   [junit4]   2> 1231628 INFO  (TEST-DeleteInactiveReplicaTest.deleteInactiveReplicaTest-seed#[4A1ABB138364B094]) [    ] o.a.s.h.c.HttpShardHandlerFactory created with socketTimeout : 90000,urlScheme : ,connTimeout : 15000,maxConnectionsPerHost : 20,maxConnections : 10000,corePoolSize : 0,maximumPoolSize : 2147483647,maxThreadIdleTime : 5,sizeOfQueue : -1,fairnessPolicy : false,
   [junit4]   2> 1231631 INFO  (TEST-DeleteInactiveReplicaTest.deleteInactiveReplicaTest-seed#[4A1ABB138364B094]) [    ] o.a.s.u.UpdateShardHandler Creating UpdateShardHandler HTTP client with params: 
   [junit4]   2> 1231632 INFO  (TEST-DeleteInactiveReplicaTest.deleteInactiveReplicaTest-seed#[4A1ABB138364B094]) [    ] o.a.s.l.LogWatcher SLF4J impl is org.slf4j.impl.Log4jLoggerFactory
   [junit4]   2> 1231632 INFO  (TEST-DeleteInactiveReplicaTest.deleteInactiveReplicaTest-seed#[4A1ABB138364B094]) [    ] o.a.s.l.LogWatcher Registering Log Listener [Log4j (org.slf4j.impl.Log4jLoggerFactory)]
   [junit4]   2> 1231632 INFO  (TEST-DeleteInactiveReplicaTest.deleteInactiveReplicaTest-seed#[4A1ABB138364B094]) [    ] o.a.s.c.ZkContainer Zookeeper client=127.0.0.1:39447/solr
   [junit4]   2> 1231632 INFO  (TEST-DeleteInactiveReplicaTest.deleteInactiveReplicaTest-seed#[4A1ABB138364B094]) [    ] o.a.s.c.ZkController zkHost includes chroot
   [junit4]   2> 1231632 INFO  (TEST-DeleteInactiveReplicaTest.deleteInactiveReplicaTest-seed#[4A1ABB138364B094]) [    ] o.a.s.c.c.SolrZkClient Using default ZkCredentialsProvider
   [junit4]   2> 1231633 INFO  (TEST-DeleteInactiveReplicaTest.deleteInactiveReplicaTest-seed#[4A1ABB138364B094]) [    ] o.a.s.c.c.ConnectionManager Waiting for client to connect to ZooKeeper
   [junit4]   2> 1231635 INFO  (zkCallback-1559-thread-1) [    ] o.a.s.c.c.ConnectionManager Watcher org.apache.solr.common.cloud.ConnectionManager@746e01d2 name:ZooKeeperConnection Watcher:127.0.0.1:39447 got event WatchedEvent state:SyncConnected type:None path:null path:null type:None
   [junit4]   2> 1231635 INFO  (TEST-DeleteInactiveReplicaTest.deleteInactiveReplicaTest-seed#[4A1ABB138364B094]) [    ] o.a.s.c.c.ConnectionManager Client is connected to ZooKeeper
   [junit4]   2> 1231635 INFO  (TEST-DeleteInactiveReplicaTest.deleteInactiveReplicaTest-seed#[4A1ABB138364B094]) [    ] o.a.s.c.c.SolrZkClient Using default ZkACLProvider
   [junit4]   2> 1231637 INFO  (TEST-DeleteInactiveReplicaTest.deleteInactiveReplicaTest-seed#[4A1ABB138364B094]) [n:127.0.0.1:65247_    ] o.a.s.c.ZkController Added new OnReconnect listener org.apache.solr.cloud.ZkController$$Lambda$11/1131684808@417865e1
   [junit4]   2> 1231637 INFO  (TEST-DeleteInactiveReplicaTest.deleteInactiveReplicaTest-seed#[4A1ABB138364B094]) [n:127.0.0.1:65247_    ] o.a.s.c.c.ConnectionManager Waiting for client to connect to ZooKeeper
   [junit4]   2> 1231639 INFO  (zkCallback-1560-thread-1-processing-n:127.0.0.1:65247_) [n:127.0.0.1:65247_    ] o.a.s.c.c.ConnectionManager Watcher org.apache.solr.common.cloud.ConnectionManager@1e1768d5 name:ZooKeeperConnection Watcher:127.0.0.1:39447/solr got event WatchedEvent state:SyncConnected type:None path:null path:null type:None
   [junit4]   2> 1231639 INFO  (TEST-DeleteInactiveReplicaTest.deleteInactiveReplicaTest-seed#[4A1ABB138364B094]) [n:127.0.0.1:65247_    ] o.a.s.c.c.ConnectionManager Client is connected to ZooKeeper
   [junit4]   2> 1231651 INFO  (TEST-DeleteInactiveReplicaTest.deleteInactiveReplicaTest-seed#[4A1ABB138364B094]) [n:127.0.0.1:65247_    ] o.a.s.c.c.ZkStateReader Updating cluster state from ZooKeeper... 
   [junit4]   2> 1231653 INFO  (TEST-DeleteInactiveReplicaTest.deleteInactiveReplicaTest-seed#[4A1ABB138364B094]) [n:127.0.0.1:65247_    ] o.a.s.c.c.ZkStateReader Updated live nodes from ZooKeeper... (0) -> (1)
   [junit4]   2> 1231657 INFO  (TEST-DeleteInactiveReplicaTest.deleteInactiveReplicaTest-seed#[4A1ABB138364B094]) [n:127.0.0.1:65247_    ] o.a.s.c.Overseer Overseer (id=null) closing
   [junit4]   2> 1231658 INFO  (TEST-DeleteInactiveReplicaTest.deleteInactiveReplicaTest-seed#[4A1ABB138364B094]) [n:127.0.0.1:65247_    ] o.a.s.c.LeaderElector Joined leadership election with path: /overseer_elect/election/95824435900317706-127.0.0.1:65247_-n_0000000001
   [junit4]   2> 1231659 INFO  (TEST-DeleteInactiveReplicaTest.deleteInactiveReplicaTest-seed#[4A1ABB138364B094]) [n:127.0.0.1:65247_    ] o.a.s.c.LeaderElector Watching path /overseer_elect/election/95824435900317701-127.0.0.1:37575_-n_0000000000 to know if I could be the leader
   [junit4]   2> 1231660 INFO  (TEST-DeleteInactiveReplicaTest.deleteInactiveReplicaTest-seed#[4A1ABB138364B094]) [n:127.0.0.1:65247_    ] o.a.s.c.ZkController Publish node=127.0.0.1:65247_ as DOWN
   [junit4]   2> 1231663 INFO  (OverseerStateUpdate-95824435900317701-127.0.0.1:37575_-n_0000000000) [n:127.0.0.1:37575_    ] o.a.s.c.Overseer processMessage: queueSize: 1, message = {
   [junit4]   2>   "operation":"downnode",
   [junit4]   2>   "node_name":"127.0.0.1:65247_"} current state version: 3
   [junit4]   2> 1231664 INFO  (OverseerStateUpdate-95824435900317701-127.0.0.1:37575_-n_0000000000) [n:127.0.0.1:37575_    ] o.a.s.c.o.NodeMutator DownNode state invoked for node: 127.0.0.1:65247_
   [junit4]   2> 1231665 INFO  (OverseerStateUpdate-95824435900317701-127.0.0.1:37575_-n_0000000000) [n:127.0.0.1:37575_    ] o.a.s.c.o.ZkStateWriter going to update_collection /collections/collection1/state.json version: 0
   [junit4]   2> 1231774 INFO  (zkCallback-1552-thread-1-processing-n:127.0.0.1:37575_) [n:127.0.0.1:37575_    ] o.a.s.c.c.ZkStateReader A cluster state change: [WatchedEvent state:SyncConnected type:NodeDataChanged path:/clusterstate.json], has occurred - updating... (live nodes size: [1])
   [junit4]   2> 1231774 INFO  (zkCallback-1560-thread-1-processing-n:127.0.0.1:65247_) [n:127.0.0.1:65247_    ] o.a.s.c.c.ZkStateReader A cluster state change: [WatchedEvent state:SyncConnected type:NodeDataChanged path:/clusterstate.json], has occurred - updating... (live nodes size: [1])
   [junit4]   2> 1231774 INFO  (zkCallback-1554-thread-1) [    ] o.a.s.c.c.ZkStateReader A cluster state change: [WatchedEvent state:SyncConnected type:NodeDataChanged path:/clusterstate.json], has occurred - updating... (live nodes size: [1])
   [junit4]   2> 1232668 INFO  (TEST-DeleteInactiveReplicaTest.deleteInactiveReplicaTest-seed#[4A1ABB138364B094]) [n:127.0.0.1:65247_    ] o.a.s.c.ZkController Register node as live in ZooKeeper:/live_nodes/127.0.0.1:65247_
   [junit4]   2> 1232669 INFO  (TEST-DeleteInactiveReplicaTest.deleteInactiveReplicaTest-seed#[4A1ABB138364B094]) [n:127.0.0.1:65247_    ] o.a.s.c.c.SolrZkClient makePath: /live_nodes/127.0.0.1:65247_
   [junit4]   2> 1232672 INFO  (zkCallback-1560-thread-1-processing-n:127.0.0.1:65247_) [n:127.0.0.1:65247_    ] o.a.s.c.c.ZkStateReader A live node change: [WatchedEvent state:SyncConnected type:NodeChildrenChanged path:/live_nodes], has occurred - updating... (live nodes size: [1])
   [junit4]   2> 1232672 INFO  (zkCallback-1554-thread-1) [    ] o.a.s.c.c.ZkStateReader A live node change: [WatchedEvent state:SyncConnected type:NodeChildrenChanged path:/live_nodes], has occurred - updating... (live nodes size: [1])
   [junit4]   2> 1232672 INFO  (zkCallback-1552-thread-1-processing-n:127.0.0.1:37575_) [n:127.0.0.1:37575_    ] o.a.s.c.c.ZkStateReader A live node change: [WatchedEvent state:SyncConnected type:NodeChildrenChanged path:/live_nodes], has occurred - updating... (live nodes size: [1])
   [junit4]   2> 1232673 INFO  (zkCallback-1554-thread-1) [    ] o.a.s.c.c.ZkStateReader Updated live nodes from ZooKeeper... (1) -> (2)
   [junit4]   2> 1232673 INFO  (zkCallback-1560-thread-1-processing-n:127.0.0.1:65247_) [n:127.0.0.1:65247_    ] o.a.s.c.c.ZkStateReader Updated live nodes from ZooKeeper... (1) -> (2)
   [junit4]   2> 1232673 INFO  (zkCallback-1552-thread-1-processing-n:127.0.0.1:37575_) [n:127.0.0.1:37575_    ] o.a.s.c.c.ZkStateReader Updated live nodes from ZooKeeper... (1) -> (2)
   [junit4]   2> 1232831 INFO  (TEST-DeleteInactiveReplicaTest.deleteInactiveReplicaTest-seed#[4A1ABB138364B094]) [n:127.0.0.1:

[...truncated too long message...]

ad-1) [    x:collection1] o.a.s.u.SolrCoreState Closing SolrCoreState
   [junit4]   2> 2007665 INFO  (coreCloseExecutor-7495-thread-1) [    x:collection1] o.a.s.u.DefaultSolrCoreState SolrCoreState ref count has reached 0 - closing IndexWriter
   [junit4]   2> 2007665 INFO  (coreCloseExecutor-7495-thread-1) [    x:collection1] o.a.s.u.DefaultSolrCoreState closing IndexWriter with IndexWriterCloser
   [junit4]   2> 2007666 INFO  (coreCloseExecutor-7495-thread-1) [    x:collection1] o.a.s.c.SolrCore [collection1] Closing main searcher on request.
   [junit4]   2> 2007666 INFO  (coreCloseExecutor-7495-thread-1) [    x:collection1] o.a.s.c.CachingDirectoryFactory Closing MockDirectoryFactory - 2 directories currently being tracked
   [junit4]   2> 2007666 INFO  (coreCloseExecutor-7495-thread-1) [    x:collection1] o.a.s.c.CachingDirectoryFactory looking to close /export/home/jenkins/workspace/Lucene-Solr-master-Solaris/solr/build/solr-core/test/J1/temp/solr.handler.component.SpellCheckComponentTest_4A1ABB138364B094-001/init-core-data-001 [CachedDir<<refCount=0;path=/export/home/jenkins/workspace/Lucene-Solr-master-Solaris/solr/build/solr-core/test/J1/temp/solr.handler.component.SpellCheckComponentTest_4A1ABB138364B094-001/init-core-data-001;done=false>>]
   [junit4]   2> 2007666 INFO  (coreCloseExecutor-7495-thread-1) [    x:collection1] o.a.s.c.CachingDirectoryFactory Closing directory, CoreContainer#isShutdown=true
   [junit4]   2> 2007666 INFO  (coreCloseExecutor-7495-thread-1) [    x:collection1] o.a.s.c.CachingDirectoryFactory Closing directory: /export/home/jenkins/workspace/Lucene-Solr-master-Solaris/solr/build/solr-core/test/J1/temp/solr.handler.component.SpellCheckComponentTest_4A1ABB138364B094-001/init-core-data-001
   [junit4]   2> 2007666 INFO  (coreCloseExecutor-7495-thread-1) [    x:collection1] o.a.s.c.CachingDirectoryFactory looking to close /export/home/jenkins/workspace/Lucene-Solr-master-Solaris/solr/build/solr-core/test/J1/temp/solr.handler.component.SpellCheckComponentTest_4A1ABB138364B094-001/init-core-data-001/index [CachedDir<<refCount=0;path=/export/home/jenkins/workspace/Lucene-Solr-master-Solaris/solr/build/solr-core/test/J1/temp/solr.handler.component.SpellCheckComponentTest_4A1ABB138364B094-001/init-core-data-001/index;done=false>>]
   [junit4]   2> 2007666 INFO  (coreCloseExecutor-7495-thread-1) [    x:collection1] o.a.s.c.CachingDirectoryFactory Closing directory, CoreContainer#isShutdown=true
   [junit4]   2> 2007666 INFO  (coreCloseExecutor-7495-thread-1) [    x:collection1] o.a.s.c.CachingDirectoryFactory Closing directory: /export/home/jenkins/workspace/Lucene-Solr-master-Solaris/solr/build/solr-core/test/J1/temp/solr.handler.component.SpellCheckComponentTest_4A1ABB138364B094-001/init-core-data-001/index
   [junit4]   2> NOTE: leaving temporary files on disk at: /export/home/jenkins/workspace/Lucene-Solr-master-Solaris/solr/build/solr-core/test/J1/temp/solr.handler.component.SpellCheckComponentTest_4A1ABB138364B094-001
   [junit4]   2> NOTE: test params are: codec=Asserting(Lucene60): {start1=PostingsFormat(name=Direct), range_facet_l_dv=PostingsFormat(name=Memory doPackFST= true), multiDefault=TestBloomFilteredLucenePostings(BloomFilteringPostingsFormat(Lucene50(blocksize=128))), intDefault=PostingsFormat(name=Memory doPackFST= false), range_facet_l=PostingsFormat(name=Memory doPackFST= false), lowerfilt1and2=TestBloomFilteredLucenePostings(BloomFilteringPostingsFormat(Lucene50(blocksize=128))), end4=PostingsFormat(name=Direct), end3=TestBloomFilteredLucenePostings(BloomFilteringPostingsFormat(Lucene50(blocksize=128))), end2=PostingsFormat(name=Memory doPackFST= true), end1=PostingsFormat(name=Memory doPackFST= false), lowerfilt=TestBloomFilteredLucenePostings(BloomFilteringPostingsFormat(Lucene50(blocksize=128))), gram1=PostingsFormat(name=Memory doPackFST= false), id=PostingsFormat(name=Memory doPackFST= true), range_facet_i_dv=PostingsFormat(name=Memory doPackFST= false), gram2=PostingsFormat(name=Memory doPackFST= true), gram3=TestBloomFilteredLucenePostings(BloomFilteringPostingsFormat(Lucene50(blocksize=128))), start3=PostingsFormat(name=Memory doPackFST= true), gram4=PostingsFormat(name=Direct), start2=TestBloomFilteredLucenePostings(BloomFilteringPostingsFormat(Lucene50(blocksize=128))), word=PostingsFormat(name=Memory doPackFST= false), timestamp=PostingsFormat(name=Memory doPackFST= false), start4=PostingsFormat(name=Memory doPackFST= false)}, docValues:{range_facet_l_dv=DocValuesFormat(name=Asserting), range_facet_i_dv=DocValuesFormat(name=Lucene54), timestamp=DocValuesFormat(name=Lucene54)}, maxPointsInLeafNode=135, maxMBSortInHeap=7.414906830622729, sim=RandomSimilarity(queryNorm=false,coord=yes): {}, locale=ja, timezone=America/Creston
   [junit4]   2> NOTE: SunOS 5.11 amd64/Oracle Corporation 1.8.0_92 (64-bit)/cpus=3,threads=1,free=200879464,total=427921408
   [junit4]   2> NOTE: All tests run in this JVM: [TestRebalanceLeaders, TestWriterPerf, SuggesterTSTTest, CopyFieldTest, ParsingFieldUpdateProcessorsTest, TestUtils, TestDefaultSearchFieldResource, TestShardHandlerFactory, FieldMutatingUpdateProcessorTest, TestAuthenticationFramework, TestCloudManagedSchema, TestAnalyzeInfixSuggestions, TestRecovery, ChangedSchemaMergeTest, ConvertedLegacyTest, ShardRoutingCustomTest, TestReversedWildcardFilterFactory, SegmentsInfoRequestHandlerTest, BJQParserTest, TestJoin, DeleteReplicaTest, PluginInfoTest, TestFoldingMultitermQuery, TestRTGBase, DocValuesMissingTest, FileUtilsTest, BadIndexSchemaTest, TestRangeQuery, TestRawResponseWriter, AddBlockUpdateTest, TestBM25SimilarityFactory, StressHdfsTest, SolrCmdDistributorTest, TestTolerantUpdateProcessorRandomCloud, UUIDUpdateProcessorFallbackTest, ResourceLoaderTest, TestInfoStreamLogging, CollectionReloadTest, TestMissingGroups, HdfsRestartWhileUpdatingTest, TestNRTOpen, TestManagedSynonymFilterFactory, TestExactStatsCache, TestDynamicLoading, SolrInfoMBeanTest, CoreAdminHandlerTest, TestSchemaVersionResource, TestIndexSearcher, HdfsRecoverLeaseTest, DistributedSuggestComponentTest, TestRuleBasedAuthorizationPlugin, OpenExchangeRatesOrgProviderTest, TestNonDefinedSimilarityFactory, HdfsThreadLeakTest, TestSchemaManager, TestObjectReleaseTracker, TestFastWriter, TestAuthorizationFramework, TestFileDictionaryLookup, FullSolrCloudDistribCmdsTest, HdfsCollectionsAPIDistributedZkTest, SearchHandlerTest, FieldAnalysisRequestHandlerTest, TestTrackingShardHandlerFactory, TestQuerySenderListener, TestMacros, IndexSchemaRuntimeFieldTest, TestSimpleQParserPlugin, TriLevelCompositeIdRoutingTest, HighlighterMaxOffsetTest, TestOmitPositions, CacheHeaderTest, TermVectorComponentTest, SignatureUpdateProcessorFactoryTest, SuggesterWFSTTest, TestReqParamsAPI, DebugComponentTest, BigEndianAscendingWordDeserializerTest, TestManagedResource, SolrPluginUtilsTest, TestScoreJoinQPScore, CloudMLTQParserTest, DistributedQueueTest, TestSolr4Spatial2, ConfigSetsAPITest, BasicFunctionalityTest, TestConfigSetsAPIExclusivity, TestJsonFacets, NumericFieldsTest, RequestLoggingTest, TestCSVResponseWriter, TestSolr4Spatial, TestRealTimeGet, DirectUpdateHandlerOptimizeTest, TestRandomCollapseQParserPlugin, TestCoreDiscovery, TestSolrJ, SortByFunctionTest, TestRequestForwarding, TestConfigReload, LoggingHandlerTest, TestUseDocValuesAsStored2, DistanceFunctionTest, TestClassicSimilarityFactory, TestSolrIndexConfig, RemoteQueryErrorTest, TestBinaryField, LeaderInitiatedRecoveryOnShardRestartTest, TestLeaderElectionZkExpiry, TestSSLRandomization, TestJettySolrRunner, MinimalSchemaTest, InfoHandlerTest, SolrCloudExampleTest, AnalyticsQueryTest, RequestHandlersTest, TestCollationField, SpellCheckCollatorTest, StatsComponentTest, CdcrUpdateLogTest, TestDocBasedVersionConstraints, TestCloudSchemaless, DeleteInactiveReplicaTest, DistributedQueryComponentCustomSortTest, ShowFileRequestHandlerTest, TestTrieFacet, BaseCdcrDistributedZkTest, DistributedMLTComponentTest, TestLMJelinekMercerSimilarityFactory, TestSolrCoreProperties, TestRestManager, TestStressLiveNodes, UniqFieldsUpdateProcessorFactoryTest, DateMathParserTest, TestCrossCoreJoin, TestConfigOverlay, BitVectorTest, CheckHdfsIndexTest, WordBreakSolrSpellCheckerTest, TestOrdValues, TestSolrConfigHandlerConcurrent, BasicDistributedZkTest, ChaosMonkeySafeLeaderTest, BasicDistributedZk2Test, CollectionsAPIDistributedZkTest, BasicZkTest, RecoveryZkTest, ClusterStateUpdateTest, TestRandomFaceting, ZkSolrClientTest, TestZkChroot, ZkCLITest, AutoCommitTest, TestHashPartitioner, TestReload, SimpleFacetsTest, SpellCheckComponentTest]
   [junit4] Completed [323/592 (2!)] on J1 in 8.57s, 11 tests, 1 error <<< FAILURES!

[...truncated 890 lines...]
BUILD FAILED
/export/home/jenkins/workspace/Lucene-Solr-master-Solaris/build.xml:740: The following error occurred while executing this line:
/export/home/jenkins/workspace/Lucene-Solr-master-Solaris/build.xml:684: The following error occurred while executing this line:
/export/home/jenkins/workspace/Lucene-Solr-master-Solaris/build.xml:59: The following error occurred while executing this line:
/export/home/jenkins/workspace/Lucene-Solr-master-Solaris/solr/build.xml:233: The following error occurred while executing this line:
/export/home/jenkins/workspace/Lucene-Solr-master-Solaris/solr/common-build.xml:529: The following error occurred while executing this line:
/export/home/jenkins/workspace/Lucene-Solr-master-Solaris/lucene/common-build.xml:1457: The following error occurred while executing this line:
/export/home/jenkins/workspace/Lucene-Solr-master-Solaris/lucene/common-build.xml:1014: There were test failures: 592 suites (10 ignored), 2394 tests, 2 errors, 86 ignored (71 assumptions) [seed: 4A1ABB138364B094]

Total time: 78 minutes 28 seconds
Build step 'Invoke Ant' marked build as failure
Archiving artifacts
[WARNINGS] Skipping publisher since build result is FAILURE
Recording test results
Email was triggered for: Failure - Any
Sending email for trigger: Failure - Any



Mime
View raw message