lucene-dev mailing list archives

Site index · List index
Message view « Date » · « Thread »
Top « Date » · « Thread »
From Policeman Jenkins Server <jenk...@thetaphi.de>
Subject [JENKINS] Lucene-Solr-6.0-Linux (64bit/jdk1.8.0_92) - Build # 183 - Still Failing!
Date Wed, 25 May 2016 22:48:45 GMT
Build: http://jenkins.thetaphi.de/job/Lucene-Solr-6.0-Linux/183/
Java: 64bit/jdk1.8.0_92 -XX:-UseCompressedOops -XX:+UseSerialGC

1 tests failed.
FAILED:  junit.framework.TestSuite.org.apache.solr.schema.TestManagedSchemaAPI

Error Message:
ObjectTracker found 2 object(s) that were not released!!! [RawDirectoryWrapper, MockDirectoryWrapper]

Stack Trace:
java.lang.AssertionError: ObjectTracker found 2 object(s) that were not released!!! [RawDirectoryWrapper, MockDirectoryWrapper]
	at __randomizedtesting.SeedInfo.seed([6791237DEE65D1F9]:0)
	at org.junit.Assert.fail(Assert.java:93)
	at org.junit.Assert.assertTrue(Assert.java:43)
	at org.junit.Assert.assertNull(Assert.java:551)
	at org.apache.solr.SolrTestCaseJ4.afterClass(SolrTestCaseJ4.java:248)
	at sun.reflect.GeneratedMethodAccessor20.invoke(Unknown Source)
	at sun.reflect.DelegatingMethodAccessorImpl.invoke(DelegatingMethodAccessorImpl.java:43)
	at java.lang.reflect.Method.invoke(Method.java:498)
	at com.carrotsearch.randomizedtesting.RandomizedRunner.invoke(RandomizedRunner.java:1764)
	at com.carrotsearch.randomizedtesting.RandomizedRunner$7.evaluate(RandomizedRunner.java:834)
	at com.carrotsearch.randomizedtesting.rules.StatementAdapter.evaluate(StatementAdapter.java:36)
	at com.carrotsearch.randomizedtesting.rules.SystemPropertiesRestoreRule$1.evaluate(SystemPropertiesRestoreRule.java:57)
	at org.apache.lucene.util.AbstractBeforeAfterRule$1.evaluate(AbstractBeforeAfterRule.java:45)
	at com.carrotsearch.randomizedtesting.rules.StatementAdapter.evaluate(StatementAdapter.java:36)
	at org.apache.lucene.util.TestRuleStoreClassName$1.evaluate(TestRuleStoreClassName.java:41)
	at com.carrotsearch.randomizedtesting.rules.NoShadowingOrOverridesOnMethodsRule$1.evaluate(NoShadowingOrOverridesOnMethodsRule.java:40)
	at com.carrotsearch.randomizedtesting.rules.NoShadowingOrOverridesOnMethodsRule$1.evaluate(NoShadowingOrOverridesOnMethodsRule.java:40)
	at com.carrotsearch.randomizedtesting.rules.StatementAdapter.evaluate(StatementAdapter.java:36)
	at com.carrotsearch.randomizedtesting.rules.StatementAdapter.evaluate(StatementAdapter.java:36)
	at com.carrotsearch.randomizedtesting.rules.StatementAdapter.evaluate(StatementAdapter.java:36)
	at org.apache.lucene.util.TestRuleAssertionsRequired$1.evaluate(TestRuleAssertionsRequired.java:53)
	at org.apache.lucene.util.TestRuleMarkFailure$1.evaluate(TestRuleMarkFailure.java:47)
	at org.apache.lucene.util.TestRuleIgnoreAfterMaxFailures$1.evaluate(TestRuleIgnoreAfterMaxFailures.java:64)
	at org.apache.lucene.util.TestRuleIgnoreTestSuites$1.evaluate(TestRuleIgnoreTestSuites.java:54)
	at com.carrotsearch.randomizedtesting.rules.StatementAdapter.evaluate(StatementAdapter.java:36)
	at com.carrotsearch.randomizedtesting.ThreadLeakControl$StatementRunner.run(ThreadLeakControl.java:367)
	at java.lang.Thread.run(Thread.java:745)




Build Log:
[...truncated 12219 lines...]
   [junit4] Suite: org.apache.solr.schema.TestManagedSchemaAPI
   [junit4]   2> Creating dataDir: /home/jenkins/workspace/Lucene-Solr-6.0-Linux/solr/build/solr-core/test/J1/temp/solr.schema.TestManagedSchemaAPI_6791237DEE65D1F9-001/init-core-data-001
   [junit4]   2> 2260646 INFO  (SUITE-TestManagedSchemaAPI-seed#[6791237DEE65D1F9]-worker) [    ] o.a.s.SolrTestCaseJ4 Randomized ssl (false) and clientAuth (false)
   [junit4]   2> 2260647 INFO  (SUITE-TestManagedSchemaAPI-seed#[6791237DEE65D1F9]-worker) [    ] o.a.s.c.ZkTestServer STARTING ZK TEST SERVER
   [junit4]   2> 2260648 INFO  (Thread-5007) [    ] o.a.s.c.ZkTestServer client port:0.0.0.0/0.0.0.0:0
   [junit4]   2> 2260648 INFO  (Thread-5007) [    ] o.a.s.c.ZkTestServer Starting server
   [junit4]   2> 2260748 INFO  (SUITE-TestManagedSchemaAPI-seed#[6791237DEE65D1F9]-worker) [    ] o.a.s.c.ZkTestServer start zk server on port:45340
   [junit4]   2> 2260748 INFO  (SUITE-TestManagedSchemaAPI-seed#[6791237DEE65D1F9]-worker) [    ] o.a.s.c.c.SolrZkClient Using default ZkCredentialsProvider
   [junit4]   2> 2260748 INFO  (SUITE-TestManagedSchemaAPI-seed#[6791237DEE65D1F9]-worker) [    ] o.a.s.c.c.ConnectionManager Waiting for client to connect to ZooKeeper
   [junit4]   2> 2260750 INFO  (zkCallback-2322-thread-1) [    ] o.a.s.c.c.ConnectionManager Watcher org.apache.solr.common.cloud.ConnectionManager@3c430fe9 name:ZooKeeperConnection Watcher:127.0.0.1:45340 got event WatchedEvent state:SyncConnected type:None path:null path:null type:None
   [junit4]   2> 2260750 INFO  (SUITE-TestManagedSchemaAPI-seed#[6791237DEE65D1F9]-worker) [    ] o.a.s.c.c.ConnectionManager Client is connected to ZooKeeper
   [junit4]   2> 2260751 INFO  (SUITE-TestManagedSchemaAPI-seed#[6791237DEE65D1F9]-worker) [    ] o.a.s.c.c.SolrZkClient Using default ZkACLProvider
   [junit4]   2> 2260751 INFO  (SUITE-TestManagedSchemaAPI-seed#[6791237DEE65D1F9]-worker) [    ] o.a.s.c.c.SolrZkClient makePath: /solr/solr.xml
   [junit4]   2> 2260753 INFO  (jetty-launcher-2321-thread-1) [    ] o.e.j.s.Server jetty-9.3.8.v20160314
   [junit4]   2> 2260753 INFO  (jetty-launcher-2321-thread-2) [    ] o.e.j.s.Server jetty-9.3.8.v20160314
   [junit4]   2> 2260754 INFO  (jetty-launcher-2321-thread-2) [    ] o.e.j.s.h.ContextHandler Started o.e.j.s.ServletContextHandler@22770acb{/solr,null,AVAILABLE}
   [junit4]   2> 2260754 INFO  (jetty-launcher-2321-thread-1) [    ] o.e.j.s.h.ContextHandler Started o.e.j.s.ServletContextHandler@6a924ee{/solr,null,AVAILABLE}
   [junit4]   2> 2260756 INFO  (jetty-launcher-2321-thread-2) [    ] o.e.j.s.ServerConnector Started ServerConnector@b05c477{HTTP/1.1,[http/1.1]}{127.0.0.1:40478}
   [junit4]   2> 2260756 INFO  (jetty-launcher-2321-thread-2) [    ] o.e.j.s.Server Started @2262525ms
   [junit4]   2> 2260756 INFO  (jetty-launcher-2321-thread-2) [    ] o.a.s.c.s.e.JettySolrRunner Jetty properties: {hostContext=/solr, hostPort=40478}
   [junit4]   2> 2260756 INFO  (jetty-launcher-2321-thread-1) [    ] o.e.j.s.ServerConnector Started ServerConnector@de08c4b{HTTP/1.1,[http/1.1]}{127.0.0.1:46502}
   [junit4]   2> 2260756 INFO  (jetty-launcher-2321-thread-1) [    ] o.e.j.s.Server Started @2262526ms
   [junit4]   2> 2260756 INFO  (jetty-launcher-2321-thread-2) [    ] o.a.s.s.SolrDispatchFilter SolrDispatchFilter.init(): sun.misc.Launcher$AppClassLoader@73d16e93
   [junit4]   2> 2260756 INFO  (jetty-launcher-2321-thread-1) [    ] o.a.s.c.s.e.JettySolrRunner Jetty properties: {hostContext=/solr, hostPort=46502}
   [junit4]   2> 2260756 INFO  (jetty-launcher-2321-thread-2) [    ] o.a.s.c.SolrResourceLoader new SolrResourceLoader for directory: '/home/jenkins/workspace/Lucene-Solr-6.0-Linux/solr/build/solr-core/test/J1/temp/solr.schema.TestManagedSchemaAPI_6791237DEE65D1F9-001/tempDir-001/node2'
   [junit4]   2> 2260756 INFO  (jetty-launcher-2321-thread-1) [    ] o.a.s.s.SolrDispatchFilter SolrDispatchFilter.init(): sun.misc.Launcher$AppClassLoader@73d16e93
   [junit4]   2> 2260756 INFO  (jetty-launcher-2321-thread-1) [    ] o.a.s.c.SolrResourceLoader new SolrResourceLoader for directory: '/home/jenkins/workspace/Lucene-Solr-6.0-Linux/solr/build/solr-core/test/J1/temp/solr.schema.TestManagedSchemaAPI_6791237DEE65D1F9-001/tempDir-001/node1'
   [junit4]   2> 2260756 INFO  (jetty-launcher-2321-thread-2) [    ] o.a.s.c.SolrResourceLoader JNDI not configured for solr (NoInitialContextEx)
   [junit4]   2> 2260756 INFO  (jetty-launcher-2321-thread-1) [    ] o.a.s.c.SolrResourceLoader JNDI not configured for solr (NoInitialContextEx)
   [junit4]   2> 2260756 INFO  (jetty-launcher-2321-thread-2) [    ] o.a.s.c.SolrResourceLoader solr home defaulted to 'solr/' (could not find system property or JNDI)
   [junit4]   2> 2260756 INFO  (jetty-launcher-2321-thread-1) [    ] o.a.s.c.SolrResourceLoader solr home defaulted to 'solr/' (could not find system property or JNDI)
   [junit4]   2> 2260758 INFO  (jetty-launcher-2321-thread-2) [    ] o.a.s.c.c.SolrZkClient Using default ZkCredentialsProvider
   [junit4]   2> 2260758 INFO  (jetty-launcher-2321-thread-1) [    ] o.a.s.c.c.SolrZkClient Using default ZkCredentialsProvider
   [junit4]   2> 2260759 INFO  (jetty-launcher-2321-thread-2) [    ] o.a.s.c.c.ConnectionManager Waiting for client to connect to ZooKeeper
   [junit4]   2> 2260759 INFO  (jetty-launcher-2321-thread-1) [    ] o.a.s.c.c.ConnectionManager Waiting for client to connect to ZooKeeper
   [junit4]   2> 2260759 INFO  (zkCallback-2324-thread-1) [    ] o.a.s.c.c.ConnectionManager Watcher org.apache.solr.common.cloud.ConnectionManager@650d516 name:ZooKeeperConnection Watcher:127.0.0.1:45340/solr got event WatchedEvent state:SyncConnected type:None path:null path:null type:None
   [junit4]   2> 2260759 INFO  (zkCallback-2323-thread-1) [    ] o.a.s.c.c.ConnectionManager Watcher org.apache.solr.common.cloud.ConnectionManager@4f7dcccc name:ZooKeeperConnection Watcher:127.0.0.1:45340/solr got event WatchedEvent state:SyncConnected type:None path:null path:null type:None
   [junit4]   2> 2260759 INFO  (jetty-launcher-2321-thread-1) [    ] o.a.s.c.c.ConnectionManager Client is connected to ZooKeeper
   [junit4]   2> 2260759 INFO  (jetty-launcher-2321-thread-2) [    ] o.a.s.c.c.ConnectionManager Client is connected to ZooKeeper
   [junit4]   2> 2260759 INFO  (jetty-launcher-2321-thread-1) [    ] o.a.s.c.c.SolrZkClient Using default ZkACLProvider
   [junit4]   2> 2260760 INFO  (jetty-launcher-2321-thread-2) [    ] o.a.s.c.c.SolrZkClient Using default ZkACLProvider
   [junit4]   2> 2260760 INFO  (jetty-launcher-2321-thread-1) [    ] o.a.s.s.SolrDispatchFilter solr.xml found in ZooKeeper. Loading...
   [junit4]   2> 2260760 INFO  (jetty-launcher-2321-thread-2) [    ] o.a.s.s.SolrDispatchFilter solr.xml found in ZooKeeper. Loading...
   [junit4]   2> 2260764 INFO  (jetty-launcher-2321-thread-2) [    ] o.a.s.c.CorePropertiesLocator Config-defined core root directory: /home/jenkins/workspace/Lucene-Solr-6.0-Linux/solr/build/solr-core/test/J1/temp/solr.schema.TestManagedSchemaAPI_6791237DEE65D1F9-001/tempDir-001/node2/.
   [junit4]   2> 2260764 INFO  (jetty-launcher-2321-thread-1) [    ] o.a.s.c.CorePropertiesLocator Config-defined core root directory: /home/jenkins/workspace/Lucene-Solr-6.0-Linux/solr/build/solr-core/test/J1/temp/solr.schema.TestManagedSchemaAPI_6791237DEE65D1F9-001/tempDir-001/node1/.
   [junit4]   2> 2260764 INFO  (jetty-launcher-2321-thread-2) [    ] o.a.s.c.CoreContainer New CoreContainer 1951590974
   [junit4]   2> 2260764 INFO  (jetty-launcher-2321-thread-1) [    ] o.a.s.c.CoreContainer New CoreContainer 120163065
   [junit4]   2> 2260764 INFO  (jetty-launcher-2321-thread-1) [    ] o.a.s.c.CoreContainer Loading cores into CoreContainer [instanceDir=/home/jenkins/workspace/Lucene-Solr-6.0-Linux/solr/build/solr-core/test/J1/temp/solr.schema.TestManagedSchemaAPI_6791237DEE65D1F9-001/tempDir-001/node1]
   [junit4]   2> 2260764 INFO  (jetty-launcher-2321-thread-2) [    ] o.a.s.c.CoreContainer Loading cores into CoreContainer [instanceDir=/home/jenkins/workspace/Lucene-Solr-6.0-Linux/solr/build/solr-core/test/J1/temp/solr.schema.TestManagedSchemaAPI_6791237DEE65D1F9-001/tempDir-001/node2]
   [junit4]   2> 2260764 WARN  (NIOServerCxn.Factory:0.0.0.0/0.0.0.0:0) [    ] o.a.z.s.NIOServerCnxn caught end of stream exception
   [junit4]   2> EndOfStreamException: Unable to read additional data from client sessionid 0x154ea1187660001, likely client has closed socket
   [junit4]   2> 	at org.apache.zookeeper.server.NIOServerCnxn.doIO(NIOServerCnxn.java:228)
   [junit4]   2> 	at org.apache.zookeeper.server.NIOServerCnxnFactory.run(NIOServerCnxnFactory.java:208)
   [junit4]   2> 	at java.lang.Thread.run(Thread.java:745)
   [junit4]   2> 2260764 WARN  (jetty-launcher-2321-thread-1) [    ] o.a.s.c.CoreContainer Couldn't add files from /home/jenkins/workspace/Lucene-Solr-6.0-Linux/solr/build/solr-core/test/J1/temp/solr.schema.TestManagedSchemaAPI_6791237DEE65D1F9-001/tempDir-001/node1/lib to classpath: /home/jenkins/workspace/Lucene-Solr-6.0-Linux/solr/build/solr-core/test/J1/temp/solr.schema.TestManagedSchemaAPI_6791237DEE65D1F9-001/tempDir-001/node1/lib
   [junit4]   2> 2260764 WARN  (jetty-launcher-2321-thread-2) [    ] o.a.s.c.CoreContainer Couldn't add files from /home/jenkins/workspace/Lucene-Solr-6.0-Linux/solr/build/solr-core/test/J1/temp/solr.schema.TestManagedSchemaAPI_6791237DEE65D1F9-001/tempDir-001/node2/lib to classpath: /home/jenkins/workspace/Lucene-Solr-6.0-Linux/solr/build/solr-core/test/J1/temp/solr.schema.TestManagedSchemaAPI_6791237DEE65D1F9-001/tempDir-001/node2/lib
   [junit4]   2> 2260764 INFO  (jetty-launcher-2321-thread-1) [    ] o.a.s.h.c.HttpShardHandlerFactory created with socketTimeout : 90000,urlScheme : ,connTimeout : 15000,maxConnectionsPerHost : 20,maxConnections : 10000,corePoolSize : 0,maximumPoolSize : 2147483647,maxThreadIdleTime : 5,sizeOfQueue : -1,fairnessPolicy : false,useRetries : false,
   [junit4]   2> 2260765 INFO  (jetty-launcher-2321-thread-2) [    ] o.a.s.h.c.HttpShardHandlerFactory created with socketTimeout : 90000,urlScheme : ,connTimeout : 15000,maxConnectionsPerHost : 20,maxConnections : 10000,corePoolSize : 0,maximumPoolSize : 2147483647,maxThreadIdleTime : 5,sizeOfQueue : -1,fairnessPolicy : false,useRetries : false,
   [junit4]   2> 2260765 INFO  (jetty-launcher-2321-thread-2) [    ] o.a.s.u.UpdateShardHandler Creating UpdateShardHandler HTTP client with params: socketTimeout=340000&connTimeout=45000&retry=true
   [junit4]   2> 2260765 INFO  (jetty-launcher-2321-thread-1) [    ] o.a.s.u.UpdateShardHandler Creating UpdateShardHandler HTTP client with params: socketTimeout=340000&connTimeout=45000&retry=true
   [junit4]   2> 2260766 INFO  (jetty-launcher-2321-thread-2) [    ] o.a.s.l.LogWatcher SLF4J impl is org.slf4j.impl.Log4jLoggerFactory
   [junit4]   2> 2260766 INFO  (jetty-launcher-2321-thread-2) [    ] o.a.s.l.LogWatcher Registering Log Listener [Log4j (org.slf4j.impl.Log4jLoggerFactory)]
   [junit4]   2> 2260766 INFO  (jetty-launcher-2321-thread-1) [    ] o.a.s.l.LogWatcher SLF4J impl is org.slf4j.impl.Log4jLoggerFactory
   [junit4]   2> 2260766 INFO  (jetty-launcher-2321-thread-1) [    ] o.a.s.l.LogWatcher Registering Log Listener [Log4j (org.slf4j.impl.Log4jLoggerFactory)]
   [junit4]   2> 2260766 INFO  (jetty-launcher-2321-thread-2) [    ] o.a.s.c.ZkContainer Zookeeper client=127.0.0.1:45340/solr
   [junit4]   2> 2260766 INFO  (jetty-launcher-2321-thread-1) [    ] o.a.s.c.ZkContainer Zookeeper client=127.0.0.1:45340/solr
   [junit4]   2> 2260766 INFO  (jetty-launcher-2321-thread-2) [    ] o.a.s.c.ZkController zkHost includes chroot
   [junit4]   2> 2260767 INFO  (jetty-launcher-2321-thread-1) [    ] o.a.s.c.ZkController zkHost includes chroot
   [junit4]   2> 2260767 INFO  (jetty-launcher-2321-thread-2) [    ] o.a.s.c.c.SolrZkClient Using default ZkCredentialsProvider
   [junit4]   2> 2260767 INFO  (jetty-launcher-2321-thread-1) [    ] o.a.s.c.c.SolrZkClient Using default ZkCredentialsProvider
   [junit4]   2> 2260767 INFO  (jetty-launcher-2321-thread-2) [    ] o.a.s.c.c.ConnectionManager Waiting for client to connect to ZooKeeper
   [junit4]   2> 2260767 INFO  (jetty-launcher-2321-thread-1) [    ] o.a.s.c.c.ConnectionManager Waiting for client to connect to ZooKeeper
   [junit4]   2> 2260768 INFO  (zkCallback-2330-thread-1) [    ] o.a.s.c.c.ConnectionManager Watcher org.apache.solr.common.cloud.ConnectionManager@2466d41f name:ZooKeeperConnection Watcher:127.0.0.1:45340 got event WatchedEvent state:SyncConnected type:None path:null path:null type:None
   [junit4]   2> 2260768 INFO  (jetty-launcher-2321-thread-1) [    ] o.a.s.c.c.ConnectionManager Client is connected to ZooKeeper
   [junit4]   2> 2260768 INFO  (zkCallback-2329-thread-1) [    ] o.a.s.c.c.ConnectionManager Watcher org.apache.solr.common.cloud.ConnectionManager@8406173 name:ZooKeeperConnection Watcher:127.0.0.1:45340 got event WatchedEvent state:SyncConnected type:None path:null path:null type:None
   [junit4]   2> 2260768 INFO  (jetty-launcher-2321-thread-2) [    ] o.a.s.c.c.ConnectionManager Client is connected to ZooKeeper
   [junit4]   2> 2260768 INFO  (jetty-launcher-2321-thread-1) [    ] o.a.s.c.c.SolrZkClient Using default ZkACLProvider
   [junit4]   2> 2260768 INFO  (jetty-launcher-2321-thread-2) [    ] o.a.s.c.c.SolrZkClient Using default ZkACLProvider
   [junit4]   2> 2260769 WARN  (NIOServerCxn.Factory:0.0.0.0/0.0.0.0:0) [    ] o.a.z.s.NIOServerCnxn caught end of stream exception
   [junit4]   2> EndOfStreamException: Unable to read additional data from client sessionid 0x154ea1187660004, likely client has closed socket
   [junit4]   2> 	at org.apache.zookeeper.server.NIOServerCnxn.doIO(NIOServerCnxn.java:228)
   [junit4]   2> 	at org.apache.zookeeper.server.NIOServerCnxnFactory.run(NIOServerCnxnFactory.java:208)
   [junit4]   2> 	at java.lang.Thread.run(Thread.java:745)
   [junit4]   2> 2260769 INFO  (jetty-launcher-2321-thread-1) [n:127.0.0.1:46502_solr    ] o.a.s.c.ZkController Added new OnReconnect listener org.apache.solr.cloud.ZkController$$Lambda$11/280943807@13620330
   [junit4]   2> 2260769 INFO  (jetty-launcher-2321-thread-2) [n:127.0.0.1:40478_solr    ] o.a.s.c.ZkController Added new OnReconnect listener org.apache.solr.cloud.ZkController$$Lambda$11/280943807@265f0278
   [junit4]   2> 2260770 INFO  (jetty-launcher-2321-thread-1) [n:127.0.0.1:46502_solr    ] o.a.s.c.c.ConnectionManager Waiting for client to connect to ZooKeeper
   [junit4]   2> 2260770 INFO  (jetty-launcher-2321-thread-2) [n:127.0.0.1:40478_solr    ] o.a.s.c.c.ConnectionManager Waiting for client to connect to ZooKeeper
   [junit4]   2> 2260772 INFO  (zkCallback-2331-thread-1-processing-n:127.0.0.1:46502_solr) [n:127.0.0.1:46502_solr    ] o.a.s.c.c.ConnectionManager Watcher org.apache.solr.common.cloud.ConnectionManager@3081dc32 name:ZooKeeperConnection Watcher:127.0.0.1:45340/solr got event WatchedEvent state:SyncConnected type:None path:null path:null type:None
   [junit4]   2> 2260772 INFO  (jetty-launcher-2321-thread-1) [n:127.0.0.1:46502_solr    ] o.a.s.c.c.ConnectionManager Client is connected to ZooKeeper
   [junit4]   2> 2260772 INFO  (zkCallback-2332-thread-1-processing-n:127.0.0.1:40478_solr) [n:127.0.0.1:40478_solr    ] o.a.s.c.c.ConnectionManager Watcher org.apache.solr.common.cloud.ConnectionManager@3bdc41ab name:ZooKeeperConnection Watcher:127.0.0.1:45340/solr got event WatchedEvent state:SyncConnected type:None path:null path:null type:None
   [junit4]   2> 2260772 INFO  (jetty-launcher-2321-thread-2) [n:127.0.0.1:40478_solr    ] o.a.s.c.c.ConnectionManager Client is connected to ZooKeeper
   [junit4]   2> 2260773 INFO  (jetty-launcher-2321-thread-1) [n:127.0.0.1:46502_solr    ] o.a.s.c.c.SolrZkClient makePath: /overseer/queue
   [junit4]   2> 2260773 INFO  (jetty-launcher-2321-thread-2) [n:127.0.0.1:40478_solr    ] o.a.s.c.c.SolrZkClient makePath: /overseer/queue
   [junit4]   2> 2260773 INFO  (jetty-launcher-2321-thread-1) [n:127.0.0.1:46502_solr    ] o.a.s.c.c.SolrZkClient makePath: /overseer/collection-queue-work
   [junit4]   2> 2260773 INFO  (jetty-launcher-2321-thread-2) [n:127.0.0.1:40478_solr    ] o.a.s.c.c.SolrZkClient makePath: /overseer/collection-queue-work
   [junit4]   2> 2260775 INFO  (jetty-launcher-2321-thread-1) [n:127.0.0.1:46502_solr    ] o.a.s.c.c.SolrZkClient makePath: /overseer/collection-map-running
   [junit4]   2> 2260775 INFO  (jetty-launcher-2321-thread-2) [n:127.0.0.1:40478_solr    ] o.a.s.c.c.SolrZkClient makePath: /overseer/collection-map-running
   [junit4]   2> 2260775 INFO  (jetty-launcher-2321-thread-2) [n:127.0.0.1:40478_solr    ] o.a.s.c.c.SolrZkClient makePath: /overseer/collection-map-completed
   [junit4]   2> 2260775 INFO  (jetty-launcher-2321-thread-1) [n:127.0.0.1:46502_solr    ] o.a.s.c.c.SolrZkClient makePath: /overseer/collection-map-completed
   [junit4]   2> 2260776 INFO  (jetty-launcher-2321-thread-2) [n:127.0.0.1:40478_solr    ] o.a.s.c.c.SolrZkClient makePath: /overseer/collection-map-failure
   [junit4]   2> 2260776 INFO  (jetty-launcher-2321-thread-1) [n:127.0.0.1:46502_solr    ] o.a.s.c.c.SolrZkClient makePath: /overseer/collection-map-failure
   [junit4]   2> 2260776 INFO  (jetty-launcher-2321-thread-1) [n:127.0.0.1:46502_solr    ] o.a.s.c.c.SolrZkClient makePath: /live_nodes
   [junit4]   2> 2260776 INFO  (jetty-launcher-2321-thread-2) [n:127.0.0.1:40478_solr    ] o.a.s.c.c.SolrZkClient makePath: /live_nodes
   [junit4]   2> 2260777 INFO  (jetty-launcher-2321-thread-2) [n:127.0.0.1:40478_solr    ] o.a.s.c.c.SolrZkClient makePath: /collections
   [junit4]   2> 2260777 INFO  (jetty-launcher-2321-thread-1) [n:127.0.0.1:46502_solr    ] o.a.s.c.c.SolrZkClient makePath: /collections
   [junit4]   2> 2260777 INFO  (jetty-launcher-2321-thread-1) [n:127.0.0.1:46502_solr    ] o.a.s.c.c.SolrZkClient makePath: /aliases.json
   [junit4]   2> 2260777 INFO  (jetty-launcher-2321-thread-2) [n:127.0.0.1:40478_solr    ] o.a.s.c.c.SolrZkClient makePath: /aliases.json
   [junit4]   2> 2260778 INFO  (jetty-launcher-2321-thread-2) [n:127.0.0.1:40478_solr    ] o.a.s.c.c.SolrZkClient makePath: /clusterstate.json
   [junit4]   2> 2260778 INFO  (jetty-launcher-2321-thread-1) [n:127.0.0.1:46502_solr    ] o.a.s.c.c.SolrZkClient makePath: /clusterstate.json
   [junit4]   2> 2260778 INFO  (jetty-launcher-2321-thread-2) [n:127.0.0.1:40478_solr    ] o.a.s.c.c.SolrZkClient makePath: /security.json
   [junit4]   2> 2260778 INFO  (jetty-launcher-2321-thread-1) [n:127.0.0.1:46502_solr    ] o.a.s.c.c.SolrZkClient makePath: /security.json
   [junit4]   2> 2260778 INFO  (jetty-launcher-2321-thread-1) [n:127.0.0.1:46502_solr    ] o.a.s.c.c.ZkStateReader Updating cluster state from ZooKeeper... 
   [junit4]   2> 2260778 INFO  (jetty-launcher-2321-thread-2) [n:127.0.0.1:40478_solr    ] o.a.s.c.c.ZkStateReader Updating cluster state from ZooKeeper... 
   [junit4]   2> 2260779 INFO  (jetty-launcher-2321-thread-2) [n:127.0.0.1:40478_solr    ] o.a.s.c.c.ZkStateReader Updated live nodes from ZooKeeper... (0) -> (0)
   [junit4]   2> 2260779 INFO  (jetty-launcher-2321-thread-1) [n:127.0.0.1:46502_solr    ] o.a.s.c.c.ZkStateReader Updated live nodes from ZooKeeper... (0) -> (0)
   [junit4]   2> 2260780 INFO  (jetty-launcher-2321-thread-2) [n:127.0.0.1:40478_solr    ] o.a.s.c.c.SolrZkClient makePath: /overseer_elect
   [junit4]   2> 2260780 INFO  (jetty-launcher-2321-thread-1) [n:127.0.0.1:46502_solr    ] o.a.s.c.c.SolrZkClient makePath: /overseer_elect
   [junit4]   2> 2260780 INFO  (jetty-launcher-2321-thread-1) [n:127.0.0.1:46502_solr    ] o.a.s.c.c.SolrZkClient makePath: /overseer_elect/election
   [junit4]   2> 2260780 INFO  (jetty-launcher-2321-thread-2) [n:127.0.0.1:40478_solr    ] o.a.s.c.c.SolrZkClient makePath: /overseer_elect/election
   [junit4]   2> 2260780 INFO  (jetty-launcher-2321-thread-2) [n:127.0.0.1:40478_solr    ] o.a.s.c.Overseer Overseer (id=null) closing
   [junit4]   2> 2260780 INFO  (jetty-launcher-2321-thread-1) [n:127.0.0.1:46502_solr    ] o.a.s.c.Overseer Overseer (id=null) closing
   [junit4]   2> 2260781 INFO  (jetty-launcher-2321-thread-2) [n:127.0.0.1:40478_solr    ] o.a.s.c.LeaderElector Joined leadership election with path: /overseer_elect/election/95958853088575494-127.0.0.1:40478_solr-n_0000000000
   [junit4]   2> 2260781 INFO  (jetty-launcher-2321-thread-1) [n:127.0.0.1:46502_solr    ] o.a.s.c.LeaderElector Joined leadership election with path: /overseer_elect/election/95958853088575493-127.0.0.1:46502_solr-n_0000000001
   [junit4]   2> 2260781 INFO  (jetty-launcher-2321-thread-2) [n:127.0.0.1:40478_solr    ] o.a.s.c.OverseerElectionContext I am going to be the leader 127.0.0.1:40478_solr
   [junit4]   2> 2260781 INFO  (jetty-launcher-2321-thread-2) [n:127.0.0.1:40478_solr    ] o.a.s.c.c.SolrZkClient makePath: /overseer_elect/leader
   [junit4]   2> 2260781 INFO  (jetty-launcher-2321-thread-1) [n:127.0.0.1:46502_solr    ] o.a.s.c.LeaderElector Watching path /overseer_elect/election/95958853088575494-127.0.0.1:40478_solr-n_0000000000 to know if I could be the leader
   [junit4]   2> 2260781 INFO  (jetty-launcher-2321-thread-1) [n:127.0.0.1:46502_solr    ] o.a.s.c.ZkController Register node as live in ZooKeeper:/live_nodes/127.0.0.1:46502_solr
   [junit4]   2> 2260787 INFO  (jetty-launcher-2321-thread-1) [n:127.0.0.1:46502_solr    ] o.a.s.c.c.SolrZkClient makePath: /live_nodes/127.0.0.1:46502_solr
   [junit4]   2> 2260787 INFO  (jetty-launcher-2321-thread-2) [n:127.0.0.1:40478_solr    ] o.a.s.c.Overseer Overseer (id=95958853088575494-127.0.0.1:40478_solr-n_0000000000) starting
   [junit4]   2> 2260788 INFO  (zkCallback-2332-thread-1-processing-n:127.0.0.1:40478_solr) [n:127.0.0.1:40478_solr    ] o.a.s.c.c.ZkStateReader A live node change: [WatchedEvent state:SyncConnected type:NodeChildrenChanged path:/live_nodes], has occurred - updating... (live nodes size: [0])
   [junit4]   2> 2260788 INFO  (zkCallback-2331-thread-1-processing-n:127.0.0.1:46502_solr) [n:127.0.0.1:46502_solr    ] o.a.s.c.c.ZkStateReader A live node change: [WatchedEvent state:SyncConnected type:NodeChildrenChanged path:/live_nodes], has occurred - updating... (live nodes size: [0])
   [junit4]   2> 2260788 INFO  (zkCallback-2332-thread-1-processing-n:127.0.0.1:40478_solr) [n:127.0.0.1:40478_solr    ] o.a.s.c.c.ZkStateReader Updated live nodes from ZooKeeper... (0) -> (1)
   [junit4]   2> 2260789 INFO  (zkCallback-2331-thread-1-processing-n:127.0.0.1:46502_solr) [n:127.0.0.1:46502_solr    ] o.a.s.c.c.ZkStateReader Updated live nodes from ZooKeeper... (0) -> (1)
   [junit4]   2> 2260789 INFO  (jetty-launcher-2321-thread-2) [n:127.0.0.1:40478_solr    ] o.a.s.c.c.SolrZkClient makePath: /overseer/queue-work
   [junit4]   2> 2260792 INFO  (jetty-launcher-2321-thread-2) [n:127.0.0.1:40478_solr    ] o.a.s.c.OverseerAutoReplicaFailoverThread Starting OverseerAutoReplicaFailoverThread autoReplicaFailoverWorkLoopDelay=10000 autoReplicaFailoverWaitAfterExpiration=30000 autoReplicaFailoverBadNodeExpiration=60000
   [junit4]   2> 2260792 INFO  (OverseerCollectionConfigSetProcessor-95958853088575494-127.0.0.1:40478_solr-n_0000000000) [n:127.0.0.1:40478_solr    ] o.a.s.c.OverseerTaskProcessor Process current queue of overseer operations
   [junit4]   2> 2260792 INFO  (OverseerStateUpdate-95958853088575494-127.0.0.1:40478_solr-n_0000000000) [n:127.0.0.1:40478_solr    ] o.a.s.c.Overseer Starting to work on the main queue
   [junit4]   2> 2260792 INFO  (jetty-launcher-2321-thread-2) [n:127.0.0.1:40478_solr    ] o.a.s.c.ZkController Publish node=127.0.0.1:40478_solr as DOWN
   [junit4]   2> 2260793 INFO  (OverseerStateUpdate-95958853088575494-127.0.0.1:40478_solr-n_0000000000) [n:127.0.0.1:40478_solr    ] o.a.s.c.c.ZkStateReader Updated live nodes from ZooKeeper... (1) -> (1)
   [junit4]   2> 2260794 INFO  (OverseerStateUpdate-95958853088575494-127.0.0.1:40478_solr-n_0000000000) [n:127.0.0.1:40478_solr    ] o.a.s.c.Overseer processMessage: queueSize: 1, message = {
   [junit4]   2>   "operation":"downnode",
   [junit4]   2>   "node_name":"127.0.0.1:40478_solr"} current state version: 0
   [junit4]   2> 2260794 INFO  (OverseerStateUpdate-95958853088575494-127.0.0.1:40478_solr-n_0000000000) [n:127.0.0.1:40478_solr    ] o.a.s.c.o.NodeMutator DownNode state invoked for node: 127.0.0.1:40478_solr
   [junit4]   2> 2260798 INFO  (jetty-launcher-2321-thread-1) [n:127.0.0.1:46502_solr    ] o.a.s.c.CoreContainer Security conf doesn't exist. Skipping setup for authorization module.
   [junit4]   2> 2260798 INFO  (jetty-launcher-2321-thread-1) [n:127.0.0.1:46502_solr    ] o.a.s.c.CoreContainer No authentication plugin used.
   [junit4]   2> 2260799 INFO  (jetty-launcher-2321-thread-1) [n:127.0.0.1:46502_solr    ] o.a.s.c.CorePropertiesLocator Looking for core definitions underneath /home/jenkins/workspace/Lucene-Solr-6.0-Linux/solr/build/solr-core/test/J1/temp/solr.schema.TestManagedSchemaAPI_6791237DEE65D1F9-001/tempDir-001/node1/.
   [junit4]   2> 2260799 INFO  (jetty-launcher-2321-thread-1) [n:127.0.0.1:46502_solr    ] o.a.s.c.CorePropertiesLocator Found 0 core definitions
   [junit4]   2> 2260799 INFO  (jetty-launcher-2321-thread-1) [n:127.0.0.1:46502_solr    ] o.a.s.s.SolrDispatchFilter user.dir=/home/jenkins/workspace/Lucene-Solr-6.0-Linux/solr/build/solr-core/test/J1
   [junit4]   2> 2260799 INFO  (jetty-launcher-2321-thread-1) [n:127.0.0.1:46502_solr    ] o.a.s.s.SolrDispatchFilter SolrDispatchFilter.init() done
   [junit4]   2> 2261793 INFO  (jetty-launcher-2321-thread-2) [n:127.0.0.1:40478_solr    ] o.a.s.c.ZkController Register node as live in ZooKeeper:/live_nodes/127.0.0.1:40478_solr
   [junit4]   2> 2261793 INFO  (jetty-launcher-2321-thread-2) [n:127.0.0.1:40478_solr    ] o.a.s.c.c.SolrZkClient makePath: /live_nodes/127.0.0.1:40478_solr
   [junit4]   2> 2261794 INFO  (zkCallback-2331-thread-1-processing-n:127.0.0.1:46502_solr) [n:127.0.0.1:46502_solr    ] o.a.s.c.c.ZkStateReader A live node change: [WatchedEvent state:SyncConnected type:NodeChildrenChanged path:/live_nodes], has occurred - updating... (live nodes size: [1])
   [junit4]   2> 2261794 INFO  (zkCallback-2332-thread-1-processing-n:127.0.0.1:40478_solr) [n:127.0.0.1:40478_solr    ] o.a.s.c.c.ZkStateReader A live node change: [WatchedEvent state:SyncConnected type:NodeChildrenChanged path:/live_nodes], has occurred - updating... (live nodes size: [1])
   [junit4]   2> 2261794 INFO  (zkCallback-2331-thread-1-processing-n:127.0.0.1:46502_solr) [n:127.0.0.1:46502_solr    ] o.a.s.c.c.ZkStateReader Updated live nodes from ZooKeeper... (1) -> (2)
   [junit4]   2> 2261794 INFO  (zkCallback-2332-thread-1-processing-n:127.0.0.1:40478_solr) [n:127.0.0.1:40478_solr    ] o.a.s.c.c.ZkStateReader Updated live nodes from ZooKeeper... (1) -> (2)
   [junit4]   2> 2261804 INFO  (jetty-launcher-2321-thread-2) [n:127.0.0.1:40478_solr    ] o.a.s.c.CoreContainer Security conf doesn't exist. Skipping setup for authorization module.
   [junit4]   2> 2261804 INFO  (jetty-launcher-2321-thread-2) [n:127.0.0.1:40478_solr    ] o.a.s.c.CoreContainer No authentication plugin used.
   [junit4]   2> 2261804 INFO  (jetty-launcher-2321-thread-2) [n:127.0.0.1:40478_solr    ] o.a.s.c.CorePropertiesLocator Looking for core definitions underneath /home/jenkins/workspace/Lucene-Solr-6.0-Linux/solr/build/solr-core/test/J1/temp/solr.schema.TestManagedSchemaAPI_6791237DEE65D1F9-001/tempDir-001/node2/.
   [junit4]   2> 2261804 INFO  (jetty-launcher-2321-thread-2) [n:127.0.0.1:40478_solr    ] o.a.s.c.CorePropertiesLocator Found 0 core definitions
   [junit4]   2> 2261804 INFO  (jetty-launcher-2321-thread-2) [n:127.0.0.1:40478_solr    ] o.a.s.s.SolrDispatchFilter user.dir=/home/jenkins/workspace/Lucene-Solr-6.0-Linux/solr/build/solr-core/test/J1
   [junit4]   2> 2261805 INFO  (jetty-launcher-2321-thread-2) [n:127.0.0.1:40478_solr    ] o.a.s.s.SolrDispatchFilter SolrDispatchFilter.init() done
   [junit4]   2> 2261805 INFO  (SUITE-TestManagedSchemaAPI-seed#[6791237DEE65D1F9]-worker) [    ] o.a.s.c.c.SolrZkClient Using default ZkCredentialsProvider
   [junit4]   2> 2261805 INFO  (SUITE-TestManagedSchemaAPI-seed#[6791237DEE65D1F9]-worker) [    ] o.a.s.c.c.ConnectionManager Waiting for client to connect to ZooKeeper
   [junit4]   2> 2261806 INFO  (zkCallback-2333-thread-1) [    ] o.a.s.c.c.ConnectionManager Watcher org.apache.solr.common.cloud.ConnectionManager@6c28b9ed name:ZooKeeperConnection Watcher:127.0.0.1:45340 got event WatchedEvent state:SyncConnected type:None path:null path:null type:None
   [junit4]   2> 2261806 INFO  (SUITE-TestManagedSchemaAPI-seed#[6791237DEE65D1F9]-worker) [    ] o.a.s.c.c.ConnectionManager Client is connected to ZooKeeper
   [junit4]   2> 2261806 INFO  (SUITE-TestManagedSchemaAPI-seed#[6791237DEE65D1F9]-worker) [    ] o.a.s.c.c.SolrZkClient Using default ZkACLProvider
   [junit4]   2> 2261807 INFO  (SUITE-TestManagedSchemaAPI-seed#[6791237DEE65D1F9]-worker) [    ] o.a.s.c.c.SolrZkClient Using default ZkCredentialsProvider
   [junit4]   2> 2261807 INFO  (SUITE-TestManagedSchemaAPI-seed#[6791237DEE65D1F9]-worker) [    ] o.a.s.c.c.ConnectionManager Waiting for client to connect to ZooKeeper
   [junit4]   2> 2261807 INFO  (zkCallback-2335-thread-1) [    ] o.a.s.c.c.ConnectionManager Watcher org.apache.solr.common.cloud.ConnectionManager@49d43a47 name:ZooKeeperConnection Watcher:127.0.0.1:45340/solr got event WatchedEvent state:SyncConnected type:None path:null path:null type:None
   [junit4]   2> 2261808 INFO  (SUITE-TestManagedSchemaAPI-seed#[6791237DEE65D1F9]-worker) [    ] o.a.s.c.c.ConnectionManager Client is connected to ZooKeeper
   [junit4]   2> 2261808 INFO  (SUITE-TestManagedSchemaAPI-seed#[6791237DEE65D1F9]-worker) [    ] o.a.s.c.c.SolrZkClient Using default ZkACLProvider
   [junit4]   2> 2261808 INFO  (SUITE-TestManagedSchemaAPI-seed#[6791237DEE65D1F9]-worker) [    ] o.a.s.c.c.ZkStateReader Updating cluster state from ZooKeeper... 
   [junit4]   2> 2261808 INFO  (SUITE-TestManagedSchemaAPI-seed#[6791237DEE65D1F9]-worker) [    ] o.a.s.c.c.ZkStateReader Updated live nodes from ZooKeeper... (0) -> (2)
   [junit4]   2> 2261809 INFO  (SUITE-TestManagedSchemaAPI-seed#[6791237DEE65D1F9]-worker) [    ] o.a.s.c.c.SolrZkClient makePath: /configs/conf1/solrconfig.xml
   [junit4]   2> 2261810 INFO  (SUITE-TestManagedSchemaAPI-seed#[6791237DEE65D1F9]-worker) [    ] o.a.s.c.c.SolrZkClient makePath: /configs/conf1/managed-schema
   [junit4]   2> 2261823 INFO  (TEST-TestManagedSchemaAPI.test-seed#[6791237DEE65D1F9]) [    ] o.a.s.SolrTestCaseJ4 ###Starting test
   [junit4]   2> 2261826 INFO  (qtp228792047-14533) [n:127.0.0.1:40478_solr    ] o.a.s.h.a.CollectionsHandler Invoked Collection Action :create with params replicationFactor=2&collection.configName=conf1&name=testschemaapi&action=CREATE&numShards=1&wt=javabin&version=2 and sendToOCPQueue=true
   [junit4]   2> 2261827 INFO  (OverseerCollectionConfigSetProcessor-95958853088575494-127.0.0.1:40478_solr-n_0000000000) [n:127.0.0.1:40478_solr    ] o.a.s.c.OverseerTaskProcessor Overseer Collection Message Handler: Get the message id:/overseer/collection-queue-work/qn-0000000000 message:{
   [junit4]   2>   "name":"testschemaapi",
   [junit4]   2>   "fromApi":"true",
   [junit4]   2>   "replicationFactor":"2",
   [junit4]   2>   "collection.configName":"conf1",
   [junit4]   2>   "numShards":"1",
   [junit4]   2>   "stateFormat":"2",
   [junit4]   2>   "operation":"create"}
   [junit4]   2> 2261827 INFO  (OverseerThreadFactory-6677-thread-1-processing-n:127.0.0.1:40478_solr) [n:127.0.0.1:40478_solr    ] o.a.s.c.OverseerCollectionMessageHandler OverseerCollectionMessageHandler.processMessage : create , {
   [junit4]   2>   "name":"testschemaapi",
   [junit4]   2>   "fromApi":"true",
   [junit4]   2>   "replicationFactor":"2",
   [junit4]   2>   "collection.configName":"conf1",
   [junit4]   2>   "numShards":"1",
   [junit4]   2>   "stateFormat":"2",
   [junit4]   2>   "operation":"create"}
   [junit4]   2> 2261828 INFO  (OverseerThreadFactory-6677-thread-1-processing-n:127.0.0.1:40478_solr) [n:127.0.0.1:40478_solr    ] o.a.s.c.c.ZkStateReader Updated live nodes from ZooKeeper... (2) -> (2)
   [junit4]   2> 2261828 INFO  (OverseerThreadFactory-6677-thread-1-processing-n:127.0.0.1:40478_solr) [n:127.0.0.1:40478_solr    ] o.a.s.c.OverseerCollectionMessageHandler Create collection testschemaapi
   [junit4]   2> 2261828 INFO  (OverseerThreadFactory-6677-thread-1-processing-n:127.0.0.1:40478_solr) [n:127.0.0.1:40478_solr    ] o.a.s.c.OverseerCollectionMessageHandler creating collections conf node /collections/testschemaapi 
   [junit4]   2> 2261828 INFO  (OverseerThreadFactory-6677-thread-1-processing-n:127.0.0.1:40478_solr) [n:127.0.0.1:40478_solr    ] o.a.s.c.c.SolrZkClient makePath: /collections/testschemaapi
   [junit4]   2> 2261829 INFO  (zkCallback-2332-thread-1-processing-n:127.0.0.1:40478_solr) [n:127.0.0.1:40478_solr    ] o.a.s.c.c.ZkStateReader A collections change: [WatchedEvent state:SyncConnected type:NodeChildrenChanged path:/collections], has occurred - updating...
   [junit4]   2> 2261829 INFO  (zkCallback-2335-thread-1) [    ] o.a.s.c.c.ZkStateReader A collections change: [WatchedEvent state:SyncConnected type:NodeChildrenChanged path:/collections], has occurred - updating...
   [junit4]   2> 2261829 INFO  (zkCallback-2331-thread-1-processing-n:127.0.0.1:46502_solr) [n:127.0.0.1:46502_solr    ] o.a.s.c.c.ZkStateReader A collections change: [WatchedEvent state:SyncConnected type:NodeChildrenChanged path:/collections], has occurred - updating...
   [junit4]   2> 2261831 INFO  (OverseerStateUpdate-95958853088575494-127.0.0.1:40478_solr-n_0000000000) [n:127.0.0.1:40478_solr    ] o.a.s.c.Overseer processMessage: queueSize: 1, message = {
   [junit4]   2>   "name":"testschemaapi",
   [junit4]   2>   "fromApi":"true",
   [junit4]   2>   "replicationFactor":"2",
   [junit4]   2>   "collection.configName":"conf1",
   [junit4]   2>   "numShards":"1",
   [junit4]   2>   "stateFormat":"2",
   [junit4]   2>   "operation":"create"} current state version: 0
   [junit4]   2> 2261831 INFO  (OverseerStateUpdate-95958853088575494-127.0.0.1:40478_solr-n_0000000000) [n:127.0.0.1:40478_solr    ] o.a.s.c.o.ClusterStateMutator building a new cName: testschemaapi
   [junit4]   2> 2261831 INFO  (OverseerStateUpdate-95958853088575494-127.0.0.1:40478_solr-n_0000000000) [n:127.0.0.1:40478_solr    ] o.a.s.c.o.ZkStateWriter going to create_collection /collections/testschemaapi/state.json
   [junit4]   2> 2261931 INFO  (OverseerThreadFactory-6677-thread-1-processing-n:127.0.0.1:40478_solr) [n:127.0.0.1:40478_solr    ] o.a.s.c.OverseerCollectionMessageHandler Creating SolrCores for new collection testschemaapi, shardNames [shard1] , replicationFactor : 2
   [junit4]   2> 2261931 INFO  (OverseerThreadFactory-6677-thread-1-processing-n:127.0.0.1:40478_solr) [n:127.0.0.1:40478_solr    ] o.a.s.c.OverseerCollectionMessageHandler Creating core testschemaapi_shard1_replica2 as part of shard shard1 of collection testschemaapi on 127.0.0.1:46502_solr
   [junit4]   2> 2261931 INFO  (OverseerThreadFactory-6677-thread-1-processing-n:127.0.0.1:40478_solr) [n:127.0.0.1:40478_solr    ] o.a.s.c.OverseerCollectionMessageHandler Creating core testschemaapi_shard1_replica1 as part of shard shard1 of collection testschemaapi on 127.0.0.1:40478_solr
   [junit4]   2> 2261933 INFO  (qtp228792047-14535) [n:127.0.0.1:40478_solr    ] o.a.s.h.a.CoreAdminOperation core create command qt=/admin/cores&collection.configName=conf1&name=testschemaapi_shard1_replica1&action=CREATE&numShards=1&collection=testschemaapi&shard=shard1&wt=javabin&version=2
   [junit4]   2> 2261934 INFO  (qtp228792047-14535) [n:127.0.0.1:40478_solr    ] o.a.s.c.CoreDescriptor Created CoreDescriptor: {name=testschemaapi_shard1_replica1, collection.configName=conf1, config=solrconfig.xml, transient=false, schema=schema.xml, loadOnStartup=true, configSetProperties=configsetprops.json, collection=testschemaapi, numShards=1, dataDir=data/, shard=shard1}
   [junit4]   2> 2261934 INFO  (qtp435882798-14526) [n:127.0.0.1:46502_solr    ] o.a.s.h.a.CoreAdminOperation core create command qt=/admin/cores&collection.configName=conf1&name=testschemaapi_shard1_replica2&action=CREATE&numShards=1&collection=testschemaapi&shard=shard1&wt=javabin&version=2
   [junit4]   2> 2261934 INFO  (qtp435882798-14526) [n:127.0.0.1:46502_solr    ] o.a.s.c.CoreDescriptor Created CoreDescriptor: {name=testschemaapi_shard1_replica2, collection.configName=conf1, config=solrconfig.xml, transient=false, schema=schema.xml, loadOnStartup=true, configSetProperties=configsetprops.json, collection=testschemaapi, numShards=1, dataDir=data/, shard=shard1}
   [junit4]   2> 2261934 INFO  (qtp228792047-14535) [n:127.0.0.1:40478_solr c:testschemaapi s:shard1  x:testschemaapi_shard1_replica1] o.a.s.c.ZkController publishing state=down
   [junit4]   2> 2261935 INFO  (qtp435882798-14526) [n:127.0.0.1:46502_solr c:testschemaapi s:shard1  x:testschemaapi_shard1_replica2] o.a.s.c.ZkController publishing state=down
   [junit4]   2> 2261935 INFO  (qtp228792047-14535) [n:127.0.0.1:40478_solr c:testschemaapi s:shard1  x:testschemaapi_shard1_replica1] o.a.s.c.ZkController Registering watch for collection testschemaapi
   [junit4]   2> 2261935 INFO  (qtp228792047-14535) [n:127.0.0.1:40478_solr c:testschemaapi s:shard1  x:testschemaapi_shard1_replica1] o.a.s.c.c.ZkStateReader addZkWatch [testschemaapi]
   [junit4]   2> 2261935 INFO  (qtp435882798-14526) [n:127.0.0.1:46502_solr c:testschemaapi s:shard1  x:testschemaapi_shard1_replica2] o.a.s.c.ZkController Registering watch for collection testschemaapi
   [junit4]   2> 2261935 INFO  (OverseerStateUpdate-95958853088575494-127.0.0.1:40478_solr-n_0000000000) [n:127.0.0.1:40478_solr    ] o.a.s.c.Overseer processMessage: queueSize: 1, message = {
   [junit4]   2>   "core":"testschemaapi_shard1_replica1",
   [junit4]   2>   "roles":null,
   [junit4]   2>   "base_url":"http://127.0.0.1:40478/solr",
   [junit4]   2>   "node_name":"127.0.0.1:40478_solr",
   [junit4]   2>   "numShards":"1",
   [junit4]   2>   "state":"down",
   [junit4]   2>   "shard":"shard1",
   [junit4]   2>   "collection":"testschemaapi",
   [junit4]   2>   "operation":"state"} current state version: 0
   [junit4]   2> 2261935 INFO  (qtp435882798-14526) [n:127.0.0.1:46502_solr c:testschemaapi s:shard1  x:testschemaapi_shard1_replica2] o.a.s.c.c.ZkStateReader addZkWatch [testschemaapi]
   [junit4]   2> 2261935 INFO  (qtp228792047-14535) [n:127.0.0.1:40478_solr c:testschemaapi s:shard1  x:testschemaapi_shard1_replica1] o.a.s.c.c.ZkStateReader Add data for [testschemaapi] ver [0]
   [junit4]   2> 2261935 INFO  (qtp228792047-14535) [n:127.0.0.1:40478_solr c:testschemaapi s:shard1  x:testschemaapi_shard1_replica1] o.a.s.c.ZkController look for our core node name
   [junit4]   2> 2261936 INFO  (OverseerStateUpdate-95958853088575494-127.0.0.1:40478_solr-n_0000000000) [n:127.0.0.1:40478_solr    ] o.a.s.c.o.ReplicaMutator Update state numShards=1 message={
   [junit4]   2>   "core":"testschemaapi_shard1_replica1",
   [junit4]   2>   "roles":null,
   [junit4]   2>   "base_url":"http://127.0.0.1:40478/solr",
   [junit4]   2>   "node_name":"127.0.0.1:40478_solr",
   [junit4]   2>   "numShards":"1",
   [junit4]   2>   "state":"down",
   [junit4]   2>   "shard":"shard1",
   [junit4]   2>   "collection":"testschemaapi",
   [junit4]   2>   "operation":"state"}
   [junit4]   2> 2261936 INFO  (qtp435882798-14526) [n:127.0.0.1:46502_solr c:testschemaapi s:shard1  x:testschemaapi_shard1_replica2] o.a.s.c.c.ZkStateReader Add data for [testschemaapi] ver [0]
   [junit4]   2> 2261936 INFO  (qtp435882798-14526) [n:127.0.0.1:46502_solr c:testschemaapi s:shard1  x:testschemaapi_shard1_replica2] o.a.s.c.ZkController look for our core node name
   [junit4]   2> 2261936 INFO  (OverseerStateUpdate-95958853088575494-127.0.0.1:40478_solr-n_0000000000) [n:127.0.0.1:40478_solr    ] o.a.s.c.Overseer processMessage: queueSize: 1, message = {
   [junit4]   2>   "core":"testschemaapi_shard1_replica2",
   [junit4]   2>   "roles":null,
   [junit4]   2>   "base_url":"http://127.0.0.1:46502/solr",
   [junit4]   2>   "node_name":"127.0.0.1:46502_solr",
   [junit4]   2>   "numShards":"1",
   [junit4]   2>   "state":"down",
   [junit4]   2>   "shard":"shard1",
   [junit4]   2>   "collection":"testschemaapi",
   [junit4]   2>   "operation":"state"} current state version: 0
   [junit4]   2> 2261936 INFO  (OverseerStateUpdate-95958853088575494-127.0.0.1:40478_solr-n_0000000000) [n:127.0.0.1:40478_solr    ] o.a.s.c.o.ReplicaMutator Update state numShards=1 message={
   [junit4]   2>   "core":"testschemaapi_shard1_replica2",
   [junit4]   2>   "roles":null,
   [junit4]   2>   "base_url":"http://127.0.0.1:46502/solr",
   [junit4]   2>   "node_name":"127.0.0.1:46502_solr",
   [junit4]   2>   "numShards":"1",
   [junit4]   2>   "state":"down",
   [junit4]   2>   "shard":"shard1",
   [junit4]   2>   "collection":"testschemaapi",
   [junit4]   2>   "operation":"state"}
   [junit4]   2> 2262037 INFO  (OverseerStateUpdate-95958853088575494-127.0.0.1:40478_solr-n_0000000000) [n:127.0.0.1:40478_solr    ] o.a.s.c.o.ZkStateWriter going to update_collection /collections/testschemaapi/state.json version: 0
   [junit4]   2> 2262038 INFO  (zkCallback-2332-thread-1-processing-n:127.0.0.1:40478_solr) [n:127.0.0.1:40478_solr    ] o.a.s.c.c.ZkStateReader A cluster state change: [WatchedEvent state:SyncConnected type:NodeDataChanged path:/collections/testschemaapi/state.json] for collection [testschemaapi] has occurred - updating... (live nodes size: [2])
   [junit4]   2> 2262038 INFO  (zkCallback-2331-thread-1-processing-n:127.0.0.1:46502_solr) [n:127.0.0.1:46502_solr    ] o.a.s.c.c.ZkStateReader A cluster state change: [WatchedEvent state:SyncConnected type:NodeDataChanged path:/collections/testschemaapi/state.json] for collection [testschemaapi] has occurred - updating... (live nodes size: [2])
   [junit4]   2> 2262038 INFO  (zkCallback-2332-thread-1-processing-n:127.0.0.1:40478_solr) [n:127.0.0.1:40478_solr    ] o.a.s.c.c.ZkStateReader Updating data for [testschemaapi] from [0] to [1]
   [junit4]   2> 2262038 INFO  (zkCallback-2331-thread-1-processing-n:127.0.0.1:46502_solr) [n:127.0.0.1:46502_solr    ] o.a.s.c.c.ZkStateReader Updating data for [testschemaapi] from [0] to [1]
   [junit4]   2> 2262936 INFO  (qtp228792047-14535) [n:127.0.0.1:40478_solr c:testschemaapi s:shard1  x:testschemaapi_shard1_replica1] o.a.s.c.ZkController waiting to find shard id in clusterstate for testschemaapi_shard1_replica1
   [junit4]   2> 2262936 INFO  (qtp228792047-14535) [n:127.0.0.1:40478_solr c:testschemaapi s:shard1  x:testschemaapi_shard1_replica1] o.a.s.c.ZkController Check for collection zkNode:testschemaapi
   [junit4]   2> 2262936 INFO  (qtp435882798-14526) [n:127.0.0.1:46502_solr c:testschemaapi s:shard1  x:testschemaapi_shard1_replica2] o.a.s.c.ZkController waiting to find shard id in clusterstate for testschemaapi_shard1_replica2
   [junit4]   2> 2262936 INFO  (qtp435882798-14526) [n:127.0.0.1:46502_solr c:testschemaapi s:shard1  x:testschemaapi_shard1_replica2] o.a.s.c.ZkController Check for collection zkNode:testschemaapi
   [junit4]   2> 2262936 INFO  (qtp228792047-14535) [n:127.0.0.1:40478_solr c:testschemaapi s:shard1  x:testschemaapi_shard1_replica1] o.a.s.c.ZkController Collection zkNode exists
   [junit4]   2> 2262936 INFO  (qtp228792047-14535) [n:127.0.0.1:40478_solr c:testschemaapi s:shard1  x:testschemaapi_shard1_replica1] o.a.s.c.c.ZkStateReader Load collection config from: [/collections/testschemaapi]
   [junit4]   2> 2262936 INFO  (qtp435882798-14526) [n:127.0.0.1:46502_solr c:testschemaapi s:shard1  x:testschemaapi_shard1_replica2] o.a.s.c.ZkController Collection zkNode exists
   [junit4]   2> 2262936 INFO  (qtp435882798-14526) [n:127.0.0.1:46502_solr c:testschemaapi s:shard1  x:testschemaapi_shard1_replica2] o.a.s.c.c.ZkStateReader Load collection config from: [/collections/testschemaapi]
   [junit4]   2> 2262936 INFO  (qtp228792047-14535) [n:127.0.0.1:40478_solr c:testschemaapi s:shard1  x:testschemaapi_shard1_replica1] o.a.s.c.c.ZkStateReader path=[/collections/testschemaapi] [configName]=[conf1] specified config exists in ZooKeeper
   [junit4]   2> 2262936 INFO  (qtp228792047-14535) [n:127.0.0.1:40478_solr c:testschemaapi s:shard1  x:testschemaapi_shard1_replica1] o.a.s.c.SolrResourceLoader new SolrResourceLoader for directory: '/home/jenkins/workspace/Lucene-Solr-6.0-Linux/solr/build/solr-core/test/J1/temp/solr.schema.TestManagedSchemaAPI_6791237DEE65D1F9-001/tempDir-001/node2/testschemaapi_shard1_replica1'
   [junit4]   2> 2262936 INFO  (qtp435882798-14526) [n:127.0.0.1:46502_solr c:testschemaapi s:shard1  x:testschemaapi_shard1_replica2] o.a.s.c.c.ZkStateReader path=[/collections/testschemaapi] [configName]=[conf1] specified config exists in ZooKeeper
   [junit4]   2> 2262936 INFO  (qtp435882798-14526) [n:127.0.0.1:46502_solr c:testschemaapi s:shard1  x:testschemaapi_shard1_replica2] o.a.s.c.SolrResourceLoader new SolrResourceLoader for directory: '/home/jenkins/workspace/Lucene-Solr-6.0-Linux/solr/build/solr-core/test/J1/temp/solr.schema.TestManagedSchemaAPI_6791237DEE65D1F9-001/tempDir-001/node1/testschemaapi_shard1_replica2'
   [junit4]   2> 2262936 INFO  (qtp228792047-14535) [n:127.0.0.1:40478_solr c:testschemaapi s:shard1  x:testschemaapi_shard1_replica1] o.a.s.c.SolrResourceLoader JNDI not configured for solr (NoInitialContextEx)
   [junit4]   2> 2262937 INFO  (qtp435882798-14526) [n:127.0.0.1:46502_solr c:testschemaapi s:shard1  x:testschemaapi_shard1_replica2] o.a.s.c.SolrResourceLoader JNDI not configured for solr (NoInitialContextEx)
   [junit4]   2> 2262937 INFO  (qtp228792047-14535) [n:127.0.0.1:40478_solr c:testschemaapi s:shard1  x:testschemaapi_shard1_replica1] o.a.s.c.SolrResourceLoader solr home defaulted to 'solr/' (could not find system property or JNDI)
   [junit4]   2> 2262937 INFO  (qtp435882798-14526) [n:127.0.0.1:46502_solr c:testschemaapi s:shard1  x:testschemaapi_shard1_replica2] o.a.s.c.SolrResourceLoader solr home defaulted to 'solr/' (could not find system property or JNDI)
   [junit4]   2> 2262937 INFO  (qtp435882798-14526) [n:127.0.0.1:46502_solr c:testschemaapi s:shard1  x:testschemaapi_shard1_replica2] o.a.s.c.Config loaded config solrconfig.xml with version 0 
   [junit4]   2> 2262937 INFO  (qtp228792047-14535) [n:127.0.0.1:40478_solr c:testschemaapi s:shard1  x:testschemaapi_shard1_replica1] o.a.s.c.Config loaded config solrconfig.xml with version 0 
   [junit4]   2> 2262939 INFO  (qtp228792047-14535) [n:127.0.0.1:40478_solr c:testschemaapi s:shard1  x:testschemaapi_shard1_replica1] o.a.s.c.SolrConfig current version of requestparams : -1
   [junit4]   2> 2262939 INFO  (qtp435882798-14526) [n:127.0.0.1:46502_solr c:testschemaapi s:shard1  x:testschemaapi_shard1_replica2] o.a.s.c.SolrConfig current version of requestparams : -1
   [junit4]   2> 2262955 INFO  (qtp228792047-14535) [n:127.0.0.1:40478_solr c:testschemaapi s:shard1  x:testschemaapi_shard1_replica1] o.a.s.c.SolrConfig Using Lucene MatchVersion: 6.0.1
   [junit4]   2> 2262955 INFO  (qtp435882798-14526) [n:127.0.0.1:46502_solr c:testschemaapi s:shard1  x:testschemaapi_shard1_replica2] o.a.s.c.SolrConfig Using Lucene MatchVersion: 6.0.1
   [junit4]   2> 2262959 INFO  (qtp228792047-14535) [n:127.0.0.1:40478_solr c:testschemaapi s:shard1  x:testschemaapi_shard1_replica1] o.a.s.c.SolrConfig Loaded SolrConfig: solrconfig.xml
   [junit4]   2> 2262960 INFO  (qtp435882798-14526) [n:127.0.0.1:46502_solr c:testschemaapi s:shard1  x:testschemaapi_shard1_replica2] o.a.s.c.SolrConfig Loaded SolrConfig: solrconfig.xml
   [junit4]   2> 2262961 INFO  (qtp228792047-14535) [n:127.0.0.1:40478_solr c:testschemaapi s:shard1  x:testschemaapi_shard1_replica1] o.a.s.s.IndexSchema [testschemaapi_shard1_replica1] Schema name=minimal
   [junit4]   2> 2262962 INFO  (qtp435882798-14526) [n:127.0.0.1:46502_solr c:testschemaapi s:shard1  x:testschemaapi_shard1_replica2] o.a.s.s.IndexSchema [testschemaapi_shard1_replica2] Schema name=minimal
   [junit4]   2> 2262963 INFO  (qtp228792047-14535) [n:127.0.0.1:40478_solr c:testschemaapi s:shard1  x:testschemaapi_shard1_replica1] o.a.s.s.IndexSchema unique key field: id
   [junit4]   2> 2262964 INFO  (qtp228792047-14535) [n:127.0.0.1:40478_solr c:testschemaapi s:shard1  x:testschemaapi_shard1_replica1] o.a.s.c.ConfigSetProperties Did not find ConfigSet properties, assuming default properties: Can't find resource 'configsetprops.json' in classpath or '/configs/conf1', cwd=/home/jenkins/workspace/Lucene-Solr-6.0-Linux/solr/build/solr-core/test/J1
   [junit4]   2> 2262964 INFO  (qtp228792047-14535) [n:127.0.0.1:40478_solr c:testschemaapi s:shard1  x:testschemaapi_shard1_replica1] o.a.s.c.CoreContainer Creating SolrCore 'testschemaapi_shard1_replica1' using configuration from collection testschemaapi
   [junit4]   2> 2262965 INFO  (qtp228792047-14535) [n:127.0.0.1:40478_solr c:testschemaapi s:shard1 r:core_node1 x:testschemaapi_shard1_replica1] o.a.s.c.SolrCore org.apache.solr.core.MockDirectoryFactory
   [junit4]   2> 2262965 INFO  (qtp228792047-14535) [n:127.0.0.1:40478_solr c:testschemaapi s:shard1 r:core_node1 x:testschemaapi_shard1_replica1] o.a.s.c.SolrCore [[testschemaapi_shard1_replica1] ] Opening new SolrCore at [/home/jenkins/workspace/Lucene-Solr-6.0-Linux/solr/build/solr-core/test/J1/temp/solr.schema.TestManagedSchemaAPI_6791237DEE65D1F9-001/tempDir-001/node2/testschemaapi_shard1_replica1], dataDir=[/home/jenkins/workspace/Lucene-Solr-6.0-Linux/solr/build/solr-core/test/J1/temp/solr.schema.TestManagedSchemaAPI_6791237DEE65D1F9-001/tempDir-001/node2/./testschemaapi_shard1_replica1/data/]
   [junit4]   2> 2262965 INFO  (qtp228792047-14535) [n:127.0.0.1:40478_solr c:testschemaapi s:shard1 r:core_node1 x:testschemaapi_shard1_replica1] o.a.s.c.SolrCore JMX monitoring not detected for core: testschemaapi_shard1_replica1
   [junit4]   2> 2262966 INFO  (qtp228792047-14535) [n:127.0.0.1:40478_solr c:testschemaapi s:shard1 r:core_node1 x:testschemaapi_shard1_replica1] o.a.s.c.CachingDirectoryFactory return new directory for /home/jenkins/workspace/Lucene-Solr-6.0-Linux/solr/build/solr-core/test/J1/temp/solr.schema.TestManagedSchemaAPI_6791237DEE65D1F9-001/tempDir-001/node2/./testschemaapi_shard1_replica1/data
   [junit4]   2> 2262966 INFO  (qtp228792047-14535) [n:127.0.0.1:40478_solr c:testschemaapi s:shard1 r:core_node1 x:testschemaapi_shard1_replica1] o.a.s.c.SolrCore New index directory detected: old=null new=/home/jenkins/workspace/Lucene-Solr-6.0-Linux/solr/build/solr-core/test/J1/temp/solr.schema.TestManagedSchemaAPI_6791237DEE65D1F9-001/tempDir-001/node2/./testschemaapi_shard1_replica1/data/index/
   [junit4]   2> 2262967 WARN  (qtp228792047-14535) [n:127.0.0.1:40478_solr c:testschemaapi s:shard1 r:core_node1 x:testschemaapi_shard1_replica1] o.a.s.c.SolrCore [testschemaapi_shard1_replica1] Solr index directory '/home/jenkins/workspace/Lucene-Solr-6.0-Linux/solr/build/solr-core/test/J1/temp/solr.schema.TestManagedSchemaAPI_6791237DEE65D1F9-001/tempDir-001/node2/./testschemaapi_shard1_replica1/data/index' doesn't exist. Creating new index...
   [junit4]   2> 2262968 INFO  (qtp228792047-14535) [n:127.0.0.1:40478_solr c:testschemaapi s:shard1 r:core_node1 x:testschemaapi_shard1_replica1] o.a.s.c.CachingDirectoryFactory return new directory for /home/jenkins/workspace/Lucene-Solr-6.0-Linux/solr/build/solr-core/test/J1/temp/solr.schema.TestManagedSchemaAPI_6791237DEE65D1F9-001/tempDir-001/node2/./testschemaapi_shard1_replica1/data/index
   [junit4]   2> 2262968 INFO  (qtp435882798-14526) [n:127.0.0.1:46502_solr c:testschemaapi s:shard1  x:testschemaapi_shard1_replica2] o.a.s.s.IndexSchema unique key field: id
   [junit4]   2> 2262969 INFO  (qtp228792047-14535) [n:127.0.0.1:40478_solr c:testschemaapi s:shard1 r:core_node1 x:testschemaapi_shard1_replica1] o.a.s.c.SolrDeletionPolicy SolrDeletionPolicy.onCommit: commits: num=1
   [junit4]   2> 	commit{dir=MockDirectoryWrapper(RAMDirectory@226a6f8d lockFactory=org.apache.lucene.store.SingleInstanceLockFactory@63d32e9c),segFN=segments_1,generation=1}
   [junit4]   2> 2262969 INFO  (qtp228792047-14535) [n:127.0.0.1:40478_solr c:testschemaapi s:shard1 r:core_node1 x:testschemaapi_shard1_replica1] o.a.s.c.SolrDeletionPolicy newest commit generation = 1
   [junit4]   2> 2262969 INFO  (OldIndexDirectoryCleanupThreadForCore-testschemaapi_shard1_replica1) [n:127.0.0.1:40478_solr c:testschemaapi s:shard1 r:core_node1 x:testschemaapi_shard1_replica1] o.a.s.c.SolrCore Looking for old index directories to cleanup for core testschemaapi_shard1_replica1 in /home/jenkins/workspace/Lucene-Solr-6.0-Linux/solr/build/solr-core/test/J1/temp/solr.schema.TestManagedSchemaAPI_6791237DEE65D1F9-001/tempDir-001/node2/./testschemaapi_shard1_replica1/data/
   [junit4]   2> 2262969 INFO  (qtp435882798-14526) [n:127.0.0.1:46502_solr c:testschemaapi s:shard1  x:testschemaapi_shard1_replica2] o.a.s.c.ConfigSetProperties Did not find ConfigSet properties, assuming default properties: Can't find resource 'configsetprops.json' in classpath or '/configs/conf1', cwd=/home/jenkins/workspace/Lucene-Solr-6.0-Linux/solr/build/solr-core/test/J1
   [junit4]   2> 2262969 WARN  (OldIndexDirectoryCleanupThreadForCore-testschemaapi_shard1_replica1) [n:127.0.0.1:40478_solr c:testschemaapi s:shard1 r:core_node1 x:testschemaapi_shard1_replica1] o.a.s.c.DirectoryFactory /home/jenkins/workspace/Lucene-Solr-6.0-Linux/solr/build/solr-core/test/J1/temp/solr.schema.TestManagedSchemaAPI_6791237DEE65D1F9-001/tempDir-001/node2/./testschemaapi_shard1_replica1/data/ does not point to a valid data directory; skipping clean-up of old index directories.
   [junit4]   2> 2262969 INFO  (qtp435882798-14526) [n:127.0.0.1:46502_solr c:testschemaapi s:shard1  x:testschemaapi_shard1_replica2] o.a.s.c.CoreContainer Creating SolrCore 'testschemaapi_shard1_replica2' using configuration from collection testschemaapi
   [junit4]   2> 2262970 INFO  (qtp435882798-14526) [n:127.0.0.1:46502_solr c:testschemaapi s:shard1 r:core_node2 x:testschemaapi_shard1_replica2] o.a.s.c.SolrCore org.apache.solr.core.MockDirectoryFactory
   [junit4]   2> 2262970 INFO  (qtp228792047-14535) [n:127.0.0.1:40478_solr c:testschemaapi s:shard1 r:core_node1 x:testschemaapi_shard1_replica1] o.a.s.c.SolrCore no updateRequestProcessorChain defined as default, creating implicit default
   [junit4]   2> 2262970 INFO  (qtp435882798-14526) [n:127.0.0.1:46502_solr c:testschemaapi s:shard1 r:core_node2 x:testschemaapi_shard1_replica2] o.a.s.c.SolrCore [[testschemaapi_shard1_replica2] ] Opening new SolrCore at [/home/jenkins/workspace/Lucene-Solr-6.0-Linux/solr/build/solr-core/test/J1/temp/solr.schema.TestManagedSchemaAPI_6791237DEE65D1F9-001/tempDir-001/node1/testschemaapi_shard1_replica2], dataDir=[/home/jenkins/workspace/Lucene-Solr-6.0-Linux/solr/build/solr-core/test/J1/temp/solr.schema.TestManagedSchemaAPI_6791237DEE65D1F9-001/tempDir-001/node1/./testschemaapi_shard1_replica2/data/]
   [junit4]   2> 2262970 INFO  (qtp435882798-14526) [n:127.0.0.1:46502_solr c:testschemaapi s:shard1 r:core_node2 x:testschemaapi_shard1_replica2] o.a.s.c.SolrCore JMX monitoring not detected for core: testschemaapi_shard1_replica2
   [junit4]   2> 2262971 INFO  (qtp435882798-14526) [n:127.0.0.1:46502_solr c:testschemaapi s:shard1 r:core_node2 x:testschemaapi_shard1_replica2] o.a.s.c.CachingDirectoryFactory return new directory for /home/jenkins/workspace/Lucene-Solr-6.0-Linux/solr/build/solr-core/test/J1/temp/solr.schema.TestManagedSchemaAPI_6791237DEE65D1F9-001/tempDir-001/node1/./testschemaapi_shard1_replica2/data
   [junit4]   2> 2262971 INFO  (qtp435882798-14526) [n:127.0.0.1:46502_solr c:testschemaapi s:shard1 r:core_node2 x:testschemaapi_shard1_replica2] o.a.s.c.SolrCore New index directory detected: old=null new=/home/jenkins/workspace/Lucene-Solr-6.0-Linux/solr/build/solr-core/test/J1/temp/solr.schema.TestManagedSchemaAPI_6791237DEE65D1F9-001/tempDir-001/node1/./testschemaapi_shard1_replica2/data/index/
   [junit4]   2> 2262971 WARN  (qtp435882798-14526) [n:127.0.0.1:46502_solr c:testschemaapi s:shard1 r:core_node2 x:testschemaapi_shard1_replica2] o.a.s.c.SolrCore [testschemaapi_shard1_replica2] Solr index directory '/home/jenkins/workspace/Lucene-Solr-6.0-Linux/solr/build/solr-core/test/J1/temp/solr.schema.TestManagedSchemaAPI_6791237DEE65D1F9-001/tempDir-001/node1/./testschemaapi_shard1_replica2/data/index' doesn't exist. Creating new index...
   [junit4]   2> 2262971 INFO  (qtp228792047-14535) [n:127.0.0.1:40478_solr c:testschemaapi s:shard1 r:core_node1 x:testschemaapi_shard1_replica1] o.a.s.h.l.XMLLoader xsltCacheLifetimeSeconds=60
   [junit4]   2> 2262971 INFO  (qtp435882798-14526) [n:127.0.0.1:46502_solr c:testschemaapi s:shard1 r:core_node2 x:testschemaapi_shard1_replica2] o.a.s.c.CachingDirectoryFactory return new directory for /home/jenkins/workspace/Lucene-Solr-6.0-Linux/solr/build/solr-core/test/J1/temp/solr.schema.TestManagedSchemaAPI_6791237DEE65D1F9-001/tempDir-001/node1/./testschemaapi_shard1_replica2/data/index
   [junit4]   2> 2262971 INFO  (qtp228792047-14535) [n:127.0.0.1:40478_solr c:testschemaapi s:shard1 r:core_node1 x:testschemaapi_shard1_replica1] o.a.s.h.l.XMLLoader xsltCacheLifetimeSeconds=60
   [junit4]   2> 2262972 INFO  (qtp435882798-14526) [n:127.0.0.1:46502_solr c:testschemaapi s:shard1 r:core_node2 x:testschemaapi_shard1_replica2] o.a.s.c.SolrDeletionPolicy SolrDeletionPolicy.onCommit: commits: num=1
   [junit4]   2> 	commit{dir=MockDirectoryWrapper(RAMDirectory@3c4dc7de lockFactory=org.apache.lucene.store.SingleInstanceLockFactory@a50945a),segFN=segments_1,generation=1}
   [junit4]   2> 2262972 INFO  (qtp435882798-14526) [n:127.0.0.1:46502_solr c:testschemaapi s:shard1 r:core_node2 x:testschemaapi_shard1_replica2] o.a.s.c.SolrDeletionPolicy newest commit generation = 1
   [junit4]   2> 2262972 INFO  (qtp228792047-14535) [n:127.0.0.1:40478_solr c:testschemaapi s:shard1 r:core_node1 x:testschemaapi_shard1_replica1] o.a.s.h.l.XMLLoader xsltCacheLifetimeSeconds=60
   [junit4]   2> 2262972 INFO  (OldIndexDirectoryCleanupThreadForCore-testschemaapi_shard1_replica2) [n:127.0.0.1:46502_solr c:testschemaapi s:shard1 r:core_node2 x:testschemaapi_shard1_replica2] o.a.s.c.SolrCore Looking for old index directories to cleanup for core testschemaapi_shard1_replica2 in /home/jenkins/workspace/Lucene-Solr-6.0-Linux/solr/build/solr-core/test/J1/temp/solr.schema.TestManagedSchemaAPI_6791237DEE65D1F9-001/tempDir-001/node1/./testschemaapi_shard1_replica2/data/
   [junit4]   2> 2262972 WARN  (OldIndexDirectoryCleanupThreadForCore-testschemaapi_shard1_replica2) [n:127.0.0.1:46502_solr c:testschemaapi s:shard1 r:core_node2 x:testschemaapi_shard1_replica2] o.a.s.c.DirectoryFactory /home/jenkins/workspace/Lucene-Solr-6.0-Linux/solr/build/solr-core/test/J1/temp/solr.schema.TestManagedSchemaAPI_6791237DEE65D1F9-001/tempDir-001/node1/./testschemaapi_shard1_replica2/data/ does not point to a valid data directory; skipping clean-up of old index directories.
   [junit4]   2> 2262972 INFO  (qtp228792047-14535) [n:127.0.0.1:40478_solr c:testschemaapi s:shard1 r:core_node1 x:testschemaapi_shard1_replica1] o.a.s.h.l.XMLLoader xsltCacheLifetimeSeconds=60
   [junit4]   2> 2262973 INFO  (qtp228792047-14535) [n:127.0.0.1:40478_solr c:testschemaapi s:shard1 r:core_node1 x:testschemaapi_shard1_replica1] o.a.s.c.RequestHandlers Registered paths: /admin/mbeans,/update/csv,/sql,/update/json/docs,/admin/luke,/export,/select,/admin/segments,/get,/admin/system,/replication,/admin/properties,/config,/stream,/schema,/admin/plugins,/admin/logging,/update/json,/admin/ping,/admin/threads,/update,/admin/file
   [junit4]   2> 2262973 INFO  (qtp228792047-14535) [n:127.0.0.1:40478_solr c:testschemaapi s:shard1 r:core_node1 x:testschemaapi_shard1_replica1] o.a.s.c.SolrCore Using default statsCache cache: org.apache.solr.search.stats.LocalStatsCache
   [junit4]   2> 2262973 INFO  (qtp435882798-14526) [n:127.0.0.1:46502_solr c:testschemaapi s:shard1 r:core_node2 x:testschemaapi_shard1_replica2] o.a.s.c.SolrCore no updateRequestProcessorChain defined as default, creating implicit default
   [junit4]   2> 2262973 INFO  (qtp228792047-14535) [n:127.0.0.1:40478_solr c:testschemaapi s:shard1 r:core_node1 x:testschemaapi_shard1_replica1] o.a.s.u.UpdateHandler Using UpdateLog implementation: org.apache.solr.update.UpdateLog
   [junit4]   2> 2262973 INFO  (qtp228792047-14535) [n:127.0.0.1:40478_solr c:testschemaapi s:shard1 r:core_node1 x:testschemaapi_shard1_replica1] o.a.s.u.UpdateLog Initializing UpdateLog: dataDir=null defaultSyncLevel=FLUSH numRecordsToKeep=100 maxNumLogsToKeep=10 numVersionBuckets=65536
   [junit4]   2> 2262974 INFO  (qtp435882798-14526) [n:127.0.0.1:46502_solr c:testschemaapi s:shard1 r:core_node2 x:testschemaapi_shard1_replica2] o.a.s.h.l.XMLLoader xsltCacheLifetimeSeconds=60
   [junit4]   2> 2262974 INFO  (qtp228792047-14535) [n:127.0.0.1:40478_solr c:testschemaapi s:shard1 r:core_node1 x:testschemaapi_shard1_replica1] o.a.s.u.CommitTracker Hard AutoCommit: disabled
   [junit4]   2> 2262974 INFO  (qtp228792047-14535) [n:127.0.0.1:40478_solr c:testschemaapi s:shard1 r:core_node1 x:testschemaapi_shard1_replica1] o.a.s.u.CommitTracker Soft AutoCommit: disabled
   [junit4]   2> 2262974 INFO  (qtp435882798-14526) [n:127.0.0.1:46502_solr c:testschemaapi s:shard1 r:core_node2 x:testschemaapi_shard1_replica2] o.a.s.h.l.XMLLoader xsltCacheLifetimeSeconds=60
   [junit4]   2> 2262974 INFO  (qtp228792047-14535) [n:127.0.0.1:40478_solr c:testschemaapi s:shard1 r:core_node1 x:testschemaapi_shard1_replica1] o.a.s.c.SolrDeletionPolicy SolrDeletionPolicy.onInit: commits: num=1
   [junit4]   2> 	commit{dir=MockDirectoryWrapper(RAMDirectory@226a6f8d lockFactory=org.apache.lucene.store.SingleInstanceLockFactory@63d32e9c),segFN=segments_1,generation=1}
   [junit4]   2> 2262974 INFO  (qtp228792047-14535) [n:127.0.0.1:40478_solr c:testschemaapi s:shard1 r:core_node1 x:testschemaapi_shard1_replica1] o.a.s.c.SolrDeletionPolicy newest commit generation = 1
   [junit4]   2> 2262974 INFO  (qtp228792047-14535) [n:127.0.0.1:40478_solr c:testschemaapi s:shard1 r:core_node1 x:testschemaapi_shard1_replica1] o.a.s.s.SolrIndexSearcher Opening [Searcher@473ddcf1[testschemaapi_shard1_replica1] main]
   [junit4]   2> 2262974 INFO  (qtp228792047-14535) [n:127.0.0.1:40478_solr c:testschemaapi s:shard1 r:core_node1 x:testschemaapi_shard1_replica1] o.a.s.c.c.ZkStateReader Load collection config from: [/collections/testschemaapi]
   [junit4]   2> 2262975 INFO  (qtp435882798-14526) [n:127.0.0.1:46502_solr c:testschemaapi s:shard1 r:core_node2 x:testschemaapi_shard1_replica2] o.a.s.h.l.XMLLoader xsltCacheLifetimeSeconds=60
   [junit4]   2> 2262975 INFO  (qtp228792047-14535) [n:127.0.0.1:40478_solr c:testschemaapi s:shard1 r:core_node1 x:testschemaapi_shard1_replica1] o.a.s.c.c.ZkStateReader path=[/collections/testschemaapi] [configName]=[conf1] specified config exists in ZooKeeper
   [junit4]   2> 2262975 INFO  (qtp228792047-14535) [n:127.0.0.1:40478_solr c:testschemaapi s:shard1 r:core_node1 x:testschemaapi_shard1_replica1] o.a.s.r.ManagedResourceStorage Setting up ZooKeeper-based storage for the RestManager with znodeBase: /configs/conf1
   [junit4]   2> 2262975 INFO  (qtp228792047-14535) [n:127.0.0.1:40478_solr c:testschemaapi s:shard1 r:core_node1 x:testschemaapi_shard1_replica1] o.a.s.r.ManagedResourceStorage Configured ZooKeeperStorageIO with znodeBase: /configs/conf1
   [junit4]   2> 2262975 INFO  (qtp228792047-14535) [n:127.0.0.1:40478_solr c:testschemaapi s:shard1 r:core_node1 x:testschemaapi_shard1_replica1] o.a.s.r.RestManager Initializing RestManager with initArgs: {}
   [junit4]   2> 2262975 INFO  (qtp435882798-14526) [n:127.0.0.1:46502_solr c:testschemaapi s:shard1 r:core_node2 x:testschemaapi_shard1_replica2] o.a.s.h.l.XMLLoader xsltCacheLifetimeSeconds=60
   [junit4]   2> 2262975 INFO  (qtp228792047-14535) [n:127.0.0.1:40478_solr c:testschemaapi s:shard1 r:core_node1 x:testschemaapi_shard1_replica1] o.a.s.r.ManagedResourceStorage Reading _rest_managed.json using ZooKeeperStorageIO:path=/configs/conf1
   [junit4]   2> 2262976 INFO  (qtp435882798-14526) [n:127.0.0.1:46502_solr c:testschemaapi s:shard1 r:core_node2 x:testschemaapi_shard1_replica2] o.a.s.c.RequestHandlers Registered paths: /admin/mbeans,/update/csv,/sql,/update/json/docs,/admin/luke,/export,/select,/admin/segments,/get,/admin/system,/replication,/admin/properties,/config,/stream,/schema,/admin/plugins,/admin/logging,/update/json,/admin/ping,/admin/threads,/update,/admin/file
   [junit4]   2> 2262976 INFO  (qtp435882798-14526) [n:127.0.0.1:46502_solr c:testschemaapi s:shard1 r:core_node2 x:testschemaapi_shard1_replica2] o.a.s.c.SolrCore Using default statsCache cache: org.apache.solr.search.stats.LocalStatsCache
   [junit4]   2> 2262976 INFO  (qtp435882798-14526) [n:127.0.0.1:46502_solr c:testschemaapi s:shard1 r:core_node2 x:testschemaapi_shard1_replica2] o.a.s.u.UpdateHandler Using UpdateLog implementation: org.apache.solr.update.UpdateLog
   [junit4]   2> 2262976 INFO  (qtp435882798-14526) [n:127.0.0.1:46502_solr c:testschemaapi s:shard1 r:core_node2 x:testschemaapi_shard1_replica2] o.a.s.u.UpdateLog Initializing UpdateLog: dataDir=null defaultSyncLevel=FLUSH numRecordsToKeep=100 maxNumLogsToKeep=10 numVersionBuckets=65536
   [junit4]   2> 2262977 INFO  (qtp228792047-14535) [n:127.0.0.1:40478_solr c:testschemaapi s:shard1 r:core_node1 x:testschemaapi_shard1_replica1] o.a.s.r.ManagedResourceStorage No data found for znode /configs/conf1/_rest_managed.json
   [junit4]   2> 2262977 INFO  (qtp435882798-14526) [n:127.0.0.1:46502_solr c:testschemaapi s:shard1 r:core_node2 x:testschemaapi_shard1_replica2] o.a.s.u.CommitTracker Hard AutoCommit: disabled
   [junit4]   2> 2262977 INFO  (qtp228792047-14535) [n:127.0.0.1:40478_solr c:testschemaapi s:shard1 r:core_node1 x:testschemaapi_shard1_replica1] o.a.s.r.ManagedResourceStorage Loaded null at path _rest_managed.json using ZooKeeperStorageIO:path=/configs/conf1
   [junit4]   2> 2262977 INFO  (qtp435882798-14526) [n:127.0.0.1:46502_solr c:testschemaapi s:shard1 r:core_node2 x:testschemaapi_shard1_replica2] o.a.s.u.CommitTracker Soft AutoCommit: disabled
   [junit4]   2> 2262977 INFO  (qtp228792047-14535) [n:127.0.0.1:40478_solr c:testschemaapi s:shard1 r:core_node1 x:testschemaapi_shard1_replica1] o.a.s.r.RestManager Initializing 0 registered ManagedResources
   [junit4]   2> 2262978 INFO  (qtp228792047-14535) [n:127.0.0.1:40478_solr c:testschemaapi s:shard1 r:core_node1 x:testschemaapi_shard1_replica1] o.a.s.s.ZkIndexSchemaReader Creating ZooKeeper watch for the managed schema at /configs/conf1/managed-schema
   [junit4]   2> 2262978 INFO  (qtp435882798-14526) [n:127.0.0.1:46502_solr c:testschemaapi s:shard1 r:core_node2 x:testschemaapi_shard1_replica2] o.a.s.c.SolrDeletionPolicy SolrDeletionPolicy.onInit: commits: num=1
   [junit4]   2> 	commit{dir=MockDirectoryWrapper(RAMDirectory@3c4dc7de lockFactory=org.apache.lucene.store.SingleInstanceLockFactory@a50945a),segFN=segments_1,generation=1}
   [junit4]   2> 2262978 INFO  (qtp435882798-14526) [n:127.0.0.1:46502_solr c:testschemaapi s:shard1 r:core_node2 x:testschemaapi_shard1_replica2] o.a.s.c.SolrDeletionPolicy newest commit generation = 1
   [junit4]   2> 2262978 INFO  (qtp435882798-14526) [n:127.0.0.1:46502_solr c:testschemaapi s:shard1 r:core_node2 x:testschemaapi_shard1_replica2] o.a.s.s.SolrIndexSearcher Opening [Searcher@2f2d710d[testschemaapi_shard1_replica2] main]
   [junit4]   2> 2262979 INFO  (qtp228792047-14535) [n:127.0.0.1:40478_solr c:testschemaapi s:shard1 r:core_node1 x:testschemaapi_shard1_replica1] o.a.s.c.ZkController Added new OnReconnect listener ZkIndexSchemaReader: /configs/conf1/managed-schema, uniqueCoreId: testschemaapi_shard1_replica1:1674060243452286
   [junit4]   2> 2262979 INFO  (qtp435882798-14526) [n:127.0.0.1:46502_solr c:testschemaapi s:shard1 r:core_node2 x:testschemaapi_shard1_replica2] o.a.s.c.c.ZkStateReader Load collection config from: [/collections/testschemaapi]
   [junit4]   2> 2262979 INFO  (qtp228792047-14535) [n:127.0.0.1:40478_solr c:testschemaapi s:shard1 r:core_node1 x:testschemaapi_shard1_replica1] o.a.s.h.ReplicationHandler Commits will be reserved for  10000
   [junit4]   2> 2262979 INFO  (searcherExecutor-6682-thread-1-processing-n:127.0.0.1:40478_solr x:testschemaapi_shard1_replica1 s:shard1 c:testschemaapi r:core_node1) [n:127.0.0.1:40478_solr c:testschemaapi s:shard1 r:core_node1 x:testschemaapi_shard1_replica1] o.a.s.c.SolrCore [testschemaapi_shard1_replica1] Registered new searcher Searcher@473ddcf1[testschemaapi_shard1_replica1] main{ExitableDirectoryReader(UninvertingDirectoryReader())}
   [junit4]   2> 2262979 INFO  (qtp228792047-14535) [n:127.0.0.1:40478_solr c:testschemaapi s:shard1 r:core_node1 x:testschemaapi_shard1_replica1] o.a.s.u.UpdateLog Looking up max value of version field to seed version buckets
   [junit4]   2> 2262979 INFO  (qtp228792047-14535) [n:127.0.0.1:40478_solr c:testschemaapi s:shard1 r:core_node1 x:testschemaapi_shard1_replica1] o.a.s.u.VersionInfo Refreshing highest value of _version_ for 65536 version buckets from index
   [junit4]   2> 2262979 INFO  (qtp228792047-14535) [n:127.0.0.1:40478_solr c:testschemaapi s:shard1 r:core_node1 x:testschemaapi_shard1_replica1] o.a.s.u.VersionInfo No terms found for _version_, cannot seed version bucket highest value from index
   [junit4]   2> 2262979 INFO  (qtp435882798-14526) [n:127.0.0.1:46502_solr c:testschemaapi s:shard1 r:core_node2 x:testschemaapi_shard1_replica2] o.a.s.c.c.ZkStateReader path=[/collections/testschemaapi] [configName]=[conf1] specified config exists in ZooKeeper
   [junit4]   2> 2262979 INFO  (qtp435882798-14526) [n:127.0.0.1:46502_solr c:testschemaapi s:shard1 r:core_node2 x:testschemaapi_shard1_replica2] o.a.s.r.ManagedResourceStorage Setting up ZooKeeper-based storage for the RestManager with znodeBase: /configs/conf1
   [junit4]   2> 2262979 INFO  (qtp228792047-14535) [n:127.0.0.1:40478_solr c:testschemaapi s:shard1 r:core_node1 x:testschemaapi_shard1_replica1] o.a.s.u.UpdateLog Could not find max version in index or recent updates, using new clock 1535341651861438464
   [junit4]   2> 2262979 INFO  (qtp435882798-14526) [n:127.0.0.1:46502_solr c:testschemaapi s:shard1 r:core_node2 x:testschemaapi_shard1_replica2] o.a.s.r.ManagedResourceStorage Configured ZooKeeperStorageIO with znodeBase: /configs/conf1
   [junit4]   2> 2262979 INFO  (qtp435882798-14526) [n:127.0.0.1:46502_solr c:testschemaapi s:shard1 r:core_node2 x:testschemaapi_shard1_replica2] o.a.s.r.RestManager Initializing RestManager with initArgs: {}
   [junit4]   2> 2262980 INFO  (qtp435882798-14526) [n:127.0.0.1:46502_solr c:testschemaapi s:shard1 r:core_node2 x:testschemaapi_shard1_replica2] o.a.s.r.ManagedResourceStorage Reading _rest_managed.json using ZooKeeperStorageIO:path=/configs/conf1
   [junit4]   2> 2262980 INFO  (qtp435882798-14526) [n:127.0.0.1:46502_solr c:testschemaapi s:shard1 r:core_node2 x:testschemaapi_shard1_replica2] o.a.s.r.ManagedResourceStorage No data found for znode /configs/conf1/_rest_managed.json
   [junit4]   2> 2262980 INFO  (qtp435882798-14526) [n:127.0.0.1:46502_solr c:testschemaapi s:shard1 r:core_node2 x:testschemaapi_shard1_replica2] o.a.s.r.ManagedResourceStorage Loaded null at path _rest_managed.json using ZooKeeperStorageIO:path=/configs/conf1
   [junit4]   2> 2262980 INFO  (qtp435882798-14526) [n:127.0.0.1:46502_solr c:testschemaapi s:shard1 r:core_node2 x:testschemaapi_shard1_replica2] o.a.s.r.RestManager Initializing 0 registered ManagedResources
   [junit4]   2> 2262980 INFO  (qtp435882798-14526) [n:127.0.0.1:46502_solr c:testschemaapi s:shard1 r:core_node2 x:testschemaapi_shard1_replica2] o.a.s.s.ZkIndexSchemaReader Creating ZooKeeper watch for the managed schema at /configs/conf1/managed-schema
   [junit4]   2> 2262980 INFO  (qtp435882798-14526) [n:127.0.0.1:46502_solr c:testschemaapi s:shard1 r:core_node2 x:testschemaapi_shard1_replica2] o.a.s.c.ZkController Added new OnReconnect listener ZkIndexSchemaReader: /configs/conf1/managed-schema, uniqueCoreId: testschemaapi_shard1_replica2:1674060248348408
   [junit4]   2> 2262980 INFO  (qtp435882798-14526) [n:127.0.0.1:46502_solr c:testschemaapi s:shard1 r:core_node2 x:testschemaapi_shard1_replica2] o.a.s.h.ReplicationHandler Commits will be reserved for  10000
   [junit4]   2> 2262980 INFO  (searcherExecutor-6683-thread-1-processing-n:127.0.0.1:46502_solr x:testschemaapi_shard1_replica2 s:shard1 c:testschemaapi r:core_node2) [n:127.0.0.1:46502_solr c:testschemaapi s:shard1 r:core_node2 x:testschemaapi_shard1_replica2] o.a.s.c.SolrCore [testschemaapi_shard1_replica2] Registered new searcher Searcher@2f2d710d[testschemaapi_shard1_replica2] main{ExitableDirectoryReader(UninvertingDirectoryReader())}
   [junit4]   2> 2262980 INFO  (qtp435882798-14526) [n:127.0.0.1:46502_solr c:testschemaapi s:shard1 r:core_node2 x:testschemaapi_shard1_replica2] o.a.s.u.UpdateLog Looking up max value of version field to seed version buckets
   [junit4]   2> 2262980 INFO  (qtp435882798-14526) [n:127.0.0.1:46502_solr c:testschemaapi s:shard1 r:core_node2 x:testschemaapi_shard1_replica2] o.a.s.u.VersionInfo Refreshing highest value of _version_ for 65536 version buckets from index
   [junit4]   2> 2262980 INFO  (qtp435882798-14526) [n:127.0.0.1:46502_solr c:testschemaapi s:shard1 r:core_node2 x:testschemaapi_shard1_replica2] o.a.s.u.VersionInfo No terms found for _version_, cannot seed version bucket highest value from index
   [junit4]   2> 2262981 INFO  (qtp435882798-14526) [n:127.0.0.1:46502_solr c:testschemaapi s:shard1 r:core_node2 x:testschemaapi_shard1_replica2] o.a.s.u.UpdateLog Could not find max version in index or recent updates, using new clock 1535341651863535616
   [junit4]   2> 2262981 INFO  (qtp228792047-14535) [n:127.0.0.1:40478_solr c:testschemaapi s:shard1 r:core_node1 x:testschemaapi_shard1_replica1] o.a.s.u.UpdateLog Took 2.0ms to seed version buckets with highest version 1535341651861438464
   [junit4]   2> 2262981 INFO  (qtp228792047-14535) [n:127.0.0.1:40478_solr c:testschemaapi s:shard1 r:core_node1 x:testschemaapi_shard1_replica1] o.a.s.c.ZkController watch zkdir /configs/conf1
   [junit4]   2> 2262982 INFO  (qtp228792047-14535) [n:127.0.0.1:40478_solr c:testschemaapi s:shard1 r:core_node1 x:testschemaapi_shard1_replica1] o.a.s.c.CoreContainer registering core: testschemaapi_shard1_replica1
   [junit4]   2> 2262982 INFO  (qtp228792047-14535) [n:127.0.0.1:40478_solr c:testschemaapi s:shard1 r:core_node1 x:testschemaapi_shard1_replica1] o.a.s.c.ZkController Register replica - core:testschemaapi_shard1_replica1 address:http://127.0.0.1:40478/solr collection:testschemaapi shard:shard1
   [junit4]   2> 2262982 INFO  (qtp228792047-14535) [n:127.0.0.1:40478_solr c:testschemaapi s:shard1 r:core_node1 x:testschemaapi_shard1_replica1] o.a.s.c.c.SolrZkClient makePath: /collections/testschemaapi/leader_elect/shard1/election
   [junit4]   2> 2262982 INFO  (qtp435882798-14526) [n:127.0.0.1:46502_solr c:testschemaapi s:shard1 r:core_node2 x:testschemaapi_shard1_replica2] o.a.s.u.UpdateLog Took 1.0ms to seed version buckets with highest version 1535341651863535616
   [junit4]   2> 2262982 INFO  (qtp435882798-14526) [n:127.0.0.1:46502_solr c:testschemaapi s:shard1 r:core_node2 x:testschemaapi_shard1_replica2] o.a.s.c.ZkController watch zkdir /configs/conf1
   [junit4]   2> 2262983 INFO  (qtp435882798-14526) [n:127.0.0.1:46502_solr c:testschemaapi s:shard1 r:core_node2 x:testschemaapi_shard1_replica2] o.a.s.c.CoreContainer registering core: testschemaapi_shard1_replica2
   [junit4]   2> 2262983 INFO  (qtp435882798-14526) [n:127.0.0.1:46502_solr c:testschemaapi s:shard1 r:core_node2 x:testschemaapi_shard1_replica2] o.a.s.c.ZkController Register replica - core:testschemaapi_shard1_replica2 address:http://127.0.0.1:46502/solr collection:testschemaapi shard:shard1
   [junit4]   2> 2262983 INFO  (qtp435882798-14526) [n:127.0.0.1:46502_solr c:testschemaapi s:shard1 r:core_node2 x:testschemaapi_shard1_replica2] o.a.s.c.c.SolrZkClient makePath: /collections/testschemaapi/leader_elect/shard1/election
   [junit4]   2> 2262984 INFO  (qtp228792047-14535) [n:127.0.0.1:40478_solr c:testschemaapi s:shard1 r:core_node1 x:testschemaapi_shard1_replica1] o.a.s.c.LeaderElector Joined leadership election with path: /collections/testschemaapi/leader_elect/shard1/election/95958853088575494-core_node1-n_0000000000
   [junit4]   2> 2262984 INFO  (qtp228792047-14535) [n:127.0.0.1:40478_solr c:testschemaapi s:shard1 r:core_node1 x:testschemaapi_shard1_replica1] o.a.s.c.ShardLeaderElectionContext Running the leader process for shard=shard1 and weAreReplacement=false and leaderVoteWait=10000
   [junit4]   2> 2262984 INFO  (qtp435882798-14526) [n:127.0.0.1:46502_solr c:testschemaapi s:shard1 r:core_node2 x:testschemaapi_shard1_replica2] o.a.s.c.LeaderElector Joined leadership election with path: /collections/testschemaapi/leader_elect/shard1/election/95958853088575493-core_node2-n_0000000001
   [junit4]   2> 2262985 INFO  (qtp228792047-14535) [n:127.0.0.1:40478_solr c:testschemaapi s:shard1 r:core_node1 x:testschemaapi_shard1_replica1] o.a.s.c.ShardLeaderElectionContext Enough replicas found to continue.
   [junit4]   2> 2262985 INFO  (qtp228792047-14535) [n:127.0.0.1:40478_solr c:testschemaapi s:shard1 r:core_node1 x:testschemaapi_shard1_replica1] o.a.s.c.ShardLeaderElectionContext I may be the new leader - try and sync
   [junit4]   2> 2262985 INFO  (qtp435882798-14526) [n:127.0.0.1:46502_solr c:testschemaapi s:shard1 r:core_node2 x:testschemaapi_shard1_replica2] o.a.s.c.LeaderElector Watching path /collections/testschemaapi/leader_elect/shard1/election/95958853088575494-core_node1-n_0000000000 to know if I could be the leader
   [junit4]   2> 2262985 INFO  (qtp228792047-14535) [n:127.0.0.1:40478_solr c:testschemaapi s:shard1 r:core_node1 x:testschemaapi_shard1_replica1] o.a.s.c.SyncStrategy Sync replicas to http://127.0.0.1:40478/solr/testschemaapi_shard1_replica1/
   [junit4]   2> 2262985 INFO  (OverseerStateUpdate-95958853088575494-127.0.0.1:40478_solr-n_0000000000) [n:127.0.0.1:40478_solr    ] o.a.s.c.Overseer processMessage: queueSize: 1, message = {
   [junit4]   2>   "operation":"leader",
   [junit4]   2>   "shard":"shard1",
   [junit4]   2>   "collection":"testschemaapi"} current state version: 0
   [junit4]   2> 2262985 INFO  (qtp228792047-14535) [n:127.0.0.1:40478_solr c:testschemaapi s:shard1 r:core_node1 x:testschemaapi_shard1_replica1] o.a.s.u.PeerSync PeerSync: core=testschemaapi_shard1_replica1 url=http://127.0.0.1:40478/solr START replicas=[http://127.0.0.1:46502/solr/testschemaapi_shard1_replica2/] nUpdates=100
   [junit4]   2> 2262985 INFO  (qtp228792047-14535) [n:127.0.0.1:40478_solr c:testschemaapi s:shard1 r:core_node1 x:testschemaapi_shard1_replica1] o.a.s.u.PeerSync PeerSync: core=testschemaapi_shard1_replica1 url=http://127.0.0.1:40478/solr DONE.  We have no versions.  sync failed.
   [junit4]   2> 2262985 INFO  (qtp228792047-14535) [n:127.0.0.1:40478_solr c:testschemaapi s:shard1 r:core_node1 x:testschemaapi_shard1_replica1] o.a.s.c.SyncStrategy Leader's attempt to sync with shard failed, moving to the next candidate
   [junit4]   2> 2262985 INFO  (qtp228792047-14535) [n:127.0.0.1:40478_solr c:testschemaapi s:shard1 r:core_node1 x:testschemaapi_shard1_replica1] o.a.s.c.ShardLeaderElectionContext We failed sync, but we have no versions - we can't sync in that case - we were active before, so become leader anyway
   [junit4]   2> 2262986 INFO  (qtp228792047-14535) [n:127.0.0.1:40478_solr c:testschemaapi s:shard1 r:core_node1 x:testschemaapi_shard1_replica1] o.a.s.c.c.SolrZkClient makePath: /collections/testschemaapi/leaders/shard1
   [junit4]   2> 2262987 INFO  (qtp435882798-14530) [n:127.0.0.1:46502_solr c:testschemaapi s:shard1 r:core_node2 x:testschemaapi_shard1_replica2] o.a.s.c.S.Request [testschemaapi_shard1_replica2]  webapp=/solr path=/get params={distrib=false&qt=/get&fingerprint=false&getVersions=100&wt=javabin&version=2} status=0 QTime=0
   [junit4]   2> 2262987 INFO  (qtp228792047-14535) [n:127.0.0.1:40478_solr c:testschemaapi s:shard1 r:core_node1 x:testschemaapi_shard1_replica1] o.a.s.c.ShardLeaderElectionContextBase Creating leader registration node /collections/testschemaapi/leaders/shard1/leader after winning as /collections/testschemaapi/leader_elect/shard1/election/95958853088575494-core_node1-n_0000000000
   [junit4]   2> 2262988 INFO  (qtp228792047-14535) [n:127.0.0.1:40478_solr c:testschemaapi s:shard1 r:core_node1 x:testschemaapi_shard1_replica1] o.a.s.c.ShardLeaderElectionContext I am the new leader: http://127.0.0.1:40478/solr/testschemaapi_shard1_replica1/ shard1
   [junit4]   2> 2262988 INFO  (OverseerStateUpdate-95958853088575494-127.0.0.1:40478_solr-n_0000000000) [n:127.0.0.1:40478_solr    ] o.a.s.c.Overseer processMessage: queueSize: 1, message = {
   [junit4]   2>   "operation":"leader",
   [junit4]   2>   "shard":"shard1",
   [junit4]   2>   "collection":"testschemaapi",
   [junit4]   2>   "base_url":"http://127.0.0.1:40478/solr",
   [junit4]   2>   "core":"testschemaapi_shard1_replica1",
   [junit4]   2>   "state":"active"} current state version: 0
   [junit4]   2> 2263089 INFO  (OverseerStateUpdate-95958853088575494-127.0.0.1:40478_solr-n_0000000000) [n:127.0.0.1:40478_solr    ] o.a.s.c.o.ZkStateWriter going to update_collection /collections/testschemaapi/state.json version: 1
   [junit4]   2> 2263089 INFO  (zkCallback-2332-thread-1-processing-n:127.0.0.1:40478_solr) [n:127.0.0.1:40478_solr    ] o.a.s.c.c.ZkStateReader A cluster state change: [WatchedEvent state:SyncConnected type:NodeDataChanged path:/collections/testschemaapi/state.json] for collection [testschemaapi] has occurred - updating... (live nodes size: [2])
   [junit4]   2> 2263089 INFO  (zkCallback-2331-thread-1-processing-n:127.0.0.1:46502_solr) [n:127.0.0.1:46502_solr    ] o.a.s.c.c.ZkStateReader A cluster state change: [WatchedEvent state:SyncConnected type:NodeDataChanged path:/collections/testschemaapi/state.json] for collection [testschemaapi] has occurred - updating... (live nodes size: [2])
   [junit4]   2> 2263090 INFO  (zkCallback-2332-thread-1-processing-n:127.0.0.1:40478_solr) [n:127.0.0.1:40478_solr    ] o.a.s.c.c.ZkStateReader Updating data for [testschemaapi] from [1] to [2]
   [junit4]   2> 2263090 INFO  (zkCallback-2331-thread-1-processing-n:127.0.0.1:46502_solr) [n:127.0.0.1:46502_solr    ] o.a.s.c.c.ZkStateReader Updating data for [testschemaapi] from [1] to [2]
   [junit4]   2> 2263138 INFO  (qtp228792047-14535) [n:127.0.0.1:40478_solr c:testschemaapi s:shard1 r:core_node1 x:testschemaapi_shard1_replica1] o.a.s.c.ZkController We are http://127.0.0.1:40478/solr/testschemaapi_shard1_replica1/ and leader is http://127.0.0.1:40478/solr/testschemaapi_shard1_replica1/
   [junit4]   2> 2263138 INFO  (qtp228792047-14535) [n:127.0.0.1:40478_solr c:testschemaapi s:shard1 r:core_node1 x:testschemaapi_shard1_replica1] o.a.s.c.ZkController No LogReplay needed for core=testschemaapi_shard1_replica1 baseURL=http://127.0.0.1:40478/solr
   [junit4]   2> 2263138 INFO  (qtp228792047-14535) [n:127.0.0.1:40478_solr c:testschemaapi s:shard1 r:core_node1 x:testschemaapi_shard1_replica1] o.a.s.c.ZkController I am the leader, no recovery necessary
   [junit4]   2> 2263138 INFO  (qtp228792047-14535) [n:127.0.0.1:40478_solr c:testschemaapi s:shard1 r:core_node1 x:testschemaapi_shard1_replica1] o.a.s.c.ZkController publishing state=active
   [junit4]   2> 2263139 INFO  (OverseerStateUpdate-95958853088575494-127.0.0.1:40478_solr-n_0000000000) [n:127.0.0.1:40478_solr    ] o.a.s.c.Overseer processMessage: queueSize: 1, message = {
   [junit4]   2>   "core":"testschemaapi_shard1_replica1",
   [junit4]   2>   "core_node_name":"core_node1",
   [junit4]   2>   "roles":null,
   [junit4]   2>   "base_url":"http://127.0.0.1:40478/solr",
   [junit4]   2>   "node_name":"127.0.0.1:40478_solr",
   [junit4]   2>   "numShards":"1",
   [junit4]   2>   "state":"active",
   [junit4]   2>   "shard":"shard1",
   [junit4]   2>   "collection":"testschemaapi",
   [junit4]   2>   "operation":"state"} current state version: 0
   [junit4]   2> 2263142 INFO  (OverseerStateUpdate-95958853088575494-127.0.0.1:40478_solr-n_0000000000) [n:127.0.0.1:40478_solr    ] o.a.s.c.o.ReplicaMutator Update state numShards=1 message={
   [junit4]   2>   "core":"testschemaapi_shard1_replica1",
   [junit4]   2>   "core_node_name":"core_node1",
   [junit4]   2>   "roles":null,
   [junit4]   2>   "base_url":"http://127.0.0.1:40478/solr",
   [junit4]   2>   "node_name":"127.0.0.1:40478_solr",
   [junit4]   2>   "numShards":"1",
   [junit4]   2>   "state":"active",
   [junit4]   2>   "shard":"shard1",
   [junit4]   2>   "collection":"testschemaapi",
   [junit4]   2>   "operation":"state"}
   [junit4]   2> 2263142 INFO  (qtp228792047-14535) [n:127.0.0.1:40478_solr c:testschemaapi s:shard1 r:core_node1 x:testschemaapi_shard1_replica1] o.a.s.c.c.ZkStateReader Updated live nodes from ZooKeeper... (2) -> (2)
   [junit4]   2> 2263142 INFO  (qtp228792047-14535) [n:127.0.0.1:40478_solr c:testschemaapi s:shard1 r:core_node1 x:testschemaapi_shard1_replica1] o.a.s.s.HttpSolrCall [admin] webapp=null path=/admin/cores params={qt=/admin/cores&collection.configName=conf1&name=testschemaapi_shard1_replica1&action=CREATE&numShards=1&collection=testschemaapi&shard=shard1&wt=javabin&version=2} status=0 QTime=1209
   [junit4]   2> 2263243 INFO  (OverseerStateUpdate-95958853088575494-127.0.0.1:40478_solr-n_0000000000) [n:127.0.0.1:40478_solr    ] o.a.s.c.o.ZkStateWriter going to update_collection /collections/testschemaapi/state.json version: 2
   [junit4]   2> 2263243 INFO  (zkCallback-2332-thread-1-processing-n:127.0.0.1:40478_solr) [n:127.0.0.1:40478_solr    ] o.a.s.c.c.ZkStateReader A cluster state change: [WatchedEvent state:SyncConnected type:NodeDataChanged path:/collections/testschemaapi/state.json] for collection [testschemaapi] has occurred - updating... (live nodes size: [2])
   [junit4]   2> 2263243 INFO  (zkCallback-2331-thread-1-processing-n:127.0.0.1:46502_solr) [n:127.0.0.1:46502_solr    ] o.a.s.c.c.ZkStateReader A cluster state change: [WatchedEvent state:SyncConnected type:NodeDataChanged path:/collections/testschemaapi/state.json] for collection [testschemaapi] has occurred - updating... (live nodes size: [2])
   [junit4]   2> 2263243 INFO  (zkCallback-2332-thread-1-processing-n:127.0.0.1:40478_solr) [n:127.0.0.1:40478_solr    ] o.a.s.c.c.ZkStateReader Updating data for [testschemaapi] from [2] to [3]
   [junit4]   2> 2263244 INFO  (zkCallback-2331-thread-1-processing-n:127.0.0.1:46502_solr) [n:127.0.0.1:46502_solr    ] o.a.s.c.c.ZkStateReader Updating data for [testschemaapi] from [2] to [3]
   [junit4]   2> 2263986 INFO  (qtp435882798-14526) [n:127.0.0.1:46502_solr c:testschemaapi s:shard1 r:core_node2 x:testschemaapi_shard1_replica2] o.a.s.c.ZkController We are http://127.0.0.1:46502/solr/testsc

[...truncated too long message...]

vletHandler.java:581)
   [junit4]   2> 	at org.eclipse.jetty.server.session.SessionHandler.doHandle(SessionHandler.java:224)
   [junit4]   2> 	at org.eclipse.jetty.server.handler.ContextHandler.doHandle(ContextHandler.java:1160)
   [junit4]   2> 	at org.eclipse.jetty.servlet.ServletHandler.doScope(ServletHandler.java:511)
   [junit4]   2> 	at org.eclipse.jetty.server.session.SessionHandler.doScope(SessionHandler.java:185)
   [junit4]   2> 	at org.eclipse.jetty.server.handler.ContextHandler.doScope(ContextHandler.java:1092)
   [junit4]   2> 	at org.eclipse.jetty.server.handler.ScopedHandler.handle(ScopedHandler.java:141)
   [junit4]   2> 	at org.eclipse.jetty.server.handler.gzip.GzipHandler.handle(GzipHandler.java:399)
   [junit4]   2> 	at org.eclipse.jetty.server.handler.HandlerWrapper.handle(HandlerWrapper.java:134)
   [junit4]   2> 	at org.eclipse.jetty.server.Server.handle(Server.java:518)
   [junit4]   2> 	at org.eclipse.jetty.server.HttpChannel.handle(HttpChannel.java:308)
   [junit4]   2> 	at org.eclipse.jetty.server.HttpConnection.onFillable(HttpConnection.java:244)
   [junit4]   2> 	at org.eclipse.jetty.io.AbstractConnection$ReadCallback.succeeded(AbstractConnection.java:273)
   [junit4]   2> 	at org.eclipse.jetty.io.FillInterest.fillable(FillInterest.java:95)
   [junit4]   2> 	at org.eclipse.jetty.io.SelectChannelEndPoint$2.run(SelectChannelEndPoint.java:93)
   [junit4]   2> 	at org.eclipse.jetty.util.thread.strategy.ExecuteProduceConsume.produceAndRun(ExecuteProduceConsume.java:246)
   [junit4]   2> 	at org.eclipse.jetty.util.thread.strategy.ExecuteProduceConsume.run(ExecuteProduceConsume.java:156)
   [junit4]   2> 	at org.eclipse.jetty.util.thread.QueuedThreadPool.runJob(QueuedThreadPool.java:654)
   [junit4]   2> 	at org.eclipse.jetty.util.thread.QueuedThreadPool$3.run(QueuedThreadPool.java:572)
   [junit4]   2> 	at java.lang.Thread.run(Thread.java:745)
   [junit4]   2> 
   [junit4]   2> 2288404 WARN  (Thread-5042) [n:127.0.0.1:40478_solr c:testschemaapi s:shard1 r:core_node1 x:testschemaapi_shard1_replica1] o.a.s.c.ZkController listener throws error
   [junit4]   2> org.apache.solr.common.SolrException: Unable to reload core [testschemaapi_shard1_replica1]
   [junit4]   2> 	at org.apache.solr.core.CoreContainer.reload(CoreContainer.java:925)
   [junit4]   2> 	at org.apache.solr.core.SolrCore.lambda$getConfListener$0(SolrCore.java:2525)
   [junit4]   2> 	at org.apache.solr.cloud.ZkController$4.run(ZkController.java:2425)
   [junit4]   2> Caused by: org.apache.solr.common.SolrException: Could not find config name for collection:testschemaapi
   [junit4]   2> 	at org.apache.solr.core.SolrCore.<init>(SolrCore.java:771)
   [junit4]   2> 	at org.apache.solr.core.SolrCore.reload(SolrCore.java:460)
   [junit4]   2> 	at org.apache.solr.core.CoreContainer.reload(CoreContainer.java:919)
   [junit4]   2> 	... 2 more
   [junit4]   2> Caused by: org.apache.solr.common.SolrException: Could not find config name for collection:testschemaapi
   [junit4]   2> 	at org.apache.solr.rest.ManagedResourceStorage.newStorageIO(ManagedResourceStorage.java:101)
   [junit4]   2> 	at org.apache.solr.core.SolrCore.initRestManager(SolrCore.java:2320)
   [junit4]   2> 	at org.apache.solr.core.SolrCore.<init>(SolrCore.java:747)
   [junit4]   2> 	... 4 more
   [junit4]   2> NOTE: test params are: codec=Asserting(Lucene60), sim=RandomSimilarity(queryNorm=true,coord=no): {}, locale=es-CR, timezone=America/New_York
   [junit4]   2> NOTE: Linux 4.4.0-21-generic amd64/Oracle Corporation 1.8.0_92 (64-bit)/cpus=12,threads=1,free=169180688,total=518979584
   [junit4]   2> NOTE: All tests run in this JVM: [TestMiniSolrCloudClusterSSL, TestEmbeddedSolrServerConstructors, HdfsBasicDistributedZk2Test, TestPartialUpdateDeduplication, TestSystemIdResolver, SharedFSAutoReplicaFailoverUtilsTest, TestQuerySenderNoQuery, TestDistribIDF, TestRequestStatusCollectionAPI, TestMiniSolrCloudCluster, TestConfigSetsAPI, TestShardHandlerFactory, TestConfigSetImmutable, TestStressVersions, FastVectorHighlighterTest, TestDFISimilarityFactory, TestSizeLimitedDistributedMap, TestExceedMaxTermLength, TestSchemaManager, TlogReplayBufferedWhileIndexingTest, SolrXmlInZkTest, TestUpdate, TermVectorComponentTest, NumericFieldsTest, TestManagedResource, HdfsSyncSliceTest, MultiTermTest, CoreMergeIndexesAdminHandlerTest, TestDocumentBuilder, TestDistributedStatsComponentCardinality, SaslZkACLProviderTest, TestCloudInspectUtil, TestQueryUtils, TestSolrCoreProperties, SuggesterFSTTest, SortByFunctionTest, BasicFunctionalityTest, TestInitParams, TestManagedStopFilterFactory, TestFastLRUCache, SpellCheckComponentTest, TestCursorMarkWithoutUniqueKey, DistributedQueueTest, SpellingQueryConverterTest, DistanceUnitsTest, CSVRequestHandlerTest, CdcrReplicationHandlerTest, SegmentsInfoRequestHandlerTest, CdcrUpdateLogTest, DistribCursorPagingTest, WrapperMergePolicyFactoryTest, DocumentBuilderTest, DistributedMLTComponentTest, SpellPossibilityIteratorTest, TestAddFieldRealTimeGet, CloudMLTQParserTest, TestCollationFieldDocValues, TestStressUserVersions, ZkControllerTest, DocValuesTest, EnumFieldTest, TestWordDelimiterFilterFactory, ShardRoutingCustomTest, OpenExchangeRatesOrgProviderTest, TermsComponentTest, TestRestoreCore, TestScoreJoinQPNoScore, TestFilteredDocIdSet, AnalyticsMergeStrategyTest, ChaosMonkeyNothingIsSafeTest, OpenCloseCoreStressTest, TestSha256AuthenticationProvider, TestCloudManagedSchema, LeaderInitiatedRecoveryOnShardRestartTest, ZkSolrClientTest, SoftAutoCommitTest, TestMaxScoreQueryParser, TestFieldTypeResource, TestTrie, TestCoreContainer, TestDefaultSearchFieldResource, DistributedFacetPivotLargeTest, TestTrackingShardHandlerFactory, HdfsUnloadDistributedZkTest, TestDynamicLoading, ChangedSchemaMergeTest, TestLRUStatsCache, TestSolrCLIRunExample, TestLFUCache, TestBM25SimilarityFactory, TestBinaryResponseWriter, TestOverriddenPrefixQueryForCustomFieldType, OverseerRolesTest, UpdateRequestProcessorFactoryTest, TestSolrXml, ChaosMonkeySafeLeaderTest, CollectionsAPIDistributedZkTest, ZkCLITest, TestReload, DistributedTermsComponentTest, TestGroupingSearch, TestSort, HighlighterTest, CurrencyFieldXmlFileTest, SolrIndexSplitterTest, SimplePostToolTest, TestCoreDiscovery, SignatureUpdateProcessorFactoryTest, SpellCheckCollatorTest, SuggesterTest, TestStressLucene, SpatialFilterTest, WordBreakSolrSpellCheckerTest, SchemaVersionSpecificBehaviorTest, TestAtomicUpdateErrorCases, DirectUpdateHandlerOptimizeTest, DefaultValueUpdateProcessorTest, DistanceFunctionTest, TestSolrDeletionPolicy1, SolrInfoMBeanTest, CacheHeaderTest, TestSurroundQueryParser, DisMaxRequestHandlerTest, DirectSolrSpellCheckerTest, RequestHandlersTest, MoreLikeThisHandlerTest, LoggingHandlerTest, JSONWriterTest, UniqFieldsUpdateProcessorFactoryTest, BinaryUpdateRequestHandlerTest, SearchHandlerTest, SystemInfoHandlerTest, UUIDFieldTest, CursorPagingTest, SolrTestCaseJ4Test, TestDistributedMissingSort, TestJettySolrRunner, ActionThrottleTest, AliasIntegrationTest, BaseCdcrDistributedZkTest, CdcrRequestHandlerTest, CdcrVersionReplicationTest, CollectionReloadTest, CollectionsAPISolrJTest, DeleteInactiveReplicaTest, DeleteStatusTest, HttpPartitionTest, SolrCloudExampleTest, TestDistribDocBasedVersion, TestExclusionRuleCollectionAccess, TestMiniSolrCloudClusterBase, TestRebalanceLeaders, TestShortCircuitedRequests, TriLevelCompositeIdRoutingTest, CachingDirectoryFactoryTest, DirectoryFactoryTest, ExitableDirectoryReaderTest, HdfsDirectoryFactoryTest, QueryResultKeyTest, TestConfigSetProperties, TestImplicitCoreProperties, TestInfoStreamLogging, TestReloadAndDeleteDocs, RequestLoggingTest, TestBlobHandler, TestSQLHandler, DistributedFacetPivotSmallAdvancedTest, DistributedFacetPivotSmallTest, DistributedSuggestComponentTest, SuggestComponentTest, TestMacros, TestChildDocTransformer, TestRawTransformer, TestSolrQueryResponse, TestManagedResourceStorage, TestBulkSchemaAPI, TestManagedSchemaAPI]
   [junit4]   2> NOTE: reproduce with: ant test  -Dtestcase=TestManagedSchemaAPI -Dtests.seed=6791237DEE65D1F9 -Dtests.multiplier=3 -Dtests.slow=true -Dtests.locale=es-CR -Dtests.timezone=America/New_York -Dtests.asserts=true -Dtests.file.encoding=US-ASCII
   [junit4] ERROR   0.00s J1 | TestManagedSchemaAPI (suite) <<<
   [junit4]    > Throwable #1: java.lang.AssertionError: ObjectTracker found 2 object(s) that were not released!!! [RawDirectoryWrapper, MockDirectoryWrapper]
   [junit4]    > 	at __randomizedtesting.SeedInfo.seed([6791237DEE65D1F9]:0)
   [junit4]    > 	at org.apache.solr.SolrTestCaseJ4.afterClass(SolrTestCaseJ4.java:248)
   [junit4]    > 	at java.lang.Thread.run(Thread.java:745)
   [junit4] Completed [524/584 (1!)] on J1 in 27.78s, 1 test, 1 failure <<< FAILURES!

[...truncated 197 lines...]
BUILD FAILED
/home/jenkins/workspace/Lucene-Solr-6.0-Linux/build.xml:740: The following error occurred while executing this line:
/home/jenkins/workspace/Lucene-Solr-6.0-Linux/build.xml:684: The following error occurred while executing this line:
/home/jenkins/workspace/Lucene-Solr-6.0-Linux/build.xml:59: The following error occurred while executing this line:
/home/jenkins/workspace/Lucene-Solr-6.0-Linux/solr/build.xml:233: The following error occurred while executing this line:
/home/jenkins/workspace/Lucene-Solr-6.0-Linux/solr/common-build.xml:527: The following error occurred while executing this line:
/home/jenkins/workspace/Lucene-Solr-6.0-Linux/lucene/common-build.xml:1457: The following error occurred while executing this line:
/home/jenkins/workspace/Lucene-Solr-6.0-Linux/lucene/common-build.xml:1014: There were test failures: 584 suites (10 ignored), 2340 tests, 1 suite-level error, 114 ignored (70 assumptions) [seed: 6791237DEE65D1F9]

Total time: 69 minutes 35 seconds
Build step 'Invoke Ant' marked build as failure
Archiving artifacts
[WARNINGS] Skipping publisher since build result is FAILURE
Recording test results
Email was triggered for: Failure - Any
Sending email for trigger: Failure - Any



Mime
View raw message