lucene-dev mailing list archives

Site index · List index
Message view « Date » · « Thread »
Top « Date » · « Thread »
From Apache Jenkins Server <jenk...@builds.apache.org>
Subject [JENKINS] Lucene-Solr-Tests-master - Build # 1143 - Failure
Date Mon, 16 May 2016 17:54:38 GMT
Build: https://builds.apache.org/job/Lucene-Solr-Tests-master/1143/

2 tests failed.
FAILED:  org.apache.solr.cloud.ChaosMonkeyNothingIsSafeTest.test

Error Message:
document count mismatch.  control=1827 sum(shards)=1811 cloudClient=1811

Stack Trace:
java.lang.AssertionError: document count mismatch.  control=1827 sum(shards)=1811 cloudClient=1811
	at __randomizedtesting.SeedInfo.seed([888BC74A4ECEACBC:DFF890E032C144]:0)
	at org.junit.Assert.fail(Assert.java:93)
	at org.apache.solr.cloud.AbstractFullDistribZkTestBase.checkShardConsistency(AbstractFullDistribZkTestBase.java:1319)
	at org.apache.solr.cloud.ChaosMonkeyNothingIsSafeTest.test(ChaosMonkeyNothingIsSafeTest.java:231)
	at sun.reflect.NativeMethodAccessorImpl.invoke0(Native Method)
	at sun.reflect.NativeMethodAccessorImpl.invoke(NativeMethodAccessorImpl.java:62)
	at sun.reflect.DelegatingMethodAccessorImpl.invoke(DelegatingMethodAccessorImpl.java:43)
	at java.lang.reflect.Method.invoke(Method.java:498)
	at com.carrotsearch.randomizedtesting.RandomizedRunner.invoke(RandomizedRunner.java:1764)
	at com.carrotsearch.randomizedtesting.RandomizedRunner$8.evaluate(RandomizedRunner.java:871)
	at com.carrotsearch.randomizedtesting.RandomizedRunner$9.evaluate(RandomizedRunner.java:907)
	at com.carrotsearch.randomizedtesting.RandomizedRunner$10.evaluate(RandomizedRunner.java:921)
	at org.apache.solr.BaseDistributedSearchTestCase$ShardsRepeatRule$ShardsFixedStatement.callStatement(BaseDistributedSearchTestCase.java:985)
	at org.apache.solr.BaseDistributedSearchTestCase$ShardsRepeatRule$ShardsStatement.evaluate(BaseDistributedSearchTestCase.java:960)
	at com.carrotsearch.randomizedtesting.rules.SystemPropertiesRestoreRule$1.evaluate(SystemPropertiesRestoreRule.java:57)
	at org.apache.lucene.util.TestRuleSetupTeardownChained$1.evaluate(TestRuleSetupTeardownChained.java:49)
	at org.apache.lucene.util.AbstractBeforeAfterRule$1.evaluate(AbstractBeforeAfterRule.java:45)
	at org.apache.lucene.util.TestRuleThreadAndTestName$1.evaluate(TestRuleThreadAndTestName.java:48)
	at org.apache.lucene.util.TestRuleIgnoreAfterMaxFailures$1.evaluate(TestRuleIgnoreAfterMaxFailures.java:64)
	at org.apache.lucene.util.TestRuleMarkFailure$1.evaluate(TestRuleMarkFailure.java:47)
	at com.carrotsearch.randomizedtesting.rules.StatementAdapter.evaluate(StatementAdapter.java:36)
	at com.carrotsearch.randomizedtesting.ThreadLeakControl$StatementRunner.run(ThreadLeakControl.java:367)
	at com.carrotsearch.randomizedtesting.ThreadLeakControl.forkTimeoutingTask(ThreadLeakControl.java:809)
	at com.carrotsearch.randomizedtesting.ThreadLeakControl$3.evaluate(ThreadLeakControl.java:460)
	at com.carrotsearch.randomizedtesting.RandomizedRunner.runSingleTest(RandomizedRunner.java:880)
	at com.carrotsearch.randomizedtesting.RandomizedRunner$5.evaluate(RandomizedRunner.java:781)
	at com.carrotsearch.randomizedtesting.RandomizedRunner$6.evaluate(RandomizedRunner.java:816)
	at com.carrotsearch.randomizedtesting.RandomizedRunner$7.evaluate(RandomizedRunner.java:827)
	at com.carrotsearch.randomizedtesting.rules.StatementAdapter.evaluate(StatementAdapter.java:36)
	at com.carrotsearch.randomizedtesting.rules.SystemPropertiesRestoreRule$1.evaluate(SystemPropertiesRestoreRule.java:57)
	at org.apache.lucene.util.AbstractBeforeAfterRule$1.evaluate(AbstractBeforeAfterRule.java:45)
	at com.carrotsearch.randomizedtesting.rules.StatementAdapter.evaluate(StatementAdapter.java:36)
	at org.apache.lucene.util.TestRuleStoreClassName$1.evaluate(TestRuleStoreClassName.java:41)
	at com.carrotsearch.randomizedtesting.rules.NoShadowingOrOverridesOnMethodsRule$1.evaluate(NoShadowingOrOverridesOnMethodsRule.java:40)
	at com.carrotsearch.randomizedtesting.rules.NoShadowingOrOverridesOnMethodsRule$1.evaluate(NoShadowingOrOverridesOnMethodsRule.java:40)
	at com.carrotsearch.randomizedtesting.rules.StatementAdapter.evaluate(StatementAdapter.java:36)
	at com.carrotsearch.randomizedtesting.rules.StatementAdapter.evaluate(StatementAdapter.java:36)
	at com.carrotsearch.randomizedtesting.rules.StatementAdapter.evaluate(StatementAdapter.java:36)
	at org.apache.lucene.util.TestRuleAssertionsRequired$1.evaluate(TestRuleAssertionsRequired.java:53)
	at org.apache.lucene.util.TestRuleMarkFailure$1.evaluate(TestRuleMarkFailure.java:47)
	at org.apache.lucene.util.TestRuleIgnoreAfterMaxFailures$1.evaluate(TestRuleIgnoreAfterMaxFailures.java:64)
	at org.apache.lucene.util.TestRuleIgnoreTestSuites$1.evaluate(TestRuleIgnoreTestSuites.java:54)
	at com.carrotsearch.randomizedtesting.rules.StatementAdapter.evaluate(StatementAdapter.java:36)
	at com.carrotsearch.randomizedtesting.ThreadLeakControl$StatementRunner.run(ThreadLeakControl.java:367)
	at java.lang.Thread.run(Thread.java:745)


FAILED:  org.apache.solr.update.HardAutoCommitTest.testCommitWithin

Error Message:
Exception during query

Stack Trace:
java.lang.RuntimeException: Exception during query
	at __randomizedtesting.SeedInfo.seed([888BC74A4ECEACBC:3259A832CDE042A9]:0)
	at org.apache.solr.SolrTestCaseJ4.assertQ(SolrTestCaseJ4.java:785)
	at org.apache.solr.update.HardAutoCommitTest.testCommitWithin(HardAutoCommitTest.java:99)
	at sun.reflect.NativeMethodAccessorImpl.invoke0(Native Method)
	at sun.reflect.NativeMethodAccessorImpl.invoke(NativeMethodAccessorImpl.java:62)
	at sun.reflect.DelegatingMethodAccessorImpl.invoke(DelegatingMethodAccessorImpl.java:43)
	at java.lang.reflect.Method.invoke(Method.java:498)
	at com.carrotsearch.randomizedtesting.RandomizedRunner.invoke(RandomizedRunner.java:1764)
	at com.carrotsearch.randomizedtesting.RandomizedRunner$8.evaluate(RandomizedRunner.java:871)
	at com.carrotsearch.randomizedtesting.RandomizedRunner$9.evaluate(RandomizedRunner.java:907)
	at com.carrotsearch.randomizedtesting.RandomizedRunner$10.evaluate(RandomizedRunner.java:921)
	at com.carrotsearch.randomizedtesting.rules.SystemPropertiesRestoreRule$1.evaluate(SystemPropertiesRestoreRule.java:57)
	at org.apache.lucene.util.TestRuleSetupTeardownChained$1.evaluate(TestRuleSetupTeardownChained.java:49)
	at org.apache.lucene.util.AbstractBeforeAfterRule$1.evaluate(AbstractBeforeAfterRule.java:45)
	at org.apache.lucene.util.TestRuleThreadAndTestName$1.evaluate(TestRuleThreadAndTestName.java:48)
	at org.apache.lucene.util.TestRuleIgnoreAfterMaxFailures$1.evaluate(TestRuleIgnoreAfterMaxFailures.java:64)
	at org.apache.lucene.util.TestRuleMarkFailure$1.evaluate(TestRuleMarkFailure.java:47)
	at com.carrotsearch.randomizedtesting.rules.StatementAdapter.evaluate(StatementAdapter.java:36)
	at com.carrotsearch.randomizedtesting.ThreadLeakControl$StatementRunner.run(ThreadLeakControl.java:367)
	at com.carrotsearch.randomizedtesting.ThreadLeakControl.forkTimeoutingTask(ThreadLeakControl.java:809)
	at com.carrotsearch.randomizedtesting.ThreadLeakControl$3.evaluate(ThreadLeakControl.java:460)
	at com.carrotsearch.randomizedtesting.RandomizedRunner.runSingleTest(RandomizedRunner.java:880)
	at com.carrotsearch.randomizedtesting.RandomizedRunner$5.evaluate(RandomizedRunner.java:781)
	at com.carrotsearch.randomizedtesting.RandomizedRunner$6.evaluate(RandomizedRunner.java:816)
	at com.carrotsearch.randomizedtesting.RandomizedRunner$7.evaluate(RandomizedRunner.java:827)
	at com.carrotsearch.randomizedtesting.rules.StatementAdapter.evaluate(StatementAdapter.java:36)
	at com.carrotsearch.randomizedtesting.rules.SystemPropertiesRestoreRule$1.evaluate(SystemPropertiesRestoreRule.java:57)
	at org.apache.lucene.util.AbstractBeforeAfterRule$1.evaluate(AbstractBeforeAfterRule.java:45)
	at com.carrotsearch.randomizedtesting.rules.StatementAdapter.evaluate(StatementAdapter.java:36)
	at org.apache.lucene.util.TestRuleStoreClassName$1.evaluate(TestRuleStoreClassName.java:41)
	at com.carrotsearch.randomizedtesting.rules.NoShadowingOrOverridesOnMethodsRule$1.evaluate(NoShadowingOrOverridesOnMethodsRule.java:40)
	at com.carrotsearch.randomizedtesting.rules.NoShadowingOrOverridesOnMethodsRule$1.evaluate(NoShadowingOrOverridesOnMethodsRule.java:40)
	at com.carrotsearch.randomizedtesting.rules.StatementAdapter.evaluate(StatementAdapter.java:36)
	at com.carrotsearch.randomizedtesting.rules.StatementAdapter.evaluate(StatementAdapter.java:36)
	at com.carrotsearch.randomizedtesting.rules.StatementAdapter.evaluate(StatementAdapter.java:36)
	at org.apache.lucene.util.TestRuleAssertionsRequired$1.evaluate(TestRuleAssertionsRequired.java:53)
	at org.apache.lucene.util.TestRuleMarkFailure$1.evaluate(TestRuleMarkFailure.java:47)
	at org.apache.lucene.util.TestRuleIgnoreAfterMaxFailures$1.evaluate(TestRuleIgnoreAfterMaxFailures.java:64)
	at org.apache.lucene.util.TestRuleIgnoreTestSuites$1.evaluate(TestRuleIgnoreTestSuites.java:54)
	at com.carrotsearch.randomizedtesting.rules.StatementAdapter.evaluate(StatementAdapter.java:36)
	at com.carrotsearch.randomizedtesting.ThreadLeakControl$StatementRunner.run(ThreadLeakControl.java:367)
	at java.lang.Thread.run(Thread.java:745)
Caused by: java.lang.RuntimeException: REQUEST FAILED: xpath=//result[@numFound=1]
	xml response was: <?xml version="1.0" encoding="UTF-8"?>
<response>
<lst name="responseHeader"><int name="status">0</int><int name="QTime">0</int></lst><result name="response" numFound="0" start="0"></result>
</response>

	request was:q=id:529&qt=standard&start=0&rows=20&version=2.2
	at org.apache.solr.SolrTestCaseJ4.assertQ(SolrTestCaseJ4.java:778)
	... 40 more




Build Log:
[...truncated 11565 lines...]
   [junit4] Suite: org.apache.solr.update.HardAutoCommitTest
   [junit4]   2> Creating dataDir: /x1/jenkins/jenkins-slave/workspace/Lucene-Solr-Tests-master/solr/build/solr-core/test/J2/temp/solr.update.HardAutoCommitTest_888BC74A4ECEACBC-001/init-core-data-001
   [junit4]   2> 1257572 INFO  (SUITE-HardAutoCommitTest-seed#[888BC74A4ECEACBC]-worker) [    ] o.a.s.SolrTestCaseJ4 Randomized ssl (false) and clientAuth (true)
   [junit4]   2> 1257577 INFO  (SUITE-HardAutoCommitTest-seed#[888BC74A4ECEACBC]-worker) [    ] o.a.s.SolrTestCaseJ4 ####initCore
   [junit4]   2> 1257577 INFO  (SUITE-HardAutoCommitTest-seed#[888BC74A4ECEACBC]-worker) [    ] o.a.s.c.SolrResourceLoader new SolrResourceLoader for directory: '/x1/jenkins/jenkins-slave/workspace/Lucene-Solr-Tests-master/solr/core/src/test-files/solr/collection1'
   [junit4]   2> 1257577 INFO  (SUITE-HardAutoCommitTest-seed#[888BC74A4ECEACBC]-worker) [    ] o.a.s.c.SolrResourceLoader JNDI not configured for solr (NoInitialContextEx)
   [junit4]   2> 1257577 INFO  (SUITE-HardAutoCommitTest-seed#[888BC74A4ECEACBC]-worker) [    ] o.a.s.c.SolrResourceLoader using system property solr.solr.home: /x1/jenkins/jenkins-slave/workspace/Lucene-Solr-Tests-master/solr/core/src/test-files/solr
   [junit4]   2> 1257577 INFO  (SUITE-HardAutoCommitTest-seed#[888BC74A4ECEACBC]-worker) [    ] o.a.s.c.SolrResourceLoader Adding 'file:/x1/jenkins/jenkins-slave/workspace/Lucene-Solr-Tests-master/solr/core/src/test-files/solr/collection1/lib/classes/' to classloader
   [junit4]   2> 1257577 INFO  (SUITE-HardAutoCommitTest-seed#[888BC74A4ECEACBC]-worker) [    ] o.a.s.c.SolrResourceLoader Adding 'file:/x1/jenkins/jenkins-slave/workspace/Lucene-Solr-Tests-master/solr/core/src/test-files/solr/collection1/lib/README' to classloader
   [junit4]   2> 1257611 INFO  (SUITE-HardAutoCommitTest-seed#[888BC74A4ECEACBC]-worker) [    ] o.a.s.c.SolrConfig current version of requestparams : -1
   [junit4]   2> 1257625 INFO  (SUITE-HardAutoCommitTest-seed#[888BC74A4ECEACBC]-worker) [    ] o.a.s.c.SolrConfig Using Lucene MatchVersion: 7.0.0
   [junit4]   2> 1257651 INFO  (SUITE-HardAutoCommitTest-seed#[888BC74A4ECEACBC]-worker) [    ] o.a.s.c.SolrConfig Loaded SolrConfig: solrconfig.xml
   [junit4]   2> 1257719 INFO  (SUITE-HardAutoCommitTest-seed#[888BC74A4ECEACBC]-worker) [    ] o.a.s.s.IndexSchema [null] Schema name=test
   [junit4]   2> 1258047 INFO  (SUITE-HardAutoCommitTest-seed#[888BC74A4ECEACBC]-worker) [    ] o.a.s.s.OpenExchangeRatesOrgProvider Initialized with rates=open-exchange-rates.json, refreshInterval=1440.
   [junit4]   2> 1258051 INFO  (SUITE-HardAutoCommitTest-seed#[888BC74A4ECEACBC]-worker) [    ] o.a.s.s.IndexSchema default search field in schema is text
   [junit4]   2> 1258052 INFO  (SUITE-HardAutoCommitTest-seed#[888BC74A4ECEACBC]-worker) [    ] o.a.s.s.IndexSchema unique key field: id
   [junit4]   2> 1258069 INFO  (SUITE-HardAutoCommitTest-seed#[888BC74A4ECEACBC]-worker) [    ] o.a.s.s.FileExchangeRateProvider Reloading exchange rates from file currency.xml
   [junit4]   2> 1258070 INFO  (SUITE-HardAutoCommitTest-seed#[888BC74A4ECEACBC]-worker) [    ] o.a.s.s.FileExchangeRateProvider Reloading exchange rates from file currency.xml
   [junit4]   2> 1258071 INFO  (SUITE-HardAutoCommitTest-seed#[888BC74A4ECEACBC]-worker) [    ] o.a.s.s.OpenExchangeRatesOrgProvider Reloading exchange rates from open-exchange-rates.json
   [junit4]   2> 1258071 INFO  (SUITE-HardAutoCommitTest-seed#[888BC74A4ECEACBC]-worker) [    ] o.a.s.s.OpenExchangeRatesOrgProvider Reloading exchange rates from open-exchange-rates.json
   [junit4]   2> 1258071 INFO  (SUITE-HardAutoCommitTest-seed#[888BC74A4ECEACBC]-worker) [    ] o.a.s.c.SolrResourceLoader JNDI not configured for solr (NoInitialContextEx)
   [junit4]   2> 1258072 INFO  (SUITE-HardAutoCommitTest-seed#[888BC74A4ECEACBC]-worker) [    ] o.a.s.c.SolrResourceLoader using system property solr.solr.home: /x1/jenkins/jenkins-slave/workspace/Lucene-Solr-Tests-master/solr/core/src/test-files/solr
   [junit4]   2> 1258072 INFO  (SUITE-HardAutoCommitTest-seed#[888BC74A4ECEACBC]-worker) [    ] o.a.s.c.SolrResourceLoader new SolrResourceLoader for directory: '/x1/jenkins/jenkins-slave/workspace/Lucene-Solr-Tests-master/solr/core/src/test-files/solr'
   [junit4]   2> 1258072 INFO  (SUITE-HardAutoCommitTest-seed#[888BC74A4ECEACBC]-worker) [    ] o.a.s.c.SolrResourceLoader JNDI not configured for solr (NoInitialContextEx)
   [junit4]   2> 1258072 INFO  (SUITE-HardAutoCommitTest-seed#[888BC74A4ECEACBC]-worker) [    ] o.a.s.c.SolrResourceLoader using system property solr.solr.home: /x1/jenkins/jenkins-slave/workspace/Lucene-Solr-Tests-master/solr/core/src/test-files/solr
   [junit4]   2> 1258072 INFO  (SUITE-HardAutoCommitTest-seed#[888BC74A4ECEACBC]-worker) [    ] o.a.s.c.CoreContainer New CoreContainer 822825293
   [junit4]   2> 1258072 INFO  (SUITE-HardAutoCommitTest-seed#[888BC74A4ECEACBC]-worker) [    ] o.a.s.c.CoreContainer Loading cores into CoreContainer [instanceDir=/x1/jenkins/jenkins-slave/workspace/Lucene-Solr-Tests-master/solr/core/src/test-files/solr]
   [junit4]   2> 1258072 WARN  (SUITE-HardAutoCommitTest-seed#[888BC74A4ECEACBC]-worker) [    ] o.a.s.c.CoreContainer Couldn't add files from /x1/jenkins/jenkins-slave/workspace/Lucene-Solr-Tests-master/solr/core/src/test-files/solr/lib to classpath: /x1/jenkins/jenkins-slave/workspace/Lucene-Solr-Tests-master/solr/core/src/test-files/solr/lib
   [junit4]   2> 1258072 INFO  (SUITE-HardAutoCommitTest-seed#[888BC74A4ECEACBC]-worker) [    ] o.a.s.h.c.HttpShardHandlerFactory created with socketTimeout : 600000,connTimeout : 60000,maxConnectionsPerHost : 20,maxConnections : 10000,corePoolSize : 0,maximumPoolSize : 2147483647,maxThreadIdleTime : 5,sizeOfQueue : -1,fairnessPolicy : false,
   [junit4]   2> 1258089 INFO  (SUITE-HardAutoCommitTest-seed#[888BC74A4ECEACBC]-worker) [    ] o.a.s.u.UpdateShardHandler Creating UpdateShardHandler HTTP client with params: 
   [junit4]   2> 1258096 INFO  (SUITE-HardAutoCommitTest-seed#[888BC74A4ECEACBC]-worker) [    ] o.a.s.l.LogWatcher SLF4J impl is org.slf4j.impl.Log4jLoggerFactory
   [junit4]   2> 1258096 INFO  (SUITE-HardAutoCommitTest-seed#[888BC74A4ECEACBC]-worker) [    ] o.a.s.l.LogWatcher Registering Log Listener [Log4j (org.slf4j.impl.Log4jLoggerFactory)]
   [junit4]   2> 1258096 INFO  (SUITE-HardAutoCommitTest-seed#[888BC74A4ECEACBC]-worker) [    ] o.a.s.c.CoreContainer Security conf doesn't exist. Skipping setup for authorization module.
   [junit4]   2> 1258096 INFO  (SUITE-HardAutoCommitTest-seed#[888BC74A4ECEACBC]-worker) [    ] o.a.s.c.CoreContainer No authentication plugin used.
   [junit4]   2> 1258097 INFO  (SUITE-HardAutoCommitTest-seed#[888BC74A4ECEACBC]-worker) [    ] o.a.s.c.CoreDescriptor Created CoreDescriptor: {name=collection1, config=solrconfig.xml, transient=false, schema=schema.xml, loadOnStartup=true, configSetProperties=configsetprops.json, collection=collection1, dataDir=/x1/jenkins/jenkins-slave/workspace/Lucene-Solr-Tests-master/solr/build/solr-core/test/J2/temp/solr.update.HardAutoCommitTest_888BC74A4ECEACBC-001/init-core-data-001, shard=shard1}
   [junit4]   2> 1258111 INFO  (coreLoadExecutor-5011-thread-1) [    ] o.a.s.c.SolrResourceLoader new SolrResourceLoader for directory: '/x1/jenkins/jenkins-slave/workspace/Lucene-Solr-Tests-master/solr/core/src/test-files/solr/collection1'
   [junit4]   2> 1258122 INFO  (coreLoadExecutor-5011-thread-1) [    ] o.a.s.c.SolrResourceLoader JNDI not configured for solr (NoInitialContextEx)
   [junit4]   2> 1258122 INFO  (coreLoadExecutor-5011-thread-1) [    ] o.a.s.c.SolrResourceLoader using system property solr.solr.home: /x1/jenkins/jenkins-slave/workspace/Lucene-Solr-Tests-master/solr/core/src/test-files/solr
   [junit4]   2> 1258123 INFO  (coreLoadExecutor-5011-thread-1) [    ] o.a.s.c.SolrResourceLoader Adding 'file:/x1/jenkins/jenkins-slave/workspace/Lucene-Solr-Tests-master/solr/core/src/test-files/solr/collection1/lib/classes/' to classloader
   [junit4]   2> 1258123 INFO  (coreLoadExecutor-5011-thread-1) [    ] o.a.s.c.SolrResourceLoader Adding 'file:/x1/jenkins/jenkins-slave/workspace/Lucene-Solr-Tests-master/solr/core/src/test-files/solr/collection1/lib/README' to classloader
   [junit4]   2> 1258157 INFO  (coreLoadExecutor-5011-thread-1) [    ] o.a.s.c.SolrConfig current version of requestparams : -1
   [junit4]   2> 1258168 INFO  (coreLoadExecutor-5011-thread-1) [    ] o.a.s.c.SolrConfig Using Lucene MatchVersion: 7.0.0
   [junit4]   2> 1258190 INFO  (coreLoadExecutor-5011-thread-1) [    ] o.a.s.c.SolrConfig Loaded SolrConfig: solrconfig.xml
   [junit4]   2> 1258211 INFO  (coreLoadExecutor-5011-thread-1) [    ] o.a.s.s.IndexSchema [collection1] Schema name=test
   [junit4]   2> 1258781 INFO  (coreLoadExecutor-5011-thread-1) [    ] o.a.s.s.OpenExchangeRatesOrgProvider Initialized with rates=open-exchange-rates.json, refreshInterval=1440.
   [junit4]   2> 1258929 INFO  (coreLoadExecutor-5011-thread-1) [    ] o.a.s.s.IndexSchema default search field in schema is text
   [junit4]   2> 1258930 INFO  (coreLoadExecutor-5011-thread-1) [    ] o.a.s.s.IndexSchema unique key field: id
   [junit4]   2> 1258932 INFO  (coreLoadExecutor-5011-thread-1) [    ] o.a.s.s.FileExchangeRateProvider Reloading exchange rates from file currency.xml
   [junit4]   2> 1258933 INFO  (coreLoadExecutor-5011-thread-1) [    ] o.a.s.s.FileExchangeRateProvider Reloading exchange rates from file currency.xml
   [junit4]   2> 1258934 INFO  (coreLoadExecutor-5011-thread-1) [    ] o.a.s.s.OpenExchangeRatesOrgProvider Reloading exchange rates from open-exchange-rates.json
   [junit4]   2> 1258934 INFO  (coreLoadExecutor-5011-thread-1) [    ] o.a.s.s.OpenExchangeRatesOrgProvider Reloading exchange rates from open-exchange-rates.json
   [junit4]   2> 1258935 INFO  (coreLoadExecutor-5011-thread-1) [    ] o.a.s.c.ConfigSetProperties Did not find ConfigSet properties, assuming default properties: Can't find resource 'configsetprops.json' in classpath or '/x1/jenkins/jenkins-slave/workspace/Lucene-Solr-Tests-master/solr/core/src/test-files/solr/collection1'
   [junit4]   2> 1258935 INFO  (coreLoadExecutor-5011-thread-1) [    ] o.a.s.c.CoreContainer Creating SolrCore 'collection1' using configuration from instancedir /x1/jenkins/jenkins-slave/workspace/Lucene-Solr-Tests-master/solr/core/src/test-files/solr/collection1
   [junit4]   2> 1258935 INFO  (coreLoadExecutor-5011-thread-1) [    x:collection1] o.a.s.c.SolrCore org.apache.solr.core.MockDirectoryFactory
   [junit4]   2> 1258936 INFO  (coreLoadExecutor-5011-thread-1) [    x:collection1] o.a.s.c.SolrCore [[collection1] ] Opening new SolrCore at [/x1/jenkins/jenkins-slave/workspace/Lucene-Solr-Tests-master/solr/core/src/test-files/solr/collection1], dataDir=[/x1/jenkins/jenkins-slave/workspace/Lucene-Solr-Tests-master/solr/build/solr-core/test/J2/temp/solr.update.HardAutoCommitTest_888BC74A4ECEACBC-001/init-core-data-001/]
   [junit4]   2> 1258936 INFO  (coreLoadExecutor-5011-thread-1) [    x:collection1] o.a.s.c.JmxMonitoredMap JMX monitoring is enabled. Adding Solr mbeans to JMX Server: com.sun.jmx.mbeanserver.JmxMBeanServer@5b170d58
   [junit4]   2> 1258936 INFO  (coreLoadExecutor-5011-thread-1) [    x:collection1] o.a.s.c.CachingDirectoryFactory return new directory for /x1/jenkins/jenkins-slave/workspace/Lucene-Solr-Tests-master/solr/build/solr-core/test/J2/temp/solr.update.HardAutoCommitTest_888BC74A4ECEACBC-001/init-core-data-001
   [junit4]   2> 1258936 INFO  (coreLoadExecutor-5011-thread-1) [    x:collection1] o.a.s.c.SolrCore New index directory detected: old=null new=/x1/jenkins/jenkins-slave/workspace/Lucene-Solr-Tests-master/solr/build/solr-core/test/J2/temp/solr.update.HardAutoCommitTest_888BC74A4ECEACBC-001/init-core-data-001/index/
   [junit4]   2> 1258936 WARN  (coreLoadExecutor-5011-thread-1) [    x:collection1] o.a.s.c.SolrCore [collection1] Solr index directory '/x1/jenkins/jenkins-slave/workspace/Lucene-Solr-Tests-master/solr/build/solr-core/test/J2/temp/solr.update.HardAutoCommitTest_888BC74A4ECEACBC-001/init-core-data-001/index' doesn't exist. Creating new index...
   [junit4]   2> 1258936 INFO  (coreLoadExecutor-5011-thread-1) [    x:collection1] o.a.s.c.CachingDirectoryFactory return new directory for /x1/jenkins/jenkins-slave/workspace/Lucene-Solr-Tests-master/solr/build/solr-core/test/J2/temp/solr.update.HardAutoCommitTest_888BC74A4ECEACBC-001/init-core-data-001/index
   [junit4]   2> 1258936 INFO  (coreLoadExecutor-5011-thread-1) [    x:collection1] o.a.s.u.RandomMergePolicy RandomMergePolicy wrapping class org.apache.lucene.index.TieredMergePolicy: [TieredMergePolicy: maxMergeAtOnce=14, maxMergeAtOnceExplicit=12, maxMergedSegmentMB=87.9375, floorSegmentMB=0.857421875, forceMergeDeletesPctAllowed=3.0151588247380188, segmentsPerTier=14.0, maxCFSSegmentSizeMB=8.796093022207999E12, noCFSRatio=0.14398869251500096
   [junit4]   2> 1258937 INFO  (coreLoadExecutor-5011-thread-1) [    x:collection1] o.a.s.c.SolrDeletionPolicy SolrDeletionPolicy.onCommit: commits: num=1
   [junit4]   2> 	commit{dir=MockDirectoryWrapper(RAMDirectory@7a027a2a lockFactory=org.apache.lucene.store.SingleInstanceLockFactory@122f4014),segFN=segments_1,generation=1}
   [junit4]   2> 1258937 INFO  (coreLoadExecutor-5011-thread-1) [    x:collection1] o.a.s.c.SolrDeletionPolicy newest commit generation = 1
   [junit4]   2> 1258939 INFO  (coreLoadExecutor-5011-thread-1) [    x:collection1] o.a.s.u.p.UpdateRequestProcessorChain creating updateRequestProcessorChain "dedupe"
   [junit4]   2> 1258939 INFO  (coreLoadExecutor-5011-thread-1) [    x:collection1] o.a.s.u.p.UpdateRequestProcessorChain inserting DistributedUpdateProcessorFactory into updateRequestProcessorChain "dedupe"
   [junit4]   2> 1258939 INFO  (coreLoadExecutor-5011-thread-1) [    x:collection1] o.a.s.u.p.UpdateRequestProcessorChain creating updateRequestProcessorChain "dedupe-allfields"
   [junit4]   2> 1258939 INFO  (coreLoadExecutor-5011-thread-1) [    x:collection1] o.a.s.u.p.UpdateRequestProcessorChain inserting DistributedUpdateProcessorFactory into updateRequestProcessorChain "dedupe-allfields"
   [junit4]   2> 1258939 INFO  (coreLoadExecutor-5011-thread-1) [    x:collection1] o.a.s.u.p.UpdateRequestProcessorChain creating updateRequestProcessorChain "stored_sig"
   [junit4]   2> 1258940 INFO  (coreLoadExecutor-5011-thread-1) [    x:collection1] o.a.s.u.p.UpdateRequestProcessorChain inserting DistributedUpdateProcessorFactory into updateRequestProcessorChain "stored_sig"
   [junit4]   2> 1258940 INFO  (coreLoadExecutor-5011-thread-1) [    x:collection1] o.a.s.u.p.UpdateRequestProcessorChain creating updateRequestProcessorChain "uniq-fields"
   [junit4]   2> 1258940 INFO  (coreLoadExecutor-5011-thread-1) [    x:collection1] o.a.s.u.p.UpdateRequestProcessorChain inserting DistributedUpdateProcessorFactory into updateRequestProcessorChain "uniq-fields"
   [junit4]   2> 1258940 INFO  (coreLoadExecutor-5011-thread-1) [    x:collection1] o.a.s.u.p.UpdateRequestProcessorChain creating updateRequestProcessorChain "distrib-dup-test-chain-explicit"
   [junit4]   2> 1258940 INFO  (coreLoadExecutor-5011-thread-1) [    x:collection1] o.a.s.u.p.UpdateRequestProcessorChain creating updateRequestProcessorChain "distrib-dup-test-chain-implicit"
   [junit4]   2> 1258940 INFO  (coreLoadExecutor-5011-thread-1) [    x:collection1] o.a.s.u.p.UpdateRequestProcessorChain inserting DistributedUpdateProcessorFactory into updateRequestProcessorChain "distrib-dup-test-chain-implicit"
   [junit4]   2> 1258940 INFO  (coreLoadExecutor-5011-thread-1) [    x:collection1] o.a.s.c.SolrCore no updateRequestProcessorChain defined as default, creating implicit default
   [junit4]   2> 1258941 INFO  (coreLoadExecutor-5011-thread-1) [    x:collection1] o.a.s.h.l.XMLLoader xsltCacheLifetimeSeconds=60
   [junit4]   2> 1258942 INFO  (coreLoadExecutor-5011-thread-1) [    x:collection1] o.a.s.h.l.XMLLoader xsltCacheLifetimeSeconds=60
   [junit4]   2> 1258942 INFO  (coreLoadExecutor-5011-thread-1) [    x:collection1] o.a.s.h.l.XMLLoader xsltCacheLifetimeSeconds=60
   [junit4]   2> 1258943 INFO  (coreLoadExecutor-5011-thread-1) [    x:collection1] o.a.s.h.l.XMLLoader xsltCacheLifetimeSeconds=60
   [junit4]   2> 1258945 INFO  (coreLoadExecutor-5011-thread-1) [    x:collection1] o.a.s.c.PluginBag requestHandler : 'lazy' created with startup=lazy 
   [junit4]   2> 1258946 INFO  (coreLoadExecutor-5011-thread-1) [    x:collection1] o.a.s.c.RequestHandlers Registered paths: /admin/mbeans,standard,spellCheckCompRH,lazy,/update/json/docs,/admin/luke,/export,spellCheckWithWordbreak_Direct,tvrh,/get,/admin/properties,/update/json,mltrh,/admin/threads,/search-facet-def,/update/csv,/sql,/graph,/search-facet-invariants,/admin/segments,spellCheckCompRH1,/mlt,/admin/system,/replication,dismax,defaults,/config,/stream,/schema,/admin/plugins,/admin/logging,spellCheckWithWordbreak,mock,/admin/ping,/update,/admin/file,/terms,spellCheckCompRH_Direct,/debug/dump
   [junit4]   2> 1258946 INFO  (coreLoadExecutor-5011-thread-1) [    x:collection1] o.a.s.c.SolrCore Using default statsCache cache: org.apache.solr.search.stats.LocalStatsCache
   [junit4]   2> 1258946 INFO  (OldIndexDirectoryCleanupThreadForCore-collection1) [    x:collection1] o.a.s.c.SolrCore Looking for old index directories to cleanup for core collection1 in /x1/jenkins/jenkins-slave/workspace/Lucene-Solr-Tests-master/solr/build/solr-core/test/J2/temp/solr.update.HardAutoCommitTest_888BC74A4ECEACBC-001/init-core-data-001/
   [junit4]   2> 1258951 INFO  (coreLoadExecutor-5011-thread-1) [    x:collection1] o.a.s.u.UpdateHandler Using UpdateLog implementation: org.apache.solr.update.UpdateLog
   [junit4]   2> 1258952 INFO  (coreLoadExecutor-5011-thread-1) [    x:collection1] o.a.s.u.UpdateLog Initializing UpdateLog: dataDir= defaultSyncLevel=FLUSH numRecordsToKeep=100 maxNumLogsToKeep=10 numVersionBuckets=65536
   [junit4]   2> 1258952 INFO  (coreLoadExecutor-5011-thread-1) [    x:collection1] o.a.s.u.CommitTracker Hard AutoCommit: disabled
   [junit4]   2> 1258952 INFO  (coreLoadExecutor-5011-thread-1) [    x:collection1] o.a.s.u.CommitTracker Soft AutoCommit: disabled
   [junit4]   2> 1258952 INFO  (coreLoadExecutor-5011-thread-1) [    x:collection1] o.a.s.u.RandomMergePolicy RandomMergePolicy wrapping class org.apache.lucene.index.TieredMergePolicy: [TieredMergePolicy: maxMergeAtOnce=17, maxMergeAtOnceExplicit=43, maxMergedSegmentMB=1.998046875, floorSegmentMB=0.9619140625, forceMergeDeletesPctAllowed=14.470222042114248, segmentsPerTier=19.0, maxCFSSegmentSizeMB=8.796093022207999E12, noCFSRatio=0.0
   [junit4]   2> 1258953 INFO  (coreLoadExecutor-5011-thread-1) [    x:collection1] o.a.s.c.SolrDeletionPolicy SolrDeletionPolicy.onInit: commits: num=1
   [junit4]   2> 	commit{dir=MockDirectoryWrapper(RAMDirectory@7a027a2a lockFactory=org.apache.lucene.store.SingleInstanceLockFactory@122f4014),segFN=segments_1,generation=1}
   [junit4]   2> 1258953 INFO  (coreLoadExecutor-5011-thread-1) [    x:collection1] o.a.s.c.SolrDeletionPolicy newest commit generation = 1
   [junit4]   2> 1258953 INFO  (coreLoadExecutor-5011-thread-1) [    x:collection1] o.a.s.s.SolrIndexSearcher Opening [Searcher@254307d8[collection1] main]
   [junit4]   2> 1258953 INFO  (coreLoadExecutor-5011-thread-1) [    x:collection1] o.a.s.r.RestManager Initializing RestManager with initArgs: {storageIO=org.apache.solr.rest.ManagedResourceStorage$InMemoryStorageIO}
   [junit4]   2> 1258953 INFO  (coreLoadExecutor-5011-thread-1) [    x:collection1] o.a.s.r.ManagedResourceStorage Reading _rest_managed.json using InMemoryStorage
   [junit4]   2> 1258953 INFO  (coreLoadExecutor-5011-thread-1) [    x:collection1] o.a.s.r.RestManager Initializing 0 registered ManagedResources
   [junit4]   2> 1258953 INFO  (coreLoadExecutor-5011-thread-1) [    x:collection1] o.a.s.h.c.SpellCheckComponent Initializing spell checkers
   [junit4]   2> 1258959 INFO  (coreLoadExecutor-5011-thread-1) [    x:collection1] o.a.s.s.DirectSolrSpellChecker init: {name=direct,classname=DirectSolrSpellChecker,field=lowerfilt,minQueryLength=3}
   [junit4]   2> 1258984 INFO  (coreLoadExecutor-5011-thread-1) [    x:collection1] o.a.s.h.ReplicationHandler Commits will be reserved for  10000
   [junit4]   2> 1258985 INFO  (coreLoadExecutor-5011-thread-1) [    x:collection1] o.a.s.u.UpdateLog Looking up max value of version field to seed version buckets
   [junit4]   2> 1258985 INFO  (coreLoadExecutor-5011-thread-1) [    x:collection1] o.a.s.u.VersionInfo Refreshing highest value of _version_ for 65536 version buckets from index
   [junit4]   2> 1258985 INFO  (coreLoadExecutor-5011-thread-1) [    x:collection1] o.a.s.u.VersionInfo No terms found for _version_, cannot seed version bucket highest value from index
   [junit4]   2> 1258985 INFO  (coreLoadExecutor-5011-thread-1) [    x:collection1] o.a.s.u.UpdateLog Could not find max version in index or recent updates, using new clock 1534507487074451456
   [junit4]   2> 1258987 INFO  (coreLoadExecutor-5011-thread-1) [    x:collection1] o.a.s.u.UpdateLog Took 1.0ms to seed version buckets with highest version 1534507487074451456
   [junit4]   2> 1258987 INFO  (coreLoadExecutor-5011-thread-1) [    x:collection1] o.a.s.c.CoreContainer registering core: collection1
   [junit4]   2> 1258987 INFO  (searcherExecutor-5012-thread-1-processing-x:collection1) [    x:collection1] o.a.s.h.c.SpellCheckComponent Loading spell index for spellchecker: default
   [junit4]   2> 1258987 INFO  (searcherExecutor-5012-thread-1-processing-x:collection1) [    x:collection1] o.a.s.h.c.SpellCheckComponent Loading spell index for spellchecker: direct
   [junit4]   2> 1258987 INFO  (searcherExecutor-5012-thread-1-processing-x:collection1) [    x:collection1] o.a.s.h.c.SpellCheckComponent Loading spell index for spellchecker: wordbreak
   [junit4]   2> 1258987 INFO  (searcherExecutor-5012-thread-1-processing-x:collection1) [    x:collection1] o.a.s.h.c.SpellCheckComponent Loading spell index for spellchecker: multipleFields
   [junit4]   2> 1258987 INFO  (searcherExecutor-5012-thread-1-processing-x:collection1) [    x:collection1] o.a.s.h.c.SpellCheckComponent Loading spell index for spellchecker: jarowinkler
   [junit4]   2> 1258988 INFO  (searcherExecutor-5012-thread-1-processing-x:collection1) [    x:collection1] o.a.s.h.c.SpellCheckComponent Loading spell index for spellchecker: external
   [junit4]   2> 1258988 INFO  (searcherExecutor-5012-thread-1-processing-x:collection1) [    x:collection1] o.a.s.h.c.SpellCheckComponent Loading spell index for spellchecker: freq
   [junit4]   2> 1258988 INFO  (searcherExecutor-5012-thread-1-processing-x:collection1) [    x:collection1] o.a.s.h.c.SpellCheckComponent Loading spell index for spellchecker: fqcn
   [junit4]   2> 1258988 INFO  (searcherExecutor-5012-thread-1-processing-x:collection1) [    x:collection1] o.a.s.h.c.SpellCheckComponent Loading spell index for spellchecker: perDict
   [junit4]   2> 1258993 INFO  (searcherExecutor-5012-thread-1-processing-x:collection1) [    x:collection1] o.a.s.c.SolrCore [collection1] Registered new searcher Searcher@254307d8[collection1] main{ExitableDirectoryReader(UninvertingDirectoryReader())}
   [junit4]   2> 1258997 INFO  (SUITE-HardAutoCommitTest-seed#[888BC74A4ECEACBC]-worker) [    ] o.a.s.SolrTestCaseJ4 ####initCore end
   [junit4]   2> 1259001 INFO  (TEST-HardAutoCommitTest.testCommitWithin-seed#[888BC74A4ECEACBC]) [    ] o.a.s.SolrTestCaseJ4 ###Starting testCommitWithin
   [junit4]   2> 1259002 INFO  (TEST-HardAutoCommitTest.testCommitWithin-seed#[888BC74A4ECEACBC]) [    ] o.a.s.u.p.LogUpdateProcessorFactory [collection1]  webapp=null path=null params={}{deleteByQuery=*:* (-1534507487091228672)} 0 1
   [junit4]   2> 1259003 INFO  (TEST-HardAutoCommitTest.testCommitWithin-seed#[888BC74A4ECEACBC]) [    ] o.a.s.c.SolrResourceLoader new SolrResourceLoader for directory: '/x1/jenkins/jenkins-slave/workspace/Lucene-Solr-Tests-master/solr/core/src/test-files/solr/collection1'
   [junit4]   2> 1259003 INFO  (TEST-HardAutoCommitTest.testCommitWithin-seed#[888BC74A4ECEACBC]) [    ] o.a.s.c.SolrResourceLoader JNDI not configured for solr (NoInitialContextEx)
   [junit4]   2> 1259004 INFO  (TEST-HardAutoCommitTest.testCommitWithin-seed#[888BC74A4ECEACBC]) [    ] o.a.s.c.SolrResourceLoader using system property solr.solr.home: /x1/jenkins/jenkins-slave/workspace/Lucene-Solr-Tests-master/solr/core/src/test-files/solr
   [junit4]   2> 1259004 INFO  (TEST-HardAutoCommitTest.testCommitWithin-seed#[888BC74A4ECEACBC]) [    ] o.a.s.c.SolrResourceLoader Adding 'file:/x1/jenkins/jenkins-slave/workspace/Lucene-Solr-Tests-master/solr/core/src/test-files/solr/collection1/lib/classes/' to classloader
   [junit4]   2> 1259004 INFO  (TEST-HardAutoCommitTest.testCommitWithin-seed#[888BC74A4ECEACBC]) [    ] o.a.s.c.SolrResourceLoader Adding 'file:/x1/jenkins/jenkins-slave/workspace/Lucene-Solr-Tests-master/solr/core/src/test-files/solr/collection1/lib/README' to classloader
   [junit4]   2> 1259047 INFO  (TEST-HardAutoCommitTest.testCommitWithin-seed#[888BC74A4ECEACBC]) [    ] o.a.s.c.SolrConfig current version of requestparams : -1
   [junit4]   2> 1259101 INFO  (TEST-HardAutoCommitTest.testCommitWithin-seed#[888BC74A4ECEACBC]) [    ] o.a.s.c.SolrConfig Using Lucene MatchVersion: 7.0.0
   [junit4]   2> 1259116 INFO  (TEST-HardAutoCommitTest.testCommitWithin-seed#[888BC74A4ECEACBC]) [    ] o.a.s.c.SolrConfig Loaded SolrConfig: solrconfig.xml
   [junit4]   2> 1259186 INFO  (TEST-HardAutoCommitTest.testCommitWithin-seed#[888BC74A4ECEACBC]) [    ] o.a.s.s.IndexSchema [collection1] Schema name=test
   [junit4]   2> 1259268 INFO  (TEST-HardAutoCommitTest.testCommitWithin-seed#[888BC74A4ECEACBC]) [    ] o.a.s.s.OpenExchangeRatesOrgProvider Initialized with rates=open-exchange-rates.json, refreshInterval=1440.
   [junit4]   2> 1259272 INFO  (TEST-HardAutoCommitTest.testCommitWithin-seed#[888BC74A4ECEACBC]) [    ] o.a.s.s.IndexSchema default search field in schema is text
   [junit4]   2> 1259273 INFO  (TEST-HardAutoCommitTest.testCommitWithin-seed#[888BC74A4ECEACBC]) [    ] o.a.s.s.IndexSchema unique key field: id
   [junit4]   2> 1259275 INFO  (TEST-HardAutoCommitTest.testCommitWithin-seed#[888BC74A4ECEACBC]) [    ] o.a.s.s.FileExchangeRateProvider Reloading exchange rates from file currency.xml
   [junit4]   2> 1259278 INFO  (TEST-HardAutoCommitTest.testCommitWithin-seed#[888BC74A4ECEACBC]) [    ] o.a.s.s.FileExchangeRateProvider Reloading exchange rates from file currency.xml
   [junit4]   2> 1259279 INFO  (TEST-HardAutoCommitTest.testCommitWithin-seed#[888BC74A4ECEACBC]) [    ] o.a.s.s.OpenExchangeRatesOrgProvider Reloading exchange rates from open-exchange-rates.json
   [junit4]   2> 1259279 INFO  (TEST-HardAutoCommitTest.testCommitWithin-seed#[888BC74A4ECEACBC]) [    ] o.a.s.s.OpenExchangeRatesOrgProvider Reloading exchange rates from open-exchange-rates.json
   [junit4]   2> 1259280 INFO  (TEST-HardAutoCommitTest.testCommitWithin-seed#[888BC74A4ECEACBC]) [    ] o.a.s.c.ConfigSetProperties Did not find ConfigSet properties, assuming default properties: Can't find resource 'configsetprops.json' in classpath or '/x1/jenkins/jenkins-slave/workspace/Lucene-Solr-Tests-master/solr/core/src/test-files/solr/collection1'
   [junit4]   2> 1259280 INFO  (TEST-HardAutoCommitTest.testCommitWithin-seed#[888BC74A4ECEACBC]) [    ] o.a.s.c.CoreContainer Reloading SolrCore 'collection1' using configuration from instancedir /x1/jenkins/jenkins-slave/workspace/Lucene-Solr-Tests-master/solr/core/src/test-files/solr/collection1
   [junit4]   2> 1259280 INFO  (TEST-HardAutoCommitTest.testCommitWithin-seed#[888BC74A4ECEACBC]) [    x:collection1] o.a.s.c.SolrCore [[collection1] ] Opening new SolrCore at [/x1/jenkins/jenkins-slave/workspace/Lucene-Solr-Tests-master/solr/core/src/test-files/solr/collection1], dataDir=[/x1/jenkins/jenkins-slave/workspace/Lucene-Solr-Tests-master/solr/build/solr-core/test/J2/temp/solr.update.HardAutoCommitTest_888BC74A4ECEACBC-001/init-core-data-001/]
   [junit4]   2> 1259281 INFO  (TEST-HardAutoCommitTest.testCommitWithin-seed#[888BC74A4ECEACBC]) [    x:collection1] o.a.s.c.JmxMonitoredMap JMX monitoring is enabled. Adding Solr mbeans to JMX Server: com.sun.jmx.mbeanserver.JmxMBeanServer@5b170d58
   [junit4]   2> 1259281 INFO  (TEST-HardAutoCommitTest.testCommitWithin-seed#[888BC74A4ECEACBC]) [    x:collection1] o.a.s.c.SolrCore New index directory detected: old=null new=/x1/jenkins/jenkins-slave/workspace/Lucene-Solr-Tests-master/solr/build/solr-core/test/J2/temp/solr.update.HardAutoCommitTest_888BC74A4ECEACBC-001/init-core-data-001/index/
   [junit4]   2> 1259284 INFO  (TEST-HardAutoCommitTest.testCommitWithin-seed#[888BC74A4ECEACBC]) [    x:collection1] o.a.s.u.p.UpdateRequestProcessorChain creating updateRequestProcessorChain "dedupe"
   [junit4]   2> 1259284 INFO  (TEST-HardAutoCommitTest.testCommitWithin-seed#[888BC74A4ECEACBC]) [    x:collection1] o.a.s.u.p.UpdateRequestProcessorChain inserting DistributedUpdateProcessorFactory into updateRequestProcessorChain "dedupe"
   [junit4]   2> 1259284 INFO  (TEST-HardAutoCommitTest.testCommitWithin-seed#[888BC74A4ECEACBC]) [    x:collection1] o.a.s.u.p.UpdateRequestProcessorChain creating updateRequestProcessorChain "dedupe-allfields"
   [junit4]   2> 1259284 INFO  (TEST-HardAutoCommitTest.testCommitWithin-seed#[888BC74A4ECEACBC]) [    x:collection1] o.a.s.u.p.UpdateRequestProcessorChain inserting DistributedUpdateProcessorFactory into updateRequestProcessorChain "dedupe-allfields"
   [junit4]   2> 1259284 INFO  (TEST-HardAutoCommitTest.testCommitWithin-seed#[888BC74A4ECEACBC]) [    x:collection1] o.a.s.u.p.UpdateRequestProcessorChain creating updateRequestProcessorChain "stored_sig"
   [junit4]   2> 1259284 INFO  (TEST-HardAutoCommitTest.testCommitWithin-seed#[888BC74A4ECEACBC]) [    x:collection1] o.a.s.u.p.UpdateRequestProcessorChain inserting DistributedUpdateProcessorFactory into updateRequestProcessorChain "stored_sig"
   [junit4]   2> 1259284 INFO  (TEST-HardAutoCommitTest.testCommitWithin-seed#[888BC74A4ECEACBC]) [    x:collection1] o.a.s.u.p.UpdateRequestProcessorChain creating updateRequestProcessorChain "uniq-fields"
   [junit4]   2> 1259284 INFO  (TEST-HardAutoCommitTest.testCommitWithin-seed#[888BC74A4ECEACBC]) [    x:collection1] o.a.s.u.p.UpdateRequestProcessorChain inserting DistributedUpdateProcessorFactory into updateRequestProcessorChain "uniq-fields"
   [junit4]   2> 1259284 INFO  (TEST-HardAutoCommitTest.testCommitWithin-seed#[888BC74A4ECEACBC]) [    x:collection1] o.a.s.u.p.UpdateRequestProcessorChain creating updateRequestProcessorChain "distrib-dup-test-chain-explicit"
   [junit4]   2> 1259284 INFO  (TEST-HardAutoCommitTest.testCommitWithin-seed#[888BC74A4ECEACBC]) [    x:collection1] o.a.s.u.p.UpdateRequestProcessorChain creating updateRequestProcessorChain "distrib-dup-test-chain-implicit"
   [junit4]   2> 1259285 INFO  (TEST-HardAutoCommitTest.testCommitWithin-seed#[888BC74A4ECEACBC]) [    x:collection1] o.a.s.u.p.UpdateRequestProcessorChain inserting DistributedUpdateProcessorFactory into updateRequestProcessorChain "distrib-dup-test-chain-implicit"
   [junit4]   2> 1259285 INFO  (TEST-HardAutoCommitTest.testCommitWithin-seed#[888BC74A4ECEACBC]) [    x:collection1] o.a.s.c.SolrCore no updateRequestProcessorChain defined as default, creating implicit default
   [junit4]   2> 1259286 INFO  (TEST-HardAutoCommitTest.testCommitWithin-seed#[888BC74A4ECEACBC]) [    x:collection1] o.a.s.h.l.XMLLoader xsltCacheLifetimeSeconds=60
   [junit4]   2> 1259286 INFO  (TEST-HardAutoCommitTest.testCommitWithin-seed#[888BC74A4ECEACBC]) [    x:collection1] o.a.s.h.l.XMLLoader xsltCacheLifetimeSeconds=60
   [junit4]   2> 1259287 INFO  (TEST-HardAutoCommitTest.testCommitWithin-seed#[888BC74A4ECEACBC]) [    x:collection1] o.a.s.h.l.XMLLoader xsltCacheLifetimeSeconds=60
   [junit4]   2> 1259287 INFO  (TEST-HardAutoCommitTest.testCommitWithin-seed#[888BC74A4ECEACBC]) [    x:collection1] o.a.s.h.l.XMLLoader xsltCacheLifetimeSeconds=60
   [junit4]   2> 1259291 INFO  (TEST-HardAutoCommitTest.testCommitWithin-seed#[888BC74A4ECEACBC]) [    x:collection1] o.a.s.c.PluginBag requestHandler : 'lazy' created with startup=lazy 
   [junit4]   2> 1259292 INFO  (OldIndexDirectoryCleanupThreadForCore-collection1) [    x:collection1] o.a.s.c.SolrCore Looking for old index directories to cleanup for core collection1 in /x1/jenkins/jenkins-slave/workspace/Lucene-Solr-Tests-master/solr/build/solr-core/test/J2/temp/solr.update.HardAutoCommitTest_888BC74A4ECEACBC-001/init-core-data-001/
   [junit4]   2> 1259294 INFO  (TEST-HardAutoCommitTest.testCommitWithin-seed#[888BC74A4ECEACBC]) [    x:collection1] o.a.s.c.RequestHandlers Registered paths: /admin/mbeans,standard,spellCheckCompRH,lazy,/update/json/docs,/admin/luke,/export,spellCheckWithWordbreak_Direct,tvrh,/get,/admin/properties,/update/json,mltrh,/admin/threads,/search-facet-def,/update/csv,/sql,/graph,/search-facet-invariants,/admin/segments,spellCheckCompRH1,/mlt,/admin/system,/replication,dismax,defaults,/config,/stream,/schema,/admin/plugins,/admin/logging,spellCheckWithWordbreak,mock,/admin/ping,/update,/admin/file,/terms,spellCheckCompRH_Direct,/debug/dump
   [junit4]   2> 1259294 INFO  (TEST-HardAutoCommitTest.testCommitWithin-seed#[888BC74A4ECEACBC]) [    x:collection1] o.a.s.c.SolrCore Using default statsCache cache: org.apache.solr.search.stats.LocalStatsCache
   [junit4]   2> 1259294 INFO  (TEST-HardAutoCommitTest.testCommitWithin-seed#[888BC74A4ECEACBC]) [    x:collection1] o.a.s.u.CommitTracker Hard AutoCommit: disabled
   [junit4]   2> 1259294 INFO  (TEST-HardAutoCommitTest.testCommitWithin-seed#[888BC74A4ECEACBC]) [    x:collection1] o.a.s.u.CommitTracker Soft AutoCommit: disabled
   [junit4]   2> 1259294 INFO  (TEST-HardAutoCommitTest.testCommitWithin-seed#[888BC74A4ECEACBC]) [    x:collection1] o.a.s.s.SolrIndexSearcher Opening [Searcher@2957678d[collection1] main]
   [junit4]   2> 1259295 INFO  (TEST-HardAutoCommitTest.testCommitWithin-seed#[888BC74A4ECEACBC]) [    x:collection1] o.a.s.r.RestManager Initializing RestManager with initArgs: {storageIO=org.apache.solr.rest.ManagedResourceStorage$InMemoryStorageIO}
   [junit4]   2> 1259295 INFO  (TEST-HardAutoCommitTest.testCommitWithin-seed#[888BC74A4ECEACBC]) [    x:collection1] o.a.s.r.ManagedResourceStorage Reading _rest_managed.json using InMemoryStorage
   [junit4]   2> 1259295 INFO  (TEST-HardAutoCommitTest.testCommitWithin-seed#[888BC74A4ECEACBC]) [    x:collection1] o.a.s.r.RestManager Initializing 0 registered ManagedResources
   [junit4]   2> 1259295 INFO  (TEST-HardAutoCommitTest.testCommitWithin-seed#[888BC74A4ECEACBC]) [    x:collection1] o.a.s.h.c.SpellCheckComponent Initializing spell checkers
   [junit4]   2> 1259295 INFO  (TEST-HardAutoCommitTest.testCommitWithin-seed#[888BC74A4ECEACBC]) [    x:collection1] o.a.s.s.DirectSolrSpellChecker init: {name=direct,classname=DirectSolrSpellChecker,field=lowerfilt,minQueryLength=3}
   [junit4]   2> 1259297 INFO  (TEST-HardAutoCommitTest.testCommitWithin-seed#[888BC74A4ECEACBC]) [    x:collection1] o.a.s.h.ReplicationHandler Commits will be reserved for  10000
   [junit4]   2> 1259298 INFO  (TEST-HardAutoCommitTest.testCommitWithin-seed#[888BC74A4ECEACBC]) [    x:collection1] o.a.s.u.UpdateLog Looking up max value of version field to seed version buckets
   [junit4]   2> 1259298 INFO  (TEST-HardAutoCommitTest.testCommitWithin-seed#[888BC74A4ECEACBC]) [    x:collection1] o.a.s.u.VersionInfo Refreshing highest value of _version_ for 65536 version buckets from index
   [junit4]   2> 1259298 INFO  (TEST-HardAutoCommitTest.testCommitWithin-seed#[888BC74A4ECEACBC]) [    x:collection1] o.a.s.u.VersionInfo No terms found for _version_, cannot seed version bucket highest value from index
   [junit4]   2> 1259299 INFO  (TEST-HardAutoCommitTest.testCommitWithin-seed#[888BC74A4ECEACBC]) [    x:collection1] o.a.s.u.UpdateLog Took 1.0ms to seed version buckets with highest version 1534507487091228672
   [junit4]   2> 1259300 INFO  (TEST-HardAutoCommitTest.testCommitWithin-seed#[888BC74A4ECEACBC]) [    x:collection1] o.a.s.u.DefaultSolrCoreState Closing old IndexWriter... core=collection1
   [junit4]   2> 1259313 INFO  (TEST-HardAutoCommitTest.testCommitWithin-seed#[888BC74A4ECEACBC]) [    x:collection1] o.a.s.u.RandomMergePolicy RandomMergePolicy wrapping class org.apache.lucene.index.TieredMergePolicy: [TieredMergePolicy: maxMergeAtOnce=11, maxMergeAtOnceExplicit=44, maxMergedSegmentMB=2.9287109375, floorSegmentMB=2.162109375, forceMergeDeletesPctAllowed=9.89225920477594, segmentsPerTier=12.0, maxCFSSegmentSizeMB=8.796093022207999E12, noCFSRatio=0.8037282179640042
   [junit4]   2> 1259313 INFO  (searcherExecutor-5017-thread-1-processing-x:collection1) [    x:collection1] o.a.s.h.c.SpellCheckComponent Loading spell index for spellchecker: default
   [junit4]   2> 1259313 INFO  (searcherExecutor-5017-thread-1-processing-x:collection1) [    x:collection1] o.a.s.h.c.SpellCheckComponent Loading spell index for spellchecker: direct
   [junit4]   2> 1259314 INFO  (searcherExecutor-5017-thread-1-processing-x:collection1) [    x:collection1] o.a.s.h.c.SpellCheckComponent Loading spell index for spellchecker: wordbreak
   [junit4]   2> 1259314 INFO  (searcherExecutor-5017-thread-1-processing-x:collection1) [    x:collection1] o.a.s.h.c.SpellCheckComponent Loading spell index for spellchecker: multipleFields
   [junit4]   2> 1259314 INFO  (searcherExecutor-5017-thread-1-processing-x:collection1) [    x:collection1] o.a.s.h.c.SpellCheckComponent Loading spell index for spellchecker: jarowinkler
   [junit4]   2> 1259314 INFO  (searcherExecutor-5017-thread-1-processing-x:collection1) [    x:collection1] o.a.s.h.c.SpellCheckComponent Loading spell index for spellchecker: external
   [junit4]   2> 1259314 INFO  (searcherExecutor-5017-thread-1-processing-x:collection1) [    x:collection1] o.a.s.h.c.SpellCheckComponent Loading spell index for spellchecker: freq
   [junit4]   2> 1259314 INFO  (searcherExecutor-5017-thread-1-processing-x:collection1) [    x:collection1] o.a.s.h.c.SpellCheckComponent Loading spell index for spellchecker: fqcn
   [junit4]   2> 1259314 INFO  (searcherExecutor-5017-thread-1-processing-x:collection1) [    x:collection1] o.a.s.h.c.SpellCheckComponent Loading spell index for spellchecker: perDict
   [junit4]   2> 1259315 INFO  (searcherExecutor-5017-thread-1-processing-x:collection1) [    x:collection1] o.a.s.c.SolrCore [collection1] Registered new searcher Searcher@2957678d[collection1] main{ExitableDirectoryReader(UninvertingDirectoryReader())}
   [junit4]   2> 1259315 INFO  (TEST-HardAutoCommitTest.testCommitWithin-seed#[888BC74A4ECEACBC]) [    x:collection1] o.a.s.c.SolrDeletionPolicy SolrDeletionPolicy.onInit: commits: num=1
   [junit4]   2> 	commit{dir=MockDirectoryWrapper(RAMDirectory@7a027a2a lockFactory=org.apache.lucene.store.SingleInstanceLockFactory@122f4014),segFN=segments_1,generation=1}
   [junit4]   2> 1259316 INFO  (TEST-HardAutoCommitTest.testCommitWithin-seed#[888BC74A4ECEACBC]) [    x:collection1] o.a.s.c.SolrDeletionPolicy newest commit generation = 1
   [junit4]   2> 1259316 INFO  (TEST-HardAutoCommitTest.testCommitWithin-seed#[888BC74A4ECEACBC]) [    x:collection1] o.a.s.u.DefaultSolrCoreState New IndexWriter is ready to be used.
   [junit4]   2> 1259316 INFO  (TEST-HardAutoCommitTest.testCommitWithin-seed#[888BC74A4ECEACBC]) [    x:collection1] o.a.s.s.SolrIndexSearcher Opening [Searcher@234670da[collection1] main]
   [junit4]   2> 1259316 INFO  (TEST-HardAutoCommitTest.testCommitWithin-seed#[888BC74A4ECEACBC]) [    x:collection1] o.a.s.c.CoreContainer replacing core: collection1
   [junit4]   2> 1259316 INFO  (TEST-HardAutoCommitTest.testCommitWithin-seed#[888BC74A4ECEACBC]) [    x:collection1] o.a.s.c.SolrCore [collection1]  CLOSING SolrCore org.apache.solr.core.SolrCore@2892bd2b
   [junit4]   2> 1259318 INFO  (TEST-HardAutoCommitTest.testCommitWithin-seed#[888BC74A4ECEACBC]) [    x:collection1] o.a.s.u.DirectUpdateHandler2 closing DirectUpdateHandler2{commits=0,autocommits=0,soft autocommits=0,optimizes=0,rollbacks=0,expungeDeletes=0,docsPending=0,adds=0,deletesById=0,deletesByQuery=1,errors=0,cumulative_adds=0,cumulative_deletesById=0,cumulative_deletesByQuery=1,cumulative_errors=0,transaction_logs_total_size=0,transaction_logs_total_number=0}
   [junit4]   2> 1259318 INFO  (TEST-HardAutoCommitTest.testCommitWithin-seed#[888BC74A4ECEACBC]) [    x:collection1] o.a.s.c.SolrCore [collection1] Closing main searcher on request.
   [junit4]   2> 1259348 INFO  (searcherExecutor-5017-thread-1-processing-x:collection1) [    x:collection1] o.a.s.c.SolrCore [collection1] Registered new searcher Searcher@234670da[collection1] main{ExitableDirectoryReader(UninvertingDirectoryReader())}
   [junit4]   2> 1259369 INFO  (TEST-HardAutoCommitTest.testCommitWithin-seed#[888BC74A4ECEACBC]) [    x:collection1] o.a.s.u.p.LogUpdateProcessorFactory [collection1] {add=[529 (1534507487454035968)]} 0 22
   [junit4]   2> 1259370 INFO  (TEST-HardAutoCommitTest.testCommitWithin-seed#[888BC74A4ECEACBC]) [    x:collection1] o.a.s.c.S.Request [collection1]  webapp=null path=null params={q=id:529&qt=standard&start=0&rows=20&version=2.2} hits=0 status=0 QTime=0
   [junit4]   2> 1259373 INFO  (TEST-HardAutoCommitTest.testCommitWithin-seed#[888BC74A4ECEACBC]) [    x:collection1] o.a.s.u.p.LogUpdateProcessorFactory [collection1] {add=[530 (1534507487481298944)]} 0 25
   [junit4]   2> 1259373 INFO  (TEST-HardAutoCommitTest.testCommitWithin-seed#[888BC74A4ECEACBC]) [    x:collection1] o.a.s.c.S.Request [collection1]  webapp=null path=null params={q=id:530&qt=standard&start=0&rows=20&version=2.2} hits=0 status=0 QTime=0
   [junit4]   2> 1259373 INFO  (TEST-HardAutoCommitTest.testCommitWithin-seed#[888BC74A4ECEACBC]) [    x:collection1] o.a.s.u.p.LogUpdateProcessorFactory [collection1] {delete=[529 (-1534507487481298945)]} 0 26
   [junit4]   2> 1259373 INFO  (TEST-HardAutoCommitTest.testCommitWithin-seed#[888BC74A4ECEACBC]) [    x:collection1] o.a.s.c.S.Request [collection1]  webapp=null path=null params={q=id:529&qt=standard&start=0&rows=20&version=2.2} hits=0 status=0 QTime=0
   [junit4]   2> 1259374 ERROR (TEST-HardAutoCommitTest.testCommitWithin-seed#[888BC74A4ECEACBC]) [    x:collection1] o.a.s.SolrTestCaseJ4 REQUEST FAILED: xpath=//result[@numFound=1]
   [junit4]   2> 	xml response was: <?xml version="1.0" encoding="UTF-8"?>
   [junit4]   2> <response>
   [junit4]   2> <lst name="responseHeader"><int name="status">0</int><int name="QTime">0</int></lst><result name="response" numFound="0" start="0"></result>
   [junit4]   2> </response>
   [junit4]   2> 
   [junit4]   2> 	request was:q=id:529&qt=standard&start=0&rows=20&version=2.2
   [junit4]   2> 1259375 ERROR (TEST-HardAutoCommitTest.testCommitWithin-seed#[888BC74A4ECEACBC]) [    x:collection1] o.a.s.SolrTestCaseJ4 REQUEST FAILED: q=id:529&qt=standard&start=0&rows=20&version=2.2:java.lang.RuntimeException: REQUEST FAILED: xpath=//result[@numFound=1]
   [junit4]   2> 	xml response was: <?xml version="1.0" encoding="UTF-8"?>
   [junit4]   2> <response>
   [junit4]   2> <lst name="responseHeader"><int name="status">0</int><int name="QTime">0</int></lst><result name="response" numFound="0" start="0"></result>
   [junit4]   2> </response>
   [junit4]   2> 
   [junit4]   2> 	request was:q=id:529&qt=standard&start=0&rows=20&version=2.2
   [junit4]   2> 	at org.apache.solr.SolrTestCaseJ4.assertQ(SolrTestCaseJ4.java:778)
   [junit4]   2> 	at org.apache.solr.update.HardAutoCommitTest.testCommitWithin(HardAutoCommitTest.java:99)
   [junit4]   2> 	at sun.reflect.NativeMethodAccessorImpl.invoke0(Native Method)
   [junit4]   2> 	at sun.reflect.NativeMethodAccessorImpl.invoke(NativeMethodAccessorImpl.java:62)
   [junit4]   2> 	at sun.reflect.DelegatingMethodAccessorImpl.invoke(DelegatingMethodAccessorImpl.java:43)
   [junit4]   2> 	at java.lang.reflect.Method.invoke(Method.java:498)
   [junit4]   2> 	at com.carrotsearch.randomizedtesting.RandomizedRunner.invoke(RandomizedRunner.java:1764)
   [junit4]   2> 	at com.carrotsearch.randomizedtesting.RandomizedRunner$8.evaluate(RandomizedRunner.java:871)
   [junit4]   2> 	at com.carrotsearch.randomizedtesting.RandomizedRunner$9.evaluate(RandomizedRunner.java:907)
   [junit4]   2> 	at com.carrotsearch.randomizedtesting.RandomizedRunner$10.evaluate(RandomizedRunner.java:921)
   [junit4]   2> 	at com.carrotsearch.randomizedtesting.rules.SystemPropertiesRestoreRule$1.evaluate(SystemPropertiesRestoreRule.java:57)
   [junit4]   2> 	at org.apache.lucene.util.TestRuleSetupTeardownChained$1.evaluate(TestRuleSetupTeardownChained.java:49)
   [junit4]   2> 	at org.apache.lucene.util.AbstractBeforeAfterRule$1.evaluate(AbstractBeforeAfterRule.java:45)
   [junit4]   2> 	at org.apache.lucene.util.TestRuleThreadAndTestName$1.evaluate(TestRuleThreadAndTestName.java:48)
   [junit4]   2> 	at org.apache.lucene.util.TestRuleIgnoreAfterMaxFailures$1.evaluate(TestRuleIgnoreAfterMaxFailures.java:64)
   [junit4]   2> 	at org.apache.lucene.util.TestRuleMarkFailure$1.evaluate(TestRuleMarkFailure.java:47)
   [junit4]   2> 	at com.carrotsearch.randomizedtesting.rules.StatementAdapter.evaluate(StatementAdapter.java:36)
   [junit4]   2> 	at com.carrotsearch.randomizedtesting.ThreadLeakControl$StatementRunner.run(ThreadLeakControl.java:367)
   [junit4]   2> 	at com.carrotsearch.randomizedtesting.ThreadLeakControl.forkTimeoutingTask(ThreadLeakControl.java:809)
   [junit4]   2> 	at com.carrotsearch.randomizedtesting.ThreadLeakControl$3.evaluate(ThreadLeakControl.java:460)
   [junit4]   2> 	at com.carrotsearch.randomizedtesting.RandomizedRunner.runSingleTest(RandomizedRunner.java:880)
   [junit4]   2> 	at com.carrotsearch.randomizedtesting.RandomizedRunner$5.evaluate(RandomizedRunner.java:781)
   [junit4]   2> 	at com.carrotsearch.randomizedtesting.RandomizedRunner$6.evaluate(RandomizedRunner.java:816)
   [junit4]   2> 	at com.carrotsearch.randomizedtesting.RandomizedRunner$7.evaluate(RandomizedRunner.java:827)
   [junit4]   2> 	at com.carrotsearch.randomizedtesting.rules.StatementAdapter.evaluate(StatementAdapter.java:36)
   [junit4]   2> 	at com.carrotsearch.randomizedtesting.rules.SystemPropertiesRestoreRule$1.evaluate(SystemPropertiesRestoreRule.java:57)
   [junit4]   2> 	at org.apache.lucene.util.AbstractBeforeAfterRule$1.evaluate(AbstractBeforeAfterRule.java:45)
   [junit4]   2> 	at com.carrotsearch.randomizedtesting.rules.StatementAdapter.evaluate(StatementAdapter.java:36)
   [junit4]   2> 	at org.apache.lucene.util.TestRuleStoreClassName$1.evaluate(TestRuleStoreClassName.java:41)
   [junit4]   2> 	at com.carrotsearch.randomizedtesting.rules.NoShadowingOrOverridesOnMethodsRule$1.evaluate(NoShadowingOrOverridesOnMethodsRule.java:40)
   [junit4]   2> 	at com.carrotsearch.randomizedtesting.rules.NoShadowingOrOverridesOnMethodsRule$1.evaluate(NoShadowingOrOverridesOnMethodsRule.java:40)
   [junit4]   2> 	at com.carrotsearch.randomizedtesting.rules.StatementAdapter.evaluate(StatementAdapter.java:36)
   [junit4]   2> 	at com.carrotsearch.randomizedtesting.rules.StatementAdapter.evaluate(StatementAdapter.java:36)
   [junit4]   2> 	at com.carrotsearch.randomizedtesting.rules.StatementAdapter.evaluate(StatementAdapter.java:36)
   [junit4]   2> 	at org.apache.lucene.util.TestRuleAssertionsRequired$1.evaluate(TestRuleAssertionsRequired.java:53)
   [junit4]   2> 	at org.apache.lucene.util.TestRuleMarkFailure$1.evaluate(TestRuleMarkFailure.java:47)
   [junit4]   2> 	at org.apache.lucene.util.TestRuleIgnoreAfterMaxFailures$1.evaluate(TestRuleIgnoreAfterMaxFailures.java:64)
   [junit4]   2> 	at org.apache.lucene.util.TestRuleIgnoreTestSuites$1.evaluate(TestRuleIgnoreTestSuites.java:54)
   [junit4]   2> 	at com.carrotsearch.randomizedtesting.rules.StatementAdapter.evaluate(StatementAdapter.java:36)
   [junit4]   2> 	at com.carrotsearch.randomizedtesting.ThreadLeakControl$StatementRunner.run(ThreadLeakControl.java:367)
   [junit4]   2> 	at java.lang.Thread.run(Thread.java:745)
   [junit4]   2> 
   [junit4]   2> 1259376 INFO  (TEST-HardAutoCommitTest.testCommitWithin-seed#[888BC74A4ECEACBC]) [    x:collection1] o.a.s.SolrTestCaseJ4 ###Ending testCommitWithin
   [junit4]   2> NOTE: reproduce with: ant test  -Dtestcase=HardAutoCommitTest -Dtests.method=testCommitWithin -Dtests.seed=888BC74A4ECEACBC -Dtests.multiplier=2 -Dtests.slow=true -Dtests.locale=ru-RU -Dtests.timezone=Turkey -Dtests.asserts=true -Dtests.file.encoding=ISO-8859-1
   [junit4] ERROR   0.38s J2 | HardAutoCommitTest.testCommitWithin <<<
   [junit4]    > Throwable #1: java.lang.RuntimeException: Exception during query
   [junit4]    > 	at __randomizedtesting.SeedInfo.seed([888BC74A4ECEACBC:3259A832CDE042A9]:0)
   [junit4]    > 	at org.apache.solr.SolrTestCaseJ4.assertQ(SolrTestCaseJ4.java:785)
   [junit4]    > 	at org.apache.solr.update.HardAutoCommitTest.testCommitWithin(HardAutoCommitTest.java:99)
   [junit4]    > 	at java.lang.Thread.run(Thread.java:745)
   [junit4]    > Caused by: java.lang.RuntimeException: REQUEST FAILED: xpath=//result[@numFound=1]
   [junit4]    > 	xml response was: <?xml version="1.0" encoding="UTF-8"?>
   [junit4]    > <response>
   [junit4]    > <lst name="responseHeader"><int name="status">0</int><int name="QTime">0</int></lst><result name="response" numFound="0" start="0"></result>
   [junit4]    > </response>
   [junit4]    > 	request was:q=id:529&qt=standard&start=0&rows=20&version=2.2
   [junit4]    > 	at org.apache.solr.SolrTestCaseJ4.assertQ(SolrTestCaseJ4.java:778)
   [junit4]    > 	... 40 more
   [junit4]   2> 1259378 INFO  (SUITE-HardAutoCommitTest-seed#[888BC74A4ECEACBC]-worker) [    x:collection1] o.a.s.SolrTestCaseJ4 ###deleteCore
   [junit4]   2> 1259378 INFO  (SUITE-HardAutoCommitTest-seed#[888BC74A4ECEACBC]-worker) [    x:collection1] o.a.s.c.CoreContainer Shutting down CoreContainer instance=822825293
   [junit4]   2> 1259390 INFO  (coreCloseExecutor-5021-thread-1-processing-x:collection1) [    x:collection1] o.a.s.c.SolrCore [collection1]  CLOSING SolrCore org.apache.solr.core.SolrCore@5da6b72
   [junit4]   2> 1259390 INFO  (coreCloseExecutor-5021-thread-1-processing-x:collection1) [    x:collection1] o.a.s.u.DirectUpdateHandler2 closing DirectUpdateHandler2{commits=0,autocommits=0,soft autocommits=0,optimizes=0,rollbacks=0,expungeDeletes=0,docsPending=2,adds=2,deletesById=1,deletesByQuery=0,errors=0,cumulative_adds=2,cumulative_deletesById=1,cumulative_deletesByQuery=0,cumulative_errors=0,transaction_logs_total_size=0,transaction_logs_total_number=0}
   [junit4]   2> 1259390 INFO  (coreCloseExecutor-5021-thread-1-processing-x:collection1) [    x:collection1] o.a.s.u.SolrCoreState Closing SolrCoreState
   [junit4]   2> 1259390 INFO  (coreCloseExecutor-5021-thread-1-processing-x:collection1) [    x:collection1] o.a.s.u.DefaultSolrCoreState SolrCoreState ref count has reached 0 - closing IndexWriter
   [junit4]   2> 1259390 INFO  (coreCloseExecutor-5021-thread-1-processing-x:collection1) [    x:collection1] o.a.s.u.DefaultSolrCoreState closing IndexWriter with IndexWriterCloser
   [junit4]   2> 1259390 INFO  (coreCloseExecutor-5021-thread-1-processing-x:collection1) [    x:collection1] o.a.s.u.DirectUpdateHandler2 Committing on IndexWriter close.
   [junit4]   2> 1259406 INFO  (coreCloseExecutor-5021-thread-1-processing-x:collection1) [    x:collection1] o.a.s.c.SolrDeletionPolicy SolrDeletionPolicy.onCommit: commits: num=2
   [junit4]   2> 	commit{dir=MockDirectoryWrapper(RAMDirectory@7a027a2a lockFactory=org.apache.lucene.store.SingleInstanceLockFactory@122f4014),segFN=segments_1,generation=1}
   [junit4]   2> 	commit{dir=MockDirectoryWrapper(RAMDirectory@7a027a2a lockFactory=org.apache.lucene.store.SingleInstanceLockFactory@122f4014),segFN=segments_2,generation=2}
   [junit4]   2> 1259406 INFO  (coreCloseExecutor-5021-thread-1-processing-x:collection1) [    x:collection1] o.a.s.c.SolrDeletionPolicy newest commit generation = 2
   [junit4]   2> 1259406 INFO  (coreCloseExecutor-5021-thread-1-processing-x:collection1) [    x:collection1] o.a.s.c.SolrCore [collection1] Closing main searcher on request.
   [junit4]   2> 1259420 INFO  (coreCloseExecutor-5021-thread-1-processing-x:collection1) [    x:collection1] o.a.s.c.CachingDirectoryFactory Closing MockDirectoryFactory - 2 directories currently being tracked
   [junit4]   2> 1259420 INFO  (coreCloseExecutor-5021-thread-1-processing-x:collection1) [    x:collection1] o.a.s.c.CachingDirectoryFactory looking to close /x1/jenkins/jenkins-slave/workspace/Lucene-Solr-Tests-master/solr/build/solr-core/test/J2/temp/solr.update.HardAutoCommitTest_888BC74A4ECEACBC-001/init-core-data-001 [CachedDir<<refCount=0;path=/x1/jenkins/jenkins-slave/workspace/Lucene-Solr-Tests-master/solr/build/solr-core/test/J2/temp/solr.update.HardAutoCommitTest_888BC74A4ECEACBC-001/init-core-data-001;done=false>>]
   [junit4]   2> 1259420 INFO  (coreCloseExecutor-5021-thread-1-processing-x:collection1) [    x:collection1] o.a.s.c.CachingDirectoryFactory Closing directory, CoreContainer#isShutdown=true
   [junit4]   2> 1259420 INFO  (coreCloseExecutor-5021-thread-1-processing-x:collection1) [    x:collection1] o.a.s.c.CachingDirectoryFactory Closing directory: /x1/jenkins/jenkins-slave/workspace/Lucene-Solr-Tests-master/solr/build/solr-core/test/J2/temp/solr.update.HardAutoCommitTest_888BC74A4ECEACBC-001/init-core-data-001
   [junit4]   2> 1259420 INFO  (coreCloseExecutor-5021-thread-1-processing-x:collection1) [    x:collection1] o.a.s.c.CachingDirectoryFactory looking to close /x1/jenkins/jenkins-slave/workspace/Lucene-Solr-Tests-master/solr/build/solr-core/test/J2/temp/solr.update.HardAutoCommitTest_888BC74A4ECEACBC-001/init-core-data-001/index [CachedDir<<refCount=0;path=/x1/jenkins/jenkins-slave/workspace/Lucene-Solr-Tests-master/solr/build/solr-core/test/J2/temp/solr.update.HardAutoCommitTest_888BC74A4ECEACBC-001/init-core-data-001/index;done=false>>]
   [junit4]   2> 1259420 INFO  (coreCloseExecutor-5021-thread-1-processing-x:collection1) [    x:collection1] o.a.s.c.CachingDirectoryFactory Closing directory, CoreContainer#isShutdown=true
   [junit4]   2> 1259421 INFO  (coreCloseExecutor-5021-thread-1-processing-x:collection1) [    x:collection1] o.a.s.c.CachingDirectoryFactory Closing directory: /x1/jenkins/jenkins-slave/workspace/Lucene-Solr-Tests-master/solr/build/solr-core/test/J2/temp/solr.update.HardAutoCommitTest_888BC74A4ECEACBC-001/init-core-data-001/index
   [junit4]   2> NOTE: leaving temporary files on disk at: /x1/jenkins/jenkins-slave/workspace/Lucene-Solr-Tests-master/solr/build/solr-core/test/J2/temp/solr.update.HardAutoCommitTest_888BC74A4ECEACBC-001
   [junit4]   2> May 16, 2016 5:39:39 PM com.carrotsearch.randomizedtesting.ThreadLeakControl checkThreadLeaks
   [junit4]   2> WARNING: Will linger awaiting termination of 2 leaked thread(s).
   [junit4]   2> NOTE: test params are: codec=Asserting(Lucene62): {range_facet_l_dv=PostingsFormat(name=LuceneVarGapDocFreqInterval), _version_=PostingsFormat(name=MockRandom), field_t=PostingsFormat(name=Asserting), multiDefault=PostingsFormat(name=LuceneFixedGap), subject=PostingsFormat(name=LuceneFixedGap), intDefault=PostingsFormat(name=MockRandom), id=PostingsFormat(name=LuceneVarGapDocFreqInterval), range_facet_i_dv=PostingsFormat(name=MockRandom), text=PostingsFormat(name=Asserting), range_facet_l=PostingsFormat(name=MockRandom), timestamp=PostingsFormat(name=MockRandom)}, docValues:{range_facet_l_dv=DocValuesFormat(name=Memory), range_facet_i_dv=DocValuesFormat(name=Asserting), timestamp=DocValuesFormat(name=Asserting)}, maxPointsInLeafNode=905, maxMBSortInHeap=7.248408505888827, sim=RandomSimilarity(queryNorm=false,coord=crazy): {}, locale=ru-RU, timezone=Turkey
   [junit4]   2> NOTE: Linux 3.13.0-85-generic amd64/Oracle Corporation 1.8.0_74 (64-bit)/cpus=4,threads=1,free=177061752,total=534249472
   [junit4]   2> NOTE: All tests run in this JVM: [SuggesterTest, TestStressReorder, BinaryUpdateRequestHandlerTest, TestDefaultStatsCache, LukeRequestHandlerTest, FieldAnalysisRequestHandlerTest, TestRuleBasedAuthorizationPlugin, AnalysisErrorHandlingTest, TestJmxMonitoredMap, DistanceUnitsTest, HdfsThreadLeakTest, RequestHandlersTest, UnloadDistributedZkTest, TestFieldCollectionResource, DeleteShardTest, ZkStateReaderTest, DistributedExpandComponentTest, DocValuesMultiTest, TestRebalanceLeaders, CircularListTest, SuggestComponentTest, TestMinMaxOnMultiValuedField, TestSizeLimitedDistributedMap, DistributedFacetPivotSmallAdvancedTest, TestManagedResource, TestNamedUpdateProcessors, TestWriterPerf, AutoCommitTest, MergeStrategyTest, SparseHLLTest, TestSolrQueryResponse, SimpleCollectionCreateDeleteTest, SearchHandlerTest, TestFileDictionaryLookup, TestXIncludeConfig, TestCollationFieldDocValues, MigrateRouteKeyTest, TestRecoveryHdfs, OverriddenZkACLAndCredentialsProvidersTest, ChangedSchemaMergeTest, TestSchemaSimilarityResource, PluginInfoTest, RollingRestartTest, TestAuthenticationFramework, SecurityConfHandlerTest, TestReload, TestPostingsSolrHighlighter, TestSort, TestSubQueryTransformer, TestFieldTypeResource, TestComplexPhraseQParserPlugin, TestZkChroot, TestAddFieldRealTimeGet, TestManagedStopFilterFactory, FacetPivotSmallTest, TestBlobHandler, CurrencyFieldXmlFileTest, LeaderElectionTest, TestCloudManagedSchema, ClusterStateTest, OverseerTest, TestMacros, FullSolrCloudDistribCmdsTest, TestTolerantSearch, DistributedVersionInfoTest, TestReloadAndDeleteDocs, SolrCoreCheckLockOnStartupTest, EnumFieldTest, FieldMutatingUpdateProcessorTest, BlockJoinFacetSimpleTest, ScriptEngineTest, TestSolrQueryParserDefaultOperatorResource, CollectionsAPISolrJTest, BadIndexSchemaTest, TestBulkSchemaAPI, CdcrRequestHandlerTest, TestDistributedMissingSort, TestCloudInspectUtil, RecoveryZkTest, CollectionStateFormat2Test, TestStressRecovery, DeleteInactiveReplicaTest, BaseCdcrDistributedZkTest, TestConfigSetsAPI, CleanupOldIndexTest, TestScoreJoinQPScore, TestRequestStatusCollectionAPI, TestFilteredDocIdSet, TestSolrConfigHandlerCloud, LeaderFailoverAfterPartitionTest, TestConfigOverlay, TestElisionMultitermQuery, RuleEngineTest, TestSimpleQParserPlugin, RegexBoostProcessorTest, TermVectorComponentDistributedTest, TestConfigSets, TestNoOpRegenerator, TestUtils, ZkControllerTest, TestRealTimeGet, HardAutoCommitTest]
   [junit4] Completed [315/597 (1!)] on J2 in 2.13s, 1 test, 1 error <<< FAILURES!

[...truncated 398 lines...]
   [junit4] Suite: org.apache.solr.cloud.ChaosMonkeyNothingIsSafeTest
   [junit4]   2> Creating dataDir: /x1/jenkins/jenkins-slave/workspace/Lucene-Solr-Tests-master/solr/build/solr-core/test/J0/temp/solr.cloud.ChaosMonkeyNothingIsSafeTest_888BC74A4ECEACBC-001/init-core-data-001
   [junit4]   2> 1332175 INFO  (SUITE-ChaosMonkeyNothingIsSafeTest-seed#[888BC74A4ECEACBC]-worker) [    ] o.a.s.BaseDistributedSearchTestCase Setting hostContext system property: /bch/
   [junit4]   2> 1332178 INFO  (TEST-ChaosMonkeyNothingIsSafeTest.test-seed#[888BC74A4ECEACBC]) [    ] o.a.s.c.ZkTestServer STARTING ZK TEST SERVER
   [junit4]   2> 1332178 INFO  (Thread-4569) [    ] o.a.s.c.ZkTestServer client port:0.0.0.0/0.0.0.0:0
   [junit4]   2> 1332178 INFO  (Thread-4569) [    ] o.a.s.c.ZkTestServer Starting server
   [junit4]   2> 1332278 INFO  (TEST-ChaosMonkeyNothingIsSafeTest.test-seed#[888BC74A4ECEACBC]) [    ] o.a.s.c.ZkTestServer start zk server on port:37193
   [junit4]   2> 1332278 INFO  (TEST-ChaosMonkeyNothingIsSafeTest.test-seed#[888BC74A4ECEACBC]) [    ] o.a.s.c.c.SolrZkClient Using default ZkCredentialsProvider
   [junit4]   2> 1332279 INFO  (TEST-ChaosMonkeyNothingIsSafeTest.test-seed#[888BC74A4ECEACBC]) [    ] o.a.s.c.c.ConnectionManager Waiting for client to connect to ZooKeeper
   [junit4]   2> 1332282 INFO  (zkCallback-1763-thread-1) [    ] o.a.s.c.c.ConnectionManager Watcher org.apache.solr.common.cloud.ConnectionManager@1dfe739f name:ZooKeeperConnection Watcher:127.0.0.1:37193 got event WatchedEvent state:SyncConnected type:None path:null path:null type:None
   [junit4]   2> 1332282 INFO  (TEST-ChaosMonkeyNothingIsSafeTest.test-seed#[888BC74A4ECEACBC]) [    ] o.a.s.c.c.ConnectionManager Client is connected to ZooKeeper
   [junit4]   2> 1332282 INFO  (TEST-ChaosMonkeyNothingIsSafeTest.test-seed#[888BC74A4ECEACBC]) [    ] o.a.s.c.c.SolrZkClient Using default ZkACLProvider
   [junit4]   2> 1332282 INFO  (TEST-ChaosMonkeyNothingIsSafeTest.test-seed#[888BC74A4ECEACBC]) [    ] o.a.s.c.c.SolrZkClient makePath: /solr
   [junit4]   2> 1332288 INFO  (TEST-ChaosMonkeyNothingIsSafeTest.test-seed#[888BC74A4ECEACBC]) [    ] o.a.s.c.c.SolrZkClient Using default ZkCredentialsProvider
   [junit4]   2> 1332288 INFO  (TEST-ChaosMonkeyNothingIsSafeTest.test-seed#[888BC74A4ECEACBC]) [    ] o.a.s.c.c.ConnectionManager Waiting for client to connect to ZooKeeper
   [junit4]   2> 1332289 INFO  (zkCallback-1764-thread-1) [    ] o.a.s.c.c.ConnectionManager Watcher org.apache.solr.common.cloud.ConnectionManager@4cc6300b name:ZooKeeperConnection Watcher:127.0.0.1:37193/solr got event WatchedEvent state:SyncConnected type:None path:null path:null type:None
   [junit4]   2> 1332289 INFO  (TEST-ChaosMonkeyNothingIsSafeTest.test-seed#[888BC74A4ECEACBC]) [    ] o.a.s.c.c.ConnectionManager Client is connected to ZooKeeper
   [junit4]   2> 1332289 INFO  (TEST-ChaosMonkeyNothingIsSafeTest.test-seed#[888BC74A4ECEACBC]) [    ] o.a.s.c.c.SolrZkClient Using default ZkACLProvider
   [junit4]   2> 1332289 INFO  (TEST-ChaosMonkeyNothingIsSafeTest.test-seed#[888BC74A4ECEACBC]) [    ] o.a.s.c.c.SolrZkClient makePath: /collections/collection1
   [junit4]   2> 1332290 INFO  (TEST-ChaosMonkeyNothingIsSafeTest.test-seed#[888BC74A4ECEACBC]) [    ] o.a.s.c.c.SolrZkClient makePath: /collections/collection1/shards
   [junit4]   2> 1332291 INFO  (TEST-ChaosMonkeyNothingIsSafeTest.test-seed#[888BC74A4ECEACBC]) [    ] o.a.s.c.c.SolrZkClient makePath: /collections/control_collection
   [junit4]   2> 1332292 INFO  (TEST-ChaosMonkeyNothingIsSafeTest.test-seed#[888BC74A4ECEACBC]) [    ] o.a.s.c.c.SolrZkClient makePath: /collections/control_collection/shards
   [junit4]   2> 1332293 INFO  (TEST-ChaosMonkeyNothingIsSafeTest.test-seed#[888BC74A4ECEACBC]) [    ] o.a.s.c.AbstractZkTestCase put /x1/jenkins/jenkins-slave/workspace/Lucene-Solr-Tests-master/solr/core/src/test-files/solr/collection1/conf/solrconfig-tlog.xml to /configs/conf1/solrconfig.xml
   [junit4]   2> 1332293 INFO  (TEST-ChaosMonkeyNothingIsSafeTest.test-seed#[888BC74A4ECEACBC]) [    ] o.a.s.c.c.SolrZkClient makePath: /configs/conf1/solrconfig.xml
   [junit4]   2> 1332294 INFO  (TEST-ChaosMonkeyNothingIsSafeTest.test-seed#[888BC74A4ECEACBC]) [    ] o.a.s.c.AbstractZkTestCase put /x1/jenkins/jenkins-slave/workspace/Lucene-Solr-Tests-master/solr/core/src/test-files/solr/collection1/conf/schema15.xml to /configs/conf1/schema.xml
   [junit4]   2> 1332294 INFO  (TEST-ChaosMonkeyNothingIsSafeTest.test-seed#[888BC74A4ECEACBC]) [    ] o.a.s.c.c.SolrZkClient makePath: /configs/conf1/schema.xml
   [junit4]   2> 1332295 INFO  (TEST-ChaosMonkeyNothingIsSafeTest.test-seed#[888BC74A4ECEACBC]) [    ] o.a.s.c.AbstractZkTestCase put /x1/jenkins/jenkins-slave/workspace/Lucene-Solr-Tests-master/solr/core/src/test-files/solr/collection1/conf/solrconfig.snippet.randomindexconfig.xml to /configs/conf1/solrconfig.snippet.randomindexconfig.xml
   [junit4]   2> 1332295 INFO  (TEST-ChaosMonkeyNothingIsSafeTest.test-seed#[888BC74A4ECEACBC]) [    ] o.a.s.c.c.SolrZkClient makePath: /configs/conf1/solrconfig.snippet.randomindexconfig.xml
   [junit4]   2> 1332296 INFO  (TEST-ChaosMonkeyNothingIsSafeTest.test-seed#[888BC74A4ECEACBC]) [    ] o.a.s.c.AbstractZkTestCase put /x1/jenkins/jenkins-slave/workspace/Lucene-Solr-Tests-master/solr/core/src/test-files/solr/collection1/conf/stopwords.txt to /configs/conf1/stopwords.txt
   [junit4]   2> 1332296 INFO  (TEST-ChaosMonkeyNothingIsSafeTest.test-seed#[888BC74A4ECEACBC]) [    ] o.a.s.c.c.SolrZkClient makePath: /configs/conf1/stopwords.txt
   [junit4]   2> 1332297 INFO  (TEST-ChaosMonkeyNothingIsSafeTest.test-seed#[888BC74A4ECEACBC]) [    ] o.a.s.c.AbstractZkTestCase put /x1/jenkins/jenkins-slave/workspace/Lucene-Solr-Tests-master/solr/core/src/test-files/solr/collection1/conf/protwords.txt to /configs/conf1/protwords.txt
   [junit4]   2> 1332297 INFO  (TEST-ChaosMonkeyNothingIsSafeTest.test-seed#[888BC74A4ECEACBC]) [    ] o.a.s.c.c.SolrZkClient makePath: /configs/conf1/protwords.txt
   [junit4]   2> 1332298 INFO  (TEST-ChaosMonkeyNothingIsSafeTest.test-seed#[888BC74A4ECEACBC]) [    ] o.a.s.c.AbstractZkTestCase put /x1/jenkins/jenkins-slave/workspace/Lucene-Solr-Tests-master/solr/core/src/test-files/solr/collection1/conf/currency.xml to /configs/conf1/currency.xml
   [junit4]   2> 1332298 INFO  (TEST-ChaosMonkeyNothingIsSafeTest.test-seed#[888BC74A4ECEACBC]) [    ] o.a.s.c.c.SolrZkClient makePath: /configs/conf1/currency.xml
   [junit4]   2> 1332299 INFO  (TEST-ChaosMonkeyNothingIsSafeTest.test-seed#[888BC74A4ECEACBC]) [    ] o.a.s.c.AbstractZkTestCase put /x1/jenkins/jenkins-slave/workspace/Lucene-Solr-Tests-master/solr/core/src/test-files/solr/collection1/conf/enumsConfig.xml to /configs/conf1/enumsConfig.xml
   [junit4]   2> 1332299 INFO  (TEST-ChaosMonkeyNothingIsSafeTest.test-seed#[888BC74A4ECEACBC]) [    ] o.a.s.c.c.SolrZkClient makePath: /configs/conf1/enumsConfig.xml
   [junit4]   2> 1332300 INFO  (TEST-ChaosMonkeyNothingIsSafeTest.test-seed#[888BC74A4ECEACBC]) [    ] o.a.s.c.AbstractZkTestCase put /x1/jenkins/jenkins-slave/workspace/Lucene-Solr-Tests-master/solr/core/src/test-files/solr/collection1/conf/open-exchange-rates.json to /configs/conf1/open-exchange-rates.json
   [junit4]   2> 1332300 INFO  (TEST-ChaosMonkeyNothingIsSafeTest.test-seed#[888BC74A4ECEACBC]) [    ] o.a.s.c.c.SolrZkClient makePath: /configs/conf1/open-exchange-rates.json
   [junit4]   2> 1332301 INFO  (TEST-ChaosMonkeyNothingIsSafeTest.test-seed#[888BC74A4ECEACBC]) [    ] o.a.s.c.AbstractZkTestCase put /x1/jenkins/jenkins-slave/workspace/Lucene-Solr-Tests-master/solr/core/src/test-files/solr/collection1/conf/mapping-ISOLatin1Accent.txt to /configs/conf1/mapping-ISOLatin1Accent.txt
   [junit4]   2> 1332301 INFO  (TEST-ChaosMonkeyNothingIsSafeTest.test-seed#[888BC74A4ECEACBC]) [    ] o.a.s.c.c.SolrZkClient makePath: /configs/conf1/mapping-ISOLatin1Accent.txt
   [junit4]   2> 1332302 INFO  (TEST-ChaosMonkeyNothingIsSafeTest.test-seed#[888BC74A4ECEACBC]) [    ] o.a.s.c.AbstractZkTestCase put /x1/jenkins/jenkins-slave/workspace/Lucene-Solr-Tests-master/solr/core/src/test-files/solr/collection1/conf/old_synonyms.txt to /configs/conf1/old_synonyms.txt
   [junit4]   2> 1332302 INFO  (TEST-ChaosMonkeyNothingIsSafeTest.test-seed#[888BC74A4ECEACBC]) [    ] o.a.s.c.c.SolrZkClient makePath: /configs/conf1/old_synonyms.txt
   [junit4]   2> 1332303 INFO  (TEST-ChaosMonkeyNothingIsSafeTest.test-seed#[888BC74A4ECEACBC]) [    ] o.a.s.c.AbstractZkTestCase put /x1/jenkins/jenkins-slave/workspace/Lucene-Solr-Tests-master/solr/core/src/test-files/solr/collection1/conf/synonyms.txt to /configs/conf1/synonyms.txt
   [junit4]   2> 1332303 INFO  (TEST-ChaosMonkeyNothingIsSafeTest.test-seed#[888BC74A4ECEACBC]) [    ] o.a.s.c.c.SolrZkClient makePath: /configs/conf1/synonyms.txt
   [junit4]   2> 1332366 INFO  (TEST-ChaosMonkeyNothingIsSafeTest.test-seed#[888BC74A4ECEACBC]) [    ] o.a.s.SolrTestCaseJ4 Writing core.properties file to /x1/jenkins/jenkins-slave/workspace/Lucene-Solr-Tests-master/solr/build/solr-core/test/J0/temp/solr.cloud.ChaosMonkeyNothingIsSafeTest_888BC74A4ECEACBC-001/control-001/cores/collection1
   [junit4]   2> 1332367 INFO  (TEST-ChaosMonkeyNothingIsSafeTest.test-seed#[888BC74A4ECEACBC]) [    ] o.e.j.s.Server jetty-9.3.8.v20160314
   [junit4]   2> 1332371 INFO  (TEST-ChaosMonkeyNothingIsSafeTest.test-seed#[888BC74A4ECEACBC]) [    ] o.e.j.s.h.ContextHandler Started o.e.j.s.ServletContextHandler@10082562{/bch,null,AVAILABLE}
   [junit4]   2> 1332376 INFO  (TEST-ChaosMonkeyNothingIsSafeTest.test-seed#[888BC74A4ECEACBC]) [    ] o.e.j.s.ServerConnector Started ServerConnector@9aacfe9{HTTP/1.1,[http/1.1]}{127.0.0.1:46893}
   [junit4]   2> 1332376 INFO  (TEST-ChaosMonkeyNothingIsSafeTest.test-seed#[888BC74A4ECEACBC]) [    ] o.e.j.s.Server Started @1334440ms
   [junit4]   2> 1332376 INFO  (TEST-ChaosMonkeyNothingIsSafeTest.test-seed#[888BC74A4ECEACBC]) [    ] o.a.s.c.s.e.JettySolrRunner Jetty properties: {solr.data.dir=/x1/jenkins/jenkins-slave/workspace/Lucene-Solr-Tests-master/solr/build/solr-core/test/J0/temp/solr.cloud.ChaosMonkeyNothingIsSafeTest_888BC74A4ECEACBC-001/tempDir-001/control/data, hostContext=/bch, hostPort=46893, coreRootDirectory=/x1/jenkins/jenkins-slave/workspace/Lucene-Solr-Tests-master/solr/build/solr-core/test/J0/../../../../../../../../../../x1/jenkins/jenkins-slave/workspace/Lucene-Solr-Tests-master/solr/build/solr-core/test/J0/temp/solr.cloud.ChaosMonkeyNothingIsSafeTest_888BC74A4ECEACBC-001/control-001/cores}
   [junit4]   2> 1332376 INFO  (TEST-ChaosMonkeyNothingIsSafeTest.test-seed#[888BC74A4ECEACBC]) [    ] o.a.s.s.SolrDispatchFilter SolrDispatchFilter.init(): sun.misc.Launcher$AppClassLoader@73d16e93
   [junit4]   2> 1332376 INFO  (TEST-ChaosMonkeyNothingIsSafeTest.test-seed#[888BC74A4ECEACBC]) [    ] o.a.s.c.SolrResourceLoader new SolrResourceLoader for directory: '/x1/jenkins/jenkins-slave/workspace/Lucene-Solr-Tests-master/solr/build/solr-core/test/J0/temp/solr.cloud.ChaosMonkeyNothingIsSafeTest_888BC74A4ECEACBC-001/control-001'
   [junit4]   2> 1332376 INFO  (TEST-ChaosMonkeyNothingIsSafeTest.test-seed#[888BC74A4ECEACBC]) [    ] o.a.s.c.SolrResourceLoader JNDI not configured for solr (NoInitialContextEx)
   [junit4]   2> 1332377 INFO  (TEST-ChaosMonkeyNothingIsSafeTest.test-seed#[888BC74A4ECEACBC]) [    ] o.a.s.c.SolrResourceLoader solr home defaulted to 'solr/' (could not find system property or JNDI)
   [junit4]   2> 1332377 INFO  (TEST-ChaosMonkeyNothingIsSafeTest.test-seed#[888BC74A4ECEACBC]) [    ] o.a.s.c.c.SolrZkClient Using default ZkCredentialsProvider
   [junit4]   2> 1332377 INFO  (TEST-ChaosMonkeyNothingIsSafeTest.test-seed#[888BC74A4ECEACBC]) [    ] o.a.s.c.c.ConnectionManager Waiting for client to connect to ZooKeeper
   [junit4]   2> 1332379 INFO  (zkCallback-1765-thread-1) [    ] o.a.s.c.c.ConnectionManager Watcher org.apache.solr.common.cloud.ConnectionManager@311c1557 name:ZooKeeperConnection Watcher:127.0.0.1:37193/solr got event WatchedEvent state:SyncConnected type:None path:null path:null type:None
   [junit4]   2> 1332379 INFO  (TEST-ChaosMonkeyNothingIsSafeTest.test-seed#[888BC74A4ECEACBC]) [    ] o.a.s.c.c.ConnectionManager Client is connected to ZooKeeper
   [junit4]   2> 1332379 INFO  (TEST-ChaosMonkeyNothingIsSafeTest.test-seed#[888BC74A4ECEACBC]) [    ] o.a.s.c.c.SolrZkClient Using default ZkACLProvider
   [junit4]   2> 1332380 INFO  (TEST-ChaosMonkeyNothingIsSafeTest.test-seed#[888BC74A4ECEACBC]) [    ] o.a.s.s.SolrDispatchFilter Loading solr.xml from SolrHome (not found in ZooKeeper)
   [junit4]   2> 1332380 INFO  (TEST-ChaosMonkeyNothingIsSafeTest.test-seed#[888BC74A4ECEACBC]) [    ] o.a.s.c.SolrXmlConfig Loading container configuration from /x1/jenkins/jenkins-slave/workspace/Lucene-Solr-Tests-master/solr/build/solr-core/test/J0/temp/solr.cloud.ChaosMonkeyNothingIsSafeTest_888BC74A4ECEACBC-001/control-001/solr.xml
   [junit4]   2> 1332384 INFO  (TEST-ChaosMonkeyNothingIsSafeTest.test-seed#[888BC74A4ECEACBC]) [    ] o.a.s.c.CorePropertiesLocator Config-defined core root directory: /x1/jenkins/jenkins-slave/workspace/Lucene-Solr-Tests-master/solr/build/solr-core/test/J0/../../../../../../../../../../x1/jenkins/jenkins-slave/workspace/Lucene-Solr-Tests-master/solr/build/solr-core/test/J0/temp/solr.cloud.ChaosMonkeyNothingIsSafeTest_888BC74A4ECEACBC-001/control-001/cores
   [junit4]   2> 1332384 INFO  (TEST-ChaosMonkeyNothingIsSafeTest.test-seed#[888BC74A4ECEACBC]) [    ] o.a.s.c.CoreContainer New CoreContainer 1748424471
   [junit4]   2> 1332384 INFO  (TEST-ChaosMonkeyNothingIsSafeTest.test-seed#[888BC74A4ECEACBC]) [    ] o.a.s.c.CoreContainer Loading cores into CoreContainer [instanceDir=/x1/jenkins/jenkins-slave/workspace/Lucene-Solr-Tests-master/solr/build/solr-core/test/J0/temp/solr.cloud.ChaosMonkeyNothingIsSafeTest_888BC74A4ECEACBC-001/control-001]
   [junit4]   2> 1332384 WARN  (TEST-ChaosMonkeyNothingIsSafeTest.test-seed#[888BC74A4ECEACBC]) [    ] o.a.s.c.CoreContainer Couldn't add files from /x1/jenkins/jenkins-slave/workspace/Lucene-Solr-Tests-master/solr/build/solr-core/test/J0/temp/solr.cloud.ChaosMonkeyNothingIsSafeTest_888BC74A4ECEACBC-001/control-001/lib to classpath: /x1/jenkins/jenkins-slave/workspace/Lucene-Solr-Tests-master/solr/build/solr-core/test/J0/temp/solr.cloud.ChaosMonkeyNothingIsSafeTest_888BC74A4ECEACBC-001/control-001/lib
   [junit4]   2> 1332384 INFO  (TEST-ChaosMonkeyNothingIsSafeTest.test-seed#[888BC74A4ECEACBC]) [    ] o.a.s.h.c.HttpShardHandlerFactory created with socketTimeout : 90000,urlScheme : ,connTimeout : 15000,maxConnectionsPerHost : 20,maxConnections : 10000,corePoolSize : 0,maximumPoolSize : 2147483647,maxThreadIdleTime : 5,sizeOfQueue : -1,fairnessPolicy : false,
   [junit4]   2> 1332390 INFO  (TEST-ChaosMonkeyNothingIsSafeTest.test-seed#[888BC74A4ECEACBC]) [    ] o.a.s.u.UpdateShardHandler Creating UpdateShardHandler HTTP client with params: 
   [junit4]   2> 1332390 INFO  (TEST-ChaosMonkeyNothingIsSafeTest.test-seed#[888BC74A4ECEACBC]) [    ] o.a.s.l.LogWatcher SLF4J impl is org.slf4j.impl.Log4jLoggerFactory
   [junit4]   2> 1332390 INFO  (TEST-ChaosMonkeyNothingIsSafeTest.test-seed#[888BC74A4ECEACBC]) [    ] o.a.s.l.LogWatcher Registering Log Listener [Log4j (org.slf4j.impl.Log4jLoggerFactory)]
   [junit4]   2> 1332390 INFO  (TEST-ChaosMonkeyNothingIsSafeTest.test-seed#[888BC74A4ECEACBC]) [    ] o.a.s.c.ZkContainer Zookeeper client=127.0.0.1:37193/solr
   [junit4]   2> 1332390 INFO  (TEST-ChaosMonkeyNothingIsSafeTest.test-seed#[888BC74A4ECEACBC]) [    ] o.a.s.c.ZkController zkHost includes chroot
   [junit4]   2> 1332390 INFO  (TEST-ChaosMonkeyNothingIsSafeTest.test-seed#[888BC74A4ECEACBC]) [    ] o.a.s.c.c.SolrZkClient Using default ZkCredentialsProvider
   [junit4]   2> 1332394 INFO  (TEST-ChaosMonkeyNothingIsSafeTest.test-seed#[888BC74A4ECEACBC]) [    ] o.a.s.c.c.ConnectionManager Waiting for client to connect to ZooKeeper
   [junit4]   2> 1332401 INFO  (zkCallback-1768-thread-1) [    ] o.a.s.c.c.ConnectionManager Watcher org.apache.solr.common.cloud.ConnectionManager@2f78c4a6 name:ZooKeeperConnection Watcher:127.0.0.1:37193 got event WatchedEvent state:SyncConnected type:None path:null path:null type:None
   [junit4]   2> 1332402 INFO  (TEST-ChaosMonkeyNothingIsSafeTest.test-seed#[888BC74A4ECEACBC]) [    ] o.a.s.c.c.ConnectionManager Client is connected to ZooKeeper
   [junit4]   2> 1332402 INFO  (TEST-ChaosMonkeyNothingIsSafeTest.test-seed#[888BC74A4ECEACBC]) [    ] o.a.s.c.c.SolrZkClient Using default ZkACLProvider
   [junit4]   2> 1332403 INFO  (TEST-ChaosMonkeyNothingIsSafeTest.test-seed#[888BC74A4ECEACBC]) [n:127.0.0.1:46893_bch    ] o.a.s.c.ZkController Added new OnReconnect listener org.apache.solr.cloud.ZkController$$Lambda$37/234470503@27b4475a
   [junit4]   2> 1332403 INFO  (TEST-ChaosMonkeyNothingIsSafeTest.test-seed#[888BC74A4ECEACBC]) [n:127.0.0.1:46893_bch    ] o.a.s.c.c.ConnectionManager Waiting for client to connect to ZooKeeper
   [junit4]   2> 1332404 INFO  (zkCallback-1769-thread-1-processing-n:127.0.0.1:46893_bch) [n:127.0.0.1:46893_bch    ] o.a.s.c.c.ConnectionManager Watcher org.apache.solr.common.cloud.ConnectionManager@4a4ae27e name:ZooKeeperConnection Watcher:127.0.0.1:37193/solr got event WatchedEvent state:SyncConnected type:None path:null path:null type:None
   [junit4]   2> 1332404 INFO  (TEST-ChaosMonkeyNothingIsSafeTest.test-seed#[888BC74A4ECEACBC]) [n:127.0.0.1:46893_bch    ] o.a.s.c.c.ConnectionManager Client is connected to ZooKeeper
   [junit4]   2> 1332405 INFO  (TEST-ChaosMonkeyNothingIsSafeTest.test-seed#[888BC74A4ECEACBC]) [n:127.0.0.1:46893_bch    ] o.a.s.c.c.SolrZkClient makePath: /overseer/queue
   [junit4]   2> 1332406 INFO  (TEST-ChaosMonkeyNothingIsSafeTest.test-seed#[888BC74A4ECEACBC]) [n:127.0.0.1:46893_bch    ] o.a.s.c.c.SolrZkClient makePath: /overseer/collection-queue-work
   [junit4]   2> 1332408 INFO  (TEST-ChaosMonkeyNothingIsSafeTest.test-seed#[888BC74A4ECEACBC]) [n:127.0.0.1:46893_bch    ] o.a.s.c.c.SolrZkClient makePath: /overseer/collection-map-running
   [junit4]   2> 1332409 INFO  (TEST-ChaosMonkeyNothingIsSafeTest.test-seed#[888BC74A4ECEACBC]) [n:127.0.0.1:46893_bch    ] o.a.s.c.c.SolrZkClient makePath: /overseer/collection-map-completed
   [junit4]   2> 1332410 INFO  (TEST-ChaosMonkeyNothingIsSafeTest.test-seed#[888BC74A4ECEACBC]) [n:127.0.0.1:46893_bch    ] o.a.s.c.c.SolrZkClient makePath: /overseer/collection-map-failure
   [junit4]   2> 1332411 INFO  (TEST-ChaosMonkeyNothingIsSafeTest.test-seed#[888BC74A4ECEACBC]) [n:127.0.0.1:46893_bch    ] o.a.s.c.c.SolrZkClient makePath: /live_nodes
   [junit4]   2> 1332411 INFO  (TEST-ChaosMonkeyNothingIsSafeTest.test-seed#[888BC74A4ECEACBC]) [n:127.0.0.1:46893_bch    ] o.a.s.c.c.SolrZkClient makePath: /aliases.json
   [junit4]   2> 1332412 INFO  (TEST-ChaosMonkeyNothingIsSafeTest.test-seed#[888BC74A4ECEACBC]) [n:127.0.0.1:46893_bch    ] o.a.s.c.c.SolrZkClient makePath: /clusterstate.json
   [junit4]   2> 1332413 INFO  (TEST-ChaosMonkeyNothingIsSafeTest.test-seed#[888BC74A4ECEACBC]) [n:127.0.0.1:46893_bch    ] o.a.s.c.c.SolrZkClient makePath: /security.json
   [junit4]   2> 1332413 INFO  (TEST-ChaosMonkeyNothingIsSafeTest.test-seed#[888BC74A4ECEACBC]) [n:127.0.0.1:46893_bch    ] o.a.s.c.c.ZkStateReader Updating cluster state from ZooKeeper... 
   [junit4]   2> 1332414 INFO  (TEST-ChaosMonkeyNothingIsSafeTest.test-seed#[888BC74A4ECEACBC]) [n:127.0.0.1:46893_bch    ] o.a.s.c.c.ZkStateReader Loaded empty cluster properties
   [junit4]   2> 1332414 INFO  (TEST-ChaosMonkeyNothingIsSafeTest.test-seed#[888BC74A4ECEACBC]) [n:127.0.0.1:46893_bch    ] o.a.s.c.c.ZkStateReader Updated live nodes from ZooKeeper... (0) -> (0)
   [junit4]   2> 1332416 INFO  (TEST-ChaosMonkeyNothingIsSafeTest.test-seed#[888BC74A4ECEACBC]) [n:127.0.0.1:46893_bch    ] o.a.s.c.c.SolrZkClient makePath: /overseer_elect
   [junit4]   2> 1332416 INFO  (TEST-ChaosMonkeyNothingIsSafeTest.test-seed#[888BC74A4ECEACBC]) [n:127.0.0.1:46893_bch    ] o.a.s.c.c.SolrZkClient makePath: /overseer_elect/election
   [junit4]   2> 1332417 INFO  (TEST-ChaosMonkeyNothingIsSafeTest.test-seed#[888BC74A4ECEACBC]) [n:127.0.0.1:46893_bch    ] o.a.s.c.Overseer Overseer (id=null) closing
   [junit4]   2> 1332417 INFO  (TEST-ChaosMonkeyNothingIsSafeTest.test-seed#[888BC74A4ECEACBC]) [n:127.0.0.1:46893_bch    ] o.a.s.c.LeaderElector Joined leadership election with path: /overseer_elect/election/95906722719006724-127.0.0.1:46893_bch-n_0000000000
   [junit4]   2> 1332417 INFO  (TEST-ChaosMonkeyNothingIsSafeTest.test-seed#[888BC74A4ECEACBC]) [n:127.0.0.1:46893_bch    ] o.a.s.c.OverseerElectionContext I am going to be the leader 127.0.0.1:46893_bch
   [junit4]   2> 1332417 INFO  (TEST-ChaosMonkeyNothingIsSafeTest.test-seed#[888BC74A4ECEACBC]) [n:127.0.0.1:46893_bch    ] o.a.s.c.c.SolrZkClient makePath: /overseer_elect/leader
   [junit4]   2> 1332418 INFO  (TEST-ChaosMonkeyNothingIsSafeTest.test-seed#[888BC74A4ECEACBC]) [n:127.0.0.1:46893_bch    ] o.a.s.c.Overseer Overseer (id=95906722719006724-127.0.0.1:46893_bch-n_0000000000) starting
   [junit4]   2> 1332419 INFO  (TEST-ChaosMonkeyNothingIsSafeTest.test-seed#[888BC74A4ECEACBC]) [n:127.0.0.1:46893_bch    ] o.a.s.c.c.SolrZkClient makePath: /overseer/queue-work
   [junit4]   2> 1332422 INFO  (TEST-ChaosMonkeyNothingIsSafeTest.test-seed#[888BC74A4ECEACBC]) [n:127.0.0.1:46893_bch    ] o.a.s.c.OverseerAutoReplicaFailoverThread Starting OverseerAutoReplicaFailoverThread autoReplicaFailoverWorkLoopDelay=10000 autoReplicaFailoverWaitAfterExpiration=30000 autoReplicaFailoverBadNodeExpiration=60000
   [junit4]   2> 1332423 INFO  (OverseerStateUpdate-95906722719006724-127.0.0.1:46893_bch-n_0000000000) [n:127.0.0.1:46893_bch    ] o.a.s.c.Overseer Starting to work on the main queue
   [junit4]   2> 1332424 INFO  (OverseerCollectionConfigSetProcessor-95906722719006724-127.0.0.1:46893_bch-n_0000000000) [n:127.0.0.1:46893_bch    ] o.a.s.c.OverseerTaskProcessor Process current queue of overseer operations
   [junit4]   2> 1332424 INFO  (TEST-ChaosMonkeyNothingIsSafeTest

[...truncated too long message...]

1-processing-n:127.0.0.1:47503_bch x:collection1 s:shard1 c:collection1 r:core_node1) [n:127.0.0.1:47503_bch c:collection1 s:shard1 r:core_node1 x:collection1] o.a.s.c.CachingDirectoryFactory Closing directory: /x1/jenkins/jenkins-slave/workspace/Lucene-Solr-Tests-master/solr/build/solr-core/test/J0/temp/solr.cloud.ChaosMonkeyNothingIsSafeTest_888BC74A4ECEACBC-001/shard-1-001/cores/collection1/data
   [junit4]   2> 1376268 INFO  (TEST-ChaosMonkeyNothingIsSafeTest.test-seed#[888BC74A4ECEACBC]) [    ] o.a.s.c.Overseer Overseer (id=95906722719006734-127.0.0.1:47503_bch-n_0000000003) closing
   [junit4]   2> 1376268 INFO  (OverseerStateUpdate-95906722719006734-127.0.0.1:47503_bch-n_0000000003) [n:127.0.0.1:47503_bch    ] o.a.s.c.Overseer Overseer Loop exiting : 127.0.0.1:47503_bch
   [junit4]   2> 1376270 INFO  (zkCallback-1791-thread-2-processing-n:127.0.0.1:47503_bch) [n:127.0.0.1:47503_bch    ] o.a.s.c.c.ZkStateReader A live node change: [WatchedEvent state:SyncConnected type:NodeChildrenChanged path:/live_nodes], has occurred - updating... (live nodes size: [1])
   [junit4]   2> 1376270 WARN  (zkCallback-1791-thread-2-processing-n:127.0.0.1:47503_bch) [n:127.0.0.1:47503_bch    ] o.a.s.c.c.ZkStateReader ZooKeeper watch triggered, but Solr cannot talk to ZK: [KeeperErrorCode = Session expired for /live_nodes]
   [junit4]   2> 1376271 INFO  (TEST-ChaosMonkeyNothingIsSafeTest.test-seed#[888BC74A4ECEACBC]) [    ] o.e.j.s.ServerConnector Stopped ServerConnector@59548ae7{HTTP/1.1,[http/1.1]}{127.0.0.1:47503}
   [junit4]   2> 1376272 INFO  (TEST-ChaosMonkeyNothingIsSafeTest.test-seed#[888BC74A4ECEACBC]) [    ] o.e.j.s.h.ContextHandler Stopped o.e.j.s.ServletContextHandler@4d9808ab{/bch,null,UNAVAILABLE}
   [junit4]   2> 1376277 INFO  (TEST-ChaosMonkeyNothingIsSafeTest.test-seed#[888BC74A4ECEACBC]) [    ] o.a.s.c.ChaosMonkey monkey: stop shard! 60556
   [junit4]   2> 1376278 INFO  (TEST-ChaosMonkeyNothingIsSafeTest.test-seed#[888BC74A4ECEACBC]) [    ] o.a.s.c.ZkTestServer connecting to 127.0.0.1:37193 37193
   [junit4]   2> 1376455 INFO  (Thread-4627) [    ] o.a.s.c.ZkTestServer connecting to 127.0.0.1:37193 37193
   [junit4]   2> NOTE: reproduce with: ant test  -Dtestcase=ChaosMonkeyNothingIsSafeTest -Dtests.method=test -Dtests.seed=888BC74A4ECEACBC -Dtests.multiplier=2 -Dtests.slow=true -Dtests.locale=mt-MT -Dtests.timezone=America/Santarem -Dtests.asserts=true -Dtests.file.encoding=ISO-8859-1
   [junit4] FAILURE 44.3s J0 | ChaosMonkeyNothingIsSafeTest.test <<<
   [junit4]    > Throwable #1: java.lang.AssertionError: document count mismatch.  control=1827 sum(shards)=1811 cloudClient=1811
   [junit4]    > 	at __randomizedtesting.SeedInfo.seed([888BC74A4ECEACBC:DFF890E032C144]:0)
   [junit4]    > 	at org.apache.solr.cloud.AbstractFullDistribZkTestBase.checkShardConsistency(AbstractFullDistribZkTestBase.java:1319)
   [junit4]    > 	at org.apache.solr.cloud.ChaosMonkeyNothingIsSafeTest.test(ChaosMonkeyNothingIsSafeTest.java:231)
   [junit4]    > 	at org.apache.solr.BaseDistributedSearchTestCase$ShardsRepeatRule$ShardsFixedStatement.callStatement(BaseDistributedSearchTestCase.java:985)
   [junit4]    > 	at org.apache.solr.BaseDistributedSearchTestCase$ShardsRepeatRule$ShardsStatement.evaluate(BaseDistributedSearchTestCase.java:960)
   [junit4]    > 	at java.lang.Thread.run(Thread.java:745)
   [junit4]   2> 1376459 INFO  (SUITE-ChaosMonkeyNothingIsSafeTest-seed#[888BC74A4ECEACBC]-worker) [    ] o.a.s.SolrTestCaseJ4 ###deleteCore
   [junit4]   2> NOTE: leaving temporary files on disk at: /x1/jenkins/jenkins-slave/workspace/Lucene-Solr-Tests-master/solr/build/solr-core/test/J0/temp/solr.cloud.ChaosMonkeyNothingIsSafeTest_888BC74A4ECEACBC-001
   [junit4]   2> May 16, 2016 5:41:35 PM com.carrotsearch.randomizedtesting.ThreadLeakControl checkThreadLeaks
   [junit4]   2> WARNING: Will linger awaiting termination of 1 leaked thread(s).
   [junit4]   2> NOTE: test params are: codec=Asserting(Lucene62): {rnd_b=PostingsFormat(name=Memory doPackFST= true), _version_=Lucene50(blocksize=128), a_t=PostingsFormat(name=Direct), a_i=PostingsFormat(name=Memory doPackFST= true), id=PostingsFormat(name=Memory doPackFST= true)}, docValues:{}, maxPointsInLeafNode=1639, maxMBSortInHeap=6.661296789573223, sim=RandomSimilarity(queryNorm=true,coord=yes): {}, locale=mt-MT, timezone=America/Santarem
   [junit4]   2> NOTE: Linux 3.13.0-85-generic amd64/Oracle Corporation 1.8.0_74 (64-bit)/cpus=4,threads=1,free=174644392,total=530579456
   [junit4]   2> NOTE: All tests run in this JVM: [TestPerFieldSimilarityWithDefaultOverride, TestRTGBase, TestLazyCores, TestXmlQParser, TestCSVLoader, TestMergePolicyConfig, BlockJoinFacetDistribTest, SolrRequestParserTest, TestArbitraryIndexDir, URLClassifyProcessorTest, HdfsChaosMonkeyNothingIsSafeTest, AlternateDirectoryTest, TestSolrCloudWithKerberosAlt, TestDynamicFieldCollectionResource, CdcrReplicationDistributedZkTest, HdfsRestartWhileUpdatingTest, XsltUpdateRequestHandlerTest, DateRangeFieldTest, TestDistribDocBasedVersion, SignatureUpdateProcessorFactoryTest, DistributedQueryComponentOptimizationTest, TestMiniSolrCloudClusterBase, CoreMergeIndexesAdminHandlerTest, TestSubQueryTransformerCrossCore, ParsingFieldUpdateProcessorsTest, JSONWriterTest, FileBasedSpellCheckerTest, SynonymTokenizerTest, HLLSerializationTest, TestRawResponseWriter, OverseerTaskQueueTest, DistributedFacetPivotLargeTest, TestLRUStatsCache, TestInitParams, PreAnalyzedFieldTest, DeleteLastCustomShardedReplicaTest, TestComponentsName, DeleteStatusTest, CurrencyFieldOpenExchangeTest, TestSchemaNameResource, RulesTest, MultiThreadedOCPTest, SSLMigrationTest, TestConfigReload, TestCustomSort, SpatialHeatmapFacetsTest, TestOverriddenPrefixQueryForCustomFieldType, TestSortingResponseWriter, TestFieldResource, TestManagedSchema, TestReplicaProperties, TestSolrQueryParserResource, WrapperMergePolicyFactoryTest, SystemInfoHandlerTest, TestShardHandlerFactory, DateFieldTest, ConcurrentDeleteAndCreateCollectionTest, IndexSchemaTest, ConnectionReuseTest, ForceLeaderTest, SmileWriterTest, CollectionTooManyReplicasTest, OutputWriterTest, CloudExitableDirectoryReaderTest, TestBadConfig, CachingDirectoryFactoryTest, ExternalFileFieldSortTest, TestAtomicUpdateErrorCases, TestReloadDeadlock, CloneFieldUpdateProcessorFactoryTest, TestSchemaVersionResource, AsyncCallRequestStatusResponseTest, CopyFieldTest, TestManagedResourceStorage, PathHierarchyTokenizerFactoryTest, DisMaxRequestHandlerTest, SharedFSAutoReplicaFailoverTest, LeaderElectionIntegrationTest, ActionThrottleTest, TestPseudoReturnFields, BasicZkTest, TestRandomDVFaceting, SolrCloudExampleTest, TestLuceneMatchVersion, TestSmileRequest, TestLeaderElectionZkExpiry, UUIDFieldTest, DocumentAnalysisRequestHandlerTest, CreateCollectionCleanupTest, HdfsDirectoryFactoryTest, TestOmitPositions, HdfsTlogReplayBufferedWhileIndexingTest, TestFoldingMultitermQuery, AddSchemaFieldsUpdateProcessorFactoryTest, DistributedQueryElevationComponentTest, RAMDirectoryFactoryTest, RankQueryTest, TestObjectReleaseTracker, BasicDistributedZkTest, BasicDistributedZk2Test, SyncSliceTest, OpenCloseCoreStressTest, TestReplicationHandler, TestRandomFaceting, TestDistributedGrouping, TestFaceting, TestRecovery, DistributedSpellCheckComponentTest, TestStressVersions, TestCoreContainer, TestSolr4Spatial, SpellCheckComponentTest, SolrCmdDistributorTest, PeerSyncTest, TestFunctionQuery, TestIndexSearcher, ShowFileRequestHandlerTest, TestCoreDiscovery, SpellCheckCollatorTest, CoreAdminHandlerTest, TestStressLucene, SuggesterWFSTTest, QueryEqualityTest, TestRemoteStreaming, DebugComponentTest, CacheHeaderTest, TestSurroundQueryParser, StandardRequestHandlerTest, TestReversedWildcardFilterFactory, TermsComponentTest, TestIndexingPerformance, IndexSchemaRuntimeFieldTest, ReturnFieldsTest, QueryParsingTest, TestPartialUpdateDeduplication, TestPHPSerializedResponseWriter, TestBinaryResponseWriter, HighlighterConfigTest, SOLR749Test, UpdateParamsTest, TestSolrIndexConfig, ResponseLogComponentTest, SolrIndexConfigTest, BadComponentTest, SampleTest, TestDocSet, TestBinaryField, TestSearchPerf, MinimalSchemaTest, TestConfig, TestFuzzyAnalyzedSuggestions, DirectSolrConnectionTest, TestPhraseSuggestions, SpellPossibilityIteratorTest, TestCharFilters, EchoParamsTest, TestSweetSpotSimilarityFactory, TestDFRSimilarityFactory, TestPerFieldSimilarity, TestLMDirichletSimilarityFactory, TestLMJelinekMercerSimilarityFactory, TestIBSimilarityFactory, TestFastWriter, ResourceLoaderTest, TestFastOutputStream, OpenExchangeRatesOrgProviderTest, DateMathParserTest, ChaosMonkeyNothingIsSafeTest]
   [junit4] Completed [448/597 (2!)] on J0 in 44.57s, 1 test, 1 failure <<< FAILURES!

[...truncated 496 lines...]
BUILD FAILED
/x1/jenkins/jenkins-slave/workspace/Lucene-Solr-Tests-master/build.xml:740: The following error occurred while executing this line:
/x1/jenkins/jenkins-slave/workspace/Lucene-Solr-Tests-master/build.xml:684: The following error occurred while executing this line:
/x1/jenkins/jenkins-slave/workspace/Lucene-Solr-Tests-master/build.xml:59: The following error occurred while executing this line:
/x1/jenkins/jenkins-slave/workspace/Lucene-Solr-Tests-master/solr/build.xml:233: The following error occurred while executing this line:
/x1/jenkins/jenkins-slave/workspace/Lucene-Solr-Tests-master/solr/common-build.xml:529: The following error occurred while executing this line:
/x1/jenkins/jenkins-slave/workspace/Lucene-Solr-Tests-master/lucene/common-build.xml:1457: The following error occurred while executing this line:
/x1/jenkins/jenkins-slave/workspace/Lucene-Solr-Tests-master/lucene/common-build.xml:1014: There were test failures: 597 suites (10 ignored), 2413 tests, 1 error, 1 failure, 86 ignored (71 assumptions) [seed: 888BC74A4ECEACBC]

Total time: 56 minutes 59 seconds
Build step 'Invoke Ant' marked build as failure
Archiving artifacts
Recording test results
Email was triggered for: Failure - Any
Sending email for trigger: Failure - Any




Mime
View raw message