lucene-dev mailing list archives

Site index · List index
Message view « Date » · « Thread »
Top « Date » · « Thread »
From Policeman Jenkins Server <jenk...@thetaphi.de>
Subject [JENKINS] Lucene-Solr-6.x-Windows (64bit/jdk1.8.0_92) - Build # 157 - Still Failing!
Date Thu, 05 May 2016 21:49:06 GMT
Build: http://jenkins.thetaphi.de/job/Lucene-Solr-6.x-Windows/157/
Java: 64bit/jdk1.8.0_92 -XX:-UseCompressedOops -XX:+UseG1GC

2 tests failed.
FAILED:  junit.framework.TestSuite.org.apache.solr.schema.TestManagedSchemaAPI

Error Message:
ObjectTracker found 8 object(s) that were not released!!! [MockDirectoryWrapper, MockDirectoryWrapper, TransactionLog, TransactionLog, MDCAwareThreadPoolExecutor, MockDirectoryWrapper, MockDirectoryWrapper, MDCAwareThreadPoolExecutor]

Stack Trace:
java.lang.AssertionError: ObjectTracker found 8 object(s) that were not released!!! [MockDirectoryWrapper, MockDirectoryWrapper, TransactionLog, TransactionLog, MDCAwareThreadPoolExecutor, MockDirectoryWrapper, MockDirectoryWrapper, MDCAwareThreadPoolExecutor]
	at __randomizedtesting.SeedInfo.seed([18545C88E3F8E230]:0)
	at org.junit.Assert.fail(Assert.java:93)
	at org.junit.Assert.assertTrue(Assert.java:43)
	at org.junit.Assert.assertNull(Assert.java:551)
	at org.apache.solr.SolrTestCaseJ4.afterClass(SolrTestCaseJ4.java:256)
	at sun.reflect.GeneratedMethodAccessor21.invoke(Unknown Source)
	at sun.reflect.DelegatingMethodAccessorImpl.invoke(DelegatingMethodAccessorImpl.java:43)
	at java.lang.reflect.Method.invoke(Method.java:498)
	at com.carrotsearch.randomizedtesting.RandomizedRunner.invoke(RandomizedRunner.java:1764)
	at com.carrotsearch.randomizedtesting.RandomizedRunner$7.evaluate(RandomizedRunner.java:834)
	at com.carrotsearch.randomizedtesting.rules.StatementAdapter.evaluate(StatementAdapter.java:36)
	at com.carrotsearch.randomizedtesting.rules.SystemPropertiesRestoreRule$1.evaluate(SystemPropertiesRestoreRule.java:57)
	at org.apache.lucene.util.AbstractBeforeAfterRule$1.evaluate(AbstractBeforeAfterRule.java:45)
	at com.carrotsearch.randomizedtesting.rules.StatementAdapter.evaluate(StatementAdapter.java:36)
	at org.apache.lucene.util.TestRuleStoreClassName$1.evaluate(TestRuleStoreClassName.java:41)
	at com.carrotsearch.randomizedtesting.rules.NoShadowingOrOverridesOnMethodsRule$1.evaluate(NoShadowingOrOverridesOnMethodsRule.java:40)
	at com.carrotsearch.randomizedtesting.rules.NoShadowingOrOverridesOnMethodsRule$1.evaluate(NoShadowingOrOverridesOnMethodsRule.java:40)
	at com.carrotsearch.randomizedtesting.rules.StatementAdapter.evaluate(StatementAdapter.java:36)
	at com.carrotsearch.randomizedtesting.rules.StatementAdapter.evaluate(StatementAdapter.java:36)
	at com.carrotsearch.randomizedtesting.rules.StatementAdapter.evaluate(StatementAdapter.java:36)
	at org.apache.lucene.util.TestRuleAssertionsRequired$1.evaluate(TestRuleAssertionsRequired.java:53)
	at org.apache.lucene.util.TestRuleMarkFailure$1.evaluate(TestRuleMarkFailure.java:47)
	at org.apache.lucene.util.TestRuleIgnoreAfterMaxFailures$1.evaluate(TestRuleIgnoreAfterMaxFailures.java:64)
	at org.apache.lucene.util.TestRuleIgnoreTestSuites$1.evaluate(TestRuleIgnoreTestSuites.java:54)
	at com.carrotsearch.randomizedtesting.rules.StatementAdapter.evaluate(StatementAdapter.java:36)
	at com.carrotsearch.randomizedtesting.ThreadLeakControl$StatementRunner.run(ThreadLeakControl.java:367)
	at java.lang.Thread.run(Thread.java:745)


FAILED:  junit.framework.TestSuite.org.apache.solr.schema.TestManagedSchemaAPI

Error Message:
Could not remove the following files (in the order of attempts):    C:\Users\jenkins\workspace\Lucene-Solr-6.x-Windows\solr\build\solr-core\test\J1\temp\solr.schema.TestManagedSchemaAPI_18545C88E3F8E230-001\tempDir-001\node1\testschemaapi_shard1_replica2\data\tlog\tlog.0000000000000000000: java.nio.file.FileSystemException: C:\Users\jenkins\workspace\Lucene-Solr-6.x-Windows\solr\build\solr-core\test\J1\temp\solr.schema.TestManagedSchemaAPI_18545C88E3F8E230-001\tempDir-001\node1\testschemaapi_shard1_replica2\data\tlog\tlog.0000000000000000000: The process cannot access the file because it is being used by another process.     C:\Users\jenkins\workspace\Lucene-Solr-6.x-Windows\solr\build\solr-core\test\J1\temp\solr.schema.TestManagedSchemaAPI_18545C88E3F8E230-001\tempDir-001\node1\testschemaapi_shard1_replica2\data\tlog: java.nio.file.DirectoryNotEmptyException: C:\Users\jenkins\workspace\Lucene-Solr-6.x-Windows\solr\build\solr-core\test\J1\temp\solr.schema.TestManagedSchemaAPI_18545C88E3F8E230-001\tempDir-001\node1\testschemaapi_shard1_replica2\data\tlog    C:\Users\jenkins\workspace\Lucene-Solr-6.x-Windows\solr\build\solr-core\test\J1\temp\solr.schema.TestManagedSchemaAPI_18545C88E3F8E230-001\tempDir-001\node1\testschemaapi_shard1_replica2\data: java.nio.file.DirectoryNotEmptyException: C:\Users\jenkins\workspace\Lucene-Solr-6.x-Windows\solr\build\solr-core\test\J1\temp\solr.schema.TestManagedSchemaAPI_18545C88E3F8E230-001\tempDir-001\node1\testschemaapi_shard1_replica2\data    C:\Users\jenkins\workspace\Lucene-Solr-6.x-Windows\solr\build\solr-core\test\J1\temp\solr.schema.TestManagedSchemaAPI_18545C88E3F8E230-001\tempDir-001\node1\testschemaapi_shard1_replica2: java.nio.file.DirectoryNotEmptyException: C:\Users\jenkins\workspace\Lucene-Solr-6.x-Windows\solr\build\solr-core\test\J1\temp\solr.schema.TestManagedSchemaAPI_18545C88E3F8E230-001\tempDir-001\node1\testschemaapi_shard1_replica2    C:\Users\jenkins\workspace\Lucene-Solr-6.x-Windows\solr\build\solr-core\test\J1\temp\solr.schema.TestManagedSchemaAPI_18545C88E3F8E230-001\tempDir-001\node1: java.nio.file.DirectoryNotEmptyException: C:\Users\jenkins\workspace\Lucene-Solr-6.x-Windows\solr\build\solr-core\test\J1\temp\solr.schema.TestManagedSchemaAPI_18545C88E3F8E230-001\tempDir-001\node1    C:\Users\jenkins\workspace\Lucene-Solr-6.x-Windows\solr\build\solr-core\test\J1\temp\solr.schema.TestManagedSchemaAPI_18545C88E3F8E230-001\tempDir-001\node2\testschemaapi_shard1_replica1\data\tlog\tlog.0000000000000000001: java.nio.file.FileSystemException: C:\Users\jenkins\workspace\Lucene-Solr-6.x-Windows\solr\build\solr-core\test\J1\temp\solr.schema.TestManagedSchemaAPI_18545C88E3F8E230-001\tempDir-001\node2\testschemaapi_shard1_replica1\data\tlog\tlog.0000000000000000001: The process cannot access the file because it is being used by another process.     C:\Users\jenkins\workspace\Lucene-Solr-6.x-Windows\solr\build\solr-core\test\J1\temp\solr.schema.TestManagedSchemaAPI_18545C88E3F8E230-001\tempDir-001\node2\testschemaapi_shard1_replica1\data\tlog: java.nio.file.DirectoryNotEmptyException: C:\Users\jenkins\workspace\Lucene-Solr-6.x-Windows\solr\build\solr-core\test\J1\temp\solr.schema.TestManagedSchemaAPI_18545C88E3F8E230-001\tempDir-001\node2\testschemaapi_shard1_replica1\data\tlog    C:\Users\jenkins\workspace\Lucene-Solr-6.x-Windows\solr\build\solr-core\test\J1\temp\solr.schema.TestManagedSchemaAPI_18545C88E3F8E230-001\tempDir-001\node2\testschemaapi_shard1_replica1\data: java.nio.file.DirectoryNotEmptyException: C:\Users\jenkins\workspace\Lucene-Solr-6.x-Windows\solr\build\solr-core\test\J1\temp\solr.schema.TestManagedSchemaAPI_18545C88E3F8E230-001\tempDir-001\node2\testschemaapi_shard1_replica1\data    C:\Users\jenkins\workspace\Lucene-Solr-6.x-Windows\solr\build\solr-core\test\J1\temp\solr.schema.TestManagedSchemaAPI_18545C88E3F8E230-001\tempDir-001\node2\testschemaapi_shard1_replica1: java.nio.file.DirectoryNotEmptyException: C:\Users\jenkins\workspace\Lucene-Solr-6.x-Windows\solr\build\solr-core\test\J1\temp\solr.schema.TestManagedSchemaAPI_18545C88E3F8E230-001\tempDir-001\node2\testschemaapi_shard1_replica1    C:\Users\jenkins\workspace\Lucene-Solr-6.x-Windows\solr\build\solr-core\test\J1\temp\solr.schema.TestManagedSchemaAPI_18545C88E3F8E230-001\tempDir-001\node2: java.nio.file.DirectoryNotEmptyException: C:\Users\jenkins\workspace\Lucene-Solr-6.x-Windows\solr\build\solr-core\test\J1\temp\solr.schema.TestManagedSchemaAPI_18545C88E3F8E230-001\tempDir-001\node2    C:\Users\jenkins\workspace\Lucene-Solr-6.x-Windows\solr\build\solr-core\test\J1\temp\solr.schema.TestManagedSchemaAPI_18545C88E3F8E230-001\tempDir-001: java.nio.file.DirectoryNotEmptyException: C:\Users\jenkins\workspace\Lucene-Solr-6.x-Windows\solr\build\solr-core\test\J1\temp\solr.schema.TestManagedSchemaAPI_18545C88E3F8E230-001\tempDir-001 

Stack Trace:
java.io.IOException: Could not remove the following files (in the order of attempts):
   C:\Users\jenkins\workspace\Lucene-Solr-6.x-Windows\solr\build\solr-core\test\J1\temp\solr.schema.TestManagedSchemaAPI_18545C88E3F8E230-001\tempDir-001\node1\testschemaapi_shard1_replica2\data\tlog\tlog.0000000000000000000: java.nio.file.FileSystemException: C:\Users\jenkins\workspace\Lucene-Solr-6.x-Windows\solr\build\solr-core\test\J1\temp\solr.schema.TestManagedSchemaAPI_18545C88E3F8E230-001\tempDir-001\node1\testschemaapi_shard1_replica2\data\tlog\tlog.0000000000000000000: The process cannot access the file because it is being used by another process.

   C:\Users\jenkins\workspace\Lucene-Solr-6.x-Windows\solr\build\solr-core\test\J1\temp\solr.schema.TestManagedSchemaAPI_18545C88E3F8E230-001\tempDir-001\node1\testschemaapi_shard1_replica2\data\tlog: java.nio.file.DirectoryNotEmptyException: C:\Users\jenkins\workspace\Lucene-Solr-6.x-Windows\solr\build\solr-core\test\J1\temp\solr.schema.TestManagedSchemaAPI_18545C88E3F8E230-001\tempDir-001\node1\testschemaapi_shard1_replica2\data\tlog
   C:\Users\jenkins\workspace\Lucene-Solr-6.x-Windows\solr\build\solr-core\test\J1\temp\solr.schema.TestManagedSchemaAPI_18545C88E3F8E230-001\tempDir-001\node1\testschemaapi_shard1_replica2\data: java.nio.file.DirectoryNotEmptyException: C:\Users\jenkins\workspace\Lucene-Solr-6.x-Windows\solr\build\solr-core\test\J1\temp\solr.schema.TestManagedSchemaAPI_18545C88E3F8E230-001\tempDir-001\node1\testschemaapi_shard1_replica2\data
   C:\Users\jenkins\workspace\Lucene-Solr-6.x-Windows\solr\build\solr-core\test\J1\temp\solr.schema.TestManagedSchemaAPI_18545C88E3F8E230-001\tempDir-001\node1\testschemaapi_shard1_replica2: java.nio.file.DirectoryNotEmptyException: C:\Users\jenkins\workspace\Lucene-Solr-6.x-Windows\solr\build\solr-core\test\J1\temp\solr.schema.TestManagedSchemaAPI_18545C88E3F8E230-001\tempDir-001\node1\testschemaapi_shard1_replica2
   C:\Users\jenkins\workspace\Lucene-Solr-6.x-Windows\solr\build\solr-core\test\J1\temp\solr.schema.TestManagedSchemaAPI_18545C88E3F8E230-001\tempDir-001\node1: java.nio.file.DirectoryNotEmptyException: C:\Users\jenkins\workspace\Lucene-Solr-6.x-Windows\solr\build\solr-core\test\J1\temp\solr.schema.TestManagedSchemaAPI_18545C88E3F8E230-001\tempDir-001\node1
   C:\Users\jenkins\workspace\Lucene-Solr-6.x-Windows\solr\build\solr-core\test\J1\temp\solr.schema.TestManagedSchemaAPI_18545C88E3F8E230-001\tempDir-001\node2\testschemaapi_shard1_replica1\data\tlog\tlog.0000000000000000001: java.nio.file.FileSystemException: C:\Users\jenkins\workspace\Lucene-Solr-6.x-Windows\solr\build\solr-core\test\J1\temp\solr.schema.TestManagedSchemaAPI_18545C88E3F8E230-001\tempDir-001\node2\testschemaapi_shard1_replica1\data\tlog\tlog.0000000000000000001: The process cannot access the file because it is being used by another process.

   C:\Users\jenkins\workspace\Lucene-Solr-6.x-Windows\solr\build\solr-core\test\J1\temp\solr.schema.TestManagedSchemaAPI_18545C88E3F8E230-001\tempDir-001\node2\testschemaapi_shard1_replica1\data\tlog: java.nio.file.DirectoryNotEmptyException: C:\Users\jenkins\workspace\Lucene-Solr-6.x-Windows\solr\build\solr-core\test\J1\temp\solr.schema.TestManagedSchemaAPI_18545C88E3F8E230-001\tempDir-001\node2\testschemaapi_shard1_replica1\data\tlog
   C:\Users\jenkins\workspace\Lucene-Solr-6.x-Windows\solr\build\solr-core\test\J1\temp\solr.schema.TestManagedSchemaAPI_18545C88E3F8E230-001\tempDir-001\node2\testschemaapi_shard1_replica1\data: java.nio.file.DirectoryNotEmptyException: C:\Users\jenkins\workspace\Lucene-Solr-6.x-Windows\solr\build\solr-core\test\J1\temp\solr.schema.TestManagedSchemaAPI_18545C88E3F8E230-001\tempDir-001\node2\testschemaapi_shard1_replica1\data
   C:\Users\jenkins\workspace\Lucene-Solr-6.x-Windows\solr\build\solr-core\test\J1\temp\solr.schema.TestManagedSchemaAPI_18545C88E3F8E230-001\tempDir-001\node2\testschemaapi_shard1_replica1: java.nio.file.DirectoryNotEmptyException: C:\Users\jenkins\workspace\Lucene-Solr-6.x-Windows\solr\build\solr-core\test\J1\temp\solr.schema.TestManagedSchemaAPI_18545C88E3F8E230-001\tempDir-001\node2\testschemaapi_shard1_replica1
   C:\Users\jenkins\workspace\Lucene-Solr-6.x-Windows\solr\build\solr-core\test\J1\temp\solr.schema.TestManagedSchemaAPI_18545C88E3F8E230-001\tempDir-001\node2: java.nio.file.DirectoryNotEmptyException: C:\Users\jenkins\workspace\Lucene-Solr-6.x-Windows\solr\build\solr-core\test\J1\temp\solr.schema.TestManagedSchemaAPI_18545C88E3F8E230-001\tempDir-001\node2
   C:\Users\jenkins\workspace\Lucene-Solr-6.x-Windows\solr\build\solr-core\test\J1\temp\solr.schema.TestManagedSchemaAPI_18545C88E3F8E230-001\tempDir-001: java.nio.file.DirectoryNotEmptyException: C:\Users\jenkins\workspace\Lucene-Solr-6.x-Windows\solr\build\solr-core\test\J1\temp\solr.schema.TestManagedSchemaAPI_18545C88E3F8E230-001\tempDir-001

	at org.apache.lucene.util.IOUtils.rm(IOUtils.java:323)
	at org.apache.lucene.util.TestRuleTemporaryFilesCleanup.afterAlways(TestRuleTemporaryFilesCleanup.java:216)
	at com.carrotsearch.randomizedtesting.rules.TestRuleAdapter$1.afterAlways(TestRuleAdapter.java:31)
	at com.carrotsearch.randomizedtesting.rules.StatementAdapter.evaluate(StatementAdapter.java:43)
	at com.carrotsearch.randomizedtesting.rules.StatementAdapter.evaluate(StatementAdapter.java:36)
	at org.apache.lucene.util.TestRuleAssertionsRequired$1.evaluate(TestRuleAssertionsRequired.java:53)
	at org.apache.lucene.util.TestRuleMarkFailure$1.evaluate(TestRuleMarkFailure.java:47)
	at org.apache.lucene.util.TestRuleIgnoreAfterMaxFailures$1.evaluate(TestRuleIgnoreAfterMaxFailures.java:64)
	at org.apache.lucene.util.TestRuleIgnoreTestSuites$1.evaluate(TestRuleIgnoreTestSuites.java:54)
	at com.carrotsearch.randomizedtesting.rules.StatementAdapter.evaluate(StatementAdapter.java:36)
	at com.carrotsearch.randomizedtesting.ThreadLeakControl$StatementRunner.run(ThreadLeakControl.java:367)
	at java.lang.Thread.run(Thread.java:745)




Build Log:
[...truncated 10813 lines...]
   [junit4] Suite: org.apache.solr.schema.TestManagedSchemaAPI
   [junit4]   2> Creating dataDir: C:\Users\jenkins\workspace\Lucene-Solr-6.x-Windows\solr\build\solr-core\test\J1\temp\solr.schema.TestManagedSchemaAPI_18545C88E3F8E230-001\init-core-data-001
   [junit4]   2> 705114 WARN  (SUITE-TestManagedSchemaAPI-seed#[18545C88E3F8E230]-worker) [    ] o.a.s.SolrTestCaseJ4 startTrackingSearchers: numOpens=6 numCloses=6
   [junit4]   2> 705114 INFO  (SUITE-TestManagedSchemaAPI-seed#[18545C88E3F8E230]-worker) [    ] o.a.s.SolrTestCaseJ4 Randomized ssl (false) and clientAuth (false)
   [junit4]   2> 705118 INFO  (SUITE-TestManagedSchemaAPI-seed#[18545C88E3F8E230]-worker) [    ] o.a.s.c.ZkTestServer STARTING ZK TEST SERVER
   [junit4]   2> 705118 INFO  (Thread-2090) [    ] o.a.s.c.ZkTestServer client port:0.0.0.0/0.0.0.0:0
   [junit4]   2> 705118 INFO  (Thread-2090) [    ] o.a.s.c.ZkTestServer Starting server
   [junit4]   2> 705218 INFO  (SUITE-TestManagedSchemaAPI-seed#[18545C88E3F8E230]-worker) [    ] o.a.s.c.ZkTestServer start zk server on port:59757
   [junit4]   2> 705218 INFO  (SUITE-TestManagedSchemaAPI-seed#[18545C88E3F8E230]-worker) [    ] o.a.s.c.c.SolrZkClient Using default ZkCredentialsProvider
   [junit4]   2> 705219 INFO  (SUITE-TestManagedSchemaAPI-seed#[18545C88E3F8E230]-worker) [    ] o.a.s.c.c.ConnectionManager Waiting for client to connect to ZooKeeper
   [junit4]   2> 705224 INFO  (zkCallback-824-thread-1) [    ] o.a.s.c.c.ConnectionManager Watcher org.apache.solr.common.cloud.ConnectionManager@7fb39aec name:ZooKeeperConnection Watcher:127.0.0.1:59757 got event WatchedEvent state:SyncConnected type:None path:null path:null type:None
   [junit4]   2> 705224 INFO  (SUITE-TestManagedSchemaAPI-seed#[18545C88E3F8E230]-worker) [    ] o.a.s.c.c.ConnectionManager Client is connected to ZooKeeper
   [junit4]   2> 705225 INFO  (SUITE-TestManagedSchemaAPI-seed#[18545C88E3F8E230]-worker) [    ] o.a.s.c.c.SolrZkClient Using default ZkACLProvider
   [junit4]   2> 705225 INFO  (SUITE-TestManagedSchemaAPI-seed#[18545C88E3F8E230]-worker) [    ] o.a.s.c.c.SolrZkClient makePath: /solr/solr.xml
   [junit4]   2> 705254 INFO  (jetty-launcher-823-thread-2) [    ] o.e.j.s.Server jetty-9.3.8.v20160314
   [junit4]   2> 705254 INFO  (jetty-launcher-823-thread-1) [    ] o.e.j.s.Server jetty-9.3.8.v20160314
   [junit4]   2> 705255 INFO  (jetty-launcher-823-thread-2) [    ] o.e.j.s.h.ContextHandler Started o.e.j.s.ServletContextHandler@7c4e3b41{/solr,null,AVAILABLE}
   [junit4]   2> 705256 INFO  (jetty-launcher-823-thread-2) [    ] o.e.j.s.ServerConnector Started ServerConnector@501f9511{HTTP/1.1,[http/1.1]}{127.0.0.1:59761}
   [junit4]   2> 705256 INFO  (jetty-launcher-823-thread-2) [    ] o.e.j.s.Server Started @709617ms
   [junit4]   2> 705256 INFO  (jetty-launcher-823-thread-2) [    ] o.a.s.c.s.e.JettySolrRunner Jetty properties: {hostContext=/solr, hostPort=59761}
   [junit4]   2> 705256 INFO  (jetty-launcher-823-thread-1) [    ] o.e.j.s.h.ContextHandler Started o.e.j.s.ServletContextHandler@1fc1b414{/solr,null,AVAILABLE}
   [junit4]   2> 705256 INFO  (jetty-launcher-823-thread-2) [    ] o.a.s.s.SolrDispatchFilter SolrDispatchFilter.init(): sun.misc.Launcher$AppClassLoader@73d16e93
   [junit4]   2> 705256 INFO  (jetty-launcher-823-thread-2) [    ] o.a.s.c.SolrResourceLoader new SolrResourceLoader for directory: 'C:\Users\jenkins\workspace\Lucene-Solr-6.x-Windows\solr\build\solr-core\test\J1\temp\solr.schema.TestManagedSchemaAPI_18545C88E3F8E230-001\tempDir-001\node2'
   [junit4]   2> 705256 INFO  (jetty-launcher-823-thread-2) [    ] o.a.s.c.SolrResourceLoader JNDI not configured for solr (NoInitialContextEx)
   [junit4]   2> 705256 INFO  (jetty-launcher-823-thread-2) [    ] o.a.s.c.SolrResourceLoader solr home defaulted to 'solr/' (could not find system property or JNDI)
   [junit4]   2> 705257 INFO  (jetty-launcher-823-thread-1) [    ] o.e.j.s.ServerConnector Started ServerConnector@efef558{HTTP/1.1,[http/1.1]}{127.0.0.1:59764}
   [junit4]   2> 705257 INFO  (jetty-launcher-823-thread-1) [    ] o.e.j.s.Server Started @709618ms
   [junit4]   2> 705257 INFO  (jetty-launcher-823-thread-1) [    ] o.a.s.c.s.e.JettySolrRunner Jetty properties: {hostContext=/solr, hostPort=59764}
   [junit4]   2> 705257 INFO  (jetty-launcher-823-thread-1) [    ] o.a.s.s.SolrDispatchFilter SolrDispatchFilter.init(): sun.misc.Launcher$AppClassLoader@73d16e93
   [junit4]   2> 705257 INFO  (jetty-launcher-823-thread-1) [    ] o.a.s.c.SolrResourceLoader new SolrResourceLoader for directory: 'C:\Users\jenkins\workspace\Lucene-Solr-6.x-Windows\solr\build\solr-core\test\J1\temp\solr.schema.TestManagedSchemaAPI_18545C88E3F8E230-001\tempDir-001\node1'
   [junit4]   2> 705257 INFO  (jetty-launcher-823-thread-1) [    ] o.a.s.c.SolrResourceLoader JNDI not configured for solr (NoInitialContextEx)
   [junit4]   2> 705257 INFO  (jetty-launcher-823-thread-2) [    ] o.a.s.c.c.SolrZkClient Using default ZkCredentialsProvider
   [junit4]   2> 705257 INFO  (jetty-launcher-823-thread-1) [    ] o.a.s.c.SolrResourceLoader solr home defaulted to 'solr/' (could not find system property or JNDI)
   [junit4]   2> 705258 INFO  (jetty-launcher-823-thread-2) [    ] o.a.s.c.c.ConnectionManager Waiting for client to connect to ZooKeeper
   [junit4]   2> 705258 INFO  (jetty-launcher-823-thread-1) [    ] o.a.s.c.c.SolrZkClient Using default ZkCredentialsProvider
   [junit4]   2> 705259 INFO  (jetty-launcher-823-thread-1) [    ] o.a.s.c.c.ConnectionManager Waiting for client to connect to ZooKeeper
   [junit4]   2> 705264 INFO  (zkCallback-825-thread-1) [    ] o.a.s.c.c.ConnectionManager Watcher org.apache.solr.common.cloud.ConnectionManager@5bc08c3c name:ZooKeeperConnection Watcher:127.0.0.1:59757/solr got event WatchedEvent state:SyncConnected type:None path:null path:null type:None
   [junit4]   2> 705264 INFO  (zkCallback-826-thread-1) [    ] o.a.s.c.c.ConnectionManager Watcher org.apache.solr.common.cloud.ConnectionManager@31dca1c name:ZooKeeperConnection Watcher:127.0.0.1:59757/solr got event WatchedEvent state:SyncConnected type:None path:null path:null type:None
   [junit4]   2> 705264 INFO  (jetty-launcher-823-thread-2) [    ] o.a.s.c.c.ConnectionManager Client is connected to ZooKeeper
   [junit4]   2> 705264 INFO  (jetty-launcher-823-thread-1) [    ] o.a.s.c.c.ConnectionManager Client is connected to ZooKeeper
   [junit4]   2> 705265 INFO  (jetty-launcher-823-thread-2) [    ] o.a.s.c.c.SolrZkClient Using default ZkACLProvider
   [junit4]   2> 705265 INFO  (jetty-launcher-823-thread-1) [    ] o.a.s.c.c.SolrZkClient Using default ZkACLProvider
   [junit4]   2> 705265 INFO  (jetty-launcher-823-thread-2) [    ] o.a.s.s.SolrDispatchFilter solr.xml found in ZooKeeper. Loading...
   [junit4]   2> 705266 INFO  (jetty-launcher-823-thread-1) [    ] o.a.s.s.SolrDispatchFilter solr.xml found in ZooKeeper. Loading...
   [junit4]   2> 705280 WARN  (NIOServerCxn.Factory:0.0.0.0/0.0.0.0:0) [    ] o.a.z.s.NIOServerCnxn caught end of stream exception
   [junit4]   2> EndOfStreamException: Unable to read additional data from client sessionid 0x15482bddb180002, likely client has closed socket
   [junit4]   2> 	at org.apache.zookeeper.server.NIOServerCnxn.doIO(NIOServerCnxn.java:228)
   [junit4]   2> 	at org.apache.zookeeper.server.NIOServerCnxnFactory.run(NIOServerCnxnFactory.java:208)
   [junit4]   2> 	at java.lang.Thread.run(Thread.java:745)
   [junit4]   2> 705281 INFO  (jetty-launcher-823-thread-2) [    ] o.a.s.c.CorePropertiesLocator Config-defined core root directory: C:\Users\jenkins\workspace\Lucene-Solr-6.x-Windows\solr\build\solr-core\test\J1\temp\solr.schema.TestManagedSchemaAPI_18545C88E3F8E230-001\tempDir-001\node2\.
   [junit4]   2> 705282 INFO  (jetty-launcher-823-thread-2) [    ] o.a.s.c.CoreContainer New CoreContainer 1856424830
   [junit4]   2> 705282 INFO  (jetty-launcher-823-thread-2) [    ] o.a.s.c.CoreContainer Loading cores into CoreContainer [instanceDir=C:\Users\jenkins\workspace\Lucene-Solr-6.x-Windows\solr\build\solr-core\test\J1\temp\solr.schema.TestManagedSchemaAPI_18545C88E3F8E230-001\tempDir-001\node2]
   [junit4]   2> 705282 WARN  (jetty-launcher-823-thread-2) [    ] o.a.s.c.CoreContainer Couldn't add files from C:\Users\jenkins\workspace\Lucene-Solr-6.x-Windows\solr\build\solr-core\test\J1\temp\solr.schema.TestManagedSchemaAPI_18545C88E3F8E230-001\tempDir-001\node2\lib to classpath: C:\Users\jenkins\workspace\Lucene-Solr-6.x-Windows\solr\build\solr-core\test\J1\temp\solr.schema.TestManagedSchemaAPI_18545C88E3F8E230-001\tempDir-001\node2\lib
   [junit4]   2> 705282 INFO  (jetty-launcher-823-thread-2) [    ] o.a.s.h.c.HttpShardHandlerFactory created with socketTimeout : 90000,urlScheme : ,connTimeout : 15000,maxConnectionsPerHost : 20,maxConnections : 10000,corePoolSize : 0,maximumPoolSize : 2147483647,maxThreadIdleTime : 5,sizeOfQueue : -1,fairnessPolicy : false,useRetries : false,
   [junit4]   2> 705285 INFO  (jetty-launcher-823-thread-2) [    ] o.a.s.u.UpdateShardHandler Creating UpdateShardHandler HTTP client with params: socketTimeout=340000&connTimeout=45000&retry=true
   [junit4]   2> 705286 INFO  (jetty-launcher-823-thread-2) [    ] o.a.s.l.LogWatcher SLF4J impl is org.slf4j.impl.Log4jLoggerFactory
   [junit4]   2> 705286 INFO  (jetty-launcher-823-thread-2) [    ] o.a.s.l.LogWatcher Registering Log Listener [Log4j (org.slf4j.impl.Log4jLoggerFactory)]
   [junit4]   2> 705286 INFO  (jetty-launcher-823-thread-2) [    ] o.a.s.c.ZkContainer Zookeeper client=127.0.0.1:59757/solr
   [junit4]   2> 705286 INFO  (jetty-launcher-823-thread-2) [    ] o.a.s.c.ZkController zkHost includes chroot
   [junit4]   2> 705286 INFO  (jetty-launcher-823-thread-2) [    ] o.a.s.c.c.SolrZkClient Using default ZkCredentialsProvider
   [junit4]   2> 705288 INFO  (jetty-launcher-823-thread-1) [    ] o.a.s.c.CorePropertiesLocator Config-defined core root directory: C:\Users\jenkins\workspace\Lucene-Solr-6.x-Windows\solr\build\solr-core\test\J1\temp\solr.schema.TestManagedSchemaAPI_18545C88E3F8E230-001\tempDir-001\node1\.
   [junit4]   2> 705288 INFO  (jetty-launcher-823-thread-1) [    ] o.a.s.c.CoreContainer New CoreContainer 308031767
   [junit4]   2> 705288 INFO  (jetty-launcher-823-thread-1) [    ] o.a.s.c.CoreContainer Loading cores into CoreContainer [instanceDir=C:\Users\jenkins\workspace\Lucene-Solr-6.x-Windows\solr\build\solr-core\test\J1\temp\solr.schema.TestManagedSchemaAPI_18545C88E3F8E230-001\tempDir-001\node1]
   [junit4]   2> 705289 WARN  (jetty-launcher-823-thread-1) [    ] o.a.s.c.CoreContainer Couldn't add files from C:\Users\jenkins\workspace\Lucene-Solr-6.x-Windows\solr\build\solr-core\test\J1\temp\solr.schema.TestManagedSchemaAPI_18545C88E3F8E230-001\tempDir-001\node1\lib to classpath: C:\Users\jenkins\workspace\Lucene-Solr-6.x-Windows\solr\build\solr-core\test\J1\temp\solr.schema.TestManagedSchemaAPI_18545C88E3F8E230-001\tempDir-001\node1\lib
   [junit4]   2> 705289 INFO  (jetty-launcher-823-thread-1) [    ] o.a.s.h.c.HttpShardHandlerFactory created with socketTimeout : 90000,urlScheme : ,connTimeout : 15000,maxConnectionsPerHost : 20,maxConnections : 10000,corePoolSize : 0,maximumPoolSize : 2147483647,maxThreadIdleTime : 5,sizeOfQueue : -1,fairnessPolicy : false,useRetries : false,
   [junit4]   2> 705289 INFO  (jetty-launcher-823-thread-2) [    ] o.a.s.c.c.ConnectionManager Waiting for client to connect to ZooKeeper
   [junit4]   2> 705290 INFO  (jetty-launcher-823-thread-1) [    ] o.a.s.u.UpdateShardHandler Creating UpdateShardHandler HTTP client with params: socketTimeout=340000&connTimeout=45000&retry=true
   [junit4]   2> 705291 INFO  (jetty-launcher-823-thread-1) [    ] o.a.s.l.LogWatcher SLF4J impl is org.slf4j.impl.Log4jLoggerFactory
   [junit4]   2> 705291 INFO  (jetty-launcher-823-thread-1) [    ] o.a.s.l.LogWatcher Registering Log Listener [Log4j (org.slf4j.impl.Log4jLoggerFactory)]
   [junit4]   2> 705291 INFO  (jetty-launcher-823-thread-1) [    ] o.a.s.c.ZkContainer Zookeeper client=127.0.0.1:59757/solr
   [junit4]   2> 705291 INFO  (jetty-launcher-823-thread-1) [    ] o.a.s.c.ZkController zkHost includes chroot
   [junit4]   2> 705291 INFO  (jetty-launcher-823-thread-1) [    ] o.a.s.c.c.SolrZkClient Using default ZkCredentialsProvider
   [junit4]   2> 705291 INFO  (jetty-launcher-823-thread-1) [    ] o.a.s.c.c.ConnectionManager Waiting for client to connect to ZooKeeper
   [junit4]   2> 705294 INFO  (zkCallback-829-thread-1) [    ] o.a.s.c.c.ConnectionManager Watcher org.apache.solr.common.cloud.ConnectionManager@3283cbd4 name:ZooKeeperConnection Watcher:127.0.0.1:59757 got event WatchedEvent state:SyncConnected type:None path:null path:null type:None
   [junit4]   2> 705296 INFO  (jetty-launcher-823-thread-2) [    ] o.a.s.c.c.ConnectionManager Client is connected to ZooKeeper
   [junit4]   2> 705296 INFO  (jetty-launcher-823-thread-2) [    ] o.a.s.c.c.SolrZkClient Using default ZkACLProvider
   [junit4]   2> 705296 INFO  (zkCallback-832-thread-1) [    ] o.a.s.c.c.ConnectionManager Watcher org.apache.solr.common.cloud.ConnectionManager@1fb8d76b name:ZooKeeperConnection Watcher:127.0.0.1:59757 got event WatchedEvent state:SyncConnected type:None path:null path:null type:None
   [junit4]   2> 705296 INFO  (jetty-launcher-823-thread-1) [    ] o.a.s.c.c.ConnectionManager Client is connected to ZooKeeper
   [junit4]   2> 705297 INFO  (jetty-launcher-823-thread-1) [    ] o.a.s.c.c.SolrZkClient Using default ZkACLProvider
   [junit4]   2> 705298 INFO  (jetty-launcher-823-thread-2) [n:127.0.0.1:59761_solr    ] o.a.s.c.ZkController Added new OnReconnect listener org.apache.solr.cloud.ZkController$$Lambda$46/1628295755@4f4e10f9
   [junit4]   2> 705300 INFO  (jetty-launcher-823-thread-2) [n:127.0.0.1:59761_solr    ] o.a.s.c.c.ConnectionManager Waiting for client to connect to ZooKeeper
   [junit4]   2> 705300 INFO  (jetty-launcher-823-thread-1) [n:127.0.0.1:59764_solr    ] o.a.s.c.ZkController Added new OnReconnect listener org.apache.solr.cloud.ZkController$$Lambda$46/1628295755@6ccb1f07
   [junit4]   2> 705301 INFO  (jetty-launcher-823-thread-1) [n:127.0.0.1:59764_solr    ] o.a.s.c.c.ConnectionManager Waiting for client to connect to ZooKeeper
   [junit4]   2> 705313 INFO  (zkCallback-833-thread-1-processing-n:127.0.0.1:59761_solr) [n:127.0.0.1:59761_solr    ] o.a.s.c.c.ConnectionManager Watcher org.apache.solr.common.cloud.ConnectionManager@27736508 name:ZooKeeperConnection Watcher:127.0.0.1:59757/solr got event WatchedEvent state:SyncConnected type:None path:null path:null type:None
   [junit4]   2> 705313 INFO  (zkCallback-834-thread-1-processing-n:127.0.0.1:59764_solr) [n:127.0.0.1:59764_solr    ] o.a.s.c.c.ConnectionManager Watcher org.apache.solr.common.cloud.ConnectionManager@53093938 name:ZooKeeperConnection Watcher:127.0.0.1:59757/solr got event WatchedEvent state:SyncConnected type:None path:null path:null type:None
   [junit4]   2> 705313 INFO  (jetty-launcher-823-thread-2) [n:127.0.0.1:59761_solr    ] o.a.s.c.c.ConnectionManager Client is connected to ZooKeeper
   [junit4]   2> 705313 INFO  (jetty-launcher-823-thread-1) [n:127.0.0.1:59764_solr    ] o.a.s.c.c.ConnectionManager Client is connected to ZooKeeper
   [junit4]   2> 705314 INFO  (jetty-launcher-823-thread-2) [n:127.0.0.1:59761_solr    ] o.a.s.c.c.SolrZkClient makePath: /overseer/queue
   [junit4]   2> 705314 INFO  (jetty-launcher-823-thread-1) [n:127.0.0.1:59764_solr    ] o.a.s.c.c.SolrZkClient makePath: /overseer/queue
   [junit4]   2> 705316 INFO  (jetty-launcher-823-thread-2) [n:127.0.0.1:59761_solr    ] o.a.s.c.c.SolrZkClient makePath: /overseer/collection-queue-work
   [junit4]   2> 705316 INFO  (jetty-launcher-823-thread-1) [n:127.0.0.1:59764_solr    ] o.a.s.c.c.SolrZkClient makePath: /overseer/collection-queue-work
   [junit4]   2> 705320 INFO  (jetty-launcher-823-thread-2) [n:127.0.0.1:59761_solr    ] o.a.s.c.c.SolrZkClient makePath: /overseer/collection-map-running
   [junit4]   2> 705321 INFO  (jetty-launcher-823-thread-1) [n:127.0.0.1:59764_solr    ] o.a.s.c.c.SolrZkClient makePath: /overseer/collection-map-running
   [junit4]   2> 705323 INFO  (jetty-launcher-823-thread-2) [n:127.0.0.1:59761_solr    ] o.a.s.c.c.SolrZkClient makePath: /overseer/collection-map-completed
   [junit4]   2> 705324 INFO  (jetty-launcher-823-thread-1) [n:127.0.0.1:59764_solr    ] o.a.s.c.c.SolrZkClient makePath: /overseer/collection-map-failure
   [junit4]   2> 705324 INFO  (jetty-launcher-823-thread-2) [n:127.0.0.1:59761_solr    ] o.a.s.c.c.SolrZkClient makePath: /overseer/collection-map-failure
   [junit4]   2> 705326 INFO  (jetty-launcher-823-thread-1) [n:127.0.0.1:59764_solr    ] o.a.s.c.c.SolrZkClient makePath: /live_nodes
   [junit4]   2> 705327 INFO  (jetty-launcher-823-thread-2) [n:127.0.0.1:59761_solr    ] o.a.s.c.c.SolrZkClient makePath: /live_nodes
   [junit4]   2> 705329 INFO  (jetty-launcher-823-thread-2) [n:127.0.0.1:59761_solr    ] o.a.s.c.c.SolrZkClient makePath: /collections
   [junit4]   2> 705329 INFO  (jetty-launcher-823-thread-1) [n:127.0.0.1:59764_solr    ] o.a.s.c.c.SolrZkClient makePath: /collections
   [junit4]   2> 705330 INFO  (jetty-launcher-823-thread-2) [n:127.0.0.1:59761_solr    ] o.a.s.c.c.SolrZkClient makePath: /aliases.json
   [junit4]   2> 705332 INFO  (jetty-launcher-823-thread-2) [n:127.0.0.1:59761_solr    ] o.a.s.c.c.SolrZkClient makePath: /clusterstate.json
   [junit4]   2> 705333 INFO  (jetty-launcher-823-thread-1) [n:127.0.0.1:59764_solr    ] o.a.s.c.c.SolrZkClient makePath: /clusterstate.json
   [junit4]   2> 705334 INFO  (jetty-launcher-823-thread-2) [n:127.0.0.1:59761_solr    ] o.a.s.c.c.SolrZkClient makePath: /security.json
   [junit4]   2> 705334 INFO  (jetty-launcher-823-thread-1) [n:127.0.0.1:59764_solr    ] o.a.s.c.c.SolrZkClient makePath: /security.json
   [junit4]   2> 705335 INFO  (jetty-launcher-823-thread-1) [n:127.0.0.1:59764_solr    ] o.a.s.c.c.ZkStateReader Updating cluster state from ZooKeeper... 
   [junit4]   2> 705335 INFO  (jetty-launcher-823-thread-2) [n:127.0.0.1:59761_solr    ] o.a.s.c.c.ZkStateReader Updating cluster state from ZooKeeper... 
   [junit4]   2> 705336 INFO  (jetty-launcher-823-thread-2) [n:127.0.0.1:59761_solr    ] o.a.s.c.c.ZkStateReader Updated live nodes from ZooKeeper... (0) -> (0)
   [junit4]   2> 705337 INFO  (jetty-launcher-823-thread-1) [n:127.0.0.1:59764_solr    ] o.a.s.c.c.ZkStateReader Updated live nodes from ZooKeeper... (0) -> (0)
   [junit4]   2> 705338 INFO  (jetty-launcher-823-thread-2) [n:127.0.0.1:59761_solr    ] o.a.s.c.c.SolrZkClient makePath: /overseer_elect
   [junit4]   2> 705339 INFO  (jetty-launcher-823-thread-1) [n:127.0.0.1:59764_solr    ] o.a.s.c.c.SolrZkClient makePath: /overseer_elect
   [junit4]   2> 705339 INFO  (jetty-launcher-823-thread-2) [n:127.0.0.1:59761_solr    ] o.a.s.c.c.SolrZkClient makePath: /overseer_elect/election
   [junit4]   2> 705340 INFO  (jetty-launcher-823-thread-1) [n:127.0.0.1:59764_solr    ] o.a.s.c.c.SolrZkClient makePath: /overseer_elect/election
   [junit4]   2> 705341 INFO  (jetty-launcher-823-thread-1) [n:127.0.0.1:59764_solr    ] o.a.s.c.Overseer Overseer (id=null) closing
   [junit4]   2> 705341 INFO  (jetty-launcher-823-thread-2) [n:127.0.0.1:59761_solr    ] o.a.s.c.Overseer Overseer (id=null) closing
   [junit4]   2> 705341 INFO  (jetty-launcher-823-thread-1) [n:127.0.0.1:59764_solr    ] o.a.s.c.LeaderElector Joined leadership election with path: /overseer_elect/election/95845244017836038-127.0.0.1:59764_solr-n_0000000000
   [junit4]   2> 705341 INFO  (jetty-launcher-823-thread-2) [n:127.0.0.1:59761_solr    ] o.a.s.c.LeaderElector Joined leadership election with path: /overseer_elect/election/95845244017836037-127.0.0.1:59761_solr-n_0000000001
   [junit4]   2> 705342 INFO  (jetty-launcher-823-thread-1) [n:127.0.0.1:59764_solr    ] o.a.s.c.OverseerElectionContext I am going to be the leader 127.0.0.1:59764_solr
   [junit4]   2> 705342 INFO  (jetty-launcher-823-thread-1) [n:127.0.0.1:59764_solr    ] o.a.s.c.c.SolrZkClient makePath: /overseer_elect/leader
   [junit4]   2> 705342 INFO  (jetty-launcher-823-thread-2) [n:127.0.0.1:59761_solr    ] o.a.s.c.LeaderElector Watching path /overseer_elect/election/95845244017836038-127.0.0.1:59764_solr-n_0000000000 to know if I could be the leader
   [junit4]   2> 705342 INFO  (jetty-launcher-823-thread-2) [n:127.0.0.1:59761_solr    ] o.a.s.c.ZkController Register node as live in ZooKeeper:/live_nodes/127.0.0.1:59761_solr
   [junit4]   2> 705343 INFO  (jetty-launcher-823-thread-2) [n:127.0.0.1:59761_solr    ] o.a.s.c.c.SolrZkClient makePath: /live_nodes/127.0.0.1:59761_solr
   [junit4]   2> 705344 INFO  (jetty-launcher-823-thread-1) [n:127.0.0.1:59764_solr    ] o.a.s.c.Overseer Overseer (id=95845244017836038-127.0.0.1:59764_solr-n_0000000000) starting
   [junit4]   2> 705345 INFO  (zkCallback-833-thread-1-processing-n:127.0.0.1:59761_solr) [n:127.0.0.1:59761_solr    ] o.a.s.c.c.ZkStateReader A live node change: [WatchedEvent state:SyncConnected type:NodeChildrenChanged path:/live_nodes], has occurred - updating... (live nodes size: [0])
   [junit4]   2> 705345 INFO  (zkCallback-834-thread-1-processing-n:127.0.0.1:59764_solr) [n:127.0.0.1:59764_solr    ] o.a.s.c.c.ZkStateReader A live node change: [WatchedEvent state:SyncConnected type:NodeChildrenChanged path:/live_nodes], has occurred - updating... (live nodes size: [0])
   [junit4]   2> 705347 INFO  (zkCallback-833-thread-1-processing-n:127.0.0.1:59761_solr) [n:127.0.0.1:59761_solr    ] o.a.s.c.c.ZkStateReader Updated live nodes from ZooKeeper... (0) -> (1)
   [junit4]   2> 705348 INFO  (zkCallback-834-thread-1-processing-n:127.0.0.1:59764_solr) [n:127.0.0.1:59764_solr    ] o.a.s.c.c.ZkStateReader Updated live nodes from ZooKeeper... (0) -> (1)
   [junit4]   2> 705351 INFO  (jetty-launcher-823-thread-1) [n:127.0.0.1:59764_solr    ] o.a.s.c.c.SolrZkClient makePath: /overseer/queue-work
   [junit4]   2> 705357 INFO  (jetty-launcher-823-thread-2) [n:127.0.0.1:59761_solr    ] o.a.s.c.CoreContainer Security conf doesn't exist. Skipping setup for authorization module.
   [junit4]   2> 705357 INFO  (jetty-launcher-823-thread-2) [n:127.0.0.1:59761_solr    ] o.a.s.c.CoreContainer No authentication plugin used.
   [junit4]   2> 705357 INFO  (jetty-launcher-823-thread-2) [n:127.0.0.1:59761_solr    ] o.a.s.c.CorePropertiesLocator Looking for core definitions underneath C:\Users\jenkins\workspace\Lucene-Solr-6.x-Windows\solr\build\solr-core\test\J1\temp\solr.schema.TestManagedSchemaAPI_18545C88E3F8E230-001\tempDir-001\node2\.
   [junit4]   2> 705358 INFO  (jetty-launcher-823-thread-2) [n:127.0.0.1:59761_solr    ] o.a.s.c.CorePropertiesLocator Found 0 core definitions
   [junit4]   2> 705359 INFO  (jetty-launcher-823-thread-2) [n:127.0.0.1:59761_solr    ] o.a.s.s.SolrDispatchFilter user.dir=C:\Users\jenkins\workspace\Lucene-Solr-6.x-Windows\solr\build\solr-core\test\J1
   [junit4]   2> 705359 INFO  (jetty-launcher-823-thread-2) [n:127.0.0.1:59761_solr    ] o.a.s.s.SolrDispatchFilter SolrDispatchFilter.init() done
   [junit4]   2> 705360 INFO  (jetty-launcher-823-thread-1) [n:127.0.0.1:59764_solr    ] o.a.s.c.OverseerAutoReplicaFailoverThread Starting OverseerAutoReplicaFailoverThread autoReplicaFailoverWorkLoopDelay=10000 autoReplicaFailoverWaitAfterExpiration=30000 autoReplicaFailoverBadNodeExpiration=60000
   [junit4]   2> 705360 INFO  (jetty-launcher-823-thread-1) [n:127.0.0.1:59764_solr    ] o.a.s.c.ZkController Publish node=127.0.0.1:59764_solr as DOWN
   [junit4]   2> 705362 INFO  (OverseerCollectionConfigSetProcessor-95845244017836038-127.0.0.1:59764_solr-n_0000000000) [n:127.0.0.1:59764_solr    ] o.a.s.c.OverseerTaskProcessor Process current queue of overseer operations
   [junit4]   2> 705362 INFO  (OverseerStateUpdate-95845244017836038-127.0.0.1:59764_solr-n_0000000000) [n:127.0.0.1:59764_solr    ] o.a.s.c.Overseer Starting to work on the main queue
   [junit4]   2> 705363 INFO  (OverseerStateUpdate-95845244017836038-127.0.0.1:59764_solr-n_0000000000) [n:127.0.0.1:59764_solr    ] o.a.s.c.c.ZkStateReader Updated live nodes from ZooKeeper... (1) -> (1)
   [junit4]   2> 705364 INFO  (OverseerStateUpdate-95845244017836038-127.0.0.1:59764_solr-n_0000000000) [n:127.0.0.1:59764_solr    ] o.a.s.c.Overseer processMessage: queueSize: 1, message = {
   [junit4]   2>   "operation":"downnode",
   [junit4]   2>   "node_name":"127.0.0.1:59764_solr"} current state version: 0
   [junit4]   2> 705365 INFO  (OverseerStateUpdate-95845244017836038-127.0.0.1:59764_solr-n_0000000000) [n:127.0.0.1:59764_solr    ] o.a.s.c.o.NodeMutator DownNode state invoked for node: 127.0.0.1:59764_solr
   [junit4]   2> 706362 INFO  (jetty-launcher-823-thread-1) [n:127.0.0.1:59764_solr    ] o.a.s.c.ZkController Register node as live in ZooKeeper:/live_nodes/127.0.0.1:59764_solr
   [junit4]   2> 706362 INFO  (jetty-launcher-823-thread-1) [n:127.0.0.1:59764_solr    ] o.a.s.c.c.SolrZkClient makePath: /live_nodes/127.0.0.1:59764_solr
   [junit4]   2> 706364 INFO  (zkCallback-833-thread-1-processing-n:127.0.0.1:59761_solr) [n:127.0.0.1:59761_solr    ] o.a.s.c.c.ZkStateReader A live node change: [WatchedEvent state:SyncConnected type:NodeChildrenChanged path:/live_nodes], has occurred - updating... (live nodes size: [1])
   [junit4]   2> 706364 INFO  (zkCallback-834-thread-1-processing-n:127.0.0.1:59764_solr) [n:127.0.0.1:59764_solr    ] o.a.s.c.c.ZkStateReader A live node change: [WatchedEvent state:SyncConnected type:NodeChildrenChanged path:/live_nodes], has occurred - updating... (live nodes size: [1])
   [junit4]   2> 706365 INFO  (zkCallback-833-thread-1-processing-n:127.0.0.1:59761_solr) [n:127.0.0.1:59761_solr    ] o.a.s.c.c.ZkStateReader Updated live nodes from ZooKeeper... (1) -> (2)
   [junit4]   2> 706365 INFO  (zkCallback-834-thread-1-processing-n:127.0.0.1:59764_solr) [n:127.0.0.1:59764_solr    ] o.a.s.c.c.ZkStateReader Updated live nodes from ZooKeeper... (1) -> (2)
   [junit4]   2> 706382 INFO  (jetty-launcher-823-thread-1) [n:127.0.0.1:59764_solr    ] o.a.s.c.CoreContainer Security conf doesn't exist. Skipping setup for authorization module.
   [junit4]   2> 706382 INFO  (jetty-launcher-823-thread-1) [n:127.0.0.1:59764_solr    ] o.a.s.c.CoreContainer No authentication plugin used.
   [junit4]   2> 706383 INFO  (jetty-launcher-823-thread-1) [n:127.0.0.1:59764_solr    ] o.a.s.c.CorePropertiesLocator Looking for core definitions underneath C:\Users\jenkins\workspace\Lucene-Solr-6.x-Windows\solr\build\solr-core\test\J1\temp\solr.schema.TestManagedSchemaAPI_18545C88E3F8E230-001\tempDir-001\node1\.
   [junit4]   2> 706383 INFO  (jetty-launcher-823-thread-1) [n:127.0.0.1:59764_solr    ] o.a.s.c.CorePropertiesLocator Found 0 core definitions
   [junit4]   2> 706387 INFO  (jetty-launcher-823-thread-1) [n:127.0.0.1:59764_solr    ] o.a.s.s.SolrDispatchFilter user.dir=C:\Users\jenkins\workspace\Lucene-Solr-6.x-Windows\solr\build\solr-core\test\J1
   [junit4]   2> 706387 INFO  (jetty-launcher-823-thread-1) [n:127.0.0.1:59764_solr    ] o.a.s.s.SolrDispatchFilter SolrDispatchFilter.init() done
   [junit4]   2> 706392 INFO  (SUITE-TestManagedSchemaAPI-seed#[18545C88E3F8E230]-worker) [    ] o.a.s.c.c.SolrZkClient Using default ZkCredentialsProvider
   [junit4]   2> 706393 INFO  (SUITE-TestManagedSchemaAPI-seed#[18545C88E3F8E230]-worker) [    ] o.a.s.c.c.ConnectionManager Waiting for client to connect to ZooKeeper
   [junit4]   2> 706420 INFO  (zkCallback-835-thread-1) [    ] o.a.s.c.c.ConnectionManager Watcher org.apache.solr.common.cloud.ConnectionManager@447c51bd name:ZooKeeperConnection Watcher:127.0.0.1:59757 got event WatchedEvent state:SyncConnected type:None path:null path:null type:None
   [junit4]   2> 706420 INFO  (SUITE-TestManagedSchemaAPI-seed#[18545C88E3F8E230]-worker) [    ] o.a.s.c.c.ConnectionManager Client is connected to ZooKeeper
   [junit4]   2> 706420 INFO  (SUITE-TestManagedSchemaAPI-seed#[18545C88E3F8E230]-worker) [    ] o.a.s.c.c.SolrZkClient Using default ZkACLProvider
   [junit4]   2> 706424 INFO  (SUITE-TestManagedSchemaAPI-seed#[18545C88E3F8E230]-worker) [    ] o.a.s.c.s.i.CloudSolrClient Final constructed zkHost string: 127.0.0.1:59757/solr
   [junit4]   2> 706424 INFO  (SUITE-TestManagedSchemaAPI-seed#[18545C88E3F8E230]-worker) [    ] o.a.s.c.c.SolrZkClient Using default ZkCredentialsProvider
   [junit4]   2> 706425 INFO  (SUITE-TestManagedSchemaAPI-seed#[18545C88E3F8E230]-worker) [    ] o.a.s.c.c.ConnectionManager Waiting for client to connect to ZooKeeper
   [junit4]   2> 706430 INFO  (zkCallback-837-thread-1) [    ] o.a.s.c.c.ConnectionManager Watcher org.apache.solr.common.cloud.ConnectionManager@274c90ef name:ZooKeeperConnection Watcher:127.0.0.1:59757/solr got event WatchedEvent state:SyncConnected type:None path:null path:null type:None
   [junit4]   2> 706430 INFO  (SUITE-TestManagedSchemaAPI-seed#[18545C88E3F8E230]-worker) [    ] o.a.s.c.c.ConnectionManager Client is connected to ZooKeeper
   [junit4]   2> 706430 INFO  (SUITE-TestManagedSchemaAPI-seed#[18545C88E3F8E230]-worker) [    ] o.a.s.c.c.SolrZkClient Using default ZkACLProvider
   [junit4]   2> 706431 INFO  (SUITE-TestManagedSchemaAPI-seed#[18545C88E3F8E230]-worker) [    ] o.a.s.c.c.ZkStateReader Updating cluster state from ZooKeeper... 
   [junit4]   2> 706434 INFO  (SUITE-TestManagedSchemaAPI-seed#[18545C88E3F8E230]-worker) [    ] o.a.s.c.c.ZkStateReader Updated live nodes from ZooKeeper... (0) -> (2)
   [junit4]   2> 706437 INFO  (SUITE-TestManagedSchemaAPI-seed#[18545C88E3F8E230]-worker) [    ] o.a.s.c.c.SolrZkClient makePath: /configs/conf1/managed-schema
   [junit4]   2> 706439 INFO  (SUITE-TestManagedSchemaAPI-seed#[18545C88E3F8E230]-worker) [    ] o.a.s.c.c.SolrZkClient makePath: /configs/conf1/solrconfig.xml
   [junit4]   2> 706460 INFO  (TEST-TestManagedSchemaAPI.test-seed#[18545C88E3F8E230]) [    ] o.a.s.SolrTestCaseJ4 ###Starting test
   [junit4]   2> 706464 INFO  (qtp484253118-5494) [n:127.0.0.1:59761_solr    ] o.a.s.h.a.CollectionsHandler Invoked Collection Action :create with params replicationFactor=2&collection.configName=conf1&name=testschemaapi&action=CREATE&numShards=1&wt=javabin&version=2 and sendToOCPQueue=true
   [junit4]   2> 706468 INFO  (OverseerCollectionConfigSetProcessor-95845244017836038-127.0.0.1:59764_solr-n_0000000000) [n:127.0.0.1:59764_solr    ] o.a.s.c.OverseerTaskProcessor Overseer Collection Message Handler: Get the message id:/overseer/collection-queue-work/qn-0000000000 message:{
   [junit4]   2>   "name":"testschemaapi",
   [junit4]   2>   "fromApi":"true",
   [junit4]   2>   "replicationFactor":"2",
   [junit4]   2>   "collection.configName":"conf1",
   [junit4]   2>   "numShards":"1",
   [junit4]   2>   "stateFormat":"2",
   [junit4]   2>   "operation":"create"}
   [junit4]   2> 706469 INFO  (OverseerThreadFactory-2046-thread-1-processing-n:127.0.0.1:59764_solr) [n:127.0.0.1:59764_solr    ] o.a.s.c.OverseerCollectionMessageHandler OverseerCollectionMessageHandler.processMessage : create , {
   [junit4]   2>   "name":"testschemaapi",
   [junit4]   2>   "fromApi":"true",
   [junit4]   2>   "replicationFactor":"2",
   [junit4]   2>   "collection.configName":"conf1",
   [junit4]   2>   "numShards":"1",
   [junit4]   2>   "stateFormat":"2",
   [junit4]   2>   "operation":"create"}
   [junit4]   2> 706469 INFO  (OverseerThreadFactory-2046-thread-1-processing-n:127.0.0.1:59764_solr) [n:127.0.0.1:59764_solr    ] o.a.s.c.OverseerCollectionMessageHandler Create collection testschemaapi
   [junit4]   2> 706469 INFO  (OverseerThreadFactory-2046-thread-1-processing-n:127.0.0.1:59764_solr) [n:127.0.0.1:59764_solr    ] o.a.s.c.OverseerCollectionMessageHandler creating collections conf node /collections/testschemaapi 
   [junit4]   2> 706470 INFO  (OverseerThreadFactory-2046-thread-1-processing-n:127.0.0.1:59764_solr) [n:127.0.0.1:59764_solr    ] o.a.s.c.c.SolrZkClient makePath: /collections/testschemaapi
   [junit4]   2> 706471 INFO  (zkCallback-837-thread-1) [    ] o.a.s.c.c.ZkStateReader A collections change: [WatchedEvent state:SyncConnected type:NodeChildrenChanged path:/collections], has occurred - updating...
   [junit4]   2> 706471 INFO  (zkCallback-833-thread-1-processing-n:127.0.0.1:59761_solr) [n:127.0.0.1:59761_solr    ] o.a.s.c.c.ZkStateReader A collections change: [WatchedEvent state:SyncConnected type:NodeChildrenChanged path:/collections], has occurred - updating...
   [junit4]   2> 706471 INFO  (zkCallback-834-thread-1-processing-n:127.0.0.1:59764_solr) [n:127.0.0.1:59764_solr    ] o.a.s.c.c.ZkStateReader A collections change: [WatchedEvent state:SyncConnected type:NodeChildrenChanged path:/collections], has occurred - updating...
   [junit4]   2> 706474 INFO  (OverseerStateUpdate-95845244017836038-127.0.0.1:59764_solr-n_0000000000) [n:127.0.0.1:59764_solr    ] o.a.s.c.Overseer processMessage: queueSize: 1, message = {
   [junit4]   2>   "name":"testschemaapi",
   [junit4]   2>   "fromApi":"true",
   [junit4]   2>   "replicationFactor":"2",
   [junit4]   2>   "collection.configName":"conf1",
   [junit4]   2>   "numShards":"1",
   [junit4]   2>   "stateFormat":"2",
   [junit4]   2>   "operation":"create"} current state version: 0
   [junit4]   2> 706475 INFO  (OverseerStateUpdate-95845244017836038-127.0.0.1:59764_solr-n_0000000000) [n:127.0.0.1:59764_solr    ] o.a.s.c.o.ClusterStateMutator building a new cName: testschemaapi
   [junit4]   2> 706476 INFO  (OverseerStateUpdate-95845244017836038-127.0.0.1:59764_solr-n_0000000000) [n:127.0.0.1:59764_solr    ] o.a.s.c.o.ZkStateWriter going to create_collection /collections/testschemaapi/state.json
   [junit4]   2> 706574 INFO  (OverseerThreadFactory-2046-thread-1-processing-n:127.0.0.1:59764_solr) [n:127.0.0.1:59764_solr    ] o.a.s.c.OverseerCollectionMessageHandler Creating SolrCores for new collection testschemaapi, shardNames [shard1] , replicationFactor : 2
   [junit4]   2> 706574 INFO  (OverseerThreadFactory-2046-thread-1-processing-n:127.0.0.1:59764_solr) [n:127.0.0.1:59764_solr    ] o.a.s.c.OverseerCollectionMessageHandler Creating core testschemaapi_shard1_replica2 as part of shard shard1 of collection testschemaapi on 127.0.0.1:59764_solr
   [junit4]   2> 706575 INFO  (OverseerThreadFactory-2046-thread-1-processing-n:127.0.0.1:59764_solr) [n:127.0.0.1:59764_solr    ] o.a.s.c.OverseerCollectionMessageHandler Creating core testschemaapi_shard1_replica1 as part of shard shard1 of collection testschemaapi on 127.0.0.1:59761_solr
   [junit4]   2> 706581 INFO  (qtp484253118-5493) [n:127.0.0.1:59761_solr    ] o.a.s.h.a.CoreAdminOperation core create command qt=/admin/cores&collection.configName=conf1&name=testschemaapi_shard1_replica1&action=CREATE&numShards=1&collection=testschemaapi&shard=shard1&wt=javabin&version=2
   [junit4]   2> 706581 INFO  (qtp1217434695-5486) [n:127.0.0.1:59764_solr    ] o.a.s.h.a.CoreAdminOperation core create command qt=/admin/cores&collection.configName=conf1&name=testschemaapi_shard1_replica2&action=CREATE&numShards=1&collection=testschemaapi&shard=shard1&wt=javabin&version=2
   [junit4]   2> 706584 INFO  (qtp484253118-5493) [n:127.0.0.1:59761_solr    ] o.a.s.c.CoreDescriptor Created CoreDescriptor: {name=testschemaapi_shard1_replica1, collection.configName=conf1, config=solrconfig.xml, transient=false, schema=schema.xml, loadOnStartup=true, configSetProperties=configsetprops.json, collection=testschemaapi, numShards=1, dataDir=data\, shard=shard1}
   [junit4]   2> 706584 INFO  (qtp1217434695-5486) [n:127.0.0.1:59764_solr    ] o.a.s.c.CoreDescriptor Created CoreDescriptor: {name=testschemaapi_shard1_replica2, collection.configName=conf1, config=solrconfig.xml, transient=false, schema=schema.xml, loadOnStartup=true, configSetProperties=configsetprops.json, collection=testschemaapi, numShards=1, dataDir=data\, shard=shard1}
   [junit4]   2> 706586 INFO  (qtp1217434695-5486) [n:127.0.0.1:59764_solr c:testschemaapi s:shard1  x:testschemaapi_shard1_replica2] o.a.s.c.ZkController publishing state=down
   [junit4]   2> 706586 INFO  (qtp484253118-5493) [n:127.0.0.1:59761_solr c:testschemaapi s:shard1  x:testschemaapi_shard1_replica1] o.a.s.c.ZkController publishing state=down
   [junit4]   2> 706587 INFO  (qtp484253118-5493) [n:127.0.0.1:59761_solr c:testschemaapi s:shard1  x:testschemaapi_shard1_replica1] o.a.s.c.ZkController Registering watch for collection testschemaapi
   [junit4]   2> 706587 INFO  (qtp1217434695-5486) [n:127.0.0.1:59764_solr c:testschemaapi s:shard1  x:testschemaapi_shard1_replica2] o.a.s.c.ZkController Registering watch for collection testschemaapi
   [junit4]   2> 706588 INFO  (qtp1217434695-5486) [n:127.0.0.1:59764_solr c:testschemaapi s:shard1  x:testschemaapi_shard1_replica2] o.a.s.c.c.ZkStateReader addZkWatch [testschemaapi]
   [junit4]   2> 706588 INFO  (qtp484253118-5493) [n:127.0.0.1:59761_solr c:testschemaapi s:shard1  x:testschemaapi_shard1_replica1] o.a.s.c.c.ZkStateReader addZkWatch [testschemaapi]
   [junit4]   2> 706589 INFO  (qtp1217434695-5486) [n:127.0.0.1:59764_solr c:testschemaapi s:shard1  x:testschemaapi_shard1_replica2] o.a.s.c.c.ZkStateReader Add data for [testschemaapi] ver [0]
   [junit4]   2> 706589 INFO  (qtp1217434695-5486) [n:127.0.0.1:59764_solr c:testschemaapi s:shard1  x:testschemaapi_shard1_replica2] o.a.s.c.ZkController look for our core node name
   [junit4]   2> 706589 INFO  (qtp484253118-5493) [n:127.0.0.1:59761_solr c:testschemaapi s:shard1  x:testschemaapi_shard1_replica1] o.a.s.c.c.ZkStateReader Add data for [testschemaapi] ver [0]
   [junit4]   2> 706589 INFO  (qtp484253118-5493) [n:127.0.0.1:59761_solr c:testschemaapi s:shard1  x:testschemaapi_shard1_replica1] o.a.s.c.ZkController look for our core node name
   [junit4]   2> 706589 INFO  (OverseerStateUpdate-95845244017836038-127.0.0.1:59764_solr-n_0000000000) [n:127.0.0.1:59764_solr    ] o.a.s.c.Overseer processMessage: queueSize: 2, message = {
   [junit4]   2>   "core":"testschemaapi_shard1_replica2",
   [junit4]   2>   "roles":null,
   [junit4]   2>   "base_url":"http://127.0.0.1:59764/solr",
   [junit4]   2>   "node_name":"127.0.0.1:59764_solr",
   [junit4]   2>   "numShards":"1",
   [junit4]   2>   "state":"down",
   [junit4]   2>   "shard":"shard1",
   [junit4]   2>   "collection":"testschemaapi",
   [junit4]   2>   "operation":"state"} current state version: 0
   [junit4]   2> 706590 INFO  (OverseerStateUpdate-95845244017836038-127.0.0.1:59764_solr-n_0000000000) [n:127.0.0.1:59764_solr    ] o.a.s.c.o.ReplicaMutator Update state numShards=1 message={
   [junit4]   2>   "core":"testschemaapi_shard1_replica2",
   [junit4]   2>   "roles":null,
   [junit4]   2>   "base_url":"http://127.0.0.1:59764/solr",
   [junit4]   2>   "node_name":"127.0.0.1:59764_solr",
   [junit4]   2>   "numShards":"1",
   [junit4]   2>   "state":"down",
   [junit4]   2>   "shard":"shard1",
   [junit4]   2>   "collection":"testschemaapi",
   [junit4]   2>   "operation":"state"}
   [junit4]   2> 706592 INFO  (OverseerStateUpdate-95845244017836038-127.0.0.1:59764_solr-n_0000000000) [n:127.0.0.1:59764_solr    ] o.a.s.c.Overseer processMessage: queueSize: 2, message = {
   [junit4]   2>   "core":"testschemaapi_shard1_replica1",
   [junit4]   2>   "roles":null,
   [junit4]   2>   "base_url":"http://127.0.0.1:59761/solr",
   [junit4]   2>   "node_name":"127.0.0.1:59761_solr",
   [junit4]   2>   "numShards":"1",
   [junit4]   2>   "state":"down",
   [junit4]   2>   "shard":"shard1",
   [junit4]   2>   "collection":"testschemaapi",
   [junit4]   2>   "operation":"state"} current state version: 0
   [junit4]   2> 706593 INFO  (OverseerStateUpdate-95845244017836038-127.0.0.1:59764_solr-n_0000000000) [n:127.0.0.1:59764_solr    ] o.a.s.c.o.ReplicaMutator Update state numShards=1 message={
   [junit4]   2>   "core":"testschemaapi_shard1_replica1",
   [junit4]   2>   "roles":null,
   [junit4]   2>   "base_url":"http://127.0.0.1:59761/solr",
   [junit4]   2>   "node_name":"127.0.0.1:59761_solr",
   [junit4]   2>   "numShards":"1",
   [junit4]   2>   "state":"down",
   [junit4]   2>   "shard":"shard1",
   [junit4]   2>   "collection":"testschemaapi",
   [junit4]   2>   "operation":"state"}
   [junit4]   2> 706697 INFO  (OverseerStateUpdate-95845244017836038-127.0.0.1:59764_solr-n_0000000000) [n:127.0.0.1:59764_solr    ] o.a.s.c.o.ZkStateWriter going to update_collection /collections/testschemaapi/state.json version: 0
   [junit4]   2> 706698 INFO  (zkCallback-834-thread-1-processing-n:127.0.0.1:59764_solr) [n:127.0.0.1:59764_solr    ] o.a.s.c.c.ZkStateReader A cluster state change: [WatchedEvent state:SyncConnected type:NodeDataChanged path:/collections/testschemaapi/state.json] for collection [testschemaapi] has occurred - updating... (live nodes size: [2])
   [junit4]   2> 706698 INFO  (zkCallback-833-thread-1-processing-n:127.0.0.1:59761_solr) [n:127.0.0.1:59761_solr    ] o.a.s.c.c.ZkStateReader A cluster state change: [WatchedEvent state:SyncConnected type:NodeDataChanged path:/collections/testschemaapi/state.json] for collection [testschemaapi] has occurred - updating... (live nodes size: [2])
   [junit4]   2> 706698 INFO  (zkCallback-833-thread-1-processing-n:127.0.0.1:59761_solr) [n:127.0.0.1:59761_solr    ] o.a.s.c.c.ZkStateReader Updating data for [testschemaapi] from [0] to [1]
   [junit4]   2> 706698 INFO  (zkCallback-834-thread-1-processing-n:127.0.0.1:59764_solr) [n:127.0.0.1:59764_solr    ] o.a.s.c.c.ZkStateReader Updating data for [testschemaapi] from [0] to [1]
   [junit4]   2> 707589 INFO  (qtp484253118-5493) [n:127.0.0.1:59761_solr c:testschemaapi s:shard1  x:testschemaapi_shard1_replica1] o.a.s.c.ZkController waiting to find shard id in clusterstate for testschemaapi_shard1_replica1
   [junit4]   2> 707589 INFO  (qtp1217434695-5486) [n:127.0.0.1:59764_solr c:testschemaapi s:shard1  x:testschemaapi_shard1_replica2] o.a.s.c.ZkController waiting to find shard id in clusterstate for testschemaapi_shard1_replica2
   [junit4]   2> 707589 INFO  (qtp484253118-5493) [n:127.0.0.1:59761_solr c:testschemaapi s:shard1  x:testschemaapi_shard1_replica1] o.a.s.c.ZkController Check for collection zkNode:testschemaapi
   [junit4]   2> 707589 INFO  (qtp1217434695-5486) [n:127.0.0.1:59764_solr c:testschemaapi s:shard1  x:testschemaapi_shard1_replica2] o.a.s.c.ZkController Check for collection zkNode:testschemaapi
   [junit4]   2> 707589 INFO  (qtp484253118-5493) [n:127.0.0.1:59761_solr c:testschemaapi s:shard1  x:testschemaapi_shard1_replica1] o.a.s.c.ZkController Collection zkNode exists
   [junit4]   2> 707589 INFO  (qtp1217434695-5486) [n:127.0.0.1:59764_solr c:testschemaapi s:shard1  x:testschemaapi_shard1_replica2] o.a.s.c.ZkController Collection zkNode exists
   [junit4]   2> 707590 INFO  (qtp1217434695-5486) [n:127.0.0.1:59764_solr c:testschemaapi s:shard1  x:testschemaapi_shard1_replica2] o.a.s.c.c.ZkStateReader Load collection config from: [/collections/testschemaapi]
   [junit4]   2> 707589 INFO  (qtp484253118-5493) [n:127.0.0.1:59761_solr c:testschemaapi s:shard1  x:testschemaapi_shard1_replica1] o.a.s.c.c.ZkStateReader Load collection config from: [/collections/testschemaapi]
   [junit4]   2> 707590 INFO  (qtp1217434695-5486) [n:127.0.0.1:59764_solr c:testschemaapi s:shard1  x:testschemaapi_shard1_replica2] o.a.s.c.c.ZkStateReader path=[/collections/testschemaapi] [configName]=[conf1] specified config exists in ZooKeeper
   [junit4]   2> 707590 INFO  (qtp484253118-5493) [n:127.0.0.1:59761_solr c:testschemaapi s:shard1  x:testschemaapi_shard1_replica1] o.a.s.c.c.ZkStateReader path=[/collections/testschemaapi] [configName]=[conf1] specified config exists in ZooKeeper
   [junit4]   2> 707590 INFO  (qtp1217434695-5486) [n:127.0.0.1:59764_solr c:testschemaapi s:shard1  x:testschemaapi_shard1_replica2] o.a.s.c.SolrResourceLoader new SolrResourceLoader for directory: 'C:\Users\jenkins\workspace\Lucene-Solr-6.x-Windows\solr\build\solr-core\test\J1\temp\solr.schema.TestManagedSchemaAPI_18545C88E3F8E230-001\tempDir-001\node1\testschemaapi_shard1_replica2'
   [junit4]   2> 707590 INFO  (qtp484253118-5493) [n:127.0.0.1:59761_solr c:testschemaapi s:shard1  x:testschemaapi_shard1_replica1] o.a.s.c.SolrResourceLoader new SolrResourceLoader for directory: 'C:\Users\jenkins\workspace\Lucene-Solr-6.x-Windows\solr\build\solr-core\test\J1\temp\solr.schema.TestManagedSchemaAPI_18545C88E3F8E230-001\tempDir-001\node2\testschemaapi_shard1_replica1'
   [junit4]   2> 707590 INFO  (qtp484253118-5493) [n:127.0.0.1:59761_solr c:testschemaapi s:shard1  x:testschemaapi_shard1_replica1] o.a.s.c.SolrResourceLoader JNDI not configured for solr (NoInitialContextEx)
   [junit4]   2> 707590 INFO  (qtp1217434695-5486) [n:127.0.0.1:59764_solr c:testschemaapi s:shard1  x:testschemaapi_shard1_replica2] o.a.s.c.SolrResourceLoader JNDI not configured for solr (NoInitialContextEx)
   [junit4]   2> 707590 INFO  (qtp484253118-5493) [n:127.0.0.1:59761_solr c:testschemaapi s:shard1  x:testschemaapi_shard1_replica1] o.a.s.c.SolrResourceLoader solr home defaulted to 'solr/' (could not find system property or JNDI)
   [junit4]   2> 707590 INFO  (qtp1217434695-5486) [n:127.0.0.1:59764_solr c:testschemaapi s:shard1  x:testschemaapi_shard1_replica2] o.a.s.c.SolrResourceLoader solr home defaulted to 'solr/' (could not find system property or JNDI)
   [junit4]   2> 707594 INFO  (qtp1217434695-5486) [n:127.0.0.1:59764_solr c:testschemaapi s:shard1  x:testschemaapi_shard1_replica2] o.a.s.c.Config loaded config solrconfig.xml with version 0 
   [junit4]   2> 707594 INFO  (qtp484253118-5493) [n:127.0.0.1:59761_solr c:testschemaapi s:shard1  x:testschemaapi_shard1_replica1] o.a.s.c.Config loaded config solrconfig.xml with version 0 
   [junit4]   2> 707601 INFO  (qtp484253118-5493) [n:127.0.0.1:59761_solr c:testschemaapi s:shard1  x:testschemaapi_shard1_replica1] o.a.s.c.SolrConfig current version of requestparams : -1
   [junit4]   2> 707601 INFO  (qtp1217434695-5486) [n:127.0.0.1:59764_solr c:testschemaapi s:shard1  x:testschemaapi_shard1_replica2] o.a.s.c.SolrConfig current version of requestparams : -1
   [junit4]   2> 707604 INFO  (qtp484253118-5493) [n:127.0.0.1:59761_solr c:testschemaapi s:shard1  x:testschemaapi_shard1_replica1] o.a.s.c.SolrConfig Using Lucene MatchVersion: 6.1.0
   [junit4]   2> 707604 INFO  (qtp1217434695-5486) [n:127.0.0.1:59764_solr c:testschemaapi s:shard1  x:testschemaapi_shard1_replica2] o.a.s.c.SolrConfig Using Lucene MatchVersion: 6.1.0
   [junit4]   2> 707610 INFO  (qtp484253118-5493) [n:127.0.0.1:59761_solr c:testschemaapi s:shard1  x:testschemaapi_shard1_replica1] o.a.s.c.SolrConfig Loaded SolrConfig: solrconfig.xml
   [junit4]   2> 707611 INFO  (qtp1217434695-5486) [n:127.0.0.1:59764_solr c:testschemaapi s:shard1  x:testschemaapi_shard1_replica2] o.a.s.c.SolrConfig Loaded SolrConfig: solrconfig.xml
   [junit4]   2> 707626 INFO  (qtp484253118-5493) [n:127.0.0.1:59761_solr c:testschemaapi s:shard1  x:testschemaapi_shard1_replica1] o.a.s.s.IndexSchema [testschemaapi_shard1_replica1] Schema name=minimal
   [junit4]   2> 707627 INFO  (qtp1217434695-5486) [n:127.0.0.1:59764_solr c:testschemaapi s:shard1  x:testschemaapi_shard1_replica2] o.a.s.s.IndexSchema [testschemaapi_shard1_replica2] Schema name=minimal
   [junit4]   2> 707632 INFO  (qtp1217434695-5486) [n:127.0.0.1:59764_solr c:testschemaapi s:shard1  x:testschemaapi_shard1_replica2] o.a.s.s.IndexSchema unique key field: id
   [junit4]   2> 707632 INFO  (qtp484253118-5493) [n:127.0.0.1:59761_solr c:testschemaapi s:shard1  x:testschemaapi_shard1_replica1] o.a.s.s.IndexSchema unique key field: id
   [junit4]   2> 707636 INFO  (qtp484253118-5493) [n:127.0.0.1:59761_solr c:testschemaapi s:shard1  x:testschemaapi_shard1_replica1] o.a.s.c.ConfigSetProperties Did not find ConfigSet properties, assuming default properties: Can't find resource 'configsetprops.json' in classpath or '/configs/conf1', cwd=C:\Users\jenkins\workspace\Lucene-Solr-6.x-Windows\solr\build\solr-core\test\J1
   [junit4]   2> 707636 INFO  (qtp484253118-5493) [n:127.0.0.1:59761_solr c:testschemaapi s:shard1  x:testschemaapi_shard1_replica1] o.a.s.c.CoreContainer Creating SolrCore 'testschemaapi_shard1_replica1' using configuration from collection testschemaapi
   [junit4]   2> 707636 INFO  (qtp1217434695-5486) [n:127.0.0.1:59764_solr c:testschemaapi s:shard1  x:testschemaapi_shard1_replica2] o.a.s.c.ConfigSetProperties Did not find ConfigSet properties, assuming default properties: Can't find resource 'configsetprops.json' in classpath or '/configs/conf1', cwd=C:\Users\jenkins\workspace\Lucene-Solr-6.x-Windows\solr\build\solr-core\test\J1
   [junit4]   2> 707636 INFO  (qtp1217434695-5486) [n:127.0.0.1:59764_solr c:testschemaapi s:shard1  x:testschemaapi_shard1_replica2] o.a.s.c.CoreContainer Creating SolrCore 'testschemaapi_shard1_replica2' using configuration from collection testschemaapi
   [junit4]   2> 707637 INFO  (qtp484253118-5493) [n:127.0.0.1:59761_solr c:testschemaapi s:shard1 r:core_node2 x:testschemaapi_shard1_replica1] o.a.s.c.SolrCore org.apache.solr.core.MockDirectoryFactory
   [junit4]   2> 707637 INFO  (qtp1217434695-5486) [n:127.0.0.1:59764_solr c:testschemaapi s:shard1 r:core_node1 x:testschemaapi_shard1_replica2] o.a.s.c.SolrCore org.apache.solr.core.MockDirectoryFactory
   [junit4]   2> 707637 INFO  (qtp484253118-5493) [n:127.0.0.1:59761_solr c:testschemaapi s:shard1 r:core_node2 x:testschemaapi_shard1_replica1] o.a.s.c.SolrCore [[testschemaapi_shard1_replica1] ] Opening new SolrCore at [C:\Users\jenkins\workspace\Lucene-Solr-6.x-Windows\solr\build\solr-core\test\J1\temp\solr.schema.TestManagedSchemaAPI_18545C88E3F8E230-001\tempDir-001\node2\testschemaapi_shard1_replica1], dataDir=[C:\Users\jenkins\workspace\Lucene-Solr-6.x-Windows\solr\build\solr-core\test\J1\temp\solr.schema.TestManagedSchemaAPI_18545C88E3F8E230-001\tempDir-001\node2\.\testschemaapi_shard1_replica1\data\]
   [junit4]   2> 707637 INFO  (qtp484253118-5493) [n:127.0.0.1:59761_solr c:testschemaapi s:shard1 r:core_node2 x:testschemaapi_shard1_replica1] o.a.s.c.SolrCore JMX monitoring not detected for core: testschemaapi_shard1_replica1
   [junit4]   2> 707637 INFO  (qtp1217434695-5486) [n:127.0.0.1:59764_solr c:testschemaapi s:shard1 r:core_node1 x:testschemaapi_shard1_replica2] o.a.s.c.SolrCore [[testschemaapi_shard1_replica2] ] Opening new SolrCore at [C:\Users\jenkins\workspace\Lucene-Solr-6.x-Windows\solr\build\solr-core\test\J1\temp\solr.schema.TestManagedSchemaAPI_18545C88E3F8E230-001\tempDir-001\node1\testschemaapi_shard1_replica2], dataDir=[C:\Users\jenkins\workspace\Lucene-Solr-6.x-Windows\solr\build\solr-core\test\J1\temp\solr.schema.TestManagedSchemaAPI_18545C88E3F8E230-001\tempDir-001\node1\.\testschemaapi_shard1_replica2\data\]
   [junit4]   2> 707637 INFO  (qtp1217434695-5486) [n:127.0.0.1:59764_solr c:testschemaapi s:shard1 r:core_node1 x:testschemaapi_shard1_replica2] o.a.s.c.SolrCore JMX monitoring not detected for core: testschemaapi_shard1_replica2
   [junit4]   2> 707637 INFO  (qtp484253118-5493) [n:127.0.0.1:59761_solr c:testschemaapi s:shard1 r:core_node2 x:testschemaapi_shard1_replica1] o.a.s.c.CachingDirectoryFactory return new directory for C:\Users\jenkins\workspace\Lucene-Solr-6.x-Windows\solr\build\solr-core\test\J1\temp\solr.schema.TestManagedSchemaAPI_18545C88E3F8E230-001\tempDir-001\node2\.\testschemaapi_shard1_replica1\data\
   [junit4]   2> 707638 INFO  (qtp1217434695-5486) [n:127.0.0.1:59764_solr c:testschemaapi s:shard1 r:core_node1 x:testschemaapi_shard1_replica2] o.a.s.c.CachingDirectoryFactory return new directory for C:\Users\jenkins\workspace\Lucene-Solr-6.x-Windows\solr\build\solr-core\test\J1\temp\solr.schema.TestManagedSchemaAPI_18545C88E3F8E230-001\tempDir-001\node1\.\testschemaapi_shard1_replica2\data\
   [junit4]   2> 707638 INFO  (qtp484253118-5493) [n:127.0.0.1:59761_solr c:testschemaapi s:shard1 r:core_node2 x:testschemaapi_shard1_replica1] o.a.s.c.SolrCore New index directory detected: old=null new=C:\Users\jenkins\workspace\Lucene-Solr-6.x-Windows\solr\build\solr-core\test\J1\temp\solr.schema.TestManagedSchemaAPI_18545C88E3F8E230-001\tempDir-001\node2\.\testschemaapi_shard1_replica1\data\index/
   [junit4]   2> 707638 WARN  (qtp484253118-5493) [n:127.0.0.1:59761_solr c:testschemaapi s:shard1 r:core_node2 x:testschemaapi_shard1_replica1] o.a.s.c.SolrCore [testschemaapi_shard1_replica1] Solr index directory 'C:\Users\jenkins\workspace\Lucene-Solr-6.x-Windows\solr\build\solr-core\test\J1\temp\solr.schema.TestManagedSchemaAPI_18545C88E3F8E230-001\tempDir-001\node2\.\testschemaapi_shard1_replica1\data\index' doesn't exist. Creating new index...
   [junit4]   2> 707638 INFO  (qtp1217434695-5486) [n:127.0.0.1:59764_solr c:testschemaapi s:shard1 r:core_node1 x:testschemaapi_shard1_replica2] o.a.s.c.SolrCore New index directory detected: old=null new=C:\Users\jenkins\workspace\Lucene-Solr-6.x-Windows\solr\build\solr-core\test\J1\temp\solr.schema.TestManagedSchemaAPI_18545C88E3F8E230-001\tempDir-001\node1\.\testschemaapi_shard1_replica2\data\index/
   [junit4]   2> 707639 WARN  (qtp1217434695-5486) [n:127.0.0.1:59764_solr c:testschemaapi s:shard1 r:core_node1 x:testschemaapi_shard1_replica2] o.a.s.c.SolrCore [testschemaapi_shard1_replica2] Solr index directory 'C:\Users\jenkins\workspace\Lucene-Solr-6.x-Windows\solr\build\solr-core\test\J1\temp\solr.schema.TestManagedSchemaAPI_18545C88E3F8E230-001\tempDir-001\node1\.\testschemaapi_shard1_replica2\data\index' doesn't exist. Creating new index...
   [junit4]   2> 707639 INFO  (qtp484253118-5493) [n:127.0.0.1:59761_solr c:testschemaapi s:shard1 r:core_node2 x:testschemaapi_shard1_replica1] o.a.s.c.CachingDirectoryFactory return new directory for C:\Users\jenkins\workspace\Lucene-Solr-6.x-Windows\solr\build\solr-core\test\J1\temp\solr.schema.TestManagedSchemaAPI_18545C88E3F8E230-001\tempDir-001\node2\.\testschemaapi_shard1_replica1\data\index
   [junit4]   2> 707639 INFO  (qtp1217434695-5486) [n:127.0.0.1:59764_solr c:testschemaapi s:shard1 r:core_node1 x:testschemaapi_shard1_replica2] o.a.s.c.CachingDirectoryFactory return new directory for C:\Users\jenkins\workspace\Lucene-Solr-6.x-Windows\solr\build\solr-core\test\J1\temp\solr.schema.TestManagedSchemaAPI_18545C88E3F8E230-001\tempDir-001\node1\.\testschemaapi_shard1_replica2\data\index
   [junit4]   2> 707640 INFO  (qtp1217434695-5486) [n:127.0.0.1:59764_solr c:testschemaapi s:shard1 r:core_node1 x:testschemaapi_shard1_replica2] o.a.s.c.SolrDeletionPolicy SolrDeletionPolicy.onCommit: commits: num=1
   [junit4]   2> 	commit{dir=MockDirectoryWrapper(RAMDirectory@5ce375da lockFactory=org.apache.lucene.store.SingleInstanceLockFactory@108f5109),segFN=segments_1,generation=1}
   [junit4]   2> 707640 INFO  (qtp1217434695-5486) [n:127.0.0.1:59764_solr c:testschemaapi s:shard1 r:core_node1 x:testschemaapi_shard1_replica2] o.a.s.c.SolrDeletionPolicy newest commit generation = 1
   [junit4]   2> 707641 INFO  (qtp484253118-5493) [n:127.0.0.1:59761_solr c:testschemaapi s:shard1 r:core_node2 x:testschemaapi_shard1_replica1] o.a.s.c.SolrDeletionPolicy SolrDeletionPolicy.onCommit: commits: num=1
   [junit4]   2> 	commit{dir=MockDirectoryWrapper(RAMDirectory@139012e8 lockFactory=org.apache.lucene.store.SingleInstanceLockFactory@23838f01),segFN=segments_1,generation=1}
   [junit4]   2> 707641 INFO  (qtp484253118-5493) [n:127.0.0.1:59761_solr c:testschemaapi s:shard1 r:core_node2 x:testschemaapi_shard1_replica1] o.a.s.c.SolrDeletionPolicy newest commit generation = 1
   [junit4]   2> 707642 INFO  (qtp1217434695-5486) [n:127.0.0.1:59764_solr c:testschemaapi s:shard1 r:core_node1 x:testschemaapi_shard1_replica2] o.a.s.c.SolrCore no updateRequestProcessorChain defined as default, creating implicit default
   [junit4]   2> 707643 INFO  (qtp484253118-5493) [n:127.0.0.1:59761_solr c:testschemaapi s:shard1 r:core_node2 x:testschemaapi_shard1_replica1] o.a.s.c.SolrCore no updateRequestProcessorChain defined as default, creating implicit default
   [junit4]   2> 707644 INFO  (OldIndexDirectoryCleanupThreadForCore-testschemaapi_shard1_replica2) [n:127.0.0.1:59764_solr c:testschemaapi s:shard1 r:core_node1 x:testschemaapi_shard1_replica2] o.a.s.c.SolrCore Looking for old index directories to cleanup for core testschemaapi_shard1_replica2 in C:\Users\jenkins\workspace\Lucene-Solr-6.x-Windows\solr\build\solr-core\test\J1\temp\solr.schema.TestManagedSchemaAPI_18545C88E3F8E230-001\tempDir-001\node1\.\testschemaapi_shard1_replica2\data\
   [junit4]   2> 707644 INFO  (OldIndexDirectoryCleanupThreadForCore-testschemaapi_shard1_replica1) [n:127.0.0.1:59761_solr c:testschemaapi s:shard1 r:core_node2 x:testschemaapi_shard1_replica1] o.a.s.c.SolrCore Looking for old index directories to cleanup for core testschemaapi_shard1_replica1 in C:\Users\jenkins\workspace\Lucene-Solr-6.x-Windows\solr\build\solr-core\test\J1\temp\solr.schema.TestManagedSchemaAPI_18545C88E3F8E230-001\tempDir-001\node2\.\testschemaapi_shard1_replica1\data\
   [junit4]   2> 707646 WARN  (OldIndexDirectoryCleanupThreadForCore-testschemaapi_shard1_replica1) [n:127.0.0.1:59761_solr c:testschemaapi s:shard1 r:core_node2 x:testschemaapi_shard1_replica1] o.a.s.c.DirectoryFactory C:\Users\jenkins\workspace\Lucene-Solr-6.x-Windows\solr\build\solr-core\test\J1\temp\solr.schema.TestManagedSchemaAPI_18545C88E3F8E230-001\tempDir-001\node2\.\testschemaapi_shard1_replica1\data\ does not point to a valid data directory; skipping clean-up of old index directories.
   [junit4]   2> 707647 WARN  (OldIndexDirectoryCleanupThreadForCore-testschemaapi_shard1_replica2) [n:127.0.0.1:59764_solr c:testschemaapi s:shard1 r:core_node1 x:testschemaapi_shard1_replica2] o.a.s.c.DirectoryFactory C:\Users\jenkins\workspace\Lucene-Solr-6.x-Windows\solr\build\solr-core\test\J1\temp\solr.schema.TestManagedSchemaAPI_18545C88E3F8E230-001\tempDir-001\node1\.\testschemaapi_shard1_replica2\data\ does not point to a valid data directory; skipping clean-up of old index directories.
   [junit4]   2> 707649 INFO  (qtp484253118-5493) [n:127.0.0.1:59761_solr c:testschemaapi s:shard1 r:core_node2 x:testschemaapi_shard1_replica1] o.a.s.h.l.XMLLoader xsltCacheLifetimeSeconds=60
   [junit4]   2> 707649 INFO  (qtp1217434695-5486) [n:127.0.0.1:59764_solr c:testschemaapi s:shard1 r:core_node1 x:testschemaapi_shard1_replica2] o.a.s.h.l.XMLLoader xsltCacheLifetimeSeconds=60
   [junit4]   2> 707651 INFO  (qtp484253118-5493) [n:127.0.0.1:59761_solr c:testschemaapi s:shard1 r:core_node2 x:testschemaapi_shard1_replica1] o.a.s.h.l.XMLLoader xsltCacheLifetimeSeconds=60
   [junit4]   2> 707651 INFO  (qtp1217434695-5486) [n:127.0.0.1:59764_solr c:testschemaapi s:shard1 r:core_node1 x:testschemaapi_shard1_replica2] o.a.s.h.l.XMLLoader xsltCacheLifetimeSeconds=60
   [junit4]   2> 707652 INFO  (qtp484253118-5493) [n:127.0.0.1:59761_solr c:testschemaapi s:shard1 r:core_node2 x:testschemaapi_shard1_replica1] o.a.s.h.l.XMLLoader xsltCacheLifetimeSeconds=60
   [junit4]   2> 707652 INFO  (qtp1217434695-5486) [n:127.0.0.1:59764_solr c:testschemaapi s:shard1 r:core_node1 x:testschemaapi_shard1_replica2] o.a.s.h.l.XMLLoader xsltCacheLifetimeSeconds=60
   [junit4]   2> 707653 INFO  (qtp484253118-5493) [n:127.0.0.1:59761_solr c:testschemaapi s:shard1 r:core_node2 x:testschemaapi_shard1_replica1] o.a.s.h.l.XMLLoader xsltCacheLifetimeSeconds=60
   [junit4]   2> 707653 INFO  (qtp1217434695-5486) [n:127.0.0.1:59764_solr c:testschemaapi s:shard1 r:core_node1 x:testschemaapi_shard1_replica2] o.a.s.h.l.XMLLoader xsltCacheLifetimeSeconds=60
   [junit4]   2> 707654 INFO  (qtp484253118-5493) [n:127.0.0.1:59761_solr c:testschemaapi s:shard1 r:core_node2 x:testschemaapi_shard1_replica1] o.a.s.c.RequestHandlers Registered paths: /admin/mbeans,/update/csv,/sql,/update/json/docs,/admin/luke,/export,/select,/admin/segments,/get,/admin/system,/replication,/admin/properties,/config,/stream,/schema,/admin/plugins,/admin/logging,/update/json,/admin/ping,/admin/threads,/update,/admin/file
   [junit4]   2> 707654 INFO  (qtp484253118-5493) [n:127.0.0.1:59761_solr c:testschemaapi s:shard1 r:core_node2 x:testschemaapi_shard1_replica1] o.a.s.c.SolrCore Using default statsCache cache: org.apache.solr.search.stats.LocalStatsCache
   [junit4]   2> 707654 INFO  (qtp1217434695-5486) [n:127.0.0.1:59764_solr c:testschemaapi s:shard1 r:core_node1 x:testschemaapi_shard1_replica2] o.a.s.c.RequestHandlers Registered paths: /admin/mbeans,/update/csv,/sql,/update/json/docs,/admin/luke,/export,/select,/admin/segments,/get,/admin/system,/replication,/admin/properties,/config,/stream,/schema,/admin/plugins,/admin/logging,/update/json,/admin/ping,/admin/threads,/update,/admin/file
   [junit4]   2> 707654 INFO  (qtp1217434695-5486) [n:127.0.0.1:59764_solr c:testschemaapi s:shard1 r:core_node1 x:testschemaapi_shard1_replica2] o.a.s.c.SolrCore Using default statsCache cache: org.apache.solr.search.stats.LocalStatsCache
   [junit4]   2> 707656 INFO  (qtp484253118-5493) [n:127.0.0.1:59761_solr c:testschemaapi s:shard1 r:core_node2 x:testschemaapi_shard1_replica1] o.a.s.u.UpdateHandler Using UpdateLog implementation: org.apache.solr.update.UpdateLog
   [junit4]   2> 707656 INFO  (qtp484253118-5493) [n:127.0.0.1:59761_solr c:testschemaapi s:shard1 r:core_node2 x:testschemaapi_shard1_replica1] o.a.s.u.UpdateLog Initializing UpdateLog: dataDir=null defaultSyncLevel=FLUSH numRecordsToKeep=100 maxNumLogsToKeep=10 numVersionBuckets=65536
   [junit4]   2> 707657 INFO  (qtp1217434695-5486) [n:127.0.0.1:59764_solr c:testschemaapi s:shard1 r:core_node1 x:testschemaapi_shard1_replica2] o.a.s.u.UpdateHandler Using UpdateLog implementation: org.apache.solr.update.UpdateLog
   [junit4]   2> 707657 INFO  (qtp1217434695-5486) [n:127.0.0.1:59764_solr c:testschemaapi s:shard1 r:core_node1 x:testschemaapi_shard1_replica2] o.a.s.u.UpdateLog Initializing UpdateLog: dataDir=null defaultSyncLevel=FLUSH numRecordsToKeep=100 maxNumLogsToKeep=10 numVersionBuckets=65536
   [junit4]   2> 707658 INFO  (qtp484253118-5493) [n:127.0.0.1:59761_solr c:testschemaapi s:shard1 r:core_node2 x:testschemaapi_shard1_replica1] o.a.s.u.CommitTracker Hard AutoCommit: disabled
   [junit4]   2> 707658 INFO  (qtp484253118-5493) [n:127.0.0.1:59761_solr c:testschemaapi s:shard1 r:core_node2 x:testschemaapi_shard1_replica1] o.a.s.u.CommitTracker Soft AutoCommit: disabled
   [junit4]   2> 707660 INFO  (qtp484253118-5493) [n:127.0.0.1:59761_solr c:testschemaapi s:shard1 r:core_node2 x:testschemaapi_shard1_replica1] o.a.s.c.SolrDeletionPolicy SolrDeletionPolicy.onInit: commits: num=1
   [junit4]   2> 	commit{dir=MockDirectoryWrapper(RAMDirectory@139012e8 lockFactory=org.apache.lucene.store.SingleInstanceLockFactory@23838f01),segFN=segments_1,generation=1}
   [junit4]   2> 707660 INFO  (qtp1217434695-5486) [n:127.0.0.1:59764_solr c:testschemaapi s:shard1 r:core_node1 x:testschemaapi_shard1_replica2] o.a.s.u.CommitTracker Hard AutoCommit: disabled
   [junit4]   2> 707660 INFO  (qtp484253118-5493) [n:127.0.0.1:59761_solr c:testschemaapi s:shard1 r:core_node2 x:testschemaapi_shard1_replica1] o.a.s.c.SolrDeletionPolicy newest commit generation = 1
   [junit4]   2> 707660 INFO  (qtp484253118-5493) [n:127.0.0.1:59761_solr c:testschemaapi s:shard1 r:core_node2 x:testschemaapi_shard1_replica1] o.a.s.s.SolrIndexSearcher Opening [Searcher@221750c2[testschemaapi_shard1_replica1] main]
   [junit4]   2> 707660 INFO  (qtp484253118-5493) [n:127.0.0.1:59761_solr c:testschemaapi s:shard1 r:core_node2 x:testschemaapi_shard1_replica1] o.a.s.c.c.ZkStateReader Load collection config from: [/collections/testschemaapi]
   [junit4]   2> 707660 INFO  (qtp1217434695-5486) [n:127.0.0.1:59764_solr c:testschemaapi s:shard1 r:core_node1 x:testschemaapi_shard1_replica2] o.a.s.u.CommitTracker Soft AutoCommit: disabled
   [junit4]   2> 707661 INFO  (qtp484253118-5493) [n:127.0.0.1:59761_solr c:testschemaapi s:shard1 r:core_node2 x:testschemaapi_shard1_replica1] o.a.s.c.c.ZkStateReader path=[/collections/testschemaapi] [configName]=[conf1] specified config exists in ZooKeeper
   [junit4]   2> 707661 INFO  (qtp484253118-5493) [n:127.0.0.1:59761_solr c:testschemaapi s:shard1 r:core_node2 x:testschemaapi_shard1_replica1] o.a.s.r.ManagedResourceStorage Setting up ZooKeeper-based storage for the RestManager with znodeBase: /configs/conf1
   [junit4]   2> 707662 INFO  (qtp484253118-5493) [n:127.0.0.1:59761_solr c:testschemaapi s:shard1 r:core_node2 x:testschemaapi_shard1_replica1] o.a.s.r.ManagedResourceStorage Configured ZooKeeperStorageIO with znodeBase: /configs/conf1
   [junit4]   2> 707662 INFO  (qtp484253118-5493) [n:127.0.0.1:59761_solr c:testschemaapi s:shard1 r:core_node2 x:testschemaapi_shard1_replica1] o.a.s.r.RestManager Initializing RestManager with initArgs: {}
   [junit4]   2> 707662 INFO  (qtp484253118-5493) [n:127.0.0.1:59761_solr c:testschemaapi s:shard1 r:core_node2 x:testschemaapi_shard1_replica1] o.a.s.r.ManagedResourceStorage Reading _rest_managed.json using ZooKeeperStorageIO:path=/configs/conf1
   [junit4]   2> 707663 INFO  (qtp1217434695-5486) [n:127.0.0.1:59764_solr c:testschemaapi s:shard1 r:core_node1 x:testschemaapi_shard1_replica2] o.a.s.c.SolrDeletionPolicy SolrDeletionPolicy.onInit: commits: num=1
   [junit4]   2> 	commit{dir=MockDirectoryWrapper(RAMDirectory@5ce375da lockFactory=org.apache.lucene.store.SingleInstanceLockFactory@108f5109),segFN=segments_1,generation=1}
   [junit4]   2> 707663 INFO  (qtp1217434695-5486) [n:127.0.0.1:59764_solr c:testschemaapi s:shard1 r:core_node1 x:testschemaapi_shard1_replica2] o.a.s.c.SolrDeletionPolicy newest commit generation = 1
   [junit4]   2> 707663 INFO  (qtp1217434695-5486) [n:127.0.0.1:59764_solr c:testschemaapi s:shard1 r:core_node1 x:testschemaapi_shard1_replica2] o.a.s.s.SolrIndexSearcher Opening [Searcher@57e1b2b6[testschemaapi_shard1_replica2] main]
   [junit4]   2> 707663 INFO  (qtp1217434695-5486) [n:127.0.0.1:59764_solr c:testschemaapi s:shard1 r:core_node1 x:testschemaapi_shard1_replica2] o.a.s.c.c.ZkStateReader Load collection config from: [/collections/testschemaapi]
   [junit4]   2> 707663 INFO  (qtp484253118-5493) [n:127.0.0.1:59761_solr c:testschemaapi s:shard1 r:core_node2 x:testschemaapi_shard1_replica1] o.a.s.r.ManagedResourceStorage No data found for znode /configs/conf1/_rest_managed.json
   [junit4]   2> 707663 INFO  (qtp484253118-5493) [n:127.0.0.1:59761_solr c:testschemaapi s:shard1 r:core_node2 x:testschemaapi_shard1_replica1] o.a.s.r.ManagedResourceStorage Loaded null at path _rest_managed.json using ZooKeeperStorageIO:path=/configs/conf1
   [junit4]   2> 707663 INFO  (qtp484253118-5493) [n:127.0.0.1:59761_solr c:testschemaapi s:shard1 r:core_node2 x:testschemaapi_shard1_replica1] o.a.s.r.RestManager Initializing 0 registered ManagedResources
   [junit4]   2> 707664 INFO  (qtp484253118-5493) [n:127.0.0.1:59761_solr c:testschemaapi s:shard1 r:core_node2 x:testschemaapi_shard1_replica1] o.a.s.s.ZkIndexSchemaReader Creating ZooKeeper watch for the managed schema at /configs/conf1/managed-schema
   [junit4]   2> 707664 INFO  (qtp484253118-5493) [n:127.0.0.1:59761_solr c:testschemaapi s:shard1 r:core_node2 x:testschemaapi_shard1_replica1] o.a.s.c.ZkController Added new OnReconnect listener ZkIndexSchemaReader: /configs/conf1/managed-schema, uniqueCoreId: testschemaapi_shard1_replica1:14295218114878
   [junit4]   2> 707664 INFO  (qtp484253118-5493) [n:127.0.0.1:59761_solr c:testschemaapi s:shard1 r:core_node2 x:testschemaapi_shard1_replica1] o.a.s.h.ReplicationHandler Commits will be reserved for  10000
   [junit4]   2> 707664 INFO  (searcherExecutor-2049-thread-1-processing-n:127.0.0.1:59761_solr x:testschemaapi_shard1_replica1 s:shard1 c:testschemaapi r:core_node2) [n:127.0.0.1:59761_solr c:testschemaapi s:shard1 r:core_node2 x:testschemaapi_shard1_replica1] o.a.s.c.SolrCore [testschemaapi_shard1_replica1] Registered new searcher Searcher@221750c2[testschemaapi_shard1_replica1] main{ExitableDirectoryReader(UninvertingDirectoryReader())}
   [junit4]   2> 707664 INFO  (qtp1217434695-5486) [n:127.0.0.1:59764_solr c:testschemaapi s:shard1 r:core_node1 x:testschemaapi_shard1_replica2] o.a.s.c.c.ZkStateReader path=[/collections/testschemaapi] [configName]=[conf1] specified config exists in ZooKeeper
   [junit4]   2> 707664 INFO  (qtp1217434695-5486) [n:127.0.0.1:59764_solr c:testschemaapi s:shard1 r:core_node1 x:testschemaapi_shard1_replica2] o.a.s.r.ManagedResourceStorage Setting up ZooKeeper-based storage for the RestManager with znodeBase: /configs/conf1
   [junit4]   2> 707664 INFO  (qtp484253118-5493) [n:127.0.0.1:59761_solr c:testschemaapi s:shard1 r:core_node2 x:testschemaapi_shard1_replica1] o.a.s.u.UpdateLog Looking up max value of version field to seed version buckets
   [junit4]   2> 707664 INFO  (qtp484253118-5493) [n:127.0.0.1:59761_solr c:testschemaapi s:shard1 r:core_node2 x:testschemaapi_shard1_replica1] o.a.s.u.VersionInfo Refreshing highest value of _version_ for 65536 version buckets from index
   [junit4]   2> 707664 INFO  (qtp484253118-5493) [n:127.0.0.1:59761_solr c:testschemaapi s:shard1 r:core_node2 x:testschemaapi_shard1_replica1] o.a.s.u.VersionInfo No terms found for _version_, cannot seed version bucket highest value from index
   [junit4]   2> 707664 INFO  (qtp484253118-5493) [n:127.0.0.1:59761_solr c:testschemaapi s:shard1 r:core_node2 x:testschemaapi_shard1_replica1] o.a.s.u.UpdateLog Could not find max version in index or recent updates, using new clock 1533523906949808128
   [junit4]   2> 707665 INFO  (qtp1217434695-5486) [n:127.0.0.1:59764_solr c:testschemaapi s:shard1 r:core_node1 x:testschemaapi_shard1_replica2] o.a.s.r.ManagedResourceStorage Configured ZooKeeperStorageIO with znodeBase: /configs/conf1
   [junit4]   2> 707665 INFO  (qtp1217434695-5486) [n:127.0.0.1:59764_solr c:testschemaapi s:shard1 r:core_node1 x:testschemaapi_shard1_replica2] o.a.s.r.RestManager Initializing RestManager with initArgs: {}
   [junit4]   2> 707665 INFO  (qtp1217434695-5486) [n:127.0.0.1:59764_solr c:testschemaapi s:shard1 r:core_node1 x:testschemaapi_shard1_replica2] o.a.s.r.ManagedResourceStorage Reading _rest_managed.json using ZooKeeperStorageIO:path=/configs/conf1
   [junit4]   2> 707666 INFO  (qtp1217434695-5486) [n:127.0.0.1:59764_solr c:testschemaapi s:shard1 r:core_node1 x:testschemaapi_shard1_replica2] o.a.s.r.ManagedResourceStorage No data found for znode /configs/conf1/_rest_managed.json
   [junit4]   2> 707666 INFO  (qtp1217434695-5486) [n:127.0.0.1:59764_solr c:testschemaapi s:shard1 r:core_node1 x:testschemaapi_shard1_replica2] o.a.s.r.ManagedResourceStorage Loaded null at path _rest_managed.json using ZooKeeperStorageIO:path=/configs/conf1
   [junit4]   2> 707666 INFO  (qtp1217434695-5486) [n:127.0.0.1:59764_solr c:testschemaapi s:shard1 r:core_node1 x:testschemaapi_shard1_replica2] o.a.s.r.RestManager Initializing 0 registered ManagedResources
   [junit4]   2> 707666 INFO  (qtp1217434695-5486) [n:127.0.0.1:59764_solr c:testschemaapi s:shard1 r:core_node1 x:testschemaapi_shard1_replica2] o.a.s.s.ZkIndexSchemaReader Creating ZooKeeper watch for the managed schema at /configs/conf1/managed-schema
   [junit4]   2> 707666 INFO  (qtp484253118-5493) [n:127.0.0.1:59761_solr c:testschemaapi s:shard1 r:core_node2 x:testschemaapi_shard1_replica1] o.a.s.u.UpdateLog Took 1.0ms to seed version buckets with highest version 1533523906949808128
   [junit4]   2> 707666 INFO  (qtp484253118-5493) [n:127.0.0.1:59761_solr c:testschemaapi s:shard1 r:core_node2 x:testschemaapi_shard1_replica1] o.a.s.c.ZkController watch zkdir /configs/conf1
   [junit4]   2> 707667 INFO  (qtp1217434695-5486) [n:127.0.0.1:59764_solr c:testschemaapi s:shard1 r:core_node1 x:testschemaapi_shard1_replica2] o.a.s.c.ZkController Added new OnReconnect listener ZkIndexSchemaReader: /configs/conf1/managed-schema, uniqueCoreId: testschemaapi_shard1_replica2:14295218300693
   [junit4]   2> 707667 INFO  (qtp1217434695-5486) [n:127.0.0.1:59764_solr c:testschemaapi s:shard1 r:core_node1 x:testschemaapi_shard1_replica2] o.a.s.h.ReplicationHandler Commits will be reserved for  10000
   [junit4]   2> 707667 INFO  (searcherExecutor-2050-thread-1-processing-n:127.0.0.1:59764_solr x:testschemaapi_shard1_replica2 s:shard1 c:testschemaapi r:core_node1) [n:127.0.0.1:59764_solr c:testschemaapi s:shard1 r:core_node1 x:testschemaapi_shard1_replica2] o.a.s.c.SolrCore [testschemaapi_shard1_replica2] Registered new searcher Searcher@57e1b2b6[testschemaapi_shard1_replica2] main{ExitableDirectoryReader(UninvertingDirectoryReader())}
   [junit4]   2> 707667 INFO  (qtp1217434695-5486) [n:127.0.0.1:59764_solr c:testschemaapi s:shard1 r:core_node1 x:testschemaapi_shard1_replica2] o.a.s.u.UpdateLog Looking up max value of version field to seed version buckets
   [junit4]   2> 707667 INFO  (qtp1217434695-5486) [n:127.0.0.1:59764_solr c:testschemaapi s:shard1 r:core_node1 x:testschemaapi_shard1_replica2] o.a.s.u.VersionInfo Refreshing highest value of _version_ for 65536 version buckets from index
   [junit4]   2> 707667 INFO  (qtp1217434695-5486) [n:127.0.0.1:59764_solr c:testschemaapi s:shard1 r:core_node1 x:testschemaapi_shard1_replica2] o.a.s.u.VersionInfo No terms found for _version_, cannot seed version bucket highest value from index
   [junit4]   2> 707667 INFO  (qtp484253118-5493) [n:127.0.0.1:59761_solr c:testschemaapi s:shard1 r:core_node2 x:testschemaapi_shard1_replica1] o.a.s.c.CoreContainer registering core: testschemaapi_shard1_replica1
   [junit4]   2> 707667 INFO  (qtp1217434695-5486) [n:127.0.0.1:59764_solr c:testschemaapi s:shard1 r:core_node1 x:testschemaapi_shard1_replica2] o.a.s.u.UpdateLog Could not find max version in index or recent updates, using new clock 1533523906952953856
   [junit4]   2> 707667 INFO  (qtp484253118-5493) [n:127.0.0.1:59761_solr c:testschemaapi s:shard1 r:core_node2 x:testschemaapi_shard1_replica1] o.a.s.c.ZkController Register replica - core:testschemaapi_shard1_replica1 address:http://127.0.0.1:59761/solr collection:testschemaapi shard:shard1
   [junit4]   2> 707668 INFO  (qtp484253118-5493) [n:127.0.0.1:59761_solr c:testschemaapi s:shard1 r:core_node2 x:testschemaapi_shard1_replica1] o.a.s.c.c.SolrZkClient makePath: /collections/testschemaapi/leader_elect/shard1/election
   [junit4]   2> 707670 INFO  (qtp1217434695-5486) [n:127.0.0.1:59764_solr c:testschemaapi s:shard1 r:core_node1 x:testschemaapi_shard1_replica2] o.a.s.u.UpdateLog Took 2.0ms to seed version buckets with highest version 1533523906952953856
   [junit4]   2> 707670 INFO  (qtp1217434695-5486) [n:127.0.0.1:59764_solr c:testschemaapi s:shard1 r:core_node1 x:testschemaapi_shard1_replica2] o.a.s.c.ZkController watch zkdir /configs/conf1
   [junit4]   2> 707670 INFO  (qtp1217434695-5486) [n:127.0.0.1:59764_solr c:testschemaapi s:shard1 r:core_node1 x:testschemaapi_shard1_replica2] o.a.s.c.CoreContainer registering core: testschemaapi_shard1_replica2
   [junit4]   2> 707671 INFO  (qtp1217434695-5486) [n:127.0.0.1:59764_solr c:testschemaapi s:shard1 r:core_node1 x:testschemaapi_shard1_replica2] o.a.s.c.ZkController Register replica - core:testschemaapi_shard1_replica2 address:http://127.0.0.1:59764/solr collection:testschemaapi shard:shard1
   [junit4]   2> 707671 INFO  (qtp1217434695-5486) [n:127.0.0.1:59764_solr c:testschemaapi s:shard1 r:core_node1 x:testschemaapi_shard1_replica2] o.a.s.c.c.SolrZkClient makePath: /collections/testschemaapi/leader_elect/shard1/election
   [junit4]   2> 707671 INFO  (qtp484253118-5493) [n:127.0.0.1:59761_solr c:testschemaapi s:shard1 r:core_node2 x:testschemaapi_shard1_replica1] o.a.s.c.LeaderElector Joined leadership election with path: /collections/testschemaapi/leader_elect/shard1/election/95845244017836037-core_node2-n_0000000000
   [junit4]

[...truncated too long message...]

che.solr.core.CoreContainer.reload(CoreContainer.java:921)
   [junit4]   2> 	at org.apache.solr.core.SolrCore.lambda$getConfListener$6(SolrCore.java:2489)
   [junit4]   2> 	at org.apache.solr.cloud.ZkController$4.run(ZkController.java:2423)
   [junit4]   2> Caused by: org.apache.solr.common.SolrException: Could not find config name for collection:testschemaapi
   [junit4]   2> 	at org.apache.solr.core.SolrCore.<init>(SolrCore.java:773)
   [junit4]   2> 	at org.apache.solr.core.SolrCore.reload(SolrCore.java:462)
   [junit4]   2> 	at org.apache.solr.core.CoreContainer.reload(CoreContainer.java:915)
   [junit4]   2> 	... 2 more
   [junit4]   2> Caused by: org.apache.solr.common.SolrException: Could not find config name for collection:testschemaapi
   [junit4]   2> 	at org.apache.solr.rest.ManagedResourceStorage.newStorageIO(ManagedResourceStorage.java:101)
   [junit4]   2> 	at org.apache.solr.core.SolrCore.initRestManager(SolrCore.java:2284)
   [junit4]   2> 	at org.apache.solr.core.SolrCore.<init>(SolrCore.java:749)
   [junit4]   2> 	... 4 more
   [junit4]   2> May 05, 2016 9:06:14 PM com.carrotsearch.randomizedtesting.ThreadLeakControl checkThreadLeaks
   [junit4]   2> WARNING: Will linger awaiting termination of 3 leaked thread(s).
   [junit4]   2> NOTE: test params are: codec=Asserting(Lucene60): {_version_=Lucene50(blocksize=128), id=PostingsFormat(name=LuceneVarGapFixedInterval), myNewField1=PostingsFormat(name=LuceneVarGapFixedInterval), myNewField=PostingsFormat(name=LuceneFixedGap)}, docValues:{}, maxPointsInLeafNode=1618, maxMBSortInHeap=7.68004217345502, sim=ClassicSimilarity, locale=es, timezone=VST
   [junit4]   2> NOTE: Windows 10 10.0 amd64/Oracle Corporation 1.8.0_92 (64-bit)/cpus=3,threads=1,free=233364624,total=536870912
   [junit4]   2> NOTE: All tests run in this JVM: [StatsComponentTest, DateFieldTest, TestSortByMinMaxFunction, TestDistribIDF, RequestHandlersTest, TestSolrCLIRunExample, TestAuthenticationFramework, TestConfigSetsAPIZkFailure, DeleteReplicaTest, RemoteQueryErrorTest, TestSolrQueryParserResource, TestPivotHelperCode, OutputWriterTest, TermVectorComponentDistributedTest, TestSolrFieldCacheMBean, MinimalSchemaTest, CleanupOldIndexTest, TestSystemIdResolver, DistributedFacetPivotLargeTest, ShardSplitTest, OpenCloseCoreStressTest, TestSolrJ, TestConfigSetImmutable, HdfsSyncSliceTest, DistributedTermsComponentTest, CollectionTooManyReplicasTest, TestFilteredDocIdSet, TestBinaryField, FileBasedSpellCheckerTest, HdfsTlogReplayBufferedWhileIndexingTest, TestMiniSolrCloudClusterBase, TestManagedSchemaAPI]
   [junit4]   2> NOTE: reproduce with: ant test  -Dtestcase=TestManagedSchemaAPI -Dtests.seed=18545C88E3F8E230 -Dtests.slow=true -Dtests.locale=es -Dtests.timezone=VST -Dtests.asserts=true -Dtests.file.encoding=UTF-8
   [junit4] ERROR   0.00s J1 | TestManagedSchemaAPI (suite) <<<
   [junit4]    > Throwable #1: java.lang.AssertionError: ObjectTracker found 8 object(s) that were not released!!! [MockDirectoryWrapper, MockDirectoryWrapper, TransactionLog, TransactionLog, MDCAwareThreadPoolExecutor, MockDirectoryWrapper, MockDirectoryWrapper, MDCAwareThreadPoolExecutor]
   [junit4]    > 	at __randomizedtesting.SeedInfo.seed([18545C88E3F8E230]:0)
   [junit4]    > 	at org.apache.solr.SolrTestCaseJ4.afterClass(SolrTestCaseJ4.java:256)
   [junit4]    > 	at java.lang.Thread.run(Thread.java:745)Throwable #2: java.io.IOException: Could not remove the following files (in the order of attempts):
   [junit4]    >    C:\Users\jenkins\workspace\Lucene-Solr-6.x-Windows\solr\build\solr-core\test\J1\temp\solr.schema.TestManagedSchemaAPI_18545C88E3F8E230-001\tempDir-001\node1\testschemaapi_shard1_replica2\data\tlog\tlog.0000000000000000000: java.nio.file.FileSystemException: C:\Users\jenkins\workspace\Lucene-Solr-6.x-Windows\solr\build\solr-core\test\J1\temp\solr.schema.TestManagedSchemaAPI_18545C88E3F8E230-001\tempDir-001\node1\testschemaapi_shard1_replica2\data\tlog\tlog.0000000000000000000: The process cannot access the file because it is being used by another process.
   [junit4]    >    C:\Users\jenkins\workspace\Lucene-Solr-6.x-Windows\solr\build\solr-core\test\J1\temp\solr.schema.TestManagedSchemaAPI_18545C88E3F8E230-001\tempDir-001\node1\testschemaapi_shard1_replica2\data\tlog: java.nio.file.DirectoryNotEmptyException: C:\Users\jenkins\workspace\Lucene-Solr-6.x-Windows\solr\build\solr-core\test\J1\temp\solr.schema.TestManagedSchemaAPI_18545C88E3F8E230-001\tempDir-001\node1\testschemaapi_shard1_replica2\data\tlog
   [junit4]    >    C:\Users\jenkins\workspace\Lucene-Solr-6.x-Windows\solr\build\solr-core\test\J1\temp\solr.schema.TestManagedSchemaAPI_18545C88E3F8E230-001\tempDir-001\node1\testschemaapi_shard1_replica2\data: java.nio.file.DirectoryNotEmptyException: C:\Users\jenkins\workspace\Lucene-Solr-6.x-Windows\solr\build\solr-core\test\J1\temp\solr.schema.TestManagedSchemaAPI_18545C88E3F8E230-001\tempDir-001\node1\testschemaapi_shard1_replica2\data
   [junit4]    >    C:\Users\jenkins\workspace\Lucene-Solr-6.x-Windows\solr\build\solr-core\test\J1\temp\solr.schema.TestManagedSchemaAPI_18545C88E3F8E230-001\tempDir-001\node1\testschemaapi_shard1_replica2: java.nio.file.DirectoryNotEmptyException: C:\Users\jenkins\workspace\Lucene-Solr-6.x-Windows\solr\build\solr-core\test\J1\temp\solr.schema.TestManagedSchemaAPI_18545C88E3F8E230-001\tempDir-001\node1\testschemaapi_shard1_replica2
   [junit4]    >    C:\Users\jenkins\workspace\Lucene-Solr-6.x-Windows\solr\build\solr-core\test\J1\temp\solr.schema.TestManagedSchemaAPI_18545C88E3F8E230-001\tempDir-001\node1: java.nio.file.DirectoryNotEmptyException: C:\Users\jenkins\workspace\Lucene-Solr-6.x-Windows\solr\build\solr-core\test\J1\temp\solr.schema.TestManagedSchemaAPI_18545C88E3F8E230-001\tempDir-001\node1
   [junit4]    >    C:\Users\jenkins\workspace\Lucene-Solr-6.x-Windows\solr\build\solr-core\test\J1\temp\solr.schema.TestManagedSchemaAPI_18545C88E3F8E230-001\tempDir-001\node2\testschemaapi_shard1_replica1\data\tlog\tlog.0000000000000000001: java.nio.file.FileSystemException: C:\Users\jenkins\workspace\Lucene-Solr-6.x-Windows\solr\build\solr-core\test\J1\temp\solr.schema.TestManagedSchemaAPI_18545C88E3F8E230-001\tempDir-001\node2\testschemaapi_shard1_replica1\data\tlog\tlog.0000000000000000001: The process cannot access the file because it is being used by another process.
   [junit4]    >    C:\Users\jenkins\workspace\Lucene-Solr-6.x-Windows\solr\build\solr-core\test\J1\temp\solr.schema.TestManagedSchemaAPI_18545C88E3F8E230-001\tempDir-001\node2\testschemaapi_shard1_replica1\data\tlog: java.nio.file.DirectoryNotEmptyException: C:\Users\jenkins\workspace\Lucene-Solr-6.x-Windows\solr\build\solr-core\test\J1\temp\solr.schema.TestManagedSchemaAPI_18545C88E3F8E230-001\tempDir-001\node2\testschemaapi_shard1_replica1\data\tlog
   [junit4]    >    C:\Users\jenkins\workspace\Lucene-Solr-6.x-Windows\solr\build\solr-core\test\J1\temp\solr.schema.TestManagedSchemaAPI_18545C88E3F8E230-001\tempDir-001\node2\testschemaapi_shard1_replica1\data: java.nio.file.DirectoryNotEmptyException: C:\Users\jenkins\workspace\Lucene-Solr-6.x-Windows\solr\build\solr-core\test\J1\temp\solr.schema.TestManagedSchemaAPI_18545C88E3F8E230-001\tempDir-001\node2\testschemaapi_shard1_replica1\data
   [junit4]    >    C:\Users\jenkins\workspace\Lucene-Solr-6.x-Windows\solr\build\solr-core\test\J1\temp\solr.schema.TestManagedSchemaAPI_18545C88E3F8E230-001\tempDir-001\node2\testschemaapi_shard1_replica1: java.nio.file.DirectoryNotEmptyException: C:\Users\jenkins\workspace\Lucene-Solr-6.x-Windows\solr\build\solr-core\test\J1\temp\solr.schema.TestManagedSchemaAPI_18545C88E3F8E230-001\tempDir-001\node2\testschemaapi_shard1_replica1
   [junit4]    >    C:\Users\jenkins\workspace\Lucene-Solr-6.x-Windows\solr\build\solr-core\test\J1\temp\solr.schema.TestManagedSchemaAPI_18545C88E3F8E230-001\tempDir-001\node2: java.nio.file.DirectoryNotEmptyException: C:\Users\jenkins\workspace\Lucene-Solr-6.x-Windows\solr\build\solr-core\test\J1\temp\solr.schema.TestManagedSchemaAPI_18545C88E3F8E230-001\tempDir-001\node2
   [junit4]    >    C:\Users\jenkins\workspace\Lucene-Solr-6.x-Windows\solr\build\solr-core\test\J1\temp\solr.schema.TestManagedSchemaAPI_18545C88E3F8E230-001\tempDir-001: java.nio.file.DirectoryNotEmptyException: C:\Users\jenkins\workspace\Lucene-Solr-6.x-Windows\solr\build\solr-core\test\J1\temp\solr.schema.TestManagedSchemaAPI_18545C88E3F8E230-001\tempDir-001
   [junit4]    > 	at org.apache.lucene.util.IOUtils.rm(IOUtils.java:323)
   [junit4]    > 	at java.lang.Thread.run(Thread.java:745)
   [junit4] Completed [97/594 (1!)] on J1 in 14.08s, 1 test, 1 failure, 1 error <<< FAILURES!

[...truncated 1638 lines...]
BUILD FAILED
C:\Users\jenkins\workspace\Lucene-Solr-6.x-Windows\build.xml:740: The following error occurred while executing this line:
C:\Users\jenkins\workspace\Lucene-Solr-6.x-Windows\build.xml:684: The following error occurred while executing this line:
C:\Users\jenkins\workspace\Lucene-Solr-6.x-Windows\build.xml:59: The following error occurred while executing this line:
C:\Users\jenkins\workspace\Lucene-Solr-6.x-Windows\solr\build.xml:233: The following error occurred while executing this line:
C:\Users\jenkins\workspace\Lucene-Solr-6.x-Windows\solr\common-build.xml:529: The following error occurred while executing this line:
C:\Users\jenkins\workspace\Lucene-Solr-6.x-Windows\lucene\common-build.xml:1457: The following error occurred while executing this line:
C:\Users\jenkins\workspace\Lucene-Solr-6.x-Windows\lucene\common-build.xml:1014: There were test failures: 594 suites (10 ignored), 2403 tests, 2 suite-level errors, 124 ignored (80 assumptions) [seed: 18545C88E3F8E230]

Total time: 78 minutes 9 seconds
Build step 'Invoke Ant' marked build as failure
Archiving artifacts
[WARNINGS] Skipping publisher since build result is FAILURE
Recording test results
Email was triggered for: Failure - Any
Sending email for trigger: Failure - Any



Mime
View raw message