lucene-dev mailing list archives

Site index · List index
Message view « Date » · « Thread »
Top « Date » · « Thread »
From Policeman Jenkins Server <jenk...@thetaphi.de>
Subject [JENKINS] Lucene-Solr-6.0-Linux (64bit/jdk1.8.0_92) - Build # 186 - Failure!
Date Thu, 26 May 2016 09:32:57 GMT
Build: http://jenkins.thetaphi.de/job/Lucene-Solr-6.0-Linux/186/
Java: 64bit/jdk1.8.0_92 -XX:+UseCompressedOops -XX:+UseConcMarkSweepGC

2 tests failed.
FAILED:  org.apache.solr.TestDistributedSearch.test

Error Message:
Expected to find shardAddress in the up shard info

Stack Trace:
java.lang.AssertionError: Expected to find shardAddress in the up shard info
	at __randomizedtesting.SeedInfo.seed([BA68A0153E0B5158:323C9FCF90F73CA0]:0)
	at org.junit.Assert.fail(Assert.java:93)
	at org.junit.Assert.assertTrue(Assert.java:43)
	at org.apache.solr.TestDistributedSearch.comparePartialResponses(TestDistributedSearch.java:1160)
	at org.apache.solr.TestDistributedSearch.queryPartialResults(TestDistributedSearch.java:1101)
	at org.apache.solr.TestDistributedSearch.test(TestDistributedSearch.java:961)
	at sun.reflect.NativeMethodAccessorImpl.invoke0(Native Method)
	at sun.reflect.NativeMethodAccessorImpl.invoke(NativeMethodAccessorImpl.java:62)
	at sun.reflect.DelegatingMethodAccessorImpl.invoke(DelegatingMethodAccessorImpl.java:43)
	at java.lang.reflect.Method.invoke(Method.java:498)
	at com.carrotsearch.randomizedtesting.RandomizedRunner.invoke(RandomizedRunner.java:1764)
	at com.carrotsearch.randomizedtesting.RandomizedRunner$8.evaluate(RandomizedRunner.java:871)
	at com.carrotsearch.randomizedtesting.RandomizedRunner$9.evaluate(RandomizedRunner.java:907)
	at com.carrotsearch.randomizedtesting.RandomizedRunner$10.evaluate(RandomizedRunner.java:921)
	at org.apache.solr.BaseDistributedSearchTestCase$ShardsRepeatRule$ShardsRepeatStatement.callStatement(BaseDistributedSearchTestCase.java:1018)
	at org.apache.solr.BaseDistributedSearchTestCase$ShardsRepeatRule$ShardsStatement.evaluate(BaseDistributedSearchTestCase.java:967)
	at com.carrotsearch.randomizedtesting.rules.SystemPropertiesRestoreRule$1.evaluate(SystemPropertiesRestoreRule.java:57)
	at org.apache.lucene.util.TestRuleSetupTeardownChained$1.evaluate(TestRuleSetupTeardownChained.java:49)
	at org.apache.lucene.util.AbstractBeforeAfterRule$1.evaluate(AbstractBeforeAfterRule.java:45)
	at org.apache.lucene.util.TestRuleThreadAndTestName$1.evaluate(TestRuleThreadAndTestName.java:48)
	at org.apache.lucene.util.TestRuleIgnoreAfterMaxFailures$1.evaluate(TestRuleIgnoreAfterMaxFailures.java:64)
	at org.apache.lucene.util.TestRuleMarkFailure$1.evaluate(TestRuleMarkFailure.java:47)
	at com.carrotsearch.randomizedtesting.rules.StatementAdapter.evaluate(StatementAdapter.java:36)
	at com.carrotsearch.randomizedtesting.ThreadLeakControl$StatementRunner.run(ThreadLeakControl.java:367)
	at com.carrotsearch.randomizedtesting.ThreadLeakControl.forkTimeoutingTask(ThreadLeakControl.java:809)
	at com.carrotsearch.randomizedtesting.ThreadLeakControl$3.evaluate(ThreadLeakControl.java:460)
	at com.carrotsearch.randomizedtesting.RandomizedRunner.runSingleTest(RandomizedRunner.java:880)
	at com.carrotsearch.randomizedtesting.RandomizedRunner$5.evaluate(RandomizedRunner.java:781)
	at com.carrotsearch.randomizedtesting.RandomizedRunner$6.evaluate(RandomizedRunner.java:816)
	at com.carrotsearch.randomizedtesting.RandomizedRunner$7.evaluate(RandomizedRunner.java:827)
	at com.carrotsearch.randomizedtesting.rules.StatementAdapter.evaluate(StatementAdapter.java:36)
	at com.carrotsearch.randomizedtesting.rules.SystemPropertiesRestoreRule$1.evaluate(SystemPropertiesRestoreRule.java:57)
	at org.apache.lucene.util.AbstractBeforeAfterRule$1.evaluate(AbstractBeforeAfterRule.java:45)
	at com.carrotsearch.randomizedtesting.rules.StatementAdapter.evaluate(StatementAdapter.java:36)
	at org.apache.lucene.util.TestRuleStoreClassName$1.evaluate(TestRuleStoreClassName.java:41)
	at com.carrotsearch.randomizedtesting.rules.NoShadowingOrOverridesOnMethodsRule$1.evaluate(NoShadowingOrOverridesOnMethodsRule.java:40)
	at com.carrotsearch.randomizedtesting.rules.NoShadowingOrOverridesOnMethodsRule$1.evaluate(NoShadowingOrOverridesOnMethodsRule.java:40)
	at com.carrotsearch.randomizedtesting.rules.StatementAdapter.evaluate(StatementAdapter.java:36)
	at com.carrotsearch.randomizedtesting.rules.StatementAdapter.evaluate(StatementAdapter.java:36)
	at com.carrotsearch.randomizedtesting.rules.StatementAdapter.evaluate(StatementAdapter.java:36)
	at org.apache.lucene.util.TestRuleAssertionsRequired$1.evaluate(TestRuleAssertionsRequired.java:53)
	at org.apache.lucene.util.TestRuleMarkFailure$1.evaluate(TestRuleMarkFailure.java:47)
	at org.apache.lucene.util.TestRuleIgnoreAfterMaxFailures$1.evaluate(TestRuleIgnoreAfterMaxFailures.java:64)
	at org.apache.lucene.util.TestRuleIgnoreTestSuites$1.evaluate(TestRuleIgnoreTestSuites.java:54)
	at com.carrotsearch.randomizedtesting.rules.StatementAdapter.evaluate(StatementAdapter.java:36)
	at com.carrotsearch.randomizedtesting.ThreadLeakControl$StatementRunner.run(ThreadLeakControl.java:367)
	at java.lang.Thread.run(Thread.java:745)


FAILED:  org.apache.solr.cloud.ChaosMonkeyNothingIsSafeTest.test

Error Message:
document count mismatch.  control=678 sum(shards)=677 cloudClient=677

Stack Trace:
java.lang.AssertionError: document count mismatch.  control=678 sum(shards)=677 cloudClient=677
	at __randomizedtesting.SeedInfo.seed([BA68A0153E0B5158:323C9FCF90F73CA0]:0)
	at org.junit.Assert.fail(Assert.java:93)
	at org.apache.solr.cloud.AbstractFullDistribZkTestBase.checkShardConsistency(AbstractFullDistribZkTestBase.java:1319)
	at org.apache.solr.cloud.ChaosMonkeyNothingIsSafeTest.test(ChaosMonkeyNothingIsSafeTest.java:226)
	at sun.reflect.NativeMethodAccessorImpl.invoke0(Native Method)
	at sun.reflect.NativeMethodAccessorImpl.invoke(NativeMethodAccessorImpl.java:62)
	at sun.reflect.DelegatingMethodAccessorImpl.invoke(DelegatingMethodAccessorImpl.java:43)
	at java.lang.reflect.Method.invoke(Method.java:498)
	at com.carrotsearch.randomizedtesting.RandomizedRunner.invoke(RandomizedRunner.java:1764)
	at com.carrotsearch.randomizedtesting.RandomizedRunner$8.evaluate(RandomizedRunner.java:871)
	at com.carrotsearch.randomizedtesting.RandomizedRunner$9.evaluate(RandomizedRunner.java:907)
	at com.carrotsearch.randomizedtesting.RandomizedRunner$10.evaluate(RandomizedRunner.java:921)
	at org.apache.solr.BaseDistributedSearchTestCase$ShardsRepeatRule$ShardsFixedStatement.callStatement(BaseDistributedSearchTestCase.java:992)
	at org.apache.solr.BaseDistributedSearchTestCase$ShardsRepeatRule$ShardsStatement.evaluate(BaseDistributedSearchTestCase.java:967)
	at com.carrotsearch.randomizedtesting.rules.SystemPropertiesRestoreRule$1.evaluate(SystemPropertiesRestoreRule.java:57)
	at org.apache.lucene.util.TestRuleSetupTeardownChained$1.evaluate(TestRuleSetupTeardownChained.java:49)
	at org.apache.lucene.util.AbstractBeforeAfterRule$1.evaluate(AbstractBeforeAfterRule.java:45)
	at org.apache.lucene.util.TestRuleThreadAndTestName$1.evaluate(TestRuleThreadAndTestName.java:48)
	at org.apache.lucene.util.TestRuleIgnoreAfterMaxFailures$1.evaluate(TestRuleIgnoreAfterMaxFailures.java:64)
	at org.apache.lucene.util.TestRuleMarkFailure$1.evaluate(TestRuleMarkFailure.java:47)
	at com.carrotsearch.randomizedtesting.rules.StatementAdapter.evaluate(StatementAdapter.java:36)
	at com.carrotsearch.randomizedtesting.ThreadLeakControl$StatementRunner.run(ThreadLeakControl.java:367)
	at com.carrotsearch.randomizedtesting.ThreadLeakControl.forkTimeoutingTask(ThreadLeakControl.java:809)
	at com.carrotsearch.randomizedtesting.ThreadLeakControl$3.evaluate(ThreadLeakControl.java:460)
	at com.carrotsearch.randomizedtesting.RandomizedRunner.runSingleTest(RandomizedRunner.java:880)
	at com.carrotsearch.randomizedtesting.RandomizedRunner$5.evaluate(RandomizedRunner.java:781)
	at com.carrotsearch.randomizedtesting.RandomizedRunner$6.evaluate(RandomizedRunner.java:816)
	at com.carrotsearch.randomizedtesting.RandomizedRunner$7.evaluate(RandomizedRunner.java:827)
	at com.carrotsearch.randomizedtesting.rules.StatementAdapter.evaluate(StatementAdapter.java:36)
	at com.carrotsearch.randomizedtesting.rules.SystemPropertiesRestoreRule$1.evaluate(SystemPropertiesRestoreRule.java:57)
	at org.apache.lucene.util.AbstractBeforeAfterRule$1.evaluate(AbstractBeforeAfterRule.java:45)
	at com.carrotsearch.randomizedtesting.rules.StatementAdapter.evaluate(StatementAdapter.java:36)
	at org.apache.lucene.util.TestRuleStoreClassName$1.evaluate(TestRuleStoreClassName.java:41)
	at com.carrotsearch.randomizedtesting.rules.NoShadowingOrOverridesOnMethodsRule$1.evaluate(NoShadowingOrOverridesOnMethodsRule.java:40)
	at com.carrotsearch.randomizedtesting.rules.NoShadowingOrOverridesOnMethodsRule$1.evaluate(NoShadowingOrOverridesOnMethodsRule.java:40)
	at com.carrotsearch.randomizedtesting.rules.StatementAdapter.evaluate(StatementAdapter.java:36)
	at com.carrotsearch.randomizedtesting.rules.StatementAdapter.evaluate(StatementAdapter.java:36)
	at com.carrotsearch.randomizedtesting.rules.StatementAdapter.evaluate(StatementAdapter.java:36)
	at org.apache.lucene.util.TestRuleAssertionsRequired$1.evaluate(TestRuleAssertionsRequired.java:53)
	at org.apache.lucene.util.TestRuleMarkFailure$1.evaluate(TestRuleMarkFailure.java:47)
	at org.apache.lucene.util.TestRuleIgnoreAfterMaxFailures$1.evaluate(TestRuleIgnoreAfterMaxFailures.java:64)
	at org.apache.lucene.util.TestRuleIgnoreTestSuites$1.evaluate(TestRuleIgnoreTestSuites.java:54)
	at com.carrotsearch.randomizedtesting.rules.StatementAdapter.evaluate(StatementAdapter.java:36)
	at com.carrotsearch.randomizedtesting.ThreadLeakControl$StatementRunner.run(ThreadLeakControl.java:367)
	at java.lang.Thread.run(Thread.java:745)




Build Log:
[...truncated 11193 lines...]
   [junit4] Suite: org.apache.solr.cloud.ChaosMonkeyNothingIsSafeTest
   [junit4]   2> Creating dataDir: /home/jenkins/workspace/Lucene-Solr-6.0-Linux/solr/build/solr-core/test/J1/temp/solr.cloud.ChaosMonkeyNothingIsSafeTest_BA68A0153E0B5158-001/init-core-data-001
   [junit4]   2> 938597 INFO  (SUITE-ChaosMonkeyNothingIsSafeTest-seed#[BA68A0153E0B5158]-worker) [    ] o.a.s.BaseDistributedSearchTestCase Setting hostContext system property: /
   [junit4]   2> 938599 INFO  (TEST-ChaosMonkeyNothingIsSafeTest.test-seed#[BA68A0153E0B5158]) [    ] o.a.s.c.ZkTestServer STARTING ZK TEST SERVER
   [junit4]   2> 938599 INFO  (Thread-2536) [    ] o.a.s.c.ZkTestServer client port:0.0.0.0/0.0.0.0:0
   [junit4]   2> 938599 INFO  (Thread-2536) [    ] o.a.s.c.ZkTestServer Starting server
   [junit4]   2> 938699 INFO  (TEST-ChaosMonkeyNothingIsSafeTest.test-seed#[BA68A0153E0B5158]) [    ] o.a.s.c.ZkTestServer start zk server on port:41882
   [junit4]   2> 938699 INFO  (TEST-ChaosMonkeyNothingIsSafeTest.test-seed#[BA68A0153E0B5158]) [    ] o.a.s.c.c.SolrZkClient Using default ZkCredentialsProvider
   [junit4]   2> 938700 INFO  (TEST-ChaosMonkeyNothingIsSafeTest.test-seed#[BA68A0153E0B5158]) [    ] o.a.s.c.c.ConnectionManager Waiting for client to connect to ZooKeeper
   [junit4]   2> 938702 INFO  (zkCallback-1047-thread-1) [    ] o.a.s.c.c.ConnectionManager Watcher org.apache.solr.common.cloud.ConnectionManager@645e6dd name:ZooKeeperConnection Watcher:127.0.0.1:41882 got event WatchedEvent state:SyncConnected type:None path:null path:null type:None
   [junit4]   2> 938702 INFO  (TEST-ChaosMonkeyNothingIsSafeTest.test-seed#[BA68A0153E0B5158]) [    ] o.a.s.c.c.ConnectionManager Client is connected to ZooKeeper
   [junit4]   2> 938702 INFO  (TEST-ChaosMonkeyNothingIsSafeTest.test-seed#[BA68A0153E0B5158]) [    ] o.a.s.c.c.SolrZkClient Using default ZkACLProvider
   [junit4]   2> 938702 INFO  (TEST-ChaosMonkeyNothingIsSafeTest.test-seed#[BA68A0153E0B5158]) [    ] o.a.s.c.c.SolrZkClient makePath: /solr
   [junit4]   2> 938703 INFO  (TEST-ChaosMonkeyNothingIsSafeTest.test-seed#[BA68A0153E0B5158]) [    ] o.a.s.c.c.SolrZkClient Using default ZkCredentialsProvider
   [junit4]   2> 938704 INFO  (TEST-ChaosMonkeyNothingIsSafeTest.test-seed#[BA68A0153E0B5158]) [    ] o.a.s.c.c.ConnectionManager Waiting for client to connect to ZooKeeper
   [junit4]   2> 938704 INFO  (zkCallback-1048-thread-1) [    ] o.a.s.c.c.ConnectionManager Watcher org.apache.solr.common.cloud.ConnectionManager@3839d0d8 name:ZooKeeperConnection Watcher:127.0.0.1:41882/solr got event WatchedEvent state:SyncConnected type:None path:null path:null type:None
   [junit4]   2> 938704 INFO  (TEST-ChaosMonkeyNothingIsSafeTest.test-seed#[BA68A0153E0B5158]) [    ] o.a.s.c.c.ConnectionManager Client is connected to ZooKeeper
   [junit4]   2> 938704 INFO  (TEST-ChaosMonkeyNothingIsSafeTest.test-seed#[BA68A0153E0B5158]) [    ] o.a.s.c.c.SolrZkClient Using default ZkACLProvider
   [junit4]   2> 938704 INFO  (TEST-ChaosMonkeyNothingIsSafeTest.test-seed#[BA68A0153E0B5158]) [    ] o.a.s.c.c.SolrZkClient makePath: /collections/collection1
   [junit4]   2> 938705 INFO  (TEST-ChaosMonkeyNothingIsSafeTest.test-seed#[BA68A0153E0B5158]) [    ] o.a.s.c.c.SolrZkClient makePath: /collections/collection1/shards
   [junit4]   2> 938706 INFO  (TEST-ChaosMonkeyNothingIsSafeTest.test-seed#[BA68A0153E0B5158]) [    ] o.a.s.c.c.SolrZkClient makePath: /collections/control_collection
   [junit4]   2> 938706 INFO  (TEST-ChaosMonkeyNothingIsSafeTest.test-seed#[BA68A0153E0B5158]) [    ] o.a.s.c.c.SolrZkClient makePath: /collections/control_collection/shards
   [junit4]   2> 938707 INFO  (TEST-ChaosMonkeyNothingIsSafeTest.test-seed#[BA68A0153E0B5158]) [    ] o.a.s.c.AbstractZkTestCase put /home/jenkins/workspace/Lucene-Solr-6.0-Linux/solr/core/src/test-files/solr/collection1/conf/solrconfig-tlog.xml to /configs/conf1/solrconfig.xml
   [junit4]   2> 938707 INFO  (TEST-ChaosMonkeyNothingIsSafeTest.test-seed#[BA68A0153E0B5158]) [    ] o.a.s.c.c.SolrZkClient makePath: /configs/conf1/solrconfig.xml
   [junit4]   2> 938708 INFO  (TEST-ChaosMonkeyNothingIsSafeTest.test-seed#[BA68A0153E0B5158]) [    ] o.a.s.c.AbstractZkTestCase put /home/jenkins/workspace/Lucene-Solr-6.0-Linux/solr/core/src/test-files/solr/collection1/conf/schema15.xml to /configs/conf1/schema.xml
   [junit4]   2> 938708 INFO  (TEST-ChaosMonkeyNothingIsSafeTest.test-seed#[BA68A0153E0B5158]) [    ] o.a.s.c.c.SolrZkClient makePath: /configs/conf1/schema.xml
   [junit4]   2> 938708 INFO  (TEST-ChaosMonkeyNothingIsSafeTest.test-seed#[BA68A0153E0B5158]) [    ] o.a.s.c.AbstractZkTestCase put /home/jenkins/workspace/Lucene-Solr-6.0-Linux/solr/core/src/test-files/solr/collection1/conf/solrconfig.snippet.randomindexconfig.xml to /configs/conf1/solrconfig.snippet.randomindexconfig.xml
   [junit4]   2> 938708 INFO  (TEST-ChaosMonkeyNothingIsSafeTest.test-seed#[BA68A0153E0B5158]) [    ] o.a.s.c.c.SolrZkClient makePath: /configs/conf1/solrconfig.snippet.randomindexconfig.xml
   [junit4]   2> 938709 INFO  (TEST-ChaosMonkeyNothingIsSafeTest.test-seed#[BA68A0153E0B5158]) [    ] o.a.s.c.AbstractZkTestCase put /home/jenkins/workspace/Lucene-Solr-6.0-Linux/solr/core/src/test-files/solr/collection1/conf/stopwords.txt to /configs/conf1/stopwords.txt
   [junit4]   2> 938710 INFO  (TEST-ChaosMonkeyNothingIsSafeTest.test-seed#[BA68A0153E0B5158]) [    ] o.a.s.c.c.SolrZkClient makePath: /configs/conf1/stopwords.txt
   [junit4]   2> 938710 INFO  (TEST-ChaosMonkeyNothingIsSafeTest.test-seed#[BA68A0153E0B5158]) [    ] o.a.s.c.AbstractZkTestCase put /home/jenkins/workspace/Lucene-Solr-6.0-Linux/solr/core/src/test-files/solr/collection1/conf/protwords.txt to /configs/conf1/protwords.txt
   [junit4]   2> 938710 INFO  (TEST-ChaosMonkeyNothingIsSafeTest.test-seed#[BA68A0153E0B5158]) [    ] o.a.s.c.c.SolrZkClient makePath: /configs/conf1/protwords.txt
   [junit4]   2> 938711 INFO  (TEST-ChaosMonkeyNothingIsSafeTest.test-seed#[BA68A0153E0B5158]) [    ] o.a.s.c.AbstractZkTestCase put /home/jenkins/workspace/Lucene-Solr-6.0-Linux/solr/core/src/test-files/solr/collection1/conf/currency.xml to /configs/conf1/currency.xml
   [junit4]   2> 938711 INFO  (TEST-ChaosMonkeyNothingIsSafeTest.test-seed#[BA68A0153E0B5158]) [    ] o.a.s.c.c.SolrZkClient makePath: /configs/conf1/currency.xml
   [junit4]   2> 938711 INFO  (TEST-ChaosMonkeyNothingIsSafeTest.test-seed#[BA68A0153E0B5158]) [    ] o.a.s.c.AbstractZkTestCase put /home/jenkins/workspace/Lucene-Solr-6.0-Linux/solr/core/src/test-files/solr/collection1/conf/enumsConfig.xml to /configs/conf1/enumsConfig.xml
   [junit4]   2> 938711 INFO  (TEST-ChaosMonkeyNothingIsSafeTest.test-seed#[BA68A0153E0B5158]) [    ] o.a.s.c.c.SolrZkClient makePath: /configs/conf1/enumsConfig.xml
   [junit4]   2> 938712 INFO  (TEST-ChaosMonkeyNothingIsSafeTest.test-seed#[BA68A0153E0B5158]) [    ] o.a.s.c.AbstractZkTestCase put /home/jenkins/workspace/Lucene-Solr-6.0-Linux/solr/core/src/test-files/solr/collection1/conf/open-exchange-rates.json to /configs/conf1/open-exchange-rates.json
   [junit4]   2> 938712 INFO  (TEST-ChaosMonkeyNothingIsSafeTest.test-seed#[BA68A0153E0B5158]) [    ] o.a.s.c.c.SolrZkClient makePath: /configs/conf1/open-exchange-rates.json
   [junit4]   2> 938712 INFO  (TEST-ChaosMonkeyNothingIsSafeTest.test-seed#[BA68A0153E0B5158]) [    ] o.a.s.c.AbstractZkTestCase put /home/jenkins/workspace/Lucene-Solr-6.0-Linux/solr/core/src/test-files/solr/collection1/conf/mapping-ISOLatin1Accent.txt to /configs/conf1/mapping-ISOLatin1Accent.txt
   [junit4]   2> 938712 INFO  (TEST-ChaosMonkeyNothingIsSafeTest.test-seed#[BA68A0153E0B5158]) [    ] o.a.s.c.c.SolrZkClient makePath: /configs/conf1/mapping-ISOLatin1Accent.txt
   [junit4]   2> 938713 INFO  (TEST-ChaosMonkeyNothingIsSafeTest.test-seed#[BA68A0153E0B5158]) [    ] o.a.s.c.AbstractZkTestCase put /home/jenkins/workspace/Lucene-Solr-6.0-Linux/solr/core/src/test-files/solr/collection1/conf/old_synonyms.txt to /configs/conf1/old_synonyms.txt
   [junit4]   2> 938713 INFO  (TEST-ChaosMonkeyNothingIsSafeTest.test-seed#[BA68A0153E0B5158]) [    ] o.a.s.c.c.SolrZkClient makePath: /configs/conf1/old_synonyms.txt
   [junit4]   2> 938713 INFO  (TEST-ChaosMonkeyNothingIsSafeTest.test-seed#[BA68A0153E0B5158]) [    ] o.a.s.c.AbstractZkTestCase put /home/jenkins/workspace/Lucene-Solr-6.0-Linux/solr/core/src/test-files/solr/collection1/conf/synonyms.txt to /configs/conf1/synonyms.txt
   [junit4]   2> 938713 INFO  (TEST-ChaosMonkeyNothingIsSafeTest.test-seed#[BA68A0153E0B5158]) [    ] o.a.s.c.c.SolrZkClient makePath: /configs/conf1/synonyms.txt
   [junit4]   2> 938760 INFO  (TEST-ChaosMonkeyNothingIsSafeTest.test-seed#[BA68A0153E0B5158]) [    ] o.a.s.SolrTestCaseJ4 Writing core.properties file to /home/jenkins/workspace/Lucene-Solr-6.0-Linux/solr/build/solr-core/test/J1/temp/solr.cloud.ChaosMonkeyNothingIsSafeTest_BA68A0153E0B5158-001/control-001/cores/collection1
   [junit4]   2> 938761 INFO  (TEST-ChaosMonkeyNothingIsSafeTest.test-seed#[BA68A0153E0B5158]) [    ] o.e.j.s.Server jetty-9.3.8.v20160314
   [junit4]   2> 938762 INFO  (TEST-ChaosMonkeyNothingIsSafeTest.test-seed#[BA68A0153E0B5158]) [    ] o.e.j.s.h.ContextHandler Started o.e.j.s.ServletContextHandler@716d01b2{/,null,AVAILABLE}
   [junit4]   2> 938763 INFO  (TEST-ChaosMonkeyNothingIsSafeTest.test-seed#[BA68A0153E0B5158]) [    ] o.e.j.s.ServerConnector Started ServerConnector@4983d582{HTTP/1.1,[http/1.1]}{127.0.0.1:40926}
   [junit4]   2> 938764 INFO  (TEST-ChaosMonkeyNothingIsSafeTest.test-seed#[BA68A0153E0B5158]) [    ] o.e.j.s.Server Started @940282ms
   [junit4]   2> 938764 INFO  (TEST-ChaosMonkeyNothingIsSafeTest.test-seed#[BA68A0153E0B5158]) [    ] o.a.s.c.s.e.JettySolrRunner Jetty properties: {solr.data.dir=/home/jenkins/workspace/Lucene-Solr-6.0-Linux/solr/build/solr-core/test/J1/temp/solr.cloud.ChaosMonkeyNothingIsSafeTest_BA68A0153E0B5158-001/tempDir-001/control/data, hostContext=/, hostPort=40926, coreRootDirectory=/home/jenkins/workspace/Lucene-Solr-6.0-Linux/solr/build/solr-core/test/J1/../../../../../../../../../home/jenkins/workspace/Lucene-Solr-6.0-Linux/solr/build/solr-core/test/J1/temp/solr.cloud.ChaosMonkeyNothingIsSafeTest_BA68A0153E0B5158-001/control-001/cores}
   [junit4]   2> 938764 INFO  (TEST-ChaosMonkeyNothingIsSafeTest.test-seed#[BA68A0153E0B5158]) [    ] o.a.s.s.SolrDispatchFilter SolrDispatchFilter.init(): sun.misc.Launcher$AppClassLoader@73d16e93
   [junit4]   2> 938764 INFO  (TEST-ChaosMonkeyNothingIsSafeTest.test-seed#[BA68A0153E0B5158]) [    ] o.a.s.c.SolrResourceLoader new SolrResourceLoader for directory: '/home/jenkins/workspace/Lucene-Solr-6.0-Linux/solr/build/solr-core/test/J1/temp/solr.cloud.ChaosMonkeyNothingIsSafeTest_BA68A0153E0B5158-001/control-001'
   [junit4]   2> 938764 INFO  (TEST-ChaosMonkeyNothingIsSafeTest.test-seed#[BA68A0153E0B5158]) [    ] o.a.s.c.SolrResourceLoader JNDI not configured for solr (NoInitialContextEx)
   [junit4]   2> 938764 INFO  (TEST-ChaosMonkeyNothingIsSafeTest.test-seed#[BA68A0153E0B5158]) [    ] o.a.s.c.SolrResourceLoader solr home defaulted to 'solr/' (could not find system property or JNDI)
   [junit4]   2> 938764 INFO  (TEST-ChaosMonkeyNothingIsSafeTest.test-seed#[BA68A0153E0B5158]) [    ] o.a.s.c.c.SolrZkClient Using default ZkCredentialsProvider
   [junit4]   2> 938764 INFO  (TEST-ChaosMonkeyNothingIsSafeTest.test-seed#[BA68A0153E0B5158]) [    ] o.a.s.c.c.ConnectionManager Waiting for client to connect to ZooKeeper
   [junit4]   2> 938765 INFO  (zkCallback-1049-thread-1) [    ] o.a.s.c.c.ConnectionManager Watcher org.apache.solr.common.cloud.ConnectionManager@42d668ea name:ZooKeeperConnection Watcher:127.0.0.1:41882/solr got event WatchedEvent state:SyncConnected type:None path:null path:null type:None
   [junit4]   2> 938765 INFO  (TEST-ChaosMonkeyNothingIsSafeTest.test-seed#[BA68A0153E0B5158]) [    ] o.a.s.c.c.ConnectionManager Client is connected to ZooKeeper
   [junit4]   2> 938765 INFO  (TEST-ChaosMonkeyNothingIsSafeTest.test-seed#[BA68A0153E0B5158]) [    ] o.a.s.c.c.SolrZkClient Using default ZkACLProvider
   [junit4]   2> 938766 INFO  (TEST-ChaosMonkeyNothingIsSafeTest.test-seed#[BA68A0153E0B5158]) [    ] o.a.s.s.SolrDispatchFilter Loading solr.xml from SolrHome (not found in ZooKeeper)
   [junit4]   2> 938766 INFO  (TEST-ChaosMonkeyNothingIsSafeTest.test-seed#[BA68A0153E0B5158]) [    ] o.a.s.c.SolrXmlConfig Loading container configuration from /home/jenkins/workspace/Lucene-Solr-6.0-Linux/solr/build/solr-core/test/J1/temp/solr.cloud.ChaosMonkeyNothingIsSafeTest_BA68A0153E0B5158-001/control-001/solr.xml
   [junit4]   2> 938769 INFO  (TEST-ChaosMonkeyNothingIsSafeTest.test-seed#[BA68A0153E0B5158]) [    ] o.a.s.c.CorePropertiesLocator Config-defined core root directory: /home/jenkins/workspace/Lucene-Solr-6.0-Linux/solr/build/solr-core/test/J1/../../../../../../../../../home/jenkins/workspace/Lucene-Solr-6.0-Linux/solr/build/solr-core/test/J1/temp/solr.cloud.ChaosMonkeyNothingIsSafeTest_BA68A0153E0B5158-001/control-001/cores
   [junit4]   2> 938769 INFO  (TEST-ChaosMonkeyNothingIsSafeTest.test-seed#[BA68A0153E0B5158]) [    ] o.a.s.c.CoreContainer New CoreContainer 2064366857
   [junit4]   2> 938769 INFO  (TEST-ChaosMonkeyNothingIsSafeTest.test-seed#[BA68A0153E0B5158]) [    ] o.a.s.c.CoreContainer Loading cores into CoreContainer [instanceDir=/home/jenkins/workspace/Lucene-Solr-6.0-Linux/solr/build/solr-core/test/J1/temp/solr.cloud.ChaosMonkeyNothingIsSafeTest_BA68A0153E0B5158-001/control-001]
   [junit4]   2> 938769 WARN  (TEST-ChaosMonkeyNothingIsSafeTest.test-seed#[BA68A0153E0B5158]) [    ] o.a.s.c.CoreContainer Couldn't add files from /home/jenkins/workspace/Lucene-Solr-6.0-Linux/solr/build/solr-core/test/J1/temp/solr.cloud.ChaosMonkeyNothingIsSafeTest_BA68A0153E0B5158-001/control-001/lib to classpath: /home/jenkins/workspace/Lucene-Solr-6.0-Linux/solr/build/solr-core/test/J1/temp/solr.cloud.ChaosMonkeyNothingIsSafeTest_BA68A0153E0B5158-001/control-001/lib
   [junit4]   2> 938770 INFO  (TEST-ChaosMonkeyNothingIsSafeTest.test-seed#[BA68A0153E0B5158]) [    ] o.a.s.h.c.HttpShardHandlerFactory created with socketTimeout : 90000,urlScheme : ,connTimeout : 15000,maxConnectionsPerHost : 20,maxConnections : 10000,corePoolSize : 0,maximumPoolSize : 2147483647,maxThreadIdleTime : 5,sizeOfQueue : -1,fairnessPolicy : false,useRetries : false,
   [junit4]   2> 938771 INFO  (TEST-ChaosMonkeyNothingIsSafeTest.test-seed#[BA68A0153E0B5158]) [    ] o.a.s.u.UpdateShardHandler Creating UpdateShardHandler HTTP client with params: socketTimeout=340000&connTimeout=45000&retry=true
   [junit4]   2> 938771 INFO  (TEST-ChaosMonkeyNothingIsSafeTest.test-seed#[BA68A0153E0B5158]) [    ] o.a.s.l.LogWatcher SLF4J impl is org.slf4j.impl.Log4jLoggerFactory
   [junit4]   2> 938771 INFO  (TEST-ChaosMonkeyNothingIsSafeTest.test-seed#[BA68A0153E0B5158]) [    ] o.a.s.l.LogWatcher Registering Log Listener [Log4j (org.slf4j.impl.Log4jLoggerFactory)]
   [junit4]   2> 938771 INFO  (TEST-ChaosMonkeyNothingIsSafeTest.test-seed#[BA68A0153E0B5158]) [    ] o.a.s.c.ZkContainer Zookeeper client=127.0.0.1:41882/solr
   [junit4]   2> 938771 INFO  (TEST-ChaosMonkeyNothingIsSafeTest.test-seed#[BA68A0153E0B5158]) [    ] o.a.s.c.ZkController zkHost includes chroot
   [junit4]   2> 938771 INFO  (TEST-ChaosMonkeyNothingIsSafeTest.test-seed#[BA68A0153E0B5158]) [    ] o.a.s.c.c.SolrZkClient Using default ZkCredentialsProvider
   [junit4]   2> 938771 INFO  (TEST-ChaosMonkeyNothingIsSafeTest.test-seed#[BA68A0153E0B5158]) [    ] o.a.s.c.c.ConnectionManager Waiting for client to connect to ZooKeeper
   [junit4]   2> 938772 INFO  (zkCallback-1052-thread-1) [    ] o.a.s.c.c.ConnectionManager Watcher org.apache.solr.common.cloud.ConnectionManager@67285f35 name:ZooKeeperConnection Watcher:127.0.0.1:41882 got event WatchedEvent state:SyncConnected type:None path:null path:null type:None
   [junit4]   2> 938772 INFO  (TEST-ChaosMonkeyNothingIsSafeTest.test-seed#[BA68A0153E0B5158]) [    ] o.a.s.c.c.ConnectionManager Client is connected to ZooKeeper
   [junit4]   2> 938772 INFO  (TEST-ChaosMonkeyNothingIsSafeTest.test-seed#[BA68A0153E0B5158]) [    ] o.a.s.c.c.SolrZkClient Using default ZkACLProvider
   [junit4]   2> 938773 INFO  (TEST-ChaosMonkeyNothingIsSafeTest.test-seed#[BA68A0153E0B5158]) [n:127.0.0.1:40926_    ] o.a.s.c.ZkController Added new OnReconnect listener org.apache.solr.cloud.ZkController$$Lambda$45/1667924837@18b37da1
   [junit4]   2> 938773 INFO  (TEST-ChaosMonkeyNothingIsSafeTest.test-seed#[BA68A0153E0B5158]) [n:127.0.0.1:40926_    ] o.a.s.c.c.ConnectionManager Waiting for client to connect to ZooKeeper
   [junit4]   2> 938773 INFO  (zkCallback-1053-thread-1-processing-n:127.0.0.1:40926_) [n:127.0.0.1:40926_    ] o.a.s.c.c.ConnectionManager Watcher org.apache.solr.common.cloud.ConnectionManager@55969c60 name:ZooKeeperConnection Watcher:127.0.0.1:41882/solr got event WatchedEvent state:SyncConnected type:None path:null path:null type:None
   [junit4]   2> 938773 INFO  (TEST-ChaosMonkeyNothingIsSafeTest.test-seed#[BA68A0153E0B5158]) [n:127.0.0.1:40926_    ] o.a.s.c.c.ConnectionManager Client is connected to ZooKeeper
   [junit4]   2> 938774 INFO  (TEST-ChaosMonkeyNothingIsSafeTest.test-seed#[BA68A0153E0B5158]) [n:127.0.0.1:40926_    ] o.a.s.c.c.SolrZkClient makePath: /overseer/queue
   [junit4]   2> 938774 INFO  (TEST-ChaosMonkeyNothingIsSafeTest.test-seed#[BA68A0153E0B5158]) [n:127.0.0.1:40926_    ] o.a.s.c.c.SolrZkClient makePath: /overseer/collection-queue-work
   [junit4]   2> 938775 INFO  (TEST-ChaosMonkeyNothingIsSafeTest.test-seed#[BA68A0153E0B5158]) [n:127.0.0.1:40926_    ] o.a.s.c.c.SolrZkClient makePath: /overseer/collection-map-running
   [junit4]   2> 938776 INFO  (TEST-ChaosMonkeyNothingIsSafeTest.test-seed#[BA68A0153E0B5158]) [n:127.0.0.1:40926_    ] o.a.s.c.c.SolrZkClient makePath: /overseer/collection-map-completed
   [junit4]   2> 938776 INFO  (TEST-ChaosMonkeyNothingIsSafeTest.test-seed#[BA68A0153E0B5158]) [n:127.0.0.1:40926_    ] o.a.s.c.c.SolrZkClient makePath: /overseer/collection-map-failure
   [junit4]   2> 938777 INFO  (TEST-ChaosMonkeyNothingIsSafeTest.test-seed#[BA68A0153E0B5158]) [n:127.0.0.1:40926_    ] o.a.s.c.c.SolrZkClient makePath: /live_nodes
   [junit4]   2> 938777 INFO  (TEST-ChaosMonkeyNothingIsSafeTest.test-seed#[BA68A0153E0B5158]) [n:127.0.0.1:40926_    ] o.a.s.c.c.SolrZkClient makePath: /aliases.json
   [junit4]   2> 938778 INFO  (TEST-ChaosMonkeyNothingIsSafeTest.test-seed#[BA68A0153E0B5158]) [n:127.0.0.1:40926_    ] o.a.s.c.c.SolrZkClient makePath: /clusterstate.json
   [junit4]   2> 938778 INFO  (TEST-ChaosMonkeyNothingIsSafeTest.test-seed#[BA68A0153E0B5158]) [n:127.0.0.1:40926_    ] o.a.s.c.c.SolrZkClient makePath: /security.json
   [junit4]   2> 938778 INFO  (TEST-ChaosMonkeyNothingIsSafeTest.test-seed#[BA68A0153E0B5158]) [n:127.0.0.1:40926_    ] o.a.s.c.c.ZkStateReader Updating cluster state from ZooKeeper... 
   [junit4]   2> 938778 INFO  (TEST-ChaosMonkeyNothingIsSafeTest.test-seed#[BA68A0153E0B5158]) [n:127.0.0.1:40926_    ] o.a.s.c.c.ZkStateReader Updated live nodes from ZooKeeper... (0) -> (0)
   [junit4]   2> 938779 INFO  (TEST-ChaosMonkeyNothingIsSafeTest.test-seed#[BA68A0153E0B5158]) [n:127.0.0.1:40926_    ] o.a.s.c.c.SolrZkClient makePath: /overseer_elect
   [junit4]   2> 938779 INFO  (TEST-ChaosMonkeyNothingIsSafeTest.test-seed#[BA68A0153E0B5158]) [n:127.0.0.1:40926_    ] o.a.s.c.c.SolrZkClient makePath: /overseer_elect/election
   [junit4]   2> 938780 INFO  (TEST-ChaosMonkeyNothingIsSafeTest.test-seed#[BA68A0153E0B5158]) [n:127.0.0.1:40926_    ] o.a.s.c.Overseer Overseer (id=null) closing
   [junit4]   2> 938780 INFO  (TEST-ChaosMonkeyNothingIsSafeTest.test-seed#[BA68A0153E0B5158]) [n:127.0.0.1:40926_    ] o.a.s.c.LeaderElector Joined leadership election with path: /overseer_elect/election/95961346132279300-127.0.0.1:40926_-n_0000000000
   [junit4]   2> 938780 INFO  (TEST-ChaosMonkeyNothingIsSafeTest.test-seed#[BA68A0153E0B5158]) [n:127.0.0.1:40926_    ] o.a.s.c.OverseerElectionContext I am going to be the leader 127.0.0.1:40926_
   [junit4]   2> 938780 INFO  (TEST-ChaosMonkeyNothingIsSafeTest.test-seed#[BA68A0153E0B5158]) [n:127.0.0.1:40926_    ] o.a.s.c.c.SolrZkClient makePath: /overseer_elect/leader
   [junit4]   2> 938780 INFO  (TEST-ChaosMonkeyNothingIsSafeTest.test-seed#[BA68A0153E0B5158]) [n:127.0.0.1:40926_    ] o.a.s.c.Overseer Overseer (id=95961346132279300-127.0.0.1:40926_-n_0000000000) starting
   [junit4]   2> 938781 INFO  (TEST-ChaosMonkeyNothingIsSafeTest.test-seed#[BA68A0153E0B5158]) [n:127.0.0.1:40926_    ] o.a.s.c.c.SolrZkClient makePath: /overseer/queue-work
   [junit4]   2> 938783 INFO  (TEST-ChaosMonkeyNothingIsSafeTest.test-seed#[BA68A0153E0B5158]) [n:127.0.0.1:40926_    ] o.a.s.c.OverseerAutoReplicaFailoverThread Starting OverseerAutoReplicaFailoverThread autoReplicaFailoverWorkLoopDelay=10000 autoReplicaFailoverWaitAfterExpiration=30000 autoReplicaFailoverBadNodeExpiration=60000
   [junit4]   2> 938783 INFO  (OverseerCollectionConfigSetProcessor-95961346132279300-127.0.0.1:40926_-n_0000000000) [n:127.0.0.1:40926_    ] o.a.s.c.OverseerTaskProcessor Process current queue of overseer operations
   [junit4]   2> 938783 INFO  (TEST-ChaosMonkeyNothingIsSafeTest.test-seed#[BA68A0153E0B5158]) [n:127.0.0.1:40926_    ] o.a.s.c.ZkController Register node as live in ZooKeeper:/live_nodes/127.0.0.1:40926_
   [junit4]   2> 938783 INFO  (OverseerStateUpdate-95961346132279300-127.0.0.1:40926_-n_0000000000) [n:127.0.0.1:40926_    ] o.a.s.c.Overseer Starting to work on the main queue
   [junit4]   2> 938783 INFO  (TEST-ChaosMonkeyNothingIsSafeTest.test-seed#[BA68A0153E0B5158]) [n:127.0.0.1:40926_    ] o.a.s.c.c.SolrZkClient makePath: /live_nodes/127.0.0.1:40926_
   [junit4]   2> 938784 INFO  (OverseerStateUpdate-95961346132279300-127.0.0.1:40926_-n_0000000000) [n:127.0.0.1:40926_    ] o.a.s.c.c.ZkStateReader Updated live nodes from ZooKeeper... (0) -> (1)
   [junit4]   2> 938784 INFO  (zkCallback-1053-thread-1-processing-n:127.0.0.1:40926_) [n:127.0.0.1:40926_    ] o.a.s.c.c.ZkStateReader A live node change: [WatchedEvent state:SyncConnected type:NodeChildrenChanged path:/live_nodes], has occurred - updating... (live nodes size: [1])
   [junit4]   2> 938785 INFO  (zkCallback-1053-thread-1-processing-n:127.0.0.1:40926_) [n:127.0.0.1:40926_    ] o.a.s.c.c.ZkStateReader Updated live nodes from ZooKeeper... (1) -> (1)
   [junit4]   2> 938796 INFO  (TEST-ChaosMonkeyNothingIsSafeTest.test-seed#[BA68A0153E0B5158]) [n:127.0.0.1:40926_    ] o.a.s.c.CoreContainer Security conf doesn't exist. Skipping setup for authorization module.
   [junit4]   2> 938796 INFO  (TEST-ChaosMonkeyNothingIsSafeTest.test-seed#[BA68A0153E0B5158]) [n:127.0.0.1:40926_    ] o.a.s.c.CoreContainer No authentication plugin used.
   [junit4]   2> 938797 INFO  (TEST-ChaosMonkeyNothingIsSafeTest.test-seed#[BA68A0153E0B5158]) [n:127.0.0.1:40926_    ] o.a.s.c.CorePropertiesLocator Looking for core definitions underneath /home/jenkins/workspace/Lucene-Solr-6.0-Linux/solr/build/solr-core/test/J1/../../../../../../../../../home/jenkins/workspace/Lucene-Solr-6.0-Linux/solr/build/solr-core/test/J1/temp/solr.cloud.ChaosMonkeyNothingIsSafeTest_BA68A0153E0B5158-001/control-001/cores
   [junit4]   2> 938797 INFO  (TEST-ChaosMonkeyNothingIsSafeTest.test-seed#[BA68A0153E0B5158]) [n:127.0.0.1:40926_    ] o.a.s.c.CoreDescriptor Created CoreDescriptor: {name=collection1, config=solrconfig.xml, transient=false, schema=schema.xml, loadOnStartup=true, configSetProperties=configsetprops.json, collection=control_collection, coreNodeName=, dataDir=data/, shard=}
   [junit4]   2> 938798 INFO  (TEST-ChaosMonkeyNothingIsSafeTest.test-seed#[BA68A0153E0B5158]) [n:127.0.0.1:40926_    ] o.a.s.c.CorePropertiesLocator Found core collection1 in /home/jenkins/workspace/Lucene-Solr-6.0-Linux/solr/build/solr-core/test/J1/../../../../../../../../../home/jenkins/workspace/Lucene-Solr-6.0-Linux/solr/build/solr-core/test/J1/temp/solr.cloud.ChaosMonkeyNothingIsSafeTest_BA68A0153E0B5158-001/control-001/cores/collection1
   [junit4]   2> 938798 INFO  (TEST-ChaosMonkeyNothingIsSafeTest.test-seed#[BA68A0153E0B5158]) [n:127.0.0.1:40926_    ] o.a.s.c.CorePropertiesLocator Found 1 core definitions
   [junit4]   2> 938798 INFO  (TEST-ChaosMonkeyNothingIsSafeTest.test-seed#[BA68A0153E0B5158]) [n:127.0.0.1:40926_    ] o.a.s.s.SolrDispatchFilter user.dir=/home/jenkins/workspace/Lucene-Solr-6.0-Linux/solr/build/solr-core/test/J1
   [junit4]   2> 938798 INFO  (TEST-ChaosMonkeyNothingIsSafeTest.test-seed#[BA68A0153E0B5158]) [n:127.0.0.1:40926_    ] o.a.s.s.SolrDispatchFilter SolrDispatchFilter.init() done
   [junit4]   2> 938798 INFO  (coreLoadExecutor-3197-thread-1-processing-n:127.0.0.1:40926_) [n:127.0.0.1:40926_ c:control_collection   x:collection1] o.a.s.c.ZkController publishing state=down
   [junit4]   2> 938798 INFO  (coreLoadExecutor-3197-thread-1-processing-n:127.0.0.1:40926_) [n:127.0.0.1:40926_ c:control_collection   x:collection1] o.a.s.c.ZkController numShards not found on descriptor - reading it from system property
   [junit4]   2> 938799 INFO  (coreLoadExecutor-3197-thread-1-processing-n:127.0.0.1:40926_) [n:127.0.0.1:40926_ c:control_collection   x:collection1] o.a.s.c.ZkController Collection control_collection not visible yet, but flagging it so a watch is registered when it becomes visible
   [junit4]   2> 938799 INFO  (coreLoadExecutor-3197-thread-1-processing-n:127.0.0.1:40926_) [n:127.0.0.1:40926_ c:control_collection   x:collection1] o.a.s.c.c.ZkStateReader addZkWatch [control_collection]
   [junit4]   2> 938799 INFO  (OverseerStateUpdate-95961346132279300-127.0.0.1:40926_-n_0000000000) [n:127.0.0.1:40926_    ] o.a.s.c.Overseer processMessage: queueSize: 1, message = {
   [junit4]   2>   "core":"collection1",
   [junit4]   2>   "roles":null,
   [junit4]   2>   "base_url":"http://127.0.0.1:40926",
   [junit4]   2>   "node_name":"127.0.0.1:40926_",
   [junit4]   2>   "numShards":"1",
   [junit4]   2>   "state":"down",
   [junit4]   2>   "shard":null,
   [junit4]   2>   "collection":"control_collection",
   [junit4]   2>   "operation":"state"} current state version: 0
   [junit4]   2> 938799 INFO  (coreLoadExecutor-3197-thread-1-processing-n:127.0.0.1:40926_) [n:127.0.0.1:40926_ c:control_collection   x:collection1] o.a.s.c.c.ZkStateReader Deleting data for [control_collection]
   [junit4]   2> 938799 INFO  (OverseerStateUpdate-95961346132279300-127.0.0.1:40926_-n_0000000000) [n:127.0.0.1:40926_    ] o.a.s.c.o.ReplicaMutator Update state numShards=1 message={
   [junit4]   2>   "core":"collection1",
   [junit4]   2>   "roles":null,
   [junit4]   2>   "base_url":"http://127.0.0.1:40926",
   [junit4]   2>   "node_name":"127.0.0.1:40926_",
   [junit4]   2>   "numShards":"1",
   [junit4]   2>   "state":"down",
   [junit4]   2>   "shard":null,
   [junit4]   2>   "collection":"control_collection",
   [junit4]   2>   "operation":"state"}
   [junit4]   2> 938799 INFO  (coreLoadExecutor-3197-thread-1-processing-n:127.0.0.1:40926_) [n:127.0.0.1:40926_ c:control_collection   x:collection1] o.a.s.c.ZkController look for our core node name
   [junit4]   2> 938799 INFO  (OverseerStateUpdate-95961346132279300-127.0.0.1:40926_-n_0000000000) [n:127.0.0.1:40926_    ] o.a.s.c.o.ClusterStateMutator building a new cName: control_collection
   [junit4]   2> 938800 INFO  (OverseerStateUpdate-95961346132279300-127.0.0.1:40926_-n_0000000000) [n:127.0.0.1:40926_    ] o.a.s.c.o.ReplicaMutator Assigning new node to shard shard=shard1
   [junit4]   2> 938800 INFO  (zkCallback-1053-thread-1-processing-n:127.0.0.1:40926_) [n:127.0.0.1:40926_    ] o.a.s.c.c.ZkStateReader A cluster state change: [WatchedEvent state:SyncConnected type:NodeDataChanged path:/clusterstate.json], has occurred - updating... (live nodes size: [1])
   [junit4]   2> 939800 INFO  (coreLoadExecutor-3197-thread-1-processing-n:127.0.0.1:40926_) [n:127.0.0.1:40926_ c:control_collection   x:collection1] o.a.s.c.ZkController waiting to find shard id in clusterstate for collection1
   [junit4]   2> 939800 INFO  (coreLoadExecutor-3197-thread-1-processing-n:127.0.0.1:40926_) [n:127.0.0.1:40926_ c:control_collection   x:collection1] o.a.s.c.ZkController Check for collection zkNode:control_collection
   [junit4]   2> 939800 INFO  (coreLoadExecutor-3197-thread-1-processing-n:127.0.0.1:40926_) [n:127.0.0.1:40926_ c:control_collection   x:collection1] o.a.s.c.ZkController Collection zkNode exists
   [junit4]   2> 939800 INFO  (coreLoadExecutor-3197-thread-1-processing-n:127.0.0.1:40926_) [n:127.0.0.1:40926_ c:control_collection   x:collection1] o.a.s.c.c.ZkStateReader Load collection config from: [/collections/control_collection]
   [junit4]   2> 939800 INFO  (coreLoadExecutor-3197-thread-1-processing-n:127.0.0.1:40926_) [n:127.0.0.1:40926_ c:control_collection   x:collection1] o.a.s.c.c.ZkStateReader path=[/collections/control_collection] [configName]=[conf1] specified config exists in ZooKeeper
   [junit4]   2> 939800 INFO  (coreLoadExecutor-3197-thread-1-processing-n:127.0.0.1:40926_) [n:127.0.0.1:40926_ c:control_collection   x:collection1] o.a.s.c.SolrResourceLoader new SolrResourceLoader for directory: '/home/jenkins/workspace/Lucene-Solr-6.0-Linux/solr/build/solr-core/test/J1/temp/solr.cloud.ChaosMonkeyNothingIsSafeTest_BA68A0153E0B5158-001/control-001/cores/collection1'
   [junit4]   2> 939801 INFO  (coreLoadExecutor-3197-thread-1-processing-n:127.0.0.1:40926_) [n:127.0.0.1:40926_ c:control_collection   x:collection1] o.a.s.c.SolrResourceLoader JNDI not configured for solr (NoInitialContextEx)
   [junit4]   2> 939801 INFO  (coreLoadExecutor-3197-thread-1-processing-n:127.0.0.1:40926_) [n:127.0.0.1:40926_ c:control_collection   x:collection1] o.a.s.c.SolrResourceLoader solr home defaulted to 'solr/' (could not find system property or JNDI)
   [junit4]   2> 939802 INFO  (coreLoadExecutor-3197-thread-1-processing-n:127.0.0.1:40926_) [n:127.0.0.1:40926_ c:control_collection   x:collection1] o.a.s.c.Config loaded config solrconfig.xml with version 0 
   [junit4]   2> 939804 INFO  (coreLoadExecutor-3197-thread-1-processing-n:127.0.0.1:40926_) [n:127.0.0.1:40926_ c:control_collection   x:collection1] o.a.s.c.SolrConfig current version of requestparams : -1
   [junit4]   2> 939807 INFO  (coreLoadExecutor-3197-thread-1-processing-n:127.0.0.1:40926_) [n:127.0.0.1:40926_ c:control_collection   x:collection1] o.a.s.c.SolrConfig Using Lucene MatchVersion: 6.0.1
   [junit4]   2> 939821 INFO  (coreLoadExecutor-3197-thread-1-processing-n:127.0.0.1:40926_) [n:127.0.0.1:40926_ c:control_collection   x:collection1] o.a.s.c.SolrConfig Loaded SolrConfig: solrconfig.xml
   [junit4]   2> 939824 INFO  (coreLoadExecutor-3197-thread-1-processing-n:127.0.0.1:40926_) [n:127.0.0.1:40926_ c:control_collection   x:collection1] o.a.s.s.IndexSchema [collection1] Schema name=test
   [junit4]   2> 939875 INFO  (coreLoadExecutor-3197-thread-1-processing-n:127.0.0.1:40926_) [n:127.0.0.1:40926_ c:control_collection   x:collection1] o.a.s.s.IndexSchema default search field in schema is text
   [junit4]   2> 939875 INFO  (coreLoadExecutor-3197-thread-1-processing-n:127.0.0.1:40926_) [n:127.0.0.1:40926_ c:control_collection   x:collection1] o.a.s.s.IndexSchema unique key field: id
   [junit4]   2> 939876 INFO  (coreLoadExecutor-3197-thread-1-processing-n:127.0.0.1:40926_) [n:127.0.0.1:40926_ c:control_collection   x:collection1] o.a.s.s.FileExchangeRateProvider Reloading exchange rates from file currency.xml
   [junit4]   2> 939877 INFO  (coreLoadExecutor-3197-thread-1-processing-n:127.0.0.1:40926_) [n:127.0.0.1:40926_ c:control_collection   x:collection1] o.a.s.s.FileExchangeRateProvider Reloading exchange rates from file currency.xml
   [junit4]   2> 939884 INFO  (coreLoadExecutor-3197-thread-1-processing-n:127.0.0.1:40926_) [n:127.0.0.1:40926_ c:control_collection   x:collection1] o.a.s.c.ConfigSetProperties Did not find ConfigSet properties, assuming default properties: Can't find resource 'configsetprops.json' in classpath or '/configs/conf1', cwd=/home/jenkins/workspace/Lucene-Solr-6.0-Linux/solr/build/solr-core/test/J1
   [junit4]   2> 939884 INFO  (coreLoadExecutor-3197-thread-1-processing-n:127.0.0.1:40926_) [n:127.0.0.1:40926_ c:control_collection   x:collection1] o.a.s.c.CoreContainer Creating SolrCore 'collection1' using configuration from collection control_collection
   [junit4]   2> 939884 INFO  (coreLoadExecutor-3197-thread-1-processing-n:127.0.0.1:40926_) [n:127.0.0.1:40926_ c:control_collection s:shard1 r:core_node1 x:collection1] o.a.s.c.SolrCore solr.StandardDirectoryFactory
   [junit4]   2> 939888 INFO  (coreLoadExecutor-3197-thread-1-processing-n:127.0.0.1:40926_) [n:127.0.0.1:40926_ c:control_collection s:shard1 r:core_node1 x:collection1] o.a.s.c.SolrCore [[collection1] ] Opening new SolrCore at [/home/jenkins/workspace/Lucene-Solr-6.0-Linux/solr/build/solr-core/test/J1/temp/solr.cloud.ChaosMonkeyNothingIsSafeTest_BA68A0153E0B5158-001/control-001/cores/collection1], dataDir=[/home/jenkins/workspace/Lucene-Solr-6.0-Linux/solr/build/solr-core/test/J1/../../../../../../../../../home/jenkins/workspace/Lucene-Solr-6.0-Linux/solr/build/solr-core/test/J1/temp/solr.cloud.ChaosMonkeyNothingIsSafeTest_BA68A0153E0B5158-001/control-001/cores/collection1/data/]
   [junit4]   2> 939889 INFO  (coreLoadExecutor-3197-thread-1-processing-n:127.0.0.1:40926_) [n:127.0.0.1:40926_ c:control_collection s:shard1 r:core_node1 x:collection1] o.a.s.c.JmxMonitoredMap JMX monitoring is enabled. Adding Solr mbeans to JMX Server: com.sun.jmx.mbeanserver.JmxMBeanServer@1e7b220e
   [junit4]   2> 939889 INFO  (coreLoadExecutor-3197-thread-1-processing-n:127.0.0.1:40926_) [n:127.0.0.1:40926_ c:control_collection s:shard1 r:core_node1 x:collection1] o.a.s.c.CachingDirectoryFactory return new directory for /home/jenkins/workspace/Lucene-Solr-6.0-Linux/solr/build/solr-core/test/J1/temp/solr.cloud.ChaosMonkeyNothingIsSafeTest_BA68A0153E0B5158-001/control-001/cores/collection1/data
   [junit4]   2> 939889 INFO  (coreLoadExecutor-3197-thread-1-processing-n:127.0.0.1:40926_) [n:127.0.0.1:40926_ c:control_collection s:shard1 r:core_node1 x:collection1] o.a.s.c.SolrCore New index directory detected: old=null new=/home/jenkins/workspace/Lucene-Solr-6.0-Linux/solr/build/solr-core/test/J1/../../../../../../../../../home/jenkins/workspace/Lucene-Solr-6.0-Linux/solr/build/solr-core/test/J1/temp/solr.cloud.ChaosMonkeyNothingIsSafeTest_BA68A0153E0B5158-001/control-001/cores/collection1/data/index/
   [junit4]   2> 939889 WARN  (coreLoadExecutor-3197-thread-1-processing-n:127.0.0.1:40926_) [n:127.0.0.1:40926_ c:control_collection s:shard1 r:core_node1 x:collection1] o.a.s.c.SolrCore [collection1] Solr index directory '/home/jenkins/workspace/Lucene-Solr-6.0-Linux/solr/build/solr-core/test/J1/../../../../../../../../../home/jenkins/workspace/Lucene-Solr-6.0-Linux/solr/build/solr-core/test/J1/temp/solr.cloud.ChaosMonkeyNothingIsSafeTest_BA68A0153E0B5158-001/control-001/cores/collection1/data/index' doesn't exist. Creating new index...
   [junit4]   2> 939890 INFO  (coreLoadExecutor-3197-thread-1-processing-n:127.0.0.1:40926_) [n:127.0.0.1:40926_ c:control_collection s:shard1 r:core_node1 x:collection1] o.a.s.c.CachingDirectoryFactory return new directory for /home/jenkins/workspace/Lucene-Solr-6.0-Linux/solr/build/solr-core/test/J1/temp/solr.cloud.ChaosMonkeyNothingIsSafeTest_BA68A0153E0B5158-001/control-001/cores/collection1/data/index
   [junit4]   2> 939890 INFO  (coreLoadExecutor-3197-thread-1-processing-n:127.0.0.1:40926_) [n:127.0.0.1:40926_ c:control_collection s:shard1 r:core_node1 x:collection1] o.a.s.u.RandomMergePolicy RandomMergePolicy wrapping class org.apache.lucene.index.TieredMergePolicy: [TieredMergePolicy: maxMergeAtOnce=14, maxMergeAtOnceExplicit=28, maxMergedSegmentMB=2.783203125, floorSegmentMB=1.0400390625, forceMergeDeletesPctAllowed=8.950631944233665, segmentsPerTier=32.0, maxCFSSegmentSizeMB=8.796093022207999E12, noCFSRatio=1.0
   [junit4]   2> 939928 INFO  (coreLoadExecutor-3197-thread-1-processing-n:127.0.0.1:40926_) [n:127.0.0.1:40926_ c:control_collection s:shard1 r:core_node1 x:collection1] o.a.s.c.SolrDeletionPolicy SolrDeletionPolicy.onCommit: commits: num=1
   [junit4]   2> 	commit{dir=/home/jenkins/workspace/Lucene-Solr-6.0-Linux/solr/build/solr-core/test/J1/temp/solr.cloud.ChaosMonkeyNothingIsSafeTest_BA68A0153E0B5158-001/control-001/cores/collection1/data/index,segFN=segments_1,generation=1}
   [junit4]   2> 939928 INFO  (coreLoadExecutor-3197-thread-1-processing-n:127.0.0.1:40926_) [n:127.0.0.1:40926_ c:control_collection s:shard1 r:core_node1 x:collection1] o.a.s.c.SolrDeletionPolicy newest commit generation = 1
   [junit4]   2> 939929 INFO  (OldIndexDirectoryCleanupThreadForCore-collection1) [n:127.0.0.1:40926_ c:control_collection s:shard1 r:core_node1 x:collection1] o.a.s.c.SolrCore Looking for old index directories to cleanup for core collection1 in /home/jenkins/workspace/Lucene-Solr-6.0-Linux/solr/build/solr-core/test/J1/../../../../../../../../../home/jenkins/workspace/Lucene-Solr-6.0-Linux/solr/build/solr-core/test/J1/temp/solr.cloud.ChaosMonkeyNothingIsSafeTest_BA68A0153E0B5158-001/control-001/cores/collection1/data/
   [junit4]   2> 939930 INFO  (coreLoadExecutor-3197-thread-1-processing-n:127.0.0.1:40926_) [n:127.0.0.1:40926_ c:control_collection s:shard1 r:core_node1 x:collection1] o.a.s.u.p.UpdateRequestProcessorChain creating updateRequestProcessorChain "nodistrib"
   [junit4]   2> 939930 INFO  (coreLoadExecutor-3197-thread-1-processing-n:127.0.0.1:40926_) [n:127.0.0.1:40926_ c:control_collection s:shard1 r:core_node1 x:collection1] o.a.s.u.p.UpdateRequestProcessorChain creating updateRequestProcessorChain "dedupe"
   [junit4]   2> 939931 INFO  (coreLoadExecutor-3197-thread-1-processing-n:127.0.0.1:40926_) [n:127.0.0.1:40926_ c:control_collection s:shard1 r:core_node1 x:collection1] o.a.s.u.p.UpdateRequestProcessorChain inserting DistributedUpdateProcessorFactory into updateRequestProcessorChain "dedupe"
   [junit4]   2> 939931 INFO  (coreLoadExecutor-3197-thread-1-processing-n:127.0.0.1:40926_) [n:127.0.0.1:40926_ c:control_collection s:shard1 r:core_node1 x:collection1] o.a.s.u.p.UpdateRequestProcessorChain creating updateRequestProcessorChain "stored_sig"
   [junit4]   2> 939931 INFO  (coreLoadExecutor-3197-thread-1-processing-n:127.0.0.1:40926_) [n:127.0.0.1:40926_ c:control_collection s:shard1 r:core_node1 x:collection1] o.a.s.u.p.UpdateRequestProcessorChain inserting DistributedUpdateProcessorFactory into updateRequestProcessorChain "stored_sig"
   [junit4]   2> 939931 INFO  (coreLoadExecutor-3197-thread-1-processing-n:127.0.0.1:40926_) [n:127.0.0.1:40926_ c:control_collection s:shard1 r:core_node1 x:collection1] o.a.s.u.p.UpdateRequestProcessorChain creating updateRequestProcessorChain "distrib-dup-test-chain-explicit"
   [junit4]   2> 939931 INFO  (coreLoadExecutor-3197-thread-1-processing-n:127.0.0.1:40926_) [n:127.0.0.1:40926_ c:control_collection s:shard1 r:core_node1 x:collection1] o.a.s.u.p.UpdateRequestProcessorChain creating updateRequestProcessorChain "distrib-dup-test-chain-implicit"
   [junit4]   2> 939931 INFO  (coreLoadExecutor-3197-thread-1-processing-n:127.0.0.1:40926_) [n:127.0.0.1:40926_ c:control_collection s:shard1 r:core_node1 x:collection1] o.a.s.u.p.UpdateRequestProcessorChain inserting DistributedUpdateProcessorFactory into updateRequestProcessorChain "distrib-dup-test-chain-implicit"
   [junit4]   2> 939931 INFO  (coreLoadExecutor-3197-thread-1-processing-n:127.0.0.1:40926_) [n:127.0.0.1:40926_ c:control_collection s:shard1 r:core_node1 x:collection1] o.a.s.c.SolrCore no updateRequestProcessorChain defined as default, creating implicit default
   [junit4]   2> 939931 WARN  (coreLoadExecutor-3197-thread-1-processing-n:127.0.0.1:40926_) [n:127.0.0.1:40926_ c:control_collection s:shard1 r:core_node1 x:collection1] o.a.s.c.RequestHandlers INVALID paramSet a in requestHandler {type = requestHandler,name = /dump,class = DumpRequestHandler,args = {defaults={a=A,b=B}}}
   [junit4]   2> 939933 INFO  (coreLoadExecutor-3197-thread-1-processing-n:127.0.0.1:40926_) [n:127.0.0.1:40926_ c:control_collection s:shard1 r:core_node1 x:collection1] o.a.s.h.l.XMLLoader xsltCacheLifetimeSeconds=60
   [junit4]   2> 939934 INFO  (coreLoadExecutor-3197-thread-1-processing-n:127.0.0.1:40926_) [n:127.0.0.1:40926_ c:control_collection s:shard1 r:core_node1 x:collection1] o.a.s.h.l.XMLLoader xsltCacheLifetimeSeconds=60
   [junit4]   2> 939935 INFO  (coreLoadExecutor-3197-thread-1-processing-n:127.0.0.1:40926_) [n:127.0.0.1:40926_ c:control_collection s:shard1 r:core_node1 x:collection1] o.a.s.h.l.XMLLoader xsltCacheLifetimeSeconds=60
   [junit4]   2> 939936 INFO  (coreLoadExecutor-3197-thread-1-processing-n:127.0.0.1:40926_) [n:127.0.0.1:40926_ c:control_collection s:shard1 r:core_node1 x:collection1] o.a.s.h.l.XMLLoader xsltCacheLifetimeSeconds=60
   [junit4]   2> 939940 INFO  (coreLoadExecutor-3197-thread-1-processing-n:127.0.0.1:40926_) [n:127.0.0.1:40926_ c:control_collection s:shard1 r:core_node1 x:collection1] o.a.s.c.RequestHandlers Registered paths: /admin/mbeans,standard,/dump,/update/csv,/sql,/update/json/docs,/admin/luke,/export,/admin/segments,/get,/admin/system,/replication,/admin/properties,/config,/stream,/schema,/admin/plugins,/admin/logging,/update/json,/admin/ping,/admin/threads,/update,/admin/file
   [junit4]   2> 939940 INFO  (coreLoadExecutor-3197-thread-1-processing-n:127.0.0.1:40926_) [n:127.0.0.1:40926_ c:control_collection s:shard1 r:core_node1 x:collection1] o.a.s.c.SolrCore Using default statsCache cache: org.apache.solr.search.stats.LocalStatsCache
   [junit4]   2> 939940 INFO  (coreLoadExecutor-3197-thread-1-processing-n:127.0.0.1:40926_) [n:127.0.0.1:40926_ c:control_collection s:shard1 r:core_node1 x:collection1] o.a.s.u.UpdateHandler Using UpdateLog implementation: org.apache.solr.update.UpdateLog
   [junit4]   2> 939940 INFO  (coreLoadExecutor-3197-thread-1-processing-n:127.0.0.1:40926_) [n:127.0.0.1:40926_ c:control_collection s:shard1 r:core_node1 x:collection1] o.a.s.u.UpdateLog Initializing UpdateLog: dataDir= defaultSyncLevel=FLUSH numRecordsToKeep=100 maxNumLogsToKeep=10 numVersionBuckets=65536
   [junit4]   2> 939941 INFO  (coreLoadExecutor-3197-thread-1-processing-n:127.0.0.1:40926_) [n:127.0.0.1:40926_ c:control_collection s:shard1 r:core_node1 x:collection1] o.a.s.u.CommitTracker Hard AutoCommit: if uncommited for 15000ms; 
   [junit4]   2> 939941 INFO  (coreLoadExecutor-3197-thread-1-processing-n:127.0.0.1:40926_) [n:127.0.0.1:40926_ c:control_collection s:shard1 r:core_node1 x:collection1] o.a.s.u.CommitTracker Soft AutoCommit: disabled
   [junit4]   2> 939942 INFO  (coreLoadExecutor-3197-thread-1-processing-n:127.0.0.1:40926_) [n:127.0.0.1:40926_ c:control_collection s:shard1 r:core_node1 x:collection1] o.a.s.u.RandomMergePolicy RandomMergePolicy wrapping class org.apache.lucene.index.TieredMergePolicy: [TieredMergePolicy: maxMergeAtOnce=48, maxMergeAtOnceExplicit=37, maxMergedSegmentMB=19.7001953125, floorSegmentMB=1.1474609375, forceMergeDeletesPctAllowed=28.482753622017775, segmentsPerTier=24.0, maxCFSSegmentSizeMB=8.796093022207999E12, noCFSRatio=0.33664684957815566
   [junit4]   2> 939942 INFO  (coreLoadExecutor-3197-thread-1-processing-n:127.0.0.1:40926_) [n:127.0.0.1:40926_ c:control_collection s:shard1 r:core_node1 x:collection1] o.a.s.c.SolrDeletionPolicy SolrDeletionPolicy.onInit: commits: num=1
   [junit4]   2> 	commit{dir=/home/jenkins/workspace/Lucene-Solr-6.0-Linux/solr/build/solr-core/test/J1/temp/solr.cloud.ChaosMonkeyNothingIsSafeTest_BA68A0153E0B5158-001/control-001/cores/collection1/data/index,segFN=segments_1,generation=1}
   [junit4]   2> 939942 INFO  (coreLoadExecutor-3197-thread-1-processing-n:127.0.0.1:40926_) [n:127.0.0.1:40926_ c:control_collection s:shard1 r:core_node1 x:collection1] o.a.s.c.SolrDeletionPolicy newest commit generation = 1
   [junit4]   2> 939942 INFO  (coreLoadExecutor-3197-thread-1-processing-n:127.0.0.1:40926_) [n:127.0.0.1:40926_ c:control_collection s:shard1 r:core_node1 x:collection1] o.a.s.s.SolrIndexSearcher Opening [Searcher@2c69ac0e[collection1] main]
   [junit4]   2> 939943 INFO  (coreLoadExecutor-3197-thread-1-processing-n:127.0.0.1:40926_) [n:127.0.0.1:40926_ c:control_collection s:shard1 r:core_node1 x:collection1] o.a.s.c.c.ZkStateReader Load collection config from: [/collections/control_collection]
   [junit4]   2> 939943 INFO  (coreLoadExecutor-3197-thread-1-processing-n:127.0.0.1:40926_) [n:127.0.0.1:40926_ c:control_collection s:shard1 r:core_node1 x:collection1] o.a.s.c.c.ZkStateReader path=[/collections/control_collection] [configName]=[conf1] specified config exists in ZooKeeper
   [junit4]   2> 939943 INFO  (coreLoadExecutor-3197-thread-1-processing-n:127.0.0.1:40926_) [n:127.0.0.1:40926_ c:control_collection s:shard1 r:core_node1 x:collection1] o.a.s.r.ManagedResourceStorage Setting up ZooKeeper-based storage for the RestManager with znodeBase: /configs/conf1
   [junit4]   2> 939943 INFO  (coreLoadExecutor-3197-thread-1-processing-n:127.0.0.1:40926_) [n:127.0.0.1:40926_ c:control_collection s:shard1 r:core_node1 x:collection1] o.a.s.r.ManagedResourceStorage Configured ZooKeeperStorageIO with znodeBase: /configs/conf1
   [junit4]   2> 939943 INFO  (coreLoadExecutor-3197-thread-1-processing-n:127.0.0.1:40926_) [n:127.0.0.1:40926_ c:control_collection s:shard1 r:core_node1 x:collection1] o.a.s.r.RestManager Initializing RestManager with initArgs: {}
   [junit4]   2> 939943 INFO  (coreLoadExecutor-3197-thread-1-processing-n:127.0.0.1:40926_) [n:127.0.0.1:40926_ c:control_collection s:shard1 r:core_node1 x:collection1] o.a.s.r.ManagedResourceStorage Reading _rest_managed.json using ZooKeeperStorageIO:path=/configs/conf1
   [junit4]   2> 939943 INFO  (coreLoadExecutor-3197-thread-1-processing-n:127.0.0.1:40926_) [n:127.0.0.1:40926_ c:control_collection s:shard1 r:core_node1 x:collection1] o.a.s.r.ManagedResourceStorage No data found for znode /configs/conf1/_rest_managed.json
   [junit4]   2> 939943 INFO  (coreLoadExecutor-3197-thread-1-processing-n:127.0.0.1:40926_) [n:127.0.0.1:40926_ c:control_collection s:shard1 r:core_node1 x:collection1] o.a.s.r.ManagedResourceStorage Loaded null at path _rest_managed.json using ZooKeeperStorageIO:path=/configs/conf1
   [junit4]   2> 939944 INFO  (coreLoadExecutor-3197-thread-1-processing-n:127.0.0.1:40926_) [n:127.0.0.1:40926_ c:control_collection s:shard1 r:core_node1 x:collection1] o.a.s.r.RestManager Initializing 0 registered ManagedResources
   [junit4]   2> 939944 INFO  (coreLoadExecutor-3197-thread-1-processing-n:127.0.0.1:40926_) [n:127.0.0.1:40926_ c:control_collection s:shard1 r:core_node1 x:collection1] o.a.s.h.ReplicationHandler Commits will be reserved for  10000
   [junit4]   2> 939944 INFO  (searcherExecutor-3198-thread-1-processing-n:127.0.0.1:40926_ x:collection1 s:shard1 c:control_collection r:core_node1) [n:127.0.0.1:40926_ c:control_collection s:shard1 r:core_node1 x:collection1] o.a.s.c.SolrCore [collection1] Registered new searcher Searcher@2c69ac0e[collection1] main{ExitableDirectoryReader(UninvertingDirectoryReader())}
   [junit4]   2> 939944 INFO  (coreLoadExecutor-3197-thread-1-processing-n:127.0.0.1:40926_) [n:127.0.0.1:40926_ c:control_collection s:shard1 r:core_node1 x:collection1] o.a.s.u.UpdateLog Looking up max value of version field to seed version buckets
   [junit4]   2> 939944 INFO  (coreLoadExecutor-3197-thread-1-processing-n:127.0.0.1:40926_) [n:127.0.0.1:40926_ c:control_collection s:shard1 r:core_node1 x:collection1] o.a.s.u.VersionInfo Refreshing highest value of _version_ for 65536 version buckets from index
   [junit4]   2> 939944 INFO  (coreLoadExecutor-3197-thread-1-processing-n:127.0.0.1:40926_) [n:127.0.0.1:40926_ c:control_collection s:shard1 r:core_node1 x:collection1] o.a.s.u.VersionInfo No terms found for _version_, cannot seed version bucket highest value from index
   [junit4]   2> 939944 INFO  (coreLoadExecutor-3197-thread-1-processing-n:127.0.0.1:40926_) [n:127.0.0.1:40926_ c:control_collection s:shard1 r:core_node1 x:collection1] o.a.s.u.UpdateLog Could not find max version in index or recent updates, using new clock 1535381539525754880
   [junit4]   2> 939947 INFO  (coreLoadExecutor-3197-thread-1-processing-n:127.0.0.1:40926_) [n:127.0.0.1:40926_ c:control_collection s:shard1 r:core_node1 x:collection1] o.a.s.u.UpdateLog Took 2.0ms to seed version buckets with highest version 1535381539525754880
   [junit4]   2> 939947 INFO  (coreLoadExecutor-3197-thread-1-processing-n:127.0.0.1:40926_) [n:127.0.0.1:40926_ c:control_collection s:shard1 r:core_node1 x:collection1] o.a.s.c.ZkController watch zkdir /configs/conf1
   [junit4]   2> 939947 INFO  (coreLoadExecutor-3197-thread-1-processing-n:127.0.0.1:40926_) [n:127.0.0.1:40926_ c:control_collection s:shard1 r:core_node1 x:collection1] o.a.s.c.CoreContainer registering core: collection1
   [junit4]   2> 939947 INFO  (coreZkRegister-3191-thread-1-processing-n:127.0.0.1:40926_ x:collection1 s:shard1 c:control_collection r:core_node1) [n:127.0.0.1:40926_ c:control_collection s:shard1 r:core_node1 x:collection1] o.a.s.c.ZkController Register replica - core:collection1 address:http://127.0.0.1:40926 collection:control_collection shard:shard1
   [junit4]   2> 939947 INFO  (coreZkRegister-3191-thread-1-processing-n:127.0.0.1:40926_ x:collection1 s:shard1 c:control_collection r:core_node1) [n:127.0.0.1:40926_ c:control_collection s:shard1 r:core_node1 x:collection1] o.a.s.c.c.SolrZkClient makePath: /collections/control_collection/leader_elect/shard1/election
   [junit4]   2> 939948 INFO  (coreZkRegister-3191-thread-1-processing-n:127.0.0.1:40926_ x:collection1 s:shard1 c:control_collection r:core_node1) [n:127.0.0.1:40926_ c:control_collection s:shard1 r:core_node1 x:collection1] o.a.s.c.LeaderElector Joined leadership election with path: /collections/control_collection/leader_elect/shard1/election/95961346132279300-core_node1-n_0000000000
   [junit4]   2> 939948 INFO  (coreZkRegister-3191-thread-1-processing-n:127.0.0.1:40926_ x:collection1 s:shard1 c:control_collection r:core_node1) [n:127.0.0.1:40926_ c:control_collection s:shard1 r:core_node1 x:collection1] o.a.s.c.ShardLeaderElectionContext Running the leader process for shard=shard1 and weAreReplacement=false and leaderVoteWait=10000
   [junit4]   2> 939949 INFO  (coreZkRegister-3191-thread-1-processing-n:127.0.0.1:40926_ x:collection1 s:shard1 c:control_collection r:core_node1) [n:127.0.0.1:40926_ c:control_collection s:shard1 r:core_node1 x:collection1] o.a.s.c.ShardLeaderElectionContext Enough replicas found to continue.
   [junit4]   2> 939949 INFO  (coreZkRegister-3191-thread-1-processing-n:127.0.0.1:40926_ x:collection1 s:shard1 c:control_collection r:core_node1) [n:127.0.0.1:40926_ c:control_collection s:shard1 r:core_node1 x:collection1] o.a.s.c.ShardLeaderElectionContext I may be the new leader - try and sync
   [junit4]   2> 939949 INFO  (coreZkRegister-3191-thread-1-processing-n:127.0.0.1:40926_ x:collection1 s:shard1 c:control_collection r:core_node1) [n:127.0.0.1:40926_ c:control_collection s:shard1 r:core_node1 x:collection1] o.a.s.c.SyncStrategy Sync replicas to http://127.0.0.1:40926/collection1/
   [junit4]   2> 939949 INFO  (OverseerStateUpdate-95961346132279300-127.0.0.1:40926_-n_0000000000) [n:127.0.0.1:40926_    ] o.a.s.c.Overseer processMessage: queueSize: 1, message = {
   [junit4]   2>   "operation":"leader",
   [junit4]   2>   "shard":"shard1",
   [junit4]   2>   "collection":"control_collection"} current state version: 1
   [junit4]   2> 939949 INFO  (coreZkRegister-3191-thread-1-processing-n:127.0.0.1:40926_ x:collection1 s:shard1 c:control_collection r:core_node1) [n:127.0.0.1:40926_ c:control_collection s:shard1 r:core_node1 x:collection1] o.a.s.c.SyncStrategy Sync Success - now sync replicas to me
   [junit4]   2> 939949 INFO  (coreZkRegister-3191-thread-1-processing-n:127.0.0.1:40926_ x:collection1 s:shard1 c:control_collection r:core_node1) [n:127.0.0.1:40926_ c:control_collection s:shard1 r:core_node1 x:collection1] o.a.s.c.SyncStrategy http://127.0.0.1:40926/collection1/ has no replicas
   [junit4]   2> 939949 INFO  (coreZkRegister-3191-thread-1-processing-n:127.0.0.1:40926_ x:collection1 s:shard1 c:control_collection r:core_node1) [n:127.0.0.1:40926_ c:control_collection s:shard1 r:core_node1 x:collection1] o.a.s.c.c.SolrZkClient makePath: /collections/control_collection/leaders/shard1
   [junit4]   2> 939950 INFO  (coreZkRegister-3191-thread-1-processing-n:127.0.0.1:40926_ x:collection1 s:shard1 c:control_collection r:core_node1) [n:127.0.0.1:40926_ c:control_collection s:shard1 r:core_node1 x:collection1] o.a.s.c.ShardLeaderElectionContextBase Creating leader registration node /collections/control_collection/leaders/shard1/leader after winning as /collections/control_collection/leader_elect/shard1/election/95961346132279300-core_node1-n_0000000000
   [junit4]   2> 939951 INFO  (coreZkRegister-3191-thread-1-processing-n:127.0.0.1:40926_ x:collection1 s:shard1 c:control_collection r:core_node1) [n:127.0.0.1:40926_ c:control_collection s:shard1 r:core_node1 x:collection1] o.a.s.c.ShardLeaderElectionContext I am the new leader: http://127.0.0.1:40926/collection1/ shard1
   [junit4]   2> 939951 INFO  (OverseerStateUpdate-95961346132279300-127.0.0.1:40926_-n_0000000000) [n:127.0.0.1:40926_    ] o.a.s.c.Overseer processMessage: queueSize: 1, message = {
   [junit4]   2>   "operation":"leader",
   [junit4]   2>   "shard":"shard1",
   [junit4]   2>   "collection":"control_collection",
   [junit4]   2>   "base_url":"http://127.0.0.1:40926",
   [junit4]   2>   "core":"collection1",
   [junit4]   2>   "state":"active"} current state version: 1
   [junit4]   2> 940052 INFO  (zkCallback-1053-thread-1-processing-n:127.0.0.1:40926_) [n:127.0.0.1:40926_    ] o.a.s.c.c.ZkStateReader A cluster state change: [WatchedEvent state:SyncConnected type:NodeDataChanged path:/clusterstate.json], has occurred - updating... (live nodes size: [1])
   [junit4]   2> 940101 INFO  (coreZkRegister-3191-thread-1-processing-n:127.0.0.1:40926_ x:collection1 s:shard1 c:control_collection r:core_node1) [n:127.0.0.1:40926_ c:control_collection s:shard1 r:core_node1 x:collection1] o.a.s.c.ZkController We are http://127.0.0.1:40926/collection1/ and leader is http://127.0.0.1:40926/collection1/
   [junit4]   2> 940102 INFO  (coreZkRegister-3191-thread-1-processing-n:127.0.0.1:40926_ x:collection1 s:shard1 c:control_collection r:core_node1) [n:127.0.0.1:40926_ c:control_collection s:shard1 r:core_node1 x:collection1] o.a.s.c.ZkController No LogReplay needed for core=collection1 baseURL=http://127.0.0.1:40926
   [junit4]   2> 940102 INFO  (coreZkRegister-3191-thread-1-processing-n:127.0.0.1:40926_ x:collection1 s:shard1 c:control_collection r:core_node1) [n:127.0.0.1:40926_ c:control_collection s:shard1 r:core_node1 x:collection1] o.a.s.c.ZkController I am the leader, no recovery necessary
   [junit4]   2> 940102 INFO  (coreZkRegister-3191-thread-1-processing-n:127.0.0.1:40926_ x:collection1 s:shard1 c:control_collection r:core_node1) [n:127.0.0.1:40926_ c:control_collection s:shard1 r:core_node1 x:collection1] o.a.s.c.ZkController publishing state=active
   [junit4]   2> 940102 INFO  (coreZkRegister-3191-thread-1-processing-n:127.0.0.1:40926_ x:collection1 s:shard1 c:control_collection r:core_node1) [n:127.0.0.1:40926_ c:control_collection s:shard1 r:core_node1 x:collection1] o.a.s.c.ZkController numShards not found on descriptor - reading it from system property
   [junit4]   2> 940103 INFO  (OverseerStateUpdate-95961346132279300-127.0.0.1:40926_-n_0000000000) [n:127.0.0.1:40926_    ] o.a.s.c.Overseer processMessage: queueSize: 1, message = {
   [junit4]   2>   "core":"collection1",
   [junit4]   2>   "core_node_name":"core_node1",
   [junit4]   2>   "roles":null,
   [junit4]   2>   "base_url":"http://127.0.0.1:40926",
   [junit4]   2>   "node_name":"127.0.0.1:40926_",
   [junit4]   2>   "numShards":"1",
   [junit4]   2>   "state":"active",
   [junit4]   2>   "shard":"shard1",
   [junit4]   2>   "collection":"control_collection",
   [junit4]   2>   "operation":"state"} current state version: 2
   [junit4]   2> 940103 INFO  (coreZkRegister-3191-thread-1-processing-n:127.0.0.1:40926_ x:collection1 s:shard1 c:control_collection r:core_node1) [n:127.0.0.1:40926_ c:control_collection s:shard1 r:core_node1 x:collection1] o.a.s.c.c.ZkStateReader Updated live nodes from ZooKeeper... (1) -> (1)
   [junit4]   2> 940103 INFO  (OverseerStateUpdate-95961346132279300-127.0.0.1:40926_-n_0000000000) [n:127.0.0.1:40926_    ] o.a.s.c.o.ReplicaMutator Update state numShards=1 message={
   [junit4]   2>   "core":"collection1",
   [junit4]   2>   "core_node_name":"core_node1",
   [junit4]   2>   "roles":null,
   [junit4]   2>   "base_url":"http://127.0.0.1:40926",
   [junit4]   2>   "node_name":"127.0.0.1:40926_",
   [junit4]   2>   "numShards":"1",
   [junit4]   2>   "state":"active",
   [junit4]   2>   "shard":"shard1",
   [junit4]   2>   "collection":"control_collection",
   [junit4]   2>   "operation":"state"}
   [junit4]   2> 940204 INFO  (zkCallback-1053-thread-1-processing-n:127.0.0.1:40926_) [n:127.0.0.1:40926_    ] o.a.s.c.c.ZkStateReader A cluster state change: [WatchedEvent state:SyncConnected type:NodeDataChanged path:/clusterstate.json], has occurred - updating... (live nodes size: [1])
   [junit4]   2> 940299 INFO  (TEST-ChaosMonkeyNothingIsSafeTest.test-seed#[BA68A0153E0B5158]) [    ] o.a.s.c.c.SolrZkClient Using default ZkCredentialsProvider
   [junit4]   2> 940299 INFO  (TEST-ChaosMonkeyNothingIsSafeTest.test-seed#[BA68A0153E0B5158]) [    ] o.a.s.c.c.ConnectionManager Waiting for client to connect to ZooKeeper
   [junit4]   2> 940301 INFO  (zkCallback-1055-thread-1) [    ] o.a.s.c.c.ConnectionManager Watcher org.apache.solr.common.cloud.ConnectionManager@c52379f name:ZooKeeperConnection Watcher:127.0.0.1:41882/solr got event WatchedEvent state:SyncConnected type:None path:null path:null type:None
   [junit4]   2> 940301 INFO  (TEST-ChaosMonkeyNothingIsSafeTest.test-seed#[BA68A0153E0B5158]) [    ] o.a.s.c.c.ConnectionManager Client is connected to ZooKeeper
   [junit4]   2> 940301 INFO  (TEST-ChaosMonkeyNothingIsSafeTest.test-seed#[BA68A0153E0B5158]) [    ] o.a.s.c.c.SolrZkClient Using default ZkACLProvider
   [junit4]   2> 940301 INFO  (TEST-ChaosMonkeyNothingIsSafeTest.test-seed#[BA68A0153E0B5158]) [    ] o.a.s.c.c.ZkStateReader Updating cluster state from ZooKeeper... 
   [junit4]   2> 940301 INFO  (TEST-ChaosMonkeyNothingIsSafeTest.test-seed#[BA68A0153E0B5158]) [    ] o.a.s.c.c.ZkStateReader Updated live nodes from ZooKeeper... (0) -> (1)
   [junit4]   2> 940302 INFO  (TEST-ChaosMonkeyNothingIsSafeTest.test-seed#[BA68A0153E0B5158]) [    ] o.a.s.c.ChaosMonkey monkey: init - expire sessions:false cause connection loss:false
   [junit4]   2> 940350 INFO  (TEST-ChaosMonkeyNothingIsSafeTest.test-seed#[BA68A0153E0B5158]) [    ] o.a.s.SolrTestCaseJ4 Writing core.properties file to /home/jenkins/workspace/Lucene-Solr-6.0-Linux/solr/build/solr-core/test/J1/temp/solr.cloud.ChaosMonkeyNothingIsSafeTest_BA68A0153E0B5158-001/shard-1-001/cores/collection1
   [junit4]   2> 940351 INFO  (TEST-ChaosMonkeyNothingIsSafeTest.test-seed#[BA68A0153E0B5158]) [    ] o.a.s.c.AbstractFullDistribZkTestBase create jetty 1 in directory /home/jenkins/workspace/Lucene-Solr-6.0-Linux/solr/build/solr-core/test/J1/temp/solr.cloud.ChaosMonkeyNothingIsSafeTest_BA68A0153E0B5158-001/shard-1-001
   [junit4]   2> 940351 INFO  (TEST-ChaosMonkeyNothingIsSafeTest.test-seed#[BA68A0153E0B5158]) [    ] o.e.j.s.Server jetty-9.3.8.v20160314
   [junit4]   2> 940352 INFO  (TEST-ChaosMonkeyNothingIsSafeTest.test-seed#[BA68A0153E0B5158]) [    ] o.e.j.s.h.ContextHandler Started o.e.j.s.ServletContextHandler@210eae50{/,null,AVAILABLE}
   [junit4]   2> 940352 INFO  (TEST-ChaosMonkeyNothingIsSafeTest.test-seed#[BA68A0153E0B5158]) [    ] o.e.j.s.ServerConnector Started ServerConnector@28e1bef6{HTTP/1.1,[http/1.1]}{127.0.0.1:44976}
   [junit4]   2> 940352 INFO  (TEST-ChaosMonkeyNothingIsSafeTest.test-seed#[BA68A0153E0B5158]) [    ] o.e.j.s.Server Started @941871ms
   [junit4]   2> 940352 INFO  (TEST-ChaosMonkeyNothingIsSafeTest.test-seed#[BA68A0153E0B5158]) [    ] o.a.s.c.s.e.JettySolrRunner Jetty properties: {solr.data.dir=/home/jenkins/workspace/Lucene-Solr-6.0-Linux/solr/build/solr-core/test/J1/temp/solr.cloud.ChaosMonkeyNothingIsSafeTest_BA68A0153E0B5158-001/tempDir-001/jetty1, solrconfig=solrconfig.xml, hostContext=/, hostPort=44976, coreRootDirectory=/home/jenkins/workspace/Lucene-Solr-6.0-Linux/solr/build/solr-core/test/J1/../../../../../../../../../home/jenkins/workspace/Lucene-Solr-6.0-Linux/solr/build/solr-core/test/J1/temp/solr.cloud.ChaosMonkeyNothingIsSafeTest_BA68A0153E0B5158-001/shard-1-001/cores}
   [junit4]   2> 940352 INFO  (TEST-ChaosMonkeyNothingIsSafeTest.test-seed#[BA68A0153E0B5158]) [    ] o.a.s.s.SolrDispatchFilter SolrDispatchFilter.init(): sun.misc.Launcher$AppClassLoader@73d16e93
   [junit4]   2> 940353 INFO  (TEST-ChaosMonkeyNothingIsSafeTest.test-seed#[BA68A0153E0B5158]) [    ] o.a.s.c.SolrResourceLoader new SolrResourceLoader for directory: '/home/jenkins/workspace/Lucene-Solr-6.0-Linux/solr/build/solr-core/test/J1/temp/solr.cloud.ChaosMonkeyNothingIsSafeTest_BA68A0153E0B5158-001/shard-1-001'
   [junit4]   2> 940353 INFO  (TEST-ChaosMonkeyNothingIsSafeTest.test-seed#[BA68A0153E0B5158]) [    ] o.a.s.c.SolrResourceLoader JNDI not configured for solr (NoInitialContextEx)
   [junit4]   2> 940353 INFO  (TEST-ChaosMonkeyNothingIsSafeTest.test-seed#[BA68A0153E0B5158]) [    ] o.a.s.c.SolrResourceLoader solr home defaulted to 'solr/' (could not find system property or JNDI)
   [junit4]   2> 940353 INFO  (TEST-ChaosMonkeyNothingIsSafeTest.test-seed#[BA68A0153E0B5158]) [    ] o.a.s.c.c.SolrZkClient Using default ZkCredentialsProvider
   [junit4]   2> 940354 INFO  (TEST-ChaosMonkeyNothingIsSafeTest.test-seed#[BA68A0153E0B5158]) [    ] o.a.s.c.c.ConnectionManager Waiting for client to connect to ZooKeeper
   [junit4]   2> 940355 INFO  (zkCallback-1056-thread-1) [    ] o.a.s.c.c.ConnectionManager Watcher org.apache.solr.common.cloud.ConnectionManager@4b507612 name:ZooKeeperConnection Watcher:127.0.0.1:41882/solr got event WatchedEvent state:SyncConnected type:None path:null path:null type:None
   [junit4]   2> 940355 INFO  (TEST-ChaosMonkeyNothingIsSafeTest.test-seed#[BA68A0153E0B5158]) [    ] o.a.s.c.c.ConnectionManager Client is connected to ZooKeeper
   [junit4]   2> 940355 INFO  (TEST-ChaosMonkeyNothingIsSafeTest.test-seed#[BA68A0153E0B5158]) [    ] o.a.s.c.c.SolrZkClient Using default ZkACLProvider
   [junit4]   2> 940355 INFO  (TEST-ChaosMonkeyNothingIsSafeTest.test-seed#[BA68A0153E0B5158]) [    ] o.a.s.s.SolrDispatchFilter Loading solr.xml from SolrHome (not found in ZooKeeper)
   [junit4]   2> 940355 INFO  (TEST-ChaosMonkeyNothingIsSafeTest.test-seed#[BA68A0153E0B5158]) [    ] o.a.s.c.SolrXmlConfig Loading container configuration from /home/jenkins/workspace/Lucene-Solr-6.0-Linux/solr/build/solr-core/test/J1/temp/solr.cloud.ChaosMonkeyNothingIsSafeTest_BA68A0153E0B5158-001/shard-1-001/solr.xml
   [junit4]   2> 940358 INFO  (TEST-ChaosMonkeyNothingIsSafeTest.test-seed#[BA68A0153E0B5158]) [    ] o.a.s.c.CorePropertiesLocator Config-defined core root directory: /home/jenkins/workspace/Lucene-Solr-6.0-Linux/solr/build/solr-core/test/J1/../../../../../../../../../home/jenkins/workspace/Lucene-Solr-6.0-Linux/solr/build/solr-core/test/J1/temp/solr.cloud.ChaosMonkeyNothingIsSafeTest_BA68A0153E0B5158-001/shard-1-001/cores
   [junit4]   2> 940358 INFO  (TEST-ChaosMonkeyNothingIsSafeTest.test-seed#[BA68A0153E0B5158]) [    ] o.a.s.c.CoreContainer New CoreContainer 1481982834
   [junit4]   2> 940358 INFO  (TEST-ChaosMonkeyNothingIsSafeTest.test-seed#[BA68A0153E0B5158]) [    ] o.a.s.c.CoreContainer Loading cores into CoreContainer [instanceDir=/home/jenkins/workspace/Lucene-Solr-6.0-Linux/solr/build/solr-core/test/J1/temp/solr.cloud.ChaosMonkeyNothingIsSafeTest_BA68A0153E0B5158-001/shard-1-001]
   [junit4]   2> 940358 WARN  (TEST-ChaosMonkeyNothingIsSafeTest.test-seed#[BA68A0153E0B5158]) [    ] o.a.s.c.CoreContainer Couldn't add files from /home/jenkins/workspace/Lucene-Solr-6.0-Linux/solr/build/solr-core/test/J1/temp/solr.cloud.ChaosMonkeyNothingIsSafeTest_BA68A0153E0B5158-001/shard-1-001/lib to classpath: /home/jenkins/workspace/Lucene-Solr-6.0-Linux/solr/build/solr-core/test/J1/temp/solr.cloud.ChaosMonkeyNothingIsSafeTest_BA68A0153E0B5158-001/shard-1-001/lib
   [junit4]   2> 940358 INFO  (TEST-ChaosMonkeyNothingIsSafeTest.test-seed#[BA68A0153E0B5158]) [    ] o.a.s.h.c.HttpShardHandlerFactory created with socketTimeout : 90000,urlScheme : ,connTimeout : 15000,maxConnectionsPerHost : 20,maxConnections : 10000,corePoolSize : 0,maximumPoolSize : 2147483647,maxThreadIdleTime : 5,sizeOfQueue : -1,fairnessPolicy : false,useRetries : false,
   [junit4]   2> 940359 INFO  (TEST-ChaosMonkeyNothingIsSafeTest.test-seed#[BA68A0153E0B5158]) [    ] o.a.s.u.UpdateShardHandler Creating UpdateShardHandler HTTP client with params: socketTimeout=340000&connTimeout=45000&retry=true
   [junit4]   2> 940359 INFO  (TEST-ChaosMonkeyNothingIsSafeTest.test-seed#[BA68A0153E0B5158]) [    ] o.a.s.l.LogWatcher SLF4J impl is org.slf4j.impl.Log4jLoggerFactory
   [junit4]   2> 940359 INFO  (TEST-ChaosMonkeyNothingIsSafeTest.test-seed#[BA68A0153E0B5158]) [    ] o.a.s.l.LogWatcher Registering Log Listener [Log4j (org.slf4j.impl.Log4jLoggerFactory)]
   [junit4]   2> 940359 INFO  (TEST-ChaosMonkeyNothingIsSafeTest.test-seed#[BA68A0153E0B5158]) [    ] o.a.s.c.ZkContainer Zookeeper client=127.0.0.1:41882/solr
   [junit4]   2> 940360 INFO  (TEST-ChaosMonkeyNothingIsSafeTest.test-seed#[BA68A0153E0B5158]) [    ] o.a.s.c.ZkController zkHost includes chroot
   [junit4]   2> 940360 INFO  (TEST-ChaosMonkeyNothingIsSafeTest.test-seed#[BA68A0153E0B5158]) [    ] o.a.s.c.c.SolrZkClient Using default ZkCredentialsProvider
   [junit4]   2> 940360 INFO  (TEST-ChaosMonkeyNothingIsSafeTest.test-seed#[BA68A0153E0B5158]) [    ] o.a.s.c.c.ConnectionManager Waiting for client to connect to ZooKeeper
   [junit4]   2> 940361 INFO  (zkCallback-1059-thread-1) [    ] o.a.s.c.c.ConnectionManager Watcher org.apache.solr.common.cloud.ConnectionManager@de428a8 name:ZooKeeperConnection Watcher:127.0.0.1:41882 got event WatchedEvent state:SyncConnected type:None path:null path:null type:None
   [junit4]   2> 940361 INFO  (TEST-ChaosMonkeyNothingIsSafeTest.test-seed#[BA68A0153E0B5158]) [    ] o.a.s.c.c.ConnectionManager Client is connected to ZooKeeper
   [junit4]   2> 940361 INFO  (TEST-ChaosMonkeyNothingIsSafeTest.test-seed#[BA68A0153E0B5158]) [    ] o.a.s.c.c.SolrZkClient Using default ZkACLProvider
   [junit4]   2> 940361 INFO  (TEST-ChaosMonkeyNothingIsSafeTest.test-seed#[BA68A0153E0B5158]) [n:127.0.0.1:44976_    ] o.a.s.c.ZkController Added new OnReconnect listener org.apache.solr.cloud.ZkController$$Lambda$45/1667924837@1496e3f7
   [junit4]   2> 940361 INFO  (TEST-ChaosMonkeyNothingIsSafeTest.test-seed#[BA68A0153E0B5158]) [n:127.0.0.1:44976_    ] o.a.s.c.c.ConnectionManager Waiting for client to connect to ZooKeeper
   [junit4]   2> 940362 INFO  (zkCallback-1060-thread-1-processing-n:127.0.0.1:44976_) [n:127.0.0.1:44976_    ] o.a.s.c.c.ConnectionManager Watcher org.apache.solr.common.cloud.ConnectionManager@5a227ed8 name:ZooKeeperConnection Watcher:127.0.0.1:41882/solr got event WatchedEvent state:SyncConnected type:None path:null path:null type:None
   [junit4]   2> 940362 INFO  (TEST-ChaosMonkeyNothingIsSafeTest.test-seed#[BA68A0153E0B5158]) [n:127.0.0.1:44976_    ] o.a.s.c.c.ConnectionManager Client is connected to ZooKeeper
   [junit4]   2> 940364 INFO  (TEST-ChaosMonkeyNothingIsSafeTest.test-seed#[BA68A0153E0B5158]) [n:127.0.0.1:44976_    ] o.a.s.c.c.ZkStateReader Updating cluster state from ZooKeeper... 
   [junit4]   2> 940364 INFO  (TEST-ChaosMonkeyNothingIsSafeTest.test-seed#[BA68A0153E0B5158]) [n:127.0.0.1:44976_    ] o.a.s.c.c.ZkStateReader Updated live nodes from ZooKeeper... (0) -> (1)
   [junit4]   2> 940364 INFO  (TEST-ChaosMonkeyNothingIsSafeTest.test-seed#[BA68A0153E0B5158]) [n:127.0.0.1:44976_    ] o.a.s.c.Overseer Overseer (id=null) closing
   [junit4]   2> 940365 INFO  (TEST-ChaosMonkeyNothingIsSafeTest.test-seed#[BA68A0153E0B5158]) [n:127.0.0.1:44976_    ] o.a.s.c.LeaderElector Joined leadership election with path: /overseer_elect/election/95961346132279304-127.0.0.1:44976_-n_0000000001
   [junit4]   2> 940365 INFO  (TEST-ChaosMonkeyNothingIsSafeTest.test-seed#[BA68A0153E0B5158]) [n:127.0.0.1:44976_    ] o.a.s.c.LeaderElector Watching path /overseer_elect/election/95961346132279300-127.0.0.1:40926_-n_0000000000 to know if I could be the leader
   [junit4]   2> 940365 INFO  (TEST-ChaosMonkeyNothingIsSafeTest.test-seed#[BA68A0153E0B5158]) [n:127.0.0.1:44976_    ] o.a.s.c.ZkController Publish node=127.0.0.1:44976_ as DOWN
   [junit4]   2> 940367 INFO  (OverseerStateUpdate-95961346132279300-127.0.0.1:40926_-n_0000000000) [n:127.0.0.1:40926_    ] o.a.s.c.Overseer processMessage: queueSize: 1, message = {
   [junit4]   2>   "operation":"downnode",
   [junit4]   2>   "node_name":"127.0.0.1:44976_"} current state version: 3
   [junit4]   2> 940367 INFO  (OverseerStateUpdate-95961346132279300-127.0.0.1:40926_-n_0000000000) [n:127.0.0.1:40926_    ] o.a.s.c.o.NodeMutator DownNode state invoked for node: 127.0.0.1:44976_
   [junit4]   2> 940468 INFO  (zkCallback-1053-thread-1-processing-n:127.0.0.1:40926_) [n:127.0.0.1:40926_    ] o.a.s.c.c.ZkStateReader A cluster state change: [WatchedEvent state:SyncConnected type:NodeDataChanged path:/clusterstate.json], has occurred - updating... (live nodes size: [1])
   [junit4]   2> 940468 INFO  (zkCallback-1055-thread-1) [    ] o.a.s.c.c.ZkStateReader A cluster state change: [WatchedEvent state:SyncConnected type:NodeDataChanged path:/clusterstate.json], has occurred - updating... (live nodes size: [1])
   [junit4]   2> 940468 INFO  (zkCallback-1060-thread-1-processing-n:127.0.0.1:44976_) [n:127.0.0.1:44976_    ] o.a.s.c.c.ZkStateReader A cluster state change: [WatchedEvent state:SyncConnected type:NodeDataChanged path:/clusterstate.json], has occurred - updating... (live nodes size: [1])
   [junit4]   2> 941367 INFO  (TEST-ChaosMonkeyNothingIsSafeTest.test-seed#[BA68A0153E0B5158]) [n:127.0.0.1:44976_    ] o.a.s.c.ZkController Register node as live in ZooKeeper:/live_nodes/127.0.0.1:44976_
   [junit4]   2> 941367 INFO  (TEST-ChaosMonkeyNothingIsSafeTest.test-seed#[BA68A0153E0B5158]) [n:127.0.0.1:44976_    ] o.a.s.c.c.SolrZkClient makePath: /live_nodes/127.0.0.1:44976_
   [junit4]   2> 941368 INFO  (zkCallback-1053-thread-1-processing-n:127.0.0.1:40926_) [n:127.0.0.1:40926_    ] o.a.s.c.c.ZkStateReader A live node change: [WatchedEvent state:SyncConnected type:NodeChildrenChanged path:/live_nodes], has occurred - updating... (live nodes size: [1])
   [junit4]   2> 941368 INFO  (zkCallback-1055-thread-1) [    ] o.a.s.c.c.ZkStateReader A live node change: [WatchedEvent state:SyncConnected type:NodeChildrenChanged path:/live_nodes], has occurred - updating... (live nodes size: [1])
   [junit4]   2> 941368 INFO  (zkCallback-1060-thread-1-processing-n:127.0.0.1:44976_) [n:127.0.0.1:44976_    ] o.a.s.c.c.ZkStateReader A live node change: [WatchedEvent state:SyncConnected type:NodeChildrenChanged path:/live_nodes], has occurred - updating... (live nodes size: [1])
   [junit4]   2> 941368 INFO  (zkCallback-1053-thread-1-processing-n:127.0.0.1:40926_) [n:127.0.0.1:40926_    ] o.a.s.c.c.ZkStateReader Updated live nodes from ZooKeeper... (1) -> (2)
   [junit4]   2> 941368 INFO  (zkCallback-1055-thread-1) [    ] o.a.s.c.c.ZkStateReader Updated live nodes from ZooKeeper... (1) -> (2)
   [junit4]   2> 941368 INFO  (zkCallback-1060-thread-1-processing-n:127.0.0.1:44976_) [n:127.0.0.1:44976_    ] o.a.s.c.c.ZkStateReader Updated live nodes from ZooKeeper... (1) -> (2)
   [junit4]   2> 941374 INFO  (TEST-ChaosMonkeyNothingIsSafeTest.test-seed#[BA68A0153E0B5158]) [n:127.0.0.1:44976_    ] o.a.s.c.CoreContainer Security conf doesn't exist. Skipping setup for authorization module.
   [junit4]   2> 941374 INFO  (TEST-ChaosMonkeyNothingIsSafeTest.test-seed#[BA68A0153E0B5158]) [n:127.0.0.1:44976_    ] o.a.s.c.CoreContainer No authentication plugin used.
   [junit4]   2> 941374 INFO  (TEST-ChaosMonkeyNothingIsSafeTest.test-seed#[BA68A0153E0B5158]) [n:127.0.0.1:44976_    ] o.a.s.c.CorePropertiesLocator Looking for core definitions underneath /home/jenkins/workspace/Lucene-Solr-6.0-Linux/solr/build/solr-core/test/J1/../../../../../../../../../home/jenkins/workspace/Lucene-Solr-6.0-Linux/solr/build/solr-core/test/J1/temp/solr.cloud.ChaosMonkeyNothingIsSafeTest_BA68A0153E0B5158-001/shard-1-001/cores
   [junit4]   2> 941374 INFO  (TEST-ChaosMonkeyNothingIsSafeTest.test-seed#[BA68A0153E0B5158]) [n:127.0.0.1:44976_    ] o.a.s.c.CoreDescriptor Created CoreDescriptor: {name=collection1, config=solrconfig.xml, transient=false, schema=schema.xml, loadOnStartup=true, configSetProperties=configsetprops.json, collection=collection1, coreNodeName=, dataDir=data/, shard=}
   [junit4]   2> 941374 INFO  (TEST-ChaosMonkeyNothingIsSafeTest.test-seed#[BA68A0153E0B5158]) [n:127.0.0.1:44976_    ] o.a.s.c.CorePropertiesLocator Found core collection1 in /home/jenkins/workspace/Lucene-Solr-6.0-Linux/solr/build/solr-core/test/J1/../../../../../../../../../home/jenkins/workspace/Lucene-Solr-6.0-Linux/solr/build/solr-core/test/J1/temp/solr.cloud.ChaosMonkeyNothingIsSafeTest_BA68A0153E0B5158-001/shard-1-001/cores/collection1
   [junit4]   2> 941374 INFO  (TEST-ChaosMonkeyNothingIsSafeTest.test-seed#[BA68A0153E0B5158]) [n:127.0.0.1:44976_    ] o.a.s.c.CorePropertiesLocator Found 1 core definitions
   [junit4]   2> 941375 INFO  (TEST-ChaosMonkeyNothingIsSafeTest.test-seed#[BA68A0153E0B5158]) [n:127.0.0.1:44976_    ] o.a.s.s.SolrDispatchFilter user.dir=/home/jenkins/workspace/Lucene-Solr-6.0-Linux/solr/build/solr-core/test/J1
   [junit4]   2> 941375 INFO  (TEST-ChaosMonkeyNothingIsSafeTest.test-seed#[BA68A0153E0B5158]) [n:127.0.0.1:44976_    ] o.a.s.s.SolrDispatchFilter SolrDispatchFilter.init() done
   [junit4]   2> 941375 INFO  (coreLoadExecutor-3208-thread-1-processing-n:127.0.0.1:44976_) [n:127.0.0.1:44976_ c:collection1   x:collection1] o.a.s.c.ZkController publishing state=down
   [junit4]   2> 941375 INFO  (coreLoadExecutor-3208-thread-1-processing-n:127.0.0.1:44976_) [n:127.0.0.1:44976_ c:collection1   x:collection1] o.a.s.c.ZkController numShards not found on descriptor - reading it from system property
   [junit4]   2> 941375 INFO  (coreLoadExecutor-3208-thread-1-processing-n:127.0.0.1:44976_) [n:127.0.0.1:44976_ c:collection1   x:collection1] o.a.s.c.ZkController Collection collection1 not visible yet, but flagging it so a watch is registered when it becomes visible
   [junit4]   2> 941375 INFO  (coreLoadExecutor-3208-thread-1-processing-n:127.0.0.1:44976_) [n:127.0.0.1:44976_ c:collection1   x:collection1] o.a.s.c.c.ZkStateReader addZkWatch [collection1]
   [junit4]   2> 941376 INFO  (OverseerStateUpdate-95961346132279300-127.0.0.1:40926_-n_0000000000) [n:127.0.0.1:40926_    ] o.a.s.c.Overseer processMessage: queueSize: 1, message = {
   [junit4]   2>   "core":"collection1",
   [junit4]   2>   "roles":null,
   [junit4]   2>   "base_url":"http://127.0.0.1:44976",
   [junit4]   2>   "node_name":"127.0.0.1:44976_",
   [junit4]   2>   "numShards":"1",
   [junit4]   2>   "state":"down",
   [junit4]   2>   "shard":null,
   [junit4]   2>   "collection":"collection1",
   [junit4]   2>   "operation":"state"} current state version: 4
   [junit4]   2> 941376 INFO  (coreLoadExecutor-3208-thread-1-processing-n:127.0.0.1:44976_) [n:127.0.0.1:44976_ c:collection1   x:collection1] o.a.s.c.c.ZkStateReader Deleting data for [collection1]
   [junit4]   2> 941376 INFO  (OverseerStateUpdate-95961346132279300-127.0.0.1:40926_-n_0000000000) [n:127.0.0.1:40926_    ] o.a.s.c.o.ReplicaMutator Update state numShards=1 message={
   [junit4]   2>   "core":"collection1",
   [junit4]   2>   "roles":null,
   [junit4]   2>   "base_url":"http://127.0.0.1:44976",
   [junit4]   2>   "node_name":"127.0.0.1:44976_",
   [junit4]   2>   "numShards":"1",
   [junit4]   2>   "state":"down",
   [junit4]   2>   "shard":null,
   [junit4]   2>   "collection":"collection1",
   [junit4]   2>   "operation":"state"}
   [junit4]   2> 941376 INFO  (OverseerStateUpdate-95961346132279300-127.0.0.1:40926_-n_0000000000) [n:127.0.0.1:40926_    ] o.a.s.c.o.ClusterStateMutator building a new cName: collection1
   [junit4]   2> 941376 INFO  (coreLoadExecutor-3208-thread-1-processing-n:127.0.0.1:44976_) [n:127.0.0.1:44976_ c:collection1   x:collection1] o.a.s.c.ZkController look for our core node name
   [junit4]   2> 941376 INFO  (OverseerStateUpdate-95961346132279300-127.0.0.1:40926_-n_0000000000) [n:127.0.0.1:40926_    ] o.a.s.c.o.ReplicaMutator Assigning new node to shard shard=shard1
   [junit4]   2> 941477 INFO  (zkCallback-1053-thread-1-processing-n:127.0.0.1:40926_) [n:127.0.0.1:40926_    ] o.a.s.c.c.ZkStateReader A cluster state change: [WatchedEvent state:SyncConnected type:NodeDataChanged path:/clusterstate.json], has occurred - updating... (live nodes size: [2])
   [junit4]   2> 941477 INFO  (zkCallback-1055-thread-1) [    ] o.a.s.c.c.ZkStateReader A cluster state change: [WatchedEvent state:SyncConnected type:NodeDataChanged path:/clusterstate.json], has occurred - updating... (live nodes size: [2])
   [junit4]   2> 941477 INFO  (zkCallback-1060-thread-1-processing-n:127.0.0.1:44976_) [n:127.0.0.1:44976_    ] o.a.s.c.c.ZkStateReader A cluster state change: [WatchedEvent state:SyncConnected type:NodeDataChanged path:/clusterstate.json], has occurred - updating... (live nodes size: [2])
   [junit4]   2> 942376 INFO  (coreLoadExecutor-3208-thread-1-processing-n:127.0.0.1:44976_) [n:127.0.0.1:44976_ c:collection1   x:collection1] o.a.s.c.ZkController waiting to find shard id in clusterstate for collection1
   [junit4]   2> 942376 INFO  (coreLoadExecutor-3208-thread-1-processing-n:127.0.0.1:44976_) [n:127.0.0.1:44976_ c:collection1   x:collection1] o.a.s.c.ZkController Check for collection zkNode:collection1
   [junit4]   2> 942376 INFO  (coreLoadExecutor-3208-thread-1-processing-n:127.0.0.1:44976_) [n:127.0.0.1:44976_ c:collection1   x:collection1] o.a.s.c.ZkController Collection zkNode exists
   [junit4]   2> 942376 INFO  (coreLoadExecutor-3208-thread-1-processing-n:127.0.0.1:44976_) [n:127.0.0.1:44976_ c:collection1   x:collection1] o.a.s.c.c.ZkStateReader Load collection config from: [/collections/collection1]
   [junit4]   2> 942377 INFO  (coreLoadExecutor-3208-thread-1-processing-n:127.0.0.1:44976_) [n:127.0.0.1:44976_ c:collection1   x:collection1] o.a.s.c.c.ZkStateReader path=[/collections/collection1] [configName]=[conf1] specified config exists in ZooKeeper
   [junit4]   2> 942377 INFO  (coreLoadExecutor-3208-thread-1-processing-n:127.0.0.1:44976_) [n:127.0.0.1:44976_ c:collection1   x:collection1] o.a.s.c.SolrResourceLoader new SolrResourceLoader for directory: '/home/jenkins/workspace/Lucene-Solr-6.0-Linux/solr/build/solr-core/test/J1/temp/solr.cloud.ChaosMonkeyNothingIsSafeTest_BA68A0153E0B5158-001/shard-1-001/cores/collection1'
   [junit4]   2> 942377 INFO  (coreLoadExecutor-3208-thread-1-processing-n:127.0.0.1:44976_) [n:127.0.0.1:44976_ c:collection1   x:collection1] o.a.s.c.SolrResourceLoader JNDI not configured for solr (NoInitialContextEx)
   [junit4]   2> 942377 INFO  (coreLoadExecutor-3208-thread-1-processing-n:127.0.0.1:44976_) [n:127.0.0.1:44976_ c:collection1   x:collection1] o.a.s.c.SolrResourceLoader solr home defaulted to 'solr/' (could not find system property or JNDI)
   [junit4]   2> 942378 INFO  (coreLoadExecutor-3208-thread-1-processing-n:127.0.0.1:44976_) [n:127.0.0.1:44976_ c:collection1   x:collection1] o.a.s.c.Config loaded config solrconfig.xml with version 0 
   [junit4]   2> 942382 INFO  (coreLoadExecutor-3208-thread-1-processing-n:127.0.0.1:44976_) [n:127.0.0.1:44976_ c:collection1   x:collection1] o.a.s.c.SolrConfig current version of requestparams : -1
   [junit4]   2> 942386 INFO  (coreLoadExecutor-3208-thread-1-processing-n:127.0.0.1:44976_) [n:127.0.0.1:44976_ c:collection1   x:collection1] o.a.s.c.SolrConfig Using Lucene MatchVersion: 6.0.1
   [junit4

[...truncated too long message...]

0,rollbacks=0,expungeDeletes=0,docsPending=0,adds=0,deletesById=0,deletesByQuery=0,errors=0,cumulative_adds=36,cumulative_deletesById=0,cumulative_deletesByQuery=1,cumulative_errors=0,transaction_logs_total_size=6705,transaction_logs_total_number=3}
   [junit4]   2> 1360537 INFO  (coreCloseExecutor-3824-thread-1) [    x:collection1] o.a.s.u.SolrCoreState Closing SolrCoreState
   [junit4]   2> 1360537 INFO  (coreCloseExecutor-3824-thread-1) [    x:collection1] o.a.s.u.DefaultSolrCoreState SolrCoreState ref count has reached 0 - closing IndexWriter
   [junit4]   2> 1360537 INFO  (coreCloseExecutor-3824-thread-1) [    x:collection1] o.a.s.u.DefaultSolrCoreState closing IndexWriter with IndexWriterCloser
   [junit4]   2> 1360537 INFO  (coreCloseExecutor-3824-thread-1) [    x:collection1] o.a.s.c.SolrCore [collection1] Closing main searcher on request.
   [junit4]   2> 1360546 INFO  (coreCloseExecutor-3824-thread-1) [    x:collection1] o.a.s.c.CachingDirectoryFactory Closing MockDirectoryFactory - 2 directories currently being tracked
   [junit4]   2> 1360546 INFO  (coreCloseExecutor-3824-thread-1) [    x:collection1] o.a.s.c.CachingDirectoryFactory looking to close /home/jenkins/workspace/Lucene-Solr-6.0-Linux/solr/build/solr-core/test/J2/temp/solr.TestDistributedSearch_BA68A0153E0B5158-001/tempDir-001/shard1/cores/collection1/data [CachedDir<<refCount=0;path=/home/jenkins/workspace/Lucene-Solr-6.0-Linux/solr/build/solr-core/test/J2/temp/solr.TestDistributedSearch_BA68A0153E0B5158-001/tempDir-001/shard1/cores/collection1/data;done=false>>]
   [junit4]   2> 1360546 INFO  (coreCloseExecutor-3824-thread-1) [    x:collection1] o.a.s.c.CachingDirectoryFactory Closing directory: /home/jenkins/workspace/Lucene-Solr-6.0-Linux/solr/build/solr-core/test/J2/temp/solr.TestDistributedSearch_BA68A0153E0B5158-001/tempDir-001/shard1/cores/collection1/data
   [junit4]   2> 1360546 INFO  (coreCloseExecutor-3824-thread-1) [    x:collection1] o.a.s.c.CachingDirectoryFactory looking to close /home/jenkins/workspace/Lucene-Solr-6.0-Linux/solr/build/solr-core/test/J2/temp/solr.TestDistributedSearch_BA68A0153E0B5158-001/tempDir-001/shard1/cores/collection1/data/index [CachedDir<<refCount=0;path=/home/jenkins/workspace/Lucene-Solr-6.0-Linux/solr/build/solr-core/test/J2/temp/solr.TestDistributedSearch_BA68A0153E0B5158-001/tempDir-001/shard1/cores/collection1/data/index;done=false>>]
   [junit4]   2> 1360546 INFO  (coreCloseExecutor-3824-thread-1) [    x:collection1] o.a.s.c.CachingDirectoryFactory Closing directory: /home/jenkins/workspace/Lucene-Solr-6.0-Linux/solr/build/solr-core/test/J2/temp/solr.TestDistributedSearch_BA68A0153E0B5158-001/tempDir-001/shard1/cores/collection1/data/index
   [junit4]   2> 1360547 INFO  (TEST-TestDistributedSearch.test-seed#[BA68A0153E0B5158]) [    ] o.e.j.s.h.ContextHandler Stopped o.e.j.s.ServletContextHandler@5ff9200f{/dr_xqv/uc,null,UNAVAILABLE}
   [junit4]   2> NOTE: reproduce with: ant test  -Dtestcase=TestDistributedSearch -Dtests.method=test -Dtests.seed=BA68A0153E0B5158 -Dtests.multiplier=3 -Dtests.slow=true -Dtests.locale=ro -Dtests.timezone=Africa/Sao_Tome -Dtests.asserts=true -Dtests.file.encoding=US-ASCII
   [junit4] FAILURE 69.8s J2 | TestDistributedSearch.test <<<
   [junit4]    > Throwable #1: java.lang.AssertionError: Expected to find shardAddress in the up shard info
   [junit4]    > 	at __randomizedtesting.SeedInfo.seed([BA68A0153E0B5158:323C9FCF90F73CA0]:0)
   [junit4]    > 	at org.apache.solr.TestDistributedSearch.comparePartialResponses(TestDistributedSearch.java:1160)
   [junit4]    > 	at org.apache.solr.TestDistributedSearch.queryPartialResults(TestDistributedSearch.java:1101)
   [junit4]    > 	at org.apache.solr.TestDistributedSearch.test(TestDistributedSearch.java:961)
   [junit4]    > 	at org.apache.solr.BaseDistributedSearchTestCase$ShardsRepeatRule$ShardsRepeatStatement.callStatement(BaseDistributedSearchTestCase.java:1018)
   [junit4]    > 	at org.apache.solr.BaseDistributedSearchTestCase$ShardsRepeatRule$ShardsStatement.evaluate(BaseDistributedSearchTestCase.java:967)
   [junit4]    > 	at java.lang.Thread.run(Thread.java:745)
   [junit4]   2> 1360549 INFO  (SUITE-TestDistributedSearch-seed#[BA68A0153E0B5158]-worker) [    ] o.a.s.SolrTestCaseJ4 ###deleteCore
   [junit4]   2> NOTE: leaving temporary files on disk at: /home/jenkins/workspace/Lucene-Solr-6.0-Linux/solr/build/solr-core/test/J2/temp/solr.TestDistributedSearch_BA68A0153E0B5158-001
   [junit4]   2> NOTE: test params are: codec=Asserting(Lucene60): {other_tl1=PostingsFormat(name=LuceneVarGapDocFreqInterval), range_facet_l_dv=PostingsFormat(name=LuceneFixedGap), SubjectTerms_mfacet=PostingsFormat(name=LuceneVarGapDocFreqInterval), n_l1=PostingsFormat(name=Asserting), a_n_tdt=FST50, multiDefault=PostingsFormat(name=Asserting), intDefault=PostingsFormat(name=LuceneVarGapDocFreqInterval), n_td1=PostingsFormat(name=LuceneVarGapDocFreqInterval), n_d1=PostingsFormat(name=Asserting), n_f1=PostingsFormat(name=LuceneVarGapDocFreqInterval), range_facet_l=PostingsFormat(name=Asserting), n_tl1=PostingsFormat(name=LuceneVarGapDocFreqInterval), oddField_s=PostingsFormat(name=LuceneFixedGap), n_tf1=PostingsFormat(name=Asserting), lowerfilt1and2=PostingsFormat(name=Asserting), a_t=PostingsFormat(name=Asserting), lowerfilt=PostingsFormat(name=Asserting), id=PostingsFormat(name=LuceneFixedGap), text=FST50, timestamp=PostingsFormat(name=Asserting), severity=FST50, foo_sev_enum=FST50, n_dt1=PostingsFormat(name=LuceneVarGapDocFreqInterval), a_i1=PostingsFormat(name=Asserting), b_n_tdt=PostingsFormat(name=LuceneVarGapDocFreqInterval), n_ti1=PostingsFormat(name=LuceneFixedGap), rnd_b=PostingsFormat(name=LuceneFixedGap), _version_=PostingsFormat(name=LuceneVarGapDocFreqInterval), foo_b=FST50, n_tdt1=PostingsFormat(name=LuceneVarGapDocFreqInterval), foo_d=PostingsFormat(name=LuceneFixedGap), range_facet_i_dv=PostingsFormat(name=Asserting), foo_f=FST50}, docValues:{range_facet_l_dv=DocValuesFormat(name=Lucene54), foo_sev_enum=DocValuesFormat(name=Asserting), range_facet_i_dv=DocValuesFormat(name=Direct), timestamp=DocValuesFormat(name=Direct)}, maxPointsInLeafNode=1383, maxMBSortInHeap=6.664950585175896, sim=RandomSimilarity(queryNorm=true,coord=no): {}, locale=ro, timezone=Africa/Sao_Tome
   [junit4]   2> NOTE: Linux 4.4.0-21-generic amd64/Oracle Corporation 1.8.0_92 (64-bit)/cpus=12,threads=1,free=275787168,total=518148096
   [junit4]   2> NOTE: All tests run in this JVM: [HdfsWriteToMultipleCollectionsTest, TestSolrDeletionPolicy1, HdfsThreadLeakTest, RuleEngineTest, RollingRestartTest, LeaderFailoverAfterPartitionTest, TestScoreJoinQPScore, CollectionsAPISolrJTest, TestNamedUpdateProcessors, NoCacheHeaderTest, RemoteQueryErrorTest, TestNonDefinedSimilarityFactory, DistributedFacetPivotWhiteBoxTest, FullSolrCloudDistribCmdsTest, TestStressRecovery, SliceStateTest, TestGroupingSearch, TestHighFrequencyDictionaryFactory, CircularListTest, QueryParsingTest, TestReRankQParserPlugin, SpatialRPTFieldTypeTest, BitVectorTest, TestOnReconnectListenerSupport, DistributedDebugComponentTest, TestZkChroot, AutoCommitTest, ShardSplitTest, DistributedFacetPivotLongTailTest, TestSchemaNameResource, TestIndexSearcher, TestAuthenticationFramework, InfoHandlerTest, TestSolr4Spatial2, TestReplicationHandlerBackup, DateMathParserTest, BJQParserTest, DistributedVersionInfoTest, TestPHPSerializedResponseWriter, TestSchemaVersionResource, SampleTest, LeaderElectionTest, SimpleMLTQParserTest, DirectSolrConnectionTest, TermVectorComponentDistributedTest, TestSearchPerf, StatsComponentTest, DirectUpdateHandlerOptimizeTest, QueryResultKeyTest, TestElisionMultitermQuery, MigrateRouteKeyTest, TestSweetSpotSimilarityFactory, TestPerFieldSimilarity, AnalyticsQueryTest, OverseerStatusTest, TestReversedWildcardFilterFactory, UpdateParamsTest, TestSolrQueryResponse, TestSolrIndexConfig, CoreAdminCreateDiscoverTest, FieldMutatingUpdateProcessorTest, TestSort, SimpleFacetsTest, DirectoryFactoryTest, BasicAuthIntegrationTest, SuggesterTest, TestSolrQueryParserResource, TestMinMaxOnMultiValuedField, BadComponentTest, TestExtendedDismaxParser, TestWriterPerf, TestIntervalFaceting, TestPKIAuthenticationPlugin, TestFieldResource, TestDistribDocBasedVersion, HLLSerializationTest, SimpleCollectionCreateDeleteTest, PluginInfoTest, ScriptEngineTest, BadIndexSchemaTest, RankQueryTest, DeleteShardTest, RecoveryZkTest, TestSolrQueryParser, TestSSLRandomization, HdfsRecoveryZkTest, TestConfigSetProperties, TestManagedSynonymFilterFactory, TestJmxMonitoredMap, BlockJoinFacetSimpleTest, TestReplicaProperties, TestNRTOpen, BufferStoreTest, ShardRoutingCustomTest, TestDistributedSearch]
   [junit4] Completed [308/584 (2!)] on J2 in 69.81s, 1 test, 1 failure <<< FAILURES!

[...truncated 913 lines...]
BUILD FAILED
/home/jenkins/workspace/Lucene-Solr-6.0-Linux/build.xml:740: The following error occurred while executing this line:
/home/jenkins/workspace/Lucene-Solr-6.0-Linux/build.xml:684: The following error occurred while executing this line:
/home/jenkins/workspace/Lucene-Solr-6.0-Linux/build.xml:59: The following error occurred while executing this line:
/home/jenkins/workspace/Lucene-Solr-6.0-Linux/solr/build.xml:233: The following error occurred while executing this line:
/home/jenkins/workspace/Lucene-Solr-6.0-Linux/solr/common-build.xml:527: The following error occurred while executing this line:
/home/jenkins/workspace/Lucene-Solr-6.0-Linux/lucene/common-build.xml:1457: The following error occurred while executing this line:
/home/jenkins/workspace/Lucene-Solr-6.0-Linux/lucene/common-build.xml:1014: There were test failures: 584 suites (10 ignored), 2340 tests, 2 failures, 114 ignored (70 assumptions) [seed: BA68A0153E0B5158]

Total time: 55 minutes 12 seconds
Build step 'Invoke Ant' marked build as failure
Archiving artifacts
[WARNINGS] Skipping publisher since build result is FAILURE
Recording test results
Email was triggered for: Failure - Any
Sending email for trigger: Failure - Any



Mime
View raw message