lucene-dev mailing list archives

Site index · List index
Message view « Date » · « Thread »
Top « Date » · « Thread »
From Apache Jenkins Server <jenk...@builds.apache.org>
Subject [JENKINS] Lucene-Solr-Tests-5.5-Java7 - Build # 25 - Still Failing
Date Thu, 05 May 2016 19:52:09 GMT
Build: https://builds.apache.org/job/Lucene-Solr-Tests-5.5-Java7/25/

1 tests failed.
FAILED:  junit.framework.TestSuite.org.apache.solr.handler.TestSolrConfigHandlerCloud

Error Message:
3 threads leaked from SUITE scope at org.apache.solr.handler.TestSolrConfigHandlerCloud:     1) Thread[id=14171, name=Thread-5460, state=TIMED_WAITING, group=TGRP-TestSolrConfigHandlerCloud]         at java.lang.Thread.sleep(Native Method)         at org.apache.solr.cloud.ZkSolrResourceLoader.openResource(ZkSolrResourceLoader.java:101)         at org.apache.solr.core.SolrResourceLoader.openSchema(SolrResourceLoader.java:355)         at org.apache.solr.schema.IndexSchemaFactory.create(IndexSchemaFactory.java:48)         at org.apache.solr.schema.IndexSchemaFactory.buildIndexSchema(IndexSchemaFactory.java:70)         at org.apache.solr.core.ConfigSetService.createIndexSchema(ConfigSetService.java:108)         at org.apache.solr.core.ConfigSetService.getConfig(ConfigSetService.java:79)         at org.apache.solr.core.CoreContainer.reload(CoreContainer.java:915)         at org.apache.solr.core.SolrCore$11.run(SolrCore.java:2603)         at org.apache.solr.cloud.ZkController$5.run(ZkController.java:2479)    2) Thread[id=13761, name=Thread-5403, state=TIMED_WAITING, group=TGRP-TestSolrConfigHandlerCloud]         at java.lang.Thread.sleep(Native Method)         at org.apache.solr.cloud.ZkSolrResourceLoader.openResource(ZkSolrResourceLoader.java:101)         at org.apache.solr.core.SolrResourceLoader.openSchema(SolrResourceLoader.java:355)         at org.apache.solr.schema.IndexSchemaFactory.create(IndexSchemaFactory.java:48)         at org.apache.solr.schema.IndexSchemaFactory.buildIndexSchema(IndexSchemaFactory.java:70)         at org.apache.solr.core.ConfigSetService.createIndexSchema(ConfigSetService.java:108)         at org.apache.solr.core.ConfigSetService.getConfig(ConfigSetService.java:79)         at org.apache.solr.core.CoreContainer.reload(CoreContainer.java:915)         at org.apache.solr.core.SolrCore$11.run(SolrCore.java:2603)         at org.apache.solr.cloud.ZkController$5.run(ZkController.java:2479)    3) Thread[id=14567, name=Thread-5505, state=TIMED_WAITING, group=TGRP-TestSolrConfigHandlerCloud]         at java.lang.Thread.sleep(Native Method)         at org.apache.solr.cloud.ZkSolrResourceLoader.openResource(ZkSolrResourceLoader.java:101)         at org.apache.solr.core.SolrResourceLoader.openSchema(SolrResourceLoader.java:355)         at org.apache.solr.schema.IndexSchemaFactory.create(IndexSchemaFactory.java:48)         at org.apache.solr.schema.IndexSchemaFactory.buildIndexSchema(IndexSchemaFactory.java:70)         at org.apache.solr.core.ConfigSetService.createIndexSchema(ConfigSetService.java:108)         at org.apache.solr.core.ConfigSetService.getConfig(ConfigSetService.java:79)         at org.apache.solr.core.CoreContainer.reload(CoreContainer.java:915)         at org.apache.solr.core.SolrCore$11.run(SolrCore.java:2603)         at org.apache.solr.cloud.ZkController$5.run(ZkController.java:2479)

Stack Trace:
com.carrotsearch.randomizedtesting.ThreadLeakError: 3 threads leaked from SUITE scope at org.apache.solr.handler.TestSolrConfigHandlerCloud: 
   1) Thread[id=14171, name=Thread-5460, state=TIMED_WAITING, group=TGRP-TestSolrConfigHandlerCloud]
        at java.lang.Thread.sleep(Native Method)
        at org.apache.solr.cloud.ZkSolrResourceLoader.openResource(ZkSolrResourceLoader.java:101)
        at org.apache.solr.core.SolrResourceLoader.openSchema(SolrResourceLoader.java:355)
        at org.apache.solr.schema.IndexSchemaFactory.create(IndexSchemaFactory.java:48)
        at org.apache.solr.schema.IndexSchemaFactory.buildIndexSchema(IndexSchemaFactory.java:70)
        at org.apache.solr.core.ConfigSetService.createIndexSchema(ConfigSetService.java:108)
        at org.apache.solr.core.ConfigSetService.getConfig(ConfigSetService.java:79)
        at org.apache.solr.core.CoreContainer.reload(CoreContainer.java:915)
        at org.apache.solr.core.SolrCore$11.run(SolrCore.java:2603)
        at org.apache.solr.cloud.ZkController$5.run(ZkController.java:2479)
   2) Thread[id=13761, name=Thread-5403, state=TIMED_WAITING, group=TGRP-TestSolrConfigHandlerCloud]
        at java.lang.Thread.sleep(Native Method)
        at org.apache.solr.cloud.ZkSolrResourceLoader.openResource(ZkSolrResourceLoader.java:101)
        at org.apache.solr.core.SolrResourceLoader.openSchema(SolrResourceLoader.java:355)
        at org.apache.solr.schema.IndexSchemaFactory.create(IndexSchemaFactory.java:48)
        at org.apache.solr.schema.IndexSchemaFactory.buildIndexSchema(IndexSchemaFactory.java:70)
        at org.apache.solr.core.ConfigSetService.createIndexSchema(ConfigSetService.java:108)
        at org.apache.solr.core.ConfigSetService.getConfig(ConfigSetService.java:79)
        at org.apache.solr.core.CoreContainer.reload(CoreContainer.java:915)
        at org.apache.solr.core.SolrCore$11.run(SolrCore.java:2603)
        at org.apache.solr.cloud.ZkController$5.run(ZkController.java:2479)
   3) Thread[id=14567, name=Thread-5505, state=TIMED_WAITING, group=TGRP-TestSolrConfigHandlerCloud]
        at java.lang.Thread.sleep(Native Method)
        at org.apache.solr.cloud.ZkSolrResourceLoader.openResource(ZkSolrResourceLoader.java:101)
        at org.apache.solr.core.SolrResourceLoader.openSchema(SolrResourceLoader.java:355)
        at org.apache.solr.schema.IndexSchemaFactory.create(IndexSchemaFactory.java:48)
        at org.apache.solr.schema.IndexSchemaFactory.buildIndexSchema(IndexSchemaFactory.java:70)
        at org.apache.solr.core.ConfigSetService.createIndexSchema(ConfigSetService.java:108)
        at org.apache.solr.core.ConfigSetService.getConfig(ConfigSetService.java:79)
        at org.apache.solr.core.CoreContainer.reload(CoreContainer.java:915)
        at org.apache.solr.core.SolrCore$11.run(SolrCore.java:2603)
        at org.apache.solr.cloud.ZkController$5.run(ZkController.java:2479)
	at __randomizedtesting.SeedInfo.seed([866252D1F5D4895A]:0)




Build Log:
[...truncated 12181 lines...]
   [junit4] Suite: org.apache.solr.handler.TestSolrConfigHandlerCloud
   [junit4]   2> Creating dataDir: /x1/jenkins/jenkins-slave/workspace/Lucene-Solr-Tests-5.5-Java7/solr/build/solr-core/test/J1/temp/solr.handler.TestSolrConfigHandlerCloud_866252D1F5D4895A-001/init-core-data-001
   [junit4]   2> 1742900 INFO  (SUITE-TestSolrConfigHandlerCloud-seed#[866252D1F5D4895A]-worker) [    ] o.a.s.SolrTestCaseJ4 Randomized ssl (false) and clientAuth (false)
   [junit4]   2> 1742901 INFO  (SUITE-TestSolrConfigHandlerCloud-seed#[866252D1F5D4895A]-worker) [    ] o.a.s.BaseDistributedSearchTestCase Setting hostContext system property: /pdrc/
   [junit4]   2> 1742903 INFO  (TEST-TestSolrConfigHandlerCloud.test-seed#[866252D1F5D4895A]) [    ] o.a.s.c.ZkTestServer STARTING ZK TEST SERVER
   [junit4]   2> 1742904 INFO  (Thread-5269) [    ] o.a.s.c.ZkTestServer client port:0.0.0.0/0.0.0.0:0
   [junit4]   2> 1742904 INFO  (Thread-5269) [    ] o.a.s.c.ZkTestServer Starting server
   [junit4]   2> 1743004 INFO  (TEST-TestSolrConfigHandlerCloud.test-seed#[866252D1F5D4895A]) [    ] o.a.s.c.ZkTestServer start zk server on port:41532
   [junit4]   2> 1743004 INFO  (TEST-TestSolrConfigHandlerCloud.test-seed#[866252D1F5D4895A]) [    ] o.a.s.c.c.SolrZkClient Using default ZkCredentialsProvider
   [junit4]   2> 1743005 INFO  (TEST-TestSolrConfigHandlerCloud.test-seed#[866252D1F5D4895A]) [    ] o.a.s.c.c.ConnectionManager Waiting for client to connect to ZooKeeper
   [junit4]   2> 1743007 INFO  (zkCallback-1886-thread-1) [    ] o.a.s.c.c.ConnectionManager Watcher org.apache.solr.common.cloud.ConnectionManager@78a0d8a8 name:ZooKeeperConnection Watcher:127.0.0.1:41532 got event WatchedEvent state:SyncConnected type:None path:null path:null type:None
   [junit4]   2> 1743007 INFO  (TEST-TestSolrConfigHandlerCloud.test-seed#[866252D1F5D4895A]) [    ] o.a.s.c.c.ConnectionManager Client is connected to ZooKeeper
   [junit4]   2> 1743007 INFO  (TEST-TestSolrConfigHandlerCloud.test-seed#[866252D1F5D4895A]) [    ] o.a.s.c.c.SolrZkClient Using default ZkACLProvider
   [junit4]   2> 1743007 INFO  (TEST-TestSolrConfigHandlerCloud.test-seed#[866252D1F5D4895A]) [    ] o.a.s.c.c.SolrZkClient makePath: /solr
   [junit4]   2> 1743009 INFO  (TEST-TestSolrConfigHandlerCloud.test-seed#[866252D1F5D4895A]) [    ] o.a.s.c.c.SolrZkClient Using default ZkCredentialsProvider
   [junit4]   2> 1743010 INFO  (TEST-TestSolrConfigHandlerCloud.test-seed#[866252D1F5D4895A]) [    ] o.a.s.c.c.ConnectionManager Waiting for client to connect to ZooKeeper
   [junit4]   2> 1743010 INFO  (zkCallback-1887-thread-1) [    ] o.a.s.c.c.ConnectionManager Watcher org.apache.solr.common.cloud.ConnectionManager@22629a04 name:ZooKeeperConnection Watcher:127.0.0.1:41532/solr got event WatchedEvent state:SyncConnected type:None path:null path:null type:None
   [junit4]   2> 1743011 INFO  (TEST-TestSolrConfigHandlerCloud.test-seed#[866252D1F5D4895A]) [    ] o.a.s.c.c.ConnectionManager Client is connected to ZooKeeper
   [junit4]   2> 1743011 INFO  (TEST-TestSolrConfigHandlerCloud.test-seed#[866252D1F5D4895A]) [    ] o.a.s.c.c.SolrZkClient Using default ZkACLProvider
   [junit4]   2> 1743011 INFO  (TEST-TestSolrConfigHandlerCloud.test-seed#[866252D1F5D4895A]) [    ] o.a.s.c.c.SolrZkClient makePath: /collections/collection1
   [junit4]   2> 1743012 INFO  (TEST-TestSolrConfigHandlerCloud.test-seed#[866252D1F5D4895A]) [    ] o.a.s.c.c.SolrZkClient makePath: /collections/collection1/shards
   [junit4]   2> 1743013 INFO  (TEST-TestSolrConfigHandlerCloud.test-seed#[866252D1F5D4895A]) [    ] o.a.s.c.c.SolrZkClient makePath: /collections/control_collection
   [junit4]   2> 1743013 INFO  (TEST-TestSolrConfigHandlerCloud.test-seed#[866252D1F5D4895A]) [    ] o.a.s.c.c.SolrZkClient makePath: /collections/control_collection/shards
   [junit4]   2> 1743015 INFO  (TEST-TestSolrConfigHandlerCloud.test-seed#[866252D1F5D4895A]) [    ] o.a.s.c.AbstractZkTestCase put /x1/jenkins/jenkins-slave/workspace/Lucene-Solr-Tests-5.5-Java7/solr/core/src/test-files/solr/collection1/conf/solrconfig-tlog.xml to /configs/conf1/solrconfig.xml
   [junit4]   2> 1743015 INFO  (TEST-TestSolrConfigHandlerCloud.test-seed#[866252D1F5D4895A]) [    ] o.a.s.c.c.SolrZkClient makePath: /configs/conf1/solrconfig.xml
   [junit4]   2> 1743017 INFO  (TEST-TestSolrConfigHandlerCloud.test-seed#[866252D1F5D4895A]) [    ] o.a.s.c.AbstractZkTestCase put /x1/jenkins/jenkins-slave/workspace/Lucene-Solr-Tests-5.5-Java7/solr/core/src/test-files/solr/collection1/conf/schema.xml to /configs/conf1/schema.xml
   [junit4]   2> 1743018 INFO  (TEST-TestSolrConfigHandlerCloud.test-seed#[866252D1F5D4895A]) [    ] o.a.s.c.c.SolrZkClient makePath: /configs/conf1/schema.xml
   [junit4]   2> 1743019 INFO  (TEST-TestSolrConfigHandlerCloud.test-seed#[866252D1F5D4895A]) [    ] o.a.s.c.AbstractZkTestCase put /x1/jenkins/jenkins-slave/workspace/Lucene-Solr-Tests-5.5-Java7/solr/core/src/test-files/solr/collection1/conf/solrconfig.snippet.randomindexconfig.xml to /configs/conf1/solrconfig.snippet.randomindexconfig.xml
   [junit4]   2> 1743019 INFO  (TEST-TestSolrConfigHandlerCloud.test-seed#[866252D1F5D4895A]) [    ] o.a.s.c.c.SolrZkClient makePath: /configs/conf1/solrconfig.snippet.randomindexconfig.xml
   [junit4]   2> 1743021 INFO  (TEST-TestSolrConfigHandlerCloud.test-seed#[866252D1F5D4895A]) [    ] o.a.s.c.AbstractZkTestCase put /x1/jenkins/jenkins-slave/workspace/Lucene-Solr-Tests-5.5-Java7/solr/core/src/test-files/solr/collection1/conf/stopwords.txt to /configs/conf1/stopwords.txt
   [junit4]   2> 1743021 INFO  (TEST-TestSolrConfigHandlerCloud.test-seed#[866252D1F5D4895A]) [    ] o.a.s.c.c.SolrZkClient makePath: /configs/conf1/stopwords.txt
   [junit4]   2> 1743023 INFO  (TEST-TestSolrConfigHandlerCloud.test-seed#[866252D1F5D4895A]) [    ] o.a.s.c.AbstractZkTestCase put /x1/jenkins/jenkins-slave/workspace/Lucene-Solr-Tests-5.5-Java7/solr/core/src/test-files/solr/collection1/conf/protwords.txt to /configs/conf1/protwords.txt
   [junit4]   2> 1743023 INFO  (TEST-TestSolrConfigHandlerCloud.test-seed#[866252D1F5D4895A]) [    ] o.a.s.c.c.SolrZkClient makePath: /configs/conf1/protwords.txt
   [junit4]   2> 1743024 INFO  (TEST-TestSolrConfigHandlerCloud.test-seed#[866252D1F5D4895A]) [    ] o.a.s.c.AbstractZkTestCase put /x1/jenkins/jenkins-slave/workspace/Lucene-Solr-Tests-5.5-Java7/solr/core/src/test-files/solr/collection1/conf/currency.xml to /configs/conf1/currency.xml
   [junit4]   2> 1743024 INFO  (TEST-TestSolrConfigHandlerCloud.test-seed#[866252D1F5D4895A]) [    ] o.a.s.c.c.SolrZkClient makePath: /configs/conf1/currency.xml
   [junit4]   2> 1743025 INFO  (TEST-TestSolrConfigHandlerCloud.test-seed#[866252D1F5D4895A]) [    ] o.a.s.c.AbstractZkTestCase put /x1/jenkins/jenkins-slave/workspace/Lucene-Solr-Tests-5.5-Java7/solr/core/src/test-files/solr/collection1/conf/enumsConfig.xml to /configs/conf1/enumsConfig.xml
   [junit4]   2> 1743025 INFO  (TEST-TestSolrConfigHandlerCloud.test-seed#[866252D1F5D4895A]) [    ] o.a.s.c.c.SolrZkClient makePath: /configs/conf1/enumsConfig.xml
   [junit4]   2> 1743027 INFO  (TEST-TestSolrConfigHandlerCloud.test-seed#[866252D1F5D4895A]) [    ] o.a.s.c.AbstractZkTestCase put /x1/jenkins/jenkins-slave/workspace/Lucene-Solr-Tests-5.5-Java7/solr/core/src/test-files/solr/collection1/conf/open-exchange-rates.json to /configs/conf1/open-exchange-rates.json
   [junit4]   2> 1743027 INFO  (TEST-TestSolrConfigHandlerCloud.test-seed#[866252D1F5D4895A]) [    ] o.a.s.c.c.SolrZkClient makePath: /configs/conf1/open-exchange-rates.json
   [junit4]   2> 1743029 INFO  (TEST-TestSolrConfigHandlerCloud.test-seed#[866252D1F5D4895A]) [    ] o.a.s.c.AbstractZkTestCase put /x1/jenkins/jenkins-slave/workspace/Lucene-Solr-Tests-5.5-Java7/solr/core/src/test-files/solr/collection1/conf/mapping-ISOLatin1Accent.txt to /configs/conf1/mapping-ISOLatin1Accent.txt
   [junit4]   2> 1743029 INFO  (TEST-TestSolrConfigHandlerCloud.test-seed#[866252D1F5D4895A]) [    ] o.a.s.c.c.SolrZkClient makePath: /configs/conf1/mapping-ISOLatin1Accent.txt
   [junit4]   2> 1743031 INFO  (TEST-TestSolrConfigHandlerCloud.test-seed#[866252D1F5D4895A]) [    ] o.a.s.c.AbstractZkTestCase put /x1/jenkins/jenkins-slave/workspace/Lucene-Solr-Tests-5.5-Java7/solr/core/src/test-files/solr/collection1/conf/old_synonyms.txt to /configs/conf1/old_synonyms.txt
   [junit4]   2> 1743031 INFO  (TEST-TestSolrConfigHandlerCloud.test-seed#[866252D1F5D4895A]) [    ] o.a.s.c.c.SolrZkClient makePath: /configs/conf1/old_synonyms.txt
   [junit4]   2> 1743032 INFO  (TEST-TestSolrConfigHandlerCloud.test-seed#[866252D1F5D4895A]) [    ] o.a.s.c.AbstractZkTestCase put /x1/jenkins/jenkins-slave/workspace/Lucene-Solr-Tests-5.5-Java7/solr/core/src/test-files/solr/collection1/conf/synonyms.txt to /configs/conf1/synonyms.txt
   [junit4]   2> 1743033 INFO  (TEST-TestSolrConfigHandlerCloud.test-seed#[866252D1F5D4895A]) [    ] o.a.s.c.c.SolrZkClient makePath: /configs/conf1/synonyms.txt
   [junit4]   2> 1743091 INFO  (TEST-TestSolrConfigHandlerCloud.test-seed#[866252D1F5D4895A]) [    ] o.a.s.SolrTestCaseJ4 Writing core.properties file to /x1/jenkins/jenkins-slave/workspace/Lucene-Solr-Tests-5.5-Java7/solr/build/solr-core/test/J1/temp/solr.handler.TestSolrConfigHandlerCloud_866252D1F5D4895A-001/control-001/cores/collection1
   [junit4]   2> 1743092 INFO  (TEST-TestSolrConfigHandlerCloud.test-seed#[866252D1F5D4895A]) [    ] o.e.j.s.Server jetty-9.2.13.v20150730
   [junit4]   2> 1743099 INFO  (TEST-TestSolrConfigHandlerCloud.test-seed#[866252D1F5D4895A]) [    ] o.e.j.s.h.ContextHandler Started o.e.j.s.ServletContextHandler@65a155eb{/pdrc,null,AVAILABLE}
   [junit4]   2> 1743099 INFO  (TEST-TestSolrConfigHandlerCloud.test-seed#[866252D1F5D4895A]) [    ] o.e.j.s.ServerConnector Started ServerConnector@4a296380{HTTP/1.1}{127.0.0.1:41581}
   [junit4]   2> 1743099 INFO  (TEST-TestSolrConfigHandlerCloud.test-seed#[866252D1F5D4895A]) [    ] o.e.j.s.Server Started @1744958ms
   [junit4]   2> 1743099 INFO  (TEST-TestSolrConfigHandlerCloud.test-seed#[866252D1F5D4895A]) [    ] o.a.s.c.s.e.JettySolrRunner Jetty properties: {hostPort=41581, hostContext=/pdrc, coreRootDirectory=/x1/jenkins/jenkins-slave/workspace/Lucene-Solr-Tests-5.5-Java7/solr/build/solr-core/test/J1/temp/solr.handler.TestSolrConfigHandlerCloud_866252D1F5D4895A-001/control-001/cores, solr.data.dir=/x1/jenkins/jenkins-slave/workspace/Lucene-Solr-Tests-5.5-Java7/solr/build/solr-core/test/J1/temp/solr.handler.TestSolrConfigHandlerCloud_866252D1F5D4895A-001/tempDir-001/control/data}
   [junit4]   2> 1743100 INFO  (TEST-TestSolrConfigHandlerCloud.test-seed#[866252D1F5D4895A]) [    ] o.a.s.s.SolrDispatchFilter SolrDispatchFilter.init(): sun.misc.Launcher$AppClassLoader@3827de24
   [junit4]   2> 1743100 INFO  (TEST-TestSolrConfigHandlerCloud.test-seed#[866252D1F5D4895A]) [    ] o.a.s.c.SolrResourceLoader new SolrResourceLoader for directory: '/x1/jenkins/jenkins-slave/workspace/Lucene-Solr-Tests-5.5-Java7/solr/build/solr-core/test/J1/temp/solr.handler.TestSolrConfigHandlerCloud_866252D1F5D4895A-001/control-001'
   [junit4]   2> 1743100 INFO  (TEST-TestSolrConfigHandlerCloud.test-seed#[866252D1F5D4895A]) [    ] o.a.s.c.SolrResourceLoader JNDI not configured for solr (NoInitialContextEx)
   [junit4]   2> 1743100 INFO  (TEST-TestSolrConfigHandlerCloud.test-seed#[866252D1F5D4895A]) [    ] o.a.s.c.SolrResourceLoader solr home defaulted to 'solr/' (could not find system property or JNDI)
   [junit4]   2> 1743100 INFO  (TEST-TestSolrConfigHandlerCloud.test-seed#[866252D1F5D4895A]) [    ] o.a.s.c.c.SolrZkClient Using default ZkCredentialsProvider
   [junit4]   2> 1743100 INFO  (TEST-TestSolrConfigHandlerCloud.test-seed#[866252D1F5D4895A]) [    ] o.a.s.c.c.ConnectionManager Waiting for client to connect to ZooKeeper
   [junit4]   2> 1743101 INFO  (zkCallback-1888-thread-1) [    ] o.a.s.c.c.ConnectionManager Watcher org.apache.solr.common.cloud.ConnectionManager@5d38b46d name:ZooKeeperConnection Watcher:127.0.0.1:41532/solr got event WatchedEvent state:SyncConnected type:None path:null path:null type:None
   [junit4]   2> 1743101 INFO  (TEST-TestSolrConfigHandlerCloud.test-seed#[866252D1F5D4895A]) [    ] o.a.s.c.c.ConnectionManager Client is connected to ZooKeeper
   [junit4]   2> 1743102 INFO  (TEST-TestSolrConfigHandlerCloud.test-seed#[866252D1F5D4895A]) [    ] o.a.s.c.c.SolrZkClient Using default ZkACLProvider
   [junit4]   2> 1743102 INFO  (TEST-TestSolrConfigHandlerCloud.test-seed#[866252D1F5D4895A]) [    ] o.a.s.s.SolrDispatchFilter Loading solr.xml from SolrHome (not found in ZooKeeper)
   [junit4]   2> 1743102 INFO  (TEST-TestSolrConfigHandlerCloud.test-seed#[866252D1F5D4895A]) [    ] o.a.s.c.SolrXmlConfig Loading container configuration from /x1/jenkins/jenkins-slave/workspace/Lucene-Solr-Tests-5.5-Java7/solr/build/solr-core/test/J1/temp/solr.handler.TestSolrConfigHandlerCloud_866252D1F5D4895A-001/control-001/solr.xml
   [junit4]   2> 1743112 INFO  (TEST-TestSolrConfigHandlerCloud.test-seed#[866252D1F5D4895A]) [    ] o.a.s.c.CorePropertiesLocator Config-defined core root directory: /x1/jenkins/jenkins-slave/workspace/Lucene-Solr-Tests-5.5-Java7/solr/build/solr-core/test/J1/temp/solr.handler.TestSolrConfigHandlerCloud_866252D1F5D4895A-001/control-001/cores
   [junit4]   2> 1743112 INFO  (TEST-TestSolrConfigHandlerCloud.test-seed#[866252D1F5D4895A]) [    ] o.a.s.c.CoreContainer New CoreContainer 1834298392
   [junit4]   2> 1743112 INFO  (TEST-TestSolrConfigHandlerCloud.test-seed#[866252D1F5D4895A]) [    ] o.a.s.c.CoreContainer Loading cores into CoreContainer [instanceDir=/x1/jenkins/jenkins-slave/workspace/Lucene-Solr-Tests-5.5-Java7/solr/build/solr-core/test/J1/temp/solr.handler.TestSolrConfigHandlerCloud_866252D1F5D4895A-001/control-001]
   [junit4]   2> 1743112 WARN  (TEST-TestSolrConfigHandlerCloud.test-seed#[866252D1F5D4895A]) [    ] o.a.s.c.CoreContainer Couldn't add files from /x1/jenkins/jenkins-slave/workspace/Lucene-Solr-Tests-5.5-Java7/solr/build/solr-core/test/J1/temp/solr.handler.TestSolrConfigHandlerCloud_866252D1F5D4895A-001/control-001/lib to classpath: /x1/jenkins/jenkins-slave/workspace/Lucene-Solr-Tests-5.5-Java7/solr/build/solr-core/test/J1/temp/solr.handler.TestSolrConfigHandlerCloud_866252D1F5D4895A-001/control-001/lib
   [junit4]   2> 1743112 INFO  (TEST-TestSolrConfigHandlerCloud.test-seed#[866252D1F5D4895A]) [    ] o.a.s.h.c.HttpShardHandlerFactory created with socketTimeout : 90000,urlScheme : ,connTimeout : 15000,maxConnectionsPerHost : 20,maxConnections : 10000,corePoolSize : 0,maximumPoolSize : 2147483647,maxThreadIdleTime : 5,sizeOfQueue : -1,fairnessPolicy : false,useRetries : false,
   [junit4]   2> 1743113 INFO  (TEST-TestSolrConfigHandlerCloud.test-seed#[866252D1F5D4895A]) [    ] o.a.s.u.UpdateShardHandler Creating UpdateShardHandler HTTP client with params: socketTimeout=340000&connTimeout=45000&retry=true
   [junit4]   2> 1743113 INFO  (TEST-TestSolrConfigHandlerCloud.test-seed#[866252D1F5D4895A]) [    ] o.a.s.l.LogWatcher SLF4J impl is org.slf4j.impl.Log4jLoggerFactory
   [junit4]   2> 1743114 INFO  (TEST-TestSolrConfigHandlerCloud.test-seed#[866252D1F5D4895A]) [    ] o.a.s.l.LogWatcher Registering Log Listener [Log4j (org.slf4j.impl.Log4jLoggerFactory)]
   [junit4]   2> 1743114 INFO  (TEST-TestSolrConfigHandlerCloud.test-seed#[866252D1F5D4895A]) [    ] o.a.s.c.ZkContainer Zookeeper client=127.0.0.1:41532/solr
   [junit4]   2> 1743114 INFO  (TEST-TestSolrConfigHandlerCloud.test-seed#[866252D1F5D4895A]) [    ] o.a.s.c.ZkController zkHost includes chroot
   [junit4]   2> 1743114 INFO  (TEST-TestSolrConfigHandlerCloud.test-seed#[866252D1F5D4895A]) [    ] o.a.s.c.c.SolrZkClient Using default ZkCredentialsProvider
   [junit4]   2> 1743114 INFO  (TEST-TestSolrConfigHandlerCloud.test-seed#[866252D1F5D4895A]) [    ] o.a.s.c.c.ConnectionManager Waiting for client to connect to ZooKeeper
   [junit4]   2> 1743116 INFO  (zkCallback-1891-thread-1) [    ] o.a.s.c.c.ConnectionManager Watcher org.apache.solr.common.cloud.ConnectionManager@703a415c name:ZooKeeperConnection Watcher:127.0.0.1:41532 got event WatchedEvent state:SyncConnected type:None path:null path:null type:None
   [junit4]   2> 1743116 INFO  (TEST-TestSolrConfigHandlerCloud.test-seed#[866252D1F5D4895A]) [    ] o.a.s.c.c.ConnectionManager Client is connected to ZooKeeper
   [junit4]   2> 1743116 INFO  (TEST-TestSolrConfigHandlerCloud.test-seed#[866252D1F5D4895A]) [    ] o.a.s.c.c.SolrZkClient Using default ZkACLProvider
   [junit4]   2> 1743117 INFO  (TEST-TestSolrConfigHandlerCloud.test-seed#[866252D1F5D4895A]) [n:127.0.0.1:41581_pdrc    ] o.a.s.c.ZkController Added new OnReconnect listener org.apache.solr.cloud.ZkController$6@52dbf2d7
   [junit4]   2> 1743117 INFO  (TEST-TestSolrConfigHandlerCloud.test-seed#[866252D1F5D4895A]) [n:127.0.0.1:41581_pdrc    ] o.a.s.c.c.ConnectionManager Waiting for client to connect to ZooKeeper
   [junit4]   2> 1743118 INFO  (zkCallback-1892-thread-1-processing-n:127.0.0.1:41581_pdrc) [n:127.0.0.1:41581_pdrc    ] o.a.s.c.c.ConnectionManager Watcher org.apache.solr.common.cloud.ConnectionManager@7008ab33 name:ZooKeeperConnection Watcher:127.0.0.1:41532/solr got event WatchedEvent state:SyncConnected type:None path:null path:null type:None
   [junit4]   2> 1743118 INFO  (TEST-TestSolrConfigHandlerCloud.test-seed#[866252D1F5D4895A]) [n:127.0.0.1:41581_pdrc    ] o.a.s.c.c.ConnectionManager Client is connected to ZooKeeper
   [junit4]   2> 1743119 INFO  (TEST-TestSolrConfigHandlerCloud.test-seed#[866252D1F5D4895A]) [n:127.0.0.1:41581_pdrc    ] o.a.s.c.c.SolrZkClient makePath: /overseer/queue
   [junit4]   2> 1743120 INFO  (TEST-TestSolrConfigHandlerCloud.test-seed#[866252D1F5D4895A]) [n:127.0.0.1:41581_pdrc    ] o.a.s.c.c.SolrZkClient makePath: /overseer/collection-queue-work
   [junit4]   2> 1743121 INFO  (TEST-TestSolrConfigHandlerCloud.test-seed#[866252D1F5D4895A]) [n:127.0.0.1:41581_pdrc    ] o.a.s.c.c.SolrZkClient makePath: /overseer/collection-map-running
   [junit4]   2> 1743122 INFO  (TEST-TestSolrConfigHandlerCloud.test-seed#[866252D1F5D4895A]) [n:127.0.0.1:41581_pdrc    ] o.a.s.c.c.SolrZkClient makePath: /overseer/collection-map-completed
   [junit4]   2> 1743123 INFO  (TEST-TestSolrConfigHandlerCloud.test-seed#[866252D1F5D4895A]) [n:127.0.0.1:41581_pdrc    ] o.a.s.c.c.SolrZkClient makePath: /overseer/collection-map-failure
   [junit4]   2> 1743125 INFO  (TEST-TestSolrConfigHandlerCloud.test-seed#[866252D1F5D4895A]) [n:127.0.0.1:41581_pdrc    ] o.a.s.c.c.SolrZkClient makePath: /live_nodes
   [junit4]   2> 1743125 INFO  (TEST-TestSolrConfigHandlerCloud.test-seed#[866252D1F5D4895A]) [n:127.0.0.1:41581_pdrc    ] o.a.s.c.c.SolrZkClient makePath: /aliases.json
   [junit4]   2> 1743126 INFO  (TEST-TestSolrConfigHandlerCloud.test-seed#[866252D1F5D4895A]) [n:127.0.0.1:41581_pdrc    ] o.a.s.c.c.SolrZkClient makePath: /clusterstate.json
   [junit4]   2> 1743127 INFO  (TEST-TestSolrConfigHandlerCloud.test-seed#[866252D1F5D4895A]) [n:127.0.0.1:41581_pdrc    ] o.a.s.c.c.SolrZkClient makePath: /security.json
   [junit4]   2> 1743127 INFO  (TEST-TestSolrConfigHandlerCloud.test-seed#[866252D1F5D4895A]) [n:127.0.0.1:41581_pdrc    ] o.a.s.c.ZkController Register node as live in ZooKeeper:/live_nodes/127.0.0.1:41581_pdrc
   [junit4]   2> 1743127 INFO  (TEST-TestSolrConfigHandlerCloud.test-seed#[866252D1F5D4895A]) [n:127.0.0.1:41581_pdrc    ] o.a.s.c.c.SolrZkClient makePath: /live_nodes/127.0.0.1:41581_pdrc
   [junit4]   2> 1743128 INFO  (TEST-TestSolrConfigHandlerCloud.test-seed#[866252D1F5D4895A]) [n:127.0.0.1:41581_pdrc    ] o.a.s.c.c.SolrZkClient makePath: /overseer_elect
   [junit4]   2> 1743129 INFO  (TEST-TestSolrConfigHandlerCloud.test-seed#[866252D1F5D4895A]) [n:127.0.0.1:41581_pdrc    ] o.a.s.c.c.SolrZkClient makePath: /overseer_elect/election
   [junit4]   2> 1743129 INFO  (TEST-TestSolrConfigHandlerCloud.test-seed#[866252D1F5D4895A]) [n:127.0.0.1:41581_pdrc    ] o.a.s.c.Overseer Overseer (id=null) closing
   [junit4]   2> 1743130 INFO  (TEST-TestSolrConfigHandlerCloud.test-seed#[866252D1F5D4895A]) [n:127.0.0.1:41581_pdrc    ] o.a.s.c.LeaderElector Joined leadership election with path: /overseer_elect/election/95844925628874756-127.0.0.1:41581_pdrc-n_0000000000
   [junit4]   2> 1743130 INFO  (TEST-TestSolrConfigHandlerCloud.test-seed#[866252D1F5D4895A]) [n:127.0.0.1:41581_pdrc    ] o.a.s.c.OverseerElectionContext I am going to be the leader 127.0.0.1:41581_pdrc
   [junit4]   2> 1743130 INFO  (TEST-TestSolrConfigHandlerCloud.test-seed#[866252D1F5D4895A]) [n:127.0.0.1:41581_pdrc    ] o.a.s.c.c.SolrZkClient makePath: /overseer_elect/leader
   [junit4]   2> 1743131 INFO  (TEST-TestSolrConfigHandlerCloud.test-seed#[866252D1F5D4895A]) [n:127.0.0.1:41581_pdrc    ] o.a.s.c.Overseer Overseer (id=95844925628874756-127.0.0.1:41581_pdrc-n_0000000000) starting
   [junit4]   2> 1743132 INFO  (TEST-TestSolrConfigHandlerCloud.test-seed#[866252D1F5D4895A]) [n:127.0.0.1:41581_pdrc    ] o.a.s.c.c.SolrZkClient makePath: /overseer/queue-work
   [junit4]   2> 1743135 INFO  (TEST-TestSolrConfigHandlerCloud.test-seed#[866252D1F5D4895A]) [n:127.0.0.1:41581_pdrc    ] o.a.s.c.OverseerAutoReplicaFailoverThread Starting OverseerAutoReplicaFailoverThread autoReplicaFailoverWorkLoopDelay=10000 autoReplicaFailoverWaitAfterExpiration=30000 autoReplicaFailoverBadNodeExpiration=60000
   [junit4]   2> 1743135 INFO  (OverseerCollectionConfigSetProcessor-95844925628874756-127.0.0.1:41581_pdrc-n_0000000000) [n:127.0.0.1:41581_pdrc    ] o.a.s.c.OverseerTaskProcessor Process current queue of overseer operations
   [junit4]   2> 1743136 INFO  (OverseerStateUpdate-95844925628874756-127.0.0.1:41581_pdrc-n_0000000000) [n:127.0.0.1:41581_pdrc    ] o.a.s.c.Overseer Starting to work on the main queue
   [junit4]   2> 1743136 INFO  (TEST-TestSolrConfigHandlerCloud.test-seed#[866252D1F5D4895A]) [n:127.0.0.1:41581_pdrc    ] o.a.s.c.c.ZkStateReader Updating cluster state from ZooKeeper... 
   [junit4]   2> 1743151 INFO  (TEST-TestSolrConfigHandlerCloud.test-seed#[866252D1F5D4895A]) [n:127.0.0.1:41581_pdrc    ] o.a.s.c.CoreContainer Security conf doesn't exist. Skipping setup for authorization module.
   [junit4]   2> 1743151 INFO  (TEST-TestSolrConfigHandlerCloud.test-seed#[866252D1F5D4895A]) [n:127.0.0.1:41581_pdrc    ] o.a.s.c.CoreContainer No authentication plugin used.
   [junit4]   2> 1743152 INFO  (TEST-TestSolrConfigHandlerCloud.test-seed#[866252D1F5D4895A]) [n:127.0.0.1:41581_pdrc    ] o.a.s.c.CorePropertiesLocator Looking for core definitions underneath /x1/jenkins/jenkins-slave/workspace/Lucene-Solr-Tests-5.5-Java7/solr/build/solr-core/test/J1/temp/solr.handler.TestSolrConfigHandlerCloud_866252D1F5D4895A-001/control-001/cores
   [junit4]   2> 1743153 INFO  (TEST-TestSolrConfigHandlerCloud.test-seed#[866252D1F5D4895A]) [n:127.0.0.1:41581_pdrc    ] o.a.s.c.CoreDescriptor Created CoreDescriptor: {schema=schema.xml, collection=control_collection, transient=false, dataDir=data/, loadOnStartup=true, shard=, configSetProperties=configsetprops.json, config=solrconfig.xml, coreNodeName=, name=collection1}
   [junit4]   2> 1743153 INFO  (TEST-TestSolrConfigHandlerCloud.test-seed#[866252D1F5D4895A]) [n:127.0.0.1:41581_pdrc    ] o.a.s.c.CorePropertiesLocator Found core collection1 in /x1/jenkins/jenkins-slave/workspace/Lucene-Solr-Tests-5.5-Java7/solr/build/solr-core/test/J1/temp/solr.handler.TestSolrConfigHandlerCloud_866252D1F5D4895A-001/control-001/cores/collection1
   [junit4]   2> 1743153 INFO  (TEST-TestSolrConfigHandlerCloud.test-seed#[866252D1F5D4895A]) [n:127.0.0.1:41581_pdrc    ] o.a.s.c.CorePropertiesLocator Found 1 core definitions
   [junit4]   2> 1743154 INFO  (TEST-TestSolrConfigHandlerCloud.test-seed#[866252D1F5D4895A]) [n:127.0.0.1:41581_pdrc    ] o.a.s.s.SolrDispatchFilter user.dir=/x1/jenkins/jenkins-slave/workspace/Lucene-Solr-Tests-5.5-Java7/solr/build/solr-core/test/J1
   [junit4]   2> 1743154 INFO  (TEST-TestSolrConfigHandlerCloud.test-seed#[866252D1F5D4895A]) [n:127.0.0.1:41581_pdrc    ] o.a.s.s.SolrDispatchFilter SolrDispatchFilter.init() done
   [junit4]   2> 1743154 INFO  (coreLoadExecutor-7001-thread-1-processing-n:127.0.0.1:41581_pdrc) [n:127.0.0.1:41581_pdrc c:control_collection   x:collection1] o.a.s.c.ZkController publishing state=down
   [junit4]   2> 1743154 INFO  (coreLoadExecutor-7001-thread-1-processing-n:127.0.0.1:41581_pdrc) [n:127.0.0.1:41581_pdrc c:control_collection   x:collection1] o.a.s.c.ZkController numShards not found on descriptor - reading it from system property
   [junit4]   2> 1743155 INFO  (coreLoadExecutor-7001-thread-1-processing-n:127.0.0.1:41581_pdrc) [n:127.0.0.1:41581_pdrc c:control_collection   x:collection1] o.a.s.c.ZkController Collection control_collection not visible yet, but flagging it so a watch is registered when it becomes visible
   [junit4]   2> 1743155 INFO  (OverseerStateUpdate-95844925628874756-127.0.0.1:41581_pdrc-n_0000000000) [n:127.0.0.1:41581_pdrc    ] o.a.s.c.Overseer processMessage: queueSize: 1, message = {
   [junit4]   2>   "collection":"control_collection",
   [junit4]   2>   "roles":null,
   [junit4]   2>   "state":"down",
   [junit4]   2>   "node_name":"127.0.0.1:41581_pdrc",
   [junit4]   2>   "numShards":"1",
   [junit4]   2>   "shard":null,
   [junit4]   2>   "operation":"state",
   [junit4]   2>   "core":"collection1",
   [junit4]   2>   "base_url":"http://127.0.0.1:41581/pdrc"} current state version: 0
   [junit4]   2> 1743155 INFO  (coreLoadExecutor-7001-thread-1-processing-n:127.0.0.1:41581_pdrc) [n:127.0.0.1:41581_pdrc c:control_collection   x:collection1] o.a.s.c.c.ZkStateReader addZkWatch [control_collection]
   [junit4]   2> 1743156 INFO  (OverseerStateUpdate-95844925628874756-127.0.0.1:41581_pdrc-n_0000000000) [n:127.0.0.1:41581_pdrc    ] o.a.s.c.o.ReplicaMutator Update state numShards=1 message={
   [junit4]   2>   "collection":"control_collection",
   [junit4]   2>   "roles":null,
   [junit4]   2>   "state":"down",
   [junit4]   2>   "node_name":"127.0.0.1:41581_pdrc",
   [junit4]   2>   "numShards":"1",
   [junit4]   2>   "shard":null,
   [junit4]   2>   "operation":"state",
   [junit4]   2>   "core":"collection1",
   [junit4]   2>   "base_url":"http://127.0.0.1:41581/pdrc"}
   [junit4]   2> 1743156 INFO  (OverseerStateUpdate-95844925628874756-127.0.0.1:41581_pdrc-n_0000000000) [n:127.0.0.1:41581_pdrc    ] o.a.s.c.o.ClusterStateMutator building a new cName: control_collection
   [junit4]   2> 1743156 INFO  (OverseerStateUpdate-95844925628874756-127.0.0.1:41581_pdrc-n_0000000000) [n:127.0.0.1:41581_pdrc    ] o.a.s.c.o.ReplicaMutator Assigning new node to shard shard=shard1
   [junit4]   2> 1743156 INFO  (coreLoadExecutor-7001-thread-1-processing-n:127.0.0.1:41581_pdrc) [n:127.0.0.1:41581_pdrc c:control_collection   x:collection1] o.a.s.c.c.ZkStateReader Deleting data for [control_collection]
   [junit4]   2> 1743157 INFO  (zkCallback-1892-thread-1-processing-n:127.0.0.1:41581_pdrc) [n:127.0.0.1:41581_pdrc    ] o.a.s.c.c.ZkStateReader A cluster state change: [WatchedEvent state:SyncConnected type:NodeDataChanged path:/clusterstate.json], has occurred - updating... (live nodes size: [1])
   [junit4]   2> 1743157 INFO  (coreLoadExecutor-7001-thread-1-processing-n:127.0.0.1:41581_pdrc) [n:127.0.0.1:41581_pdrc c:control_collection   x:collection1] o.a.s.c.ZkController look for our core node name
   [junit4]   2> 1744158 INFO  (coreLoadExecutor-7001-thread-1-processing-n:127.0.0.1:41581_pdrc) [n:127.0.0.1:41581_pdrc c:control_collection   x:collection1] o.a.s.c.ZkController waiting to find shard id in clusterstate for collection1
   [junit4]   2> 1744158 INFO  (coreLoadExecutor-7001-thread-1-processing-n:127.0.0.1:41581_pdrc) [n:127.0.0.1:41581_pdrc c:control_collection   x:collection1] o.a.s.c.ZkController Check for collection zkNode:control_collection
   [junit4]   2> 1744158 INFO  (coreLoadExecutor-7001-thread-1-processing-n:127.0.0.1:41581_pdrc) [n:127.0.0.1:41581_pdrc c:control_collection   x:collection1] o.a.s.c.ZkController Collection zkNode exists
   [junit4]   2> 1744158 INFO  (coreLoadExecutor-7001-thread-1-processing-n:127.0.0.1:41581_pdrc) [n:127.0.0.1:41581_pdrc c:control_collection   x:collection1] o.a.s.c.c.ZkStateReader Load collection config from: [/collections/control_collection]
   [junit4]   2> 1744159 INFO  (coreLoadExecutor-7001-thread-1-processing-n:127.0.0.1:41581_pdrc) [n:127.0.0.1:41581_pdrc c:control_collection   x:collection1] o.a.s.c.c.ZkStateReader path=[/collections/control_collection] [configName]=[conf1] specified config exists in ZooKeeper
   [junit4]   2> 1744159 INFO  (coreLoadExecutor-7001-thread-1-processing-n:127.0.0.1:41581_pdrc) [n:127.0.0.1:41581_pdrc c:control_collection   x:collection1] o.a.s.c.SolrResourceLoader new SolrResourceLoader for directory: '/x1/jenkins/jenkins-slave/workspace/Lucene-Solr-Tests-5.5-Java7/solr/build/solr-core/test/J1/temp/solr.handler.TestSolrConfigHandlerCloud_866252D1F5D4895A-001/control-001/cores/collection1'
   [junit4]   2> 1744159 INFO  (coreLoadExecutor-7001-thread-1-processing-n:127.0.0.1:41581_pdrc) [n:127.0.0.1:41581_pdrc c:control_collection   x:collection1] o.a.s.c.SolrResourceLoader JNDI not configured for solr (NoInitialContextEx)
   [junit4]   2> 1744159 INFO  (coreLoadExecutor-7001-thread-1-processing-n:127.0.0.1:41581_pdrc) [n:127.0.0.1:41581_pdrc c:control_collection   x:collection1] o.a.s.c.SolrResourceLoader solr home defaulted to 'solr/' (could not find system property or JNDI)
   [junit4]   2> 1744161 INFO  (coreLoadExecutor-7001-thread-1-processing-n:127.0.0.1:41581_pdrc) [n:127.0.0.1:41581_pdrc c:control_collection   x:collection1] o.a.s.c.Config loaded config solrconfig.xml with version 0 
   [junit4]   2> 1744166 INFO  (coreLoadExecutor-7001-thread-1-processing-n:127.0.0.1:41581_pdrc) [n:127.0.0.1:41581_pdrc c:control_collection   x:collection1] o.a.s.c.SolrConfig current version of requestparams : -1
   [junit4]   2> 1744174 INFO  (coreLoadExecutor-7001-thread-1-processing-n:127.0.0.1:41581_pdrc) [n:127.0.0.1:41581_pdrc c:control_collection   x:collection1] o.a.s.c.SolrConfig Using Lucene MatchVersion: 5.5.1
   [junit4]   2> 1744193 INFO  (coreLoadExecutor-7001-thread-1-processing-n:127.0.0.1:41581_pdrc) [n:127.0.0.1:41581_pdrc c:control_collection   x:collection1] o.a.s.c.SolrConfig Loaded SolrConfig: solrconfig.xml
   [junit4]   2> 1744198 INFO  (coreLoadExecutor-7001-thread-1-processing-n:127.0.0.1:41581_pdrc) [n:127.0.0.1:41581_pdrc c:control_collection   x:collection1] o.a.s.s.IndexSchema [collection1] Schema name=test
   [junit4]   2> 1744354 INFO  (coreLoadExecutor-7001-thread-1-processing-n:127.0.0.1:41581_pdrc) [n:127.0.0.1:41581_pdrc c:control_collection   x:collection1] o.a.s.s.OpenExchangeRatesOrgProvider Initialized with rates=open-exchange-rates.json, refreshInterval=1440.
   [junit4]   2> 1744359 INFO  (coreLoadExecutor-7001-thread-1-processing-n:127.0.0.1:41581_pdrc) [n:127.0.0.1:41581_pdrc c:control_collection   x:collection1] o.a.s.s.IndexSchema default search field in schema is text
   [junit4]   2> 1744360 INFO  (coreLoadExecutor-7001-thread-1-processing-n:127.0.0.1:41581_pdrc) [n:127.0.0.1:41581_pdrc c:control_collection   x:collection1] o.a.s.s.IndexSchema unique key field: id
   [junit4]   2> 1744366 INFO  (coreLoadExecutor-7001-thread-1-processing-n:127.0.0.1:41581_pdrc) [n:127.0.0.1:41581_pdrc c:control_collection   x:collection1] o.a.s.s.FileExchangeRateProvider Reloading exchange rates from file currency.xml
   [junit4]   2> 1744368 INFO  (coreLoadExecutor-7001-thread-1-processing-n:127.0.0.1:41581_pdrc) [n:127.0.0.1:41581_pdrc c:control_collection   x:collection1] o.a.s.s.FileExchangeRateProvider Reloading exchange rates from file currency.xml
   [junit4]   2> 1744370 INFO  (coreLoadExecutor-7001-thread-1-processing-n:127.0.0.1:41581_pdrc) [n:127.0.0.1:41581_pdrc c:control_collection   x:collection1] o.a.s.s.OpenExchangeRatesOrgProvider Reloading exchange rates from open-exchange-rates.json
   [junit4]   2> 1744370 INFO  (coreLoadExecutor-7001-thread-1-processing-n:127.0.0.1:41581_pdrc) [n:127.0.0.1:41581_pdrc c:control_collection   x:collection1] o.a.s.s.OpenExchangeRatesOrgProvider Reloading exchange rates from open-exchange-rates.json
   [junit4]   2> 1744371 INFO  (coreLoadExecutor-7001-thread-1-processing-n:127.0.0.1:41581_pdrc) [n:127.0.0.1:41581_pdrc c:control_collection   x:collection1] o.a.s.c.ConfigSetProperties Did not find ConfigSet properties, assuming default properties: Can't find resource 'configsetprops.json' in classpath or '/configs/conf1', cwd=/x1/jenkins/jenkins-slave/workspace/Lucene-Solr-Tests-5.5-Java7/solr/build/solr-core/test/J1
   [junit4]   2> 1744371 INFO  (coreLoadExecutor-7001-thread-1-processing-n:127.0.0.1:41581_pdrc) [n:127.0.0.1:41581_pdrc c:control_collection   x:collection1] o.a.s.c.CoreContainer Creating SolrCore 'collection1' using configuration from collection control_collection
   [junit4]   2> 1744371 INFO  (coreLoadExecutor-7001-thread-1-processing-n:127.0.0.1:41581_pdrc) [n:127.0.0.1:41581_pdrc c:control_collection s:shard1 r:core_node1 x:collection1] o.a.s.c.SolrCore org.apache.solr.core.MockDirectoryFactory
   [junit4]   2> 1744371 INFO  (coreLoadExecutor-7001-thread-1-processing-n:127.0.0.1:41581_pdrc) [n:127.0.0.1:41581_pdrc c:control_collection s:shard1 r:core_node1 x:collection1] o.a.s.c.SolrCore [[collection1] ] Opening new SolrCore at [/x1/jenkins/jenkins-slave/workspace/Lucene-Solr-Tests-5.5-Java7/solr/build/solr-core/test/J1/temp/solr.handler.TestSolrConfigHandlerCloud_866252D1F5D4895A-001/control-001/cores/collection1], dataDir=[/x1/jenkins/jenkins-slave/workspace/Lucene-Solr-Tests-5.5-Java7/solr/build/solr-core/test/J1/temp/solr.handler.TestSolrConfigHandlerCloud_866252D1F5D4895A-001/control-001/cores/collection1/data/]
   [junit4]   2> 1744372 INFO  (coreLoadExecutor-7001-thread-1-processing-n:127.0.0.1:41581_pdrc) [n:127.0.0.1:41581_pdrc c:control_collection s:shard1 r:core_node1 x:collection1] o.a.s.c.JmxMonitoredMap JMX monitoring is enabled. Adding Solr mbeans to JMX Server: com.sun.jmx.mbeanserver.JmxMBeanServer@bbd5a18
   [junit4]   2> 1744372 INFO  (coreLoadExecutor-7001-thread-1-processing-n:127.0.0.1:41581_pdrc) [n:127.0.0.1:41581_pdrc c:control_collection s:shard1 r:core_node1 x:collection1] o.a.s.c.CachingDirectoryFactory return new directory for /x1/jenkins/jenkins-slave/workspace/Lucene-Solr-Tests-5.5-Java7/solr/build/solr-core/test/J1/temp/solr.handler.TestSolrConfigHandlerCloud_866252D1F5D4895A-001/control-001/cores/collection1/data
   [junit4]   2> 1744372 INFO  (coreLoadExecutor-7001-thread-1-processing-n:127.0.0.1:41581_pdrc) [n:127.0.0.1:41581_pdrc c:control_collection s:shard1 r:core_node1 x:collection1] o.a.s.c.SolrCore New index directory detected: old=null new=/x1/jenkins/jenkins-slave/workspace/Lucene-Solr-Tests-5.5-Java7/solr/build/solr-core/test/J1/temp/solr.handler.TestSolrConfigHandlerCloud_866252D1F5D4895A-001/control-001/cores/collection1/data/index/
   [junit4]   2> 1744372 WARN  (coreLoadExecutor-7001-thread-1-processing-n:127.0.0.1:41581_pdrc) [n:127.0.0.1:41581_pdrc c:control_collection s:shard1 r:core_node1 x:collection1] o.a.s.c.SolrCore [collection1] Solr index directory '/x1/jenkins/jenkins-slave/workspace/Lucene-Solr-Tests-5.5-Java7/solr/build/solr-core/test/J1/temp/solr.handler.TestSolrConfigHandlerCloud_866252D1F5D4895A-001/control-001/cores/collection1/data/index' doesn't exist. Creating new index...
   [junit4]   2> 1744372 INFO  (coreLoadExecutor-7001-thread-1-processing-n:127.0.0.1:41581_pdrc) [n:127.0.0.1:41581_pdrc c:control_collection s:shard1 r:core_node1 x:collection1] o.a.s.c.CachingDirectoryFactory return new directory for /x1/jenkins/jenkins-slave/workspace/Lucene-Solr-Tests-5.5-Java7/solr/build/solr-core/test/J1/temp/solr.handler.TestSolrConfigHandlerCloud_866252D1F5D4895A-001/control-001/cores/collection1/data/index
   [junit4]   2> 1744373 INFO  (coreLoadExecutor-7001-thread-1-processing-n:127.0.0.1:41581_pdrc) [n:127.0.0.1:41581_pdrc c:control_collection s:shard1 r:core_node1 x:collection1] o.a.s.u.RandomMergePolicy RandomMergePolicy wrapping class org.apache.lucene.index.TieredMergePolicy: [TieredMergePolicy: maxMergeAtOnce=39, maxMergeAtOnceExplicit=39, maxMergedSegmentMB=77.2509765625, floorSegmentMB=1.775390625, forceMergeDeletesPctAllowed=2.7192848321037633, segmentsPerTier=40.0, maxCFSSegmentSizeMB=8.796093022207999E12, noCFSRatio=0.3596469587140986
   [junit4]   2> 1744373 INFO  (coreLoadExecutor-7001-thread-1-processing-n:127.0.0.1:41581_pdrc) [n:127.0.0.1:41581_pdrc c:control_collection s:shard1 r:core_node1 x:collection1] o.a.s.c.SolrDeletionPolicy SolrDeletionPolicy.onCommit: commits: num=1
   [junit4]   2> 	commit{dir=MockDirectoryWrapper(RAMDirectory@6b382d7a lockFactory=org.apache.lucene.store.SingleInstanceLockFactory@3531db94),segFN=segments_1,generation=1}
   [junit4]   2> 1744373 INFO  (coreLoadExecutor-7001-thread-1-processing-n:127.0.0.1:41581_pdrc) [n:127.0.0.1:41581_pdrc c:control_collection s:shard1 r:core_node1 x:collection1] o.a.s.c.SolrDeletionPolicy newest commit generation = 1
   [junit4]   2> 1744373 INFO  (OldIndexDirectoryCleanupThreadForCore-collection1) [n:127.0.0.1:41581_pdrc c:control_collection s:shard1 r:core_node1 x:collection1] o.a.s.c.SolrCore Looking for old index directories to cleanup for core collection1 in /x1/jenkins/jenkins-slave/workspace/Lucene-Solr-Tests-5.5-Java7/solr/build/solr-core/test/J1/temp/solr.handler.TestSolrConfigHandlerCloud_866252D1F5D4895A-001/control-001/cores/collection1/data/
   [junit4]   2> 1744374 WARN  (OldIndexDirectoryCleanupThreadForCore-collection1) [n:127.0.0.1:41581_pdrc c:control_collection s:shard1 r:core_node1 x:collection1] o.a.s.c.DirectoryFactory /x1/jenkins/jenkins-slave/workspace/Lucene-Solr-Tests-5.5-Java7/solr/build/solr-core/test/J1/temp/solr.handler.TestSolrConfigHandlerCloud_866252D1F5D4895A-001/control-001/cores/collection1/data/ does not point to a valid data directory; skipping clean-up of old index directories.
   [junit4]   2> 1744375 INFO  (coreLoadExecutor-7001-thread-1-processing-n:127.0.0.1:41581_pdrc) [n:127.0.0.1:41581_pdrc c:control_collection s:shard1 r:core_node1 x:collection1] o.a.s.u.p.UpdateRequestProcessorChain creating updateRequestProcessorChain "nodistrib"
   [junit4]   2> 1744375 INFO  (coreLoadExecutor-7001-thread-1-processing-n:127.0.0.1:41581_pdrc) [n:127.0.0.1:41581_pdrc c:control_collection s:shard1 r:core_node1 x:collection1] o.a.s.u.p.UpdateRequestProcessorChain creating updateRequestProcessorChain "dedupe"
   [junit4]   2> 1744375 INFO  (coreLoadExecutor-7001-thread-1-processing-n:127.0.0.1:41581_pdrc) [n:127.0.0.1:41581_pdrc c:control_collection s:shard1 r:core_node1 x:collection1] o.a.s.u.p.UpdateRequestProcessorChain inserting DistributedUpdateProcessorFactory into updateRequestProcessorChain "dedupe"
   [junit4]   2> 1744376 INFO  (coreLoadExecutor-7001-thread-1-processing-n:127.0.0.1:41581_pdrc) [n:127.0.0.1:41581_pdrc c:control_collection s:shard1 r:core_node1 x:collection1] o.a.s.u.p.UpdateRequestProcessorChain creating updateRequestProcessorChain "stored_sig"
   [junit4]   2> 1744376 INFO  (coreLoadExecutor-7001-thread-1-processing-n:127.0.0.1:41581_pdrc) [n:127.0.0.1:41581_pdrc c:control_collection s:shard1 r:core_node1 x:collection1] o.a.s.u.p.UpdateRequestProcessorChain inserting DistributedUpdateProcessorFactory into updateRequestProcessorChain "stored_sig"
   [junit4]   2> 1744376 INFO  (coreLoadExecutor-7001-thread-1-processing-n:127.0.0.1:41581_pdrc) [n:127.0.0.1:41581_pdrc c:control_collection s:shard1 r:core_node1 x:collection1] o.a.s.u.p.UpdateRequestProcessorChain creating updateRequestProcessorChain "distrib-dup-test-chain-explicit"
   [junit4]   2> 1744376 INFO  (coreLoadExecutor-7001-thread-1-processing-n:127.0.0.1:41581_pdrc) [n:127.0.0.1:41581_pdrc c:control_collection s:shard1 r:core_node1 x:collection1] o.a.s.u.p.UpdateRequestProcessorChain creating updateRequestProcessorChain "distrib-dup-test-chain-implicit"
   [junit4]   2> 1744376 INFO  (coreLoadExecutor-7001-thread-1-processing-n:127.0.0.1:41581_pdrc) [n:127.0.0.1:41581_pdrc c:control_collection s:shard1 r:core_node1 x:collection1] o.a.s.u.p.UpdateRequestProcessorChain inserting DistributedUpdateProcessorFactory into updateRequestProcessorChain "distrib-dup-test-chain-implicit"
   [junit4]   2> 1744376 INFO  (coreLoadExecutor-7001-thread-1-processing-n:127.0.0.1:41581_pdrc) [n:127.0.0.1:41581_pdrc c:control_collection s:shard1 r:core_node1 x:collection1] o.a.s.c.SolrCore no updateRequestProcessorChain defined as default, creating implicit default
   [junit4]   2> 1744376 WARN  (coreLoadExecutor-7001-thread-1-processing-n:127.0.0.1:41581_pdrc) [n:127.0.0.1:41581_pdrc c:control_collection s:shard1 r:core_node1 x:collection1] o.a.s.c.RequestHandlers INVALID paramSet a in requestHandler {type = requestHandler,name = /dump,class = DumpRequestHandler,args = {defaults={a=A,b=B}}}
   [junit4]   2> 1744378 INFO  (coreLoadExecutor-7001-thread-1-processing-n:127.0.0.1:41581_pdrc) [n:127.0.0.1:41581_pdrc c:control_collection s:shard1 r:core_node1 x:collection1] o.a.s.h.l.XMLLoader xsltCacheLifetimeSeconds=60
   [junit4]   2> 1744379 INFO  (coreLoadExecutor-7001-thread-1-processing-n:127.0.0.1:41581_pdrc) [n:127.0.0.1:41581_pdrc c:control_collection s:shard1 r:core_node1 x:collection1] o.a.s.h.l.XMLLoader xsltCacheLifetimeSeconds=60
   [junit4]   2> 1744380 INFO  (coreLoadExecutor-7001-thread-1-processing-n:127.0.0.1:41581_pdrc) [n:127.0.0.1:41581_pdrc c:control_collection s:shard1 r:core_node1 x:collection1] o.a.s.h.l.XMLLoader xsltCacheLifetimeSeconds=60
   [junit4]   2> 1744380 INFO  (coreLoadExecutor-7001-thread-1-processing-n:127.0.0.1:41581_pdrc) [n:127.0.0.1:41581_pdrc c:control_collection s:shard1 r:core_node1 x:collection1] o.a.s.h.l.XMLLoader xsltCacheLifetimeSeconds=60
   [junit4]   2> 1744383 INFO  (coreLoadExecutor-7001-thread-1-processing-n:127.0.0.1:41581_pdrc) [n:127.0.0.1:41581_pdrc c:control_collection s:shard1 r:core_node1 x:collection1] o.a.s.c.RequestHandlers Registered paths: /dump,/admin/logging,/admin/ping,/admin/mbeans,standard,/schema,/update/csv,/admin/properties,/update,/admin/luke,/replication,/update/json/docs,/admin/file,/admin/threads,/admin/segments,/config,/admin/plugins,/update/json,/get,/admin/system
   [junit4]   2> 1744383 INFO  (coreLoadExecutor-7001-thread-1-processing-n:127.0.0.1:41581_pdrc) [n:127.0.0.1:41581_pdrc c:control_collection s:shard1 r:core_node1 x:collection1] o.a.s.c.SolrCore Using default statsCache cache: org.apache.solr.search.stats.LocalStatsCache
   [junit4]   2> 1744384 INFO  (coreLoadExecutor-7001-thread-1-processing-n:127.0.0.1:41581_pdrc) [n:127.0.0.1:41581_pdrc c:control_collection s:shard1 r:core_node1 x:collection1] o.a.s.u.UpdateHandler Using UpdateLog implementation: org.apache.solr.update.UpdateLog
   [junit4]   2> 1744384 INFO  (coreLoadExecutor-7001-thread-1-processing-n:127.0.0.1:41581_pdrc) [n:127.0.0.1:41581_pdrc c:control_collection s:shard1 r:core_node1 x:collection1] o.a.s.u.UpdateLog Initializing UpdateLog: dataDir= defaultSyncLevel=FLUSH numRecordsToKeep=100 maxNumLogsToKeep=10 numVersionBuckets=65536
   [junit4]   2> 1744384 INFO  (coreLoadExecutor-7001-thread-1-processing-n:127.0.0.1:41581_pdrc) [n:127.0.0.1:41581_pdrc c:control_collection s:shard1 r:core_node1 x:collection1] o.a.s.u.CommitTracker Hard AutoCommit: disabled
   [junit4]   2> 1744384 INFO  (coreLoadExecutor-7001-thread-1-processing-n:127.0.0.1:41581_pdrc) [n:127.0.0.1:41581_pdrc c:control_collection s:shard1 r:core_node1 x:collection1] o.a.s.u.CommitTracker Soft AutoCommit: disabled
   [junit4]   2> 1744385 INFO  (coreLoadExecutor-7001-thread-1-processing-n:127.0.0.1:41581_pdrc) [n:127.0.0.1:41581_pdrc c:control_collection s:shard1 r:core_node1 x:collection1] o.a.s.u.RandomMergePolicy RandomMergePolicy wrapping class org.apache.lucene.index.TieredMergePolicy: [TieredMergePolicy: maxMergeAtOnce=43, maxMergeAtOnceExplicit=17, maxMergedSegmentMB=44.830078125, floorSegmentMB=0.388671875, forceMergeDeletesPctAllowed=10.269271420468366, segmentsPerTier=37.0, maxCFSSegmentSizeMB=8.796093022207999E12, noCFSRatio=0.0
   [junit4]   2> 1744385 INFO  (coreLoadExecutor-7001-thread-1-processing-n:127.0.0.1:41581_pdrc) [n:127.0.0.1:41581_pdrc c:control_collection s:shard1 r:core_node1 x:collection1] o.a.s.c.SolrDeletionPolicy SolrDeletionPolicy.onInit: commits: num=1
   [junit4]   2> 	commit{dir=MockDirectoryWrapper(RAMDirectory@6b382d7a lockFactory=org.apache.lucene.store.SingleInstanceLockFactory@3531db94),segFN=segments_1,generation=1}
   [junit4]   2> 1744385 INFO  (coreLoadExecutor-7001-thread-1-processing-n:127.0.0.1:41581_pdrc) [n:127.0.0.1:41581_pdrc c:control_collection s:shard1 r:core_node1 x:collection1] o.a.s.c.SolrDeletionPolicy newest commit generation = 1
   [junit4]   2> 1744385 INFO  (coreLoadExecutor-7001-thread-1-processing-n:127.0.0.1:41581_pdrc) [n:127.0.0.1:41581_pdrc c:control_collection s:shard1 r:core_node1 x:collection1] o.a.s.s.SolrIndexSearcher Opening Searcher@1b9f8012[collection1] main
   [junit4]   2> 1744385 INFO  (coreLoadExecutor-7001-thread-1-processing-n:127.0.0.1:41581_pdrc) [n:127.0.0.1:41581_pdrc c:control_collection s:shard1 r:core_node1 x:collection1] o.a.s.c.c.ZkStateReader Load collection config from: [/collections/control_collection]
   [junit4]   2> 1744386 INFO  (coreLoadExecutor-7001-thread-1-processing-n:127.0.0.1:41581_pdrc) [n:127.0.0.1:41581_pdrc c:control_collection s:shard1 r:core_node1 x:collection1] o.a.s.c.c.ZkStateReader path=[/collections/control_collection] [configName]=[conf1] specified config exists in ZooKeeper
   [junit4]   2> 1744386 INFO  (coreLoadExecutor-7001-thread-1-processing-n:127.0.0.1:41581_pdrc) [n:127.0.0.1:41581_pdrc c:control_collection s:shard1 r:core_node1 x:collection1] o.a.s.r.ManagedResourceStorage Setting up ZooKeeper-based storage for the RestManager with znodeBase: /configs/conf1
   [junit4]   2> 1744386 INFO  (coreLoadExecutor-7001-thread-1-processing-n:127.0.0.1:41581_pdrc) [n:127.0.0.1:41581_pdrc c:control_collection s:shard1 r:core_node1 x:collection1] o.a.s.r.ManagedResourceStorage Configured ZooKeeperStorageIO with znodeBase: /configs/conf1
   [junit4]   2> 1744386 INFO  (coreLoadExecutor-7001-thread-1-processing-n:127.0.0.1:41581_pdrc) [n:127.0.0.1:41581_pdrc c:control_collection s:shard1 r:core_node1 x:collection1] o.a.s.r.RestManager Initializing RestManager with initArgs: {}
   [junit4]   2> 1744386 INFO  (coreLoadExecutor-7001-thread-1-processing-n:127.0.0.1:41581_pdrc) [n:127.0.0.1:41581_pdrc c:control_collection s:shard1 r:core_node1 x:collection1] o.a.s.r.ManagedResourceStorage Reading _rest_managed.json using ZooKeeperStorageIO:path=/configs/conf1
   [junit4]   2> 1744386 INFO  (coreLoadExecutor-7001-thread-1-processing-n:127.0.0.1:41581_pdrc) [n:127.0.0.1:41581_pdrc c:control_collection s:shard1 r:core_node1 x:collection1] o.a.s.r.ManagedResourceStorage No data found for znode /configs/conf1/_rest_managed.json
   [junit4]   2> 1744387 INFO  (coreLoadExecutor-7001-thread-1-processing-n:127.0.0.1:41581_pdrc) [n:127.0.0.1:41581_pdrc c:control_collection s:shard1 r:core_node1 x:collection1] o.a.s.r.ManagedResourceStorage Loaded null at path _rest_managed.json using ZooKeeperStorageIO:path=/configs/conf1
   [junit4]   2> 1744387 INFO  (coreLoadExecutor-7001-thread-1-processing-n:127.0.0.1:41581_pdrc) [n:127.0.0.1:41581_pdrc c:control_collection s:shard1 r:core_node1 x:collection1] o.a.s.r.RestManager Initializing 0 registered ManagedResources
   [junit4]   2> 1744387 INFO  (coreLoadExecutor-7001-thread-1-processing-n:127.0.0.1:41581_pdrc) [n:127.0.0.1:41581_pdrc c:control_collection s:shard1 r:core_node1 x:collection1] o.a.s.h.ReplicationHandler Commits will be reserved for  10000
   [junit4]   2> 1744387 INFO  (searcherExecutor-7002-thread-1-processing-c:control_collection n:127.0.0.1:41581_pdrc s:shard1 x:collection1 r:core_node1) [n:127.0.0.1:41581_pdrc c:control_collection s:shard1 r:core_node1 x:collection1] o.a.s.c.SolrCore [collection1] Registered new searcher Searcher@1b9f8012[collection1] main{ExitableDirectoryReader(UninvertingDirectoryReader())}
   [junit4]   2> 1744387 INFO  (coreLoadExecutor-7001-thread-1-processing-n:127.0.0.1:41581_pdrc) [n:127.0.0.1:41581_pdrc c:control_collection s:shard1 r:core_node1 x:collection1] o.a.s.u.UpdateLog Looking up max value of version field to seed version buckets
   [junit4]   2> 1744387 INFO  (coreLoadExecutor-7001-thread-1-processing-n:127.0.0.1:41581_pdrc) [n:127.0.0.1:41581_pdrc c:control_collection s:shard1 r:core_node1 x:collection1] o.a.s.u.VersionInfo Refreshing highest value of _version_ for 65536 version buckets from index
   [junit4]   2> 1744387 INFO  (coreLoadExecutor-7001-thread-1-processing-n:127.0.0.1:41581_pdrc) [n:127.0.0.1:41581_pdrc c:control_collection s:shard1 r:core_node1 x:collection1] o.a.s.u.VersionInfo No terms found for _version_, cannot seed version bucket highest value from index
   [junit4]   2> 1744388 INFO  (coreLoadExecutor-7001-thread-1-processing-n:127.0.0.1:41581_pdrc) [n:127.0.0.1:41581_pdrc c:control_collection s:shard1 r:core_node1 x:collection1] o.a.s.u.UpdateLog Could not find max version in index or recent updates, using new clock 1533518811617034240
   [junit4]   2> 1744389 INFO  (coreLoadExecutor-7001-thread-1-processing-n:127.0.0.1:41581_pdrc) [n:127.0.0.1:41581_pdrc c:control_collection s:shard1 r:core_node1 x:collection1] o.a.s.u.UpdateLog Took 1.0ms to seed version buckets with highest version 1533518811617034240
   [junit4]   2> 1744389 INFO  (coreLoadExecutor-7001-thread-1-processing-n:127.0.0.1:41581_pdrc) [n:127.0.0.1:41581_pdrc c:control_collection s:shard1 r:core_node1 x:collection1] o.a.s.c.ZkController watch zkdir /configs/conf1
   [junit4]   2> 1744390 INFO  (coreLoadExecutor-7001-thread-1-processing-n:127.0.0.1:41581_pdrc) [n:127.0.0.1:41581_pdrc c:control_collection s:shard1 r:core_node1 x:collection1] o.a.s.c.CoreContainer registering core: collection1
   [junit4]   2> 1744390 INFO  (coreZkRegister-6995-thread-1-processing-c:control_collection n:127.0.0.1:41581_pdrc s:shard1 x:collection1 r:core_node1) [n:127.0.0.1:41581_pdrc c:control_collection s:shard1 r:core_node1 x:collection1] o.a.s.c.ZkController Register replica - core:collection1 address:http://127.0.0.1:41581/pdrc collection:control_collection shard:shard1
   [junit4]   2> 1744390 INFO  (coreZkRegister-6995-thread-1-processing-c:control_collection n:127.0.0.1:41581_pdrc s:shard1 x:collection1 r:core_node1) [n:127.0.0.1:41581_pdrc c:control_collection s:shard1 r:core_node1 x:collection1] o.a.s.c.c.SolrZkClient makePath: /collections/control_collection/leader_elect/shard1/election
   [junit4]   2> 1744392 INFO  (coreZkRegister-6995-thread-1-processing-c:control_collection n:127.0.0.1:41581_pdrc s:shard1 x:collection1 r:core_node1) [n:127.0.0.1:41581_pdrc c:control_collection s:shard1 r:core_node1 x:collection1] o.a.s.c.LeaderElector Joined leadership election with path: /collections/control_collection/leader_elect/shard1/election/95844925628874756-core_node1-n_0000000000
   [junit4]   2> 1744392 INFO  (coreZkRegister-6995-thread-1-processing-c:control_collection n:127.0.0.1:41581_pdrc s:shard1 x:collection1 r:core_node1) [n:127.0.0.1:41581_pdrc c:control_collection s:shard1 r:core_node1 x:collection1] o.a.s.c.ShardLeaderElectionContext Running the leader process for shard=shard1 and weAreReplacement=false and leaderVoteWait=10000
   [junit4]   2> 1744393 INFO  (coreZkRegister-6995-thread-1-processing-c:control_collection n:127.0.0.1:41581_pdrc s:shard1 x:collection1 r:core_node1) [n:127.0.0.1:41581_pdrc c:control_collection s:shard1 r:core_node1 x:collection1] o.a.s.c.ShardLeaderElectionContext Enough replicas found to continue.
   [junit4]   2> 1744393 INFO  (coreZkRegister-6995-thread-1-processing-c:control_collection n:127.0.0.1:41581_pdrc s:shard1 x:collection1 r:core_node1) [n:127.0.0.1:41581_pdrc c:control_collection s:shard1 r:core_node1 x:collection1] o.a.s.c.ShardLeaderElectionContext I may be the new leader - try and sync
   [junit4]   2> 1744393 INFO  (coreZkRegister-6995-thread-1-processing-c:control_collection n:127.0.0.1:41581_pdrc s:shard1 x:collection1 r:core_node1) [n:127.0.0.1:41581_pdrc c:control_collection s:shard1 r:core_node1 x:collection1] o.a.s.c.SyncStrategy Sync replicas to http://127.0.0.1:41581/pdrc/collection1/
   [junit4]   2> 1744393 INFO  (coreZkRegister-6995-thread-1-processing-c:control_collection n:127.0.0.1:41581_pdrc s:shard1 x:collection1 r:core_node1) [n:127.0.0.1:41581_pdrc c:control_collection s:shard1 r:core_node1 x:collection1] o.a.s.c.SyncStrategy Sync Success - now sync replicas to me
   [junit4]   2> 1744394 INFO  (OverseerStateUpdate-95844925628874756-127.0.0.1:41581_pdrc-n_0000000000) [n:127.0.0.1:41581_pdrc    ] o.a.s.c.Overseer processMessage: queueSize: 1, message = {
   [junit4]   2>   "operation":"leader",
   [junit4]   2>   "shard":"shard1",
   [junit4]   2>   "collection":"control_collection"} current state version: 1
   [junit4]   2> 1744394 INFO  (coreZkRegister-6995-thread-1-processing-c:control_collection n:127.0.0.1:41581_pdrc s:shard1 x:collection1 r:core_node1) [n:127.0.0.1:41581_pdrc c:control_collection s:shard1 r:core_node1 x:collection1] o.a.s.c.SyncStrategy http://127.0.0.1:41581/pdrc/collection1/ has no replicas
   [junit4]   2> 1744394 INFO  (coreZkRegister-6995-thread-1-processing-c:control_collection n:127.0.0.1:41581_pdrc s:shard1 x:collection1 r:core_node1) [n:127.0.0.1:41581_pdrc c:control_collection s:shard1 r:core_node1 x:collection1] o.a.s.c.c.SolrZkClient makePath: /collections/control_collection/leaders/shard1
   [junit4]   2> 1744396 INFO  (coreZkRegister-6995-thread-1-processing-c:control_collection n:127.0.0.1:41581_pdrc s:shard1 x:collection1 r:core_node1) [n:127.0.0.1:41581_pdrc c:control_collection s:shard1 r:core_node1 x:collection1] o.a.s.c.ShardLeaderElectionContextBase Creating leader registration node /collections/control_collection/leaders/shard1/leader after winning as /collections/control_collection/leader_elect/shard1/election/95844925628874756-core_node1-n_0000000000
   [junit4]   2> 1744397 INFO  (coreZkRegister-6995-thread-1-processing-c:control_collection n:127.0.0.1:41581_pdrc s:shard1 x:collection1 r:core_node1) [n:127.0.0.1:41581_pdrc c:control_collection s:shard1 r:core_node1 x:collection1] o.a.s.c.ShardLeaderElectionContext I am the new leader: http://127.0.0.1:41581/pdrc/collection1/ shard1
   [junit4]   2> 1744398 INFO  (OverseerStateUpdate-95844925628874756-127.0.0.1:41581_pdrc-n_0000000000) [n:127.0.0.1:41581_pdrc    ] o.a.s.c.Overseer processMessage: queueSize: 1, message = {
   [junit4]   2>   "operation":"leader",
   [junit4]   2>   "shard":"shard1",
   [junit4]   2>   "collection":"control_collection",
   [junit4]   2>   "base_url":"http://127.0.0.1:41581/pdrc",
   [junit4]   2>   "core":"collection1",
   [junit4]   2>   "state":"active"} current state version: 1
   [junit4]   2> 1744500 INFO  (zkCallback-1892-thread-1-processing-n:127.0.0.1:41581_pdrc) [n:127.0.0.1:41581_pdrc    ] o.a.s.c.c.ZkStateReader A cluster state change: [WatchedEvent state:SyncConnected type:NodeDataChanged path:/clusterstate.json], has occurred - updating... (live nodes size: [1])
   [junit4]   2> 1744548 INFO  (coreZkRegister-6995-thread-1-processing-c:control_collection n:127.0.0.1:41581_pdrc s:shard1 x:collection1 r:core_node1) [n:127.0.0.1:41581_pdrc c:control_collection s:shard1 r:core_node1 x:collection1] o.a.s.c.ZkController We are http://127.0.0.1:41581/pdrc/collection1/ and leader is http://127.0.0.1:41581/pdrc/collection1/
   [junit4]   2> 1744548 INFO  (coreZkRegister-6995-thread-1-processing-c:control_collection n:127.0.0.1:41581_pdrc s:shard1 x:collection1 r:core_node1) [n:127.0.0.1:41581_pdrc c:control_collection s:shard1 r:core_node1 x:collection1] o.a.s.c.ZkController No LogReplay needed for core=collection1 baseURL=http://127.0.0.1:41581/pdrc
   [junit4]   2> 1744548 INFO  (coreZkRegister-6995-thread-1-processing-c:control_collection n:127.0.0.1:41581_pdrc s:shard1 x:collection1 r:core_node1) [n:127.0.0.1:41581_pdrc c:control_collection s:shard1 r:core_node1 x:collection1] o.a.s.c.ZkController I am the leader, no recovery necessary
   [junit4]   2> 1744548 INFO  (coreZkRegister-6995-thread-1-processing-c:control_collection n:127.0.0.1:41581_pdrc s:shard1 x:collection1 r:core_node1) [n:127.0.0.1:41581_pdrc c:control_collection s:shard1 r:core_node1 x:collection1] o.a.s.c.ZkController publishing state=active
   [junit4]   2> 1744549 INFO  (coreZkRegister-6995-thread-1-processing-c:control_collection n:127.0.0.1:41581_pdrc s:shard1 x:collection1 r:core_node1) [n:127.0.0.1:41581_pdrc c:control_collection s:shard1 r:core_node1 x:collection1] o.a.s.c.ZkController numShards not found on descriptor - reading it from system property
   [junit4]   2> 1744550 INFO  (OverseerStateUpdate-95844925628874756-127.0.0.1:41581_pdrc-n_0000000000) [n:127.0.0.1:41581_pdrc    ] o.a.s.c.Overseer processMessage: queueSize: 1, message = {
   [junit4]   2>   "collection":"control_collection",
   [junit4]   2>   "roles":null,
   [junit4]   2>   "state":"active",
   [junit4]   2>   "node_name":"127.0.0.1:41581_pdrc",
   [junit4]   2>   "numShards":"1",
   [junit4]   2>   "core_node_name":"core_node1",
   [junit4]   2>   "shard":"shard1",
   [junit4]   2>   "operation":"state",
   [junit4]   2>   "core":"collection1",
   [junit4]   2>   "base_url":"http://127.0.0.1:41581/pdrc"} current state version: 2
   [junit4]   2> 1744550 INFO  (OverseerStateUpdate-95844925628874756-127.0.0.1:41581_pdrc-n_0000000000) [n:127.0.0.1:41581_pdrc    ] o.a.s.c.o.ReplicaMutator Update state numShards=1 message={
   [junit4]   2>   "collection":"control_collection",
   [junit4]   2>   "roles":null,
   [junit4]   2>   "state":"active",
   [junit4]   2>   "node_name":"127.0.0.1:41581_pdrc",
   [junit4]   2>   "numShards":"1",
   [junit4]   2>   "core_node_name":"core_node1",
   [junit4]   2>   "shard":"shard1",
   [junit4]   2>   "operation":"state",
   [junit4]   2>   "core":"collection1",
   [junit4]   2>   "base_url":"http://127.0.0.1:41581/pdrc"}
   [junit4]   2> 1744652 INFO  (zkCallback-1892-thread-1-processing-n:127.0.0.1:41581_pdrc) [n:127.0.0.1:41581_pdrc    ] o.a.s.c.c.ZkStateReader A cluster state change: [WatchedEvent state:SyncConnected type:NodeDataChanged path:/clusterstate.json], has occurred - updating... (live nodes size: [1])
   [junit4]   2> 1744655 INFO  (TEST-TestSolrConfigHandlerCloud.test-seed#[866252D1F5D4895A]) [    ] o.a.s.c.c.SolrZkClient Using default ZkCredentialsProvider
   [junit4]   2> 1744656 INFO  (TEST-TestSolrConfigHandlerCloud.test-seed#[866252D1F5D4895A]) [    ] o.a.s.c.c.ConnectionManager Waiting for client to connect to ZooKeeper
   [junit4]   2> 1744657 INFO  (zkCallback-1894-thread-1) [    ] o.a.s.c.c.ConnectionManager Watcher org.apache.solr.common.cloud.ConnectionManager@581f947a name:ZooKeeperConnection Watcher:127.0.0.1:41532/solr got event WatchedEvent state:SyncConnected type:None path:null path:null type:None
   [junit4]   2> 1744657 INFO  (TEST-TestSolrConfigHandlerCloud.test-seed#[866252D1F5D4895A]) [    ] o.a.s.c.c.ConnectionManager Client is connected to ZooKeeper
   [junit4]   2> 1744657 INFO  (TEST-TestSolrConfigHandlerCloud.test-seed#[866252D1F5D4895A]) [    ] o.a.s.c.c.SolrZkClient Using default ZkACLProvider
   [junit4]   2> 1744657 INFO  (TEST-TestSolrConfigHandlerCloud.test-seed#[866252D1F5D4895A]) [    ] o.a.s.c.c.ZkStateReader Updating cluster state from ZooKeeper... 
   [junit4]   2> 1744658 INFO  (TEST-TestSolrConfigHandlerCloud.test-seed#[866252D1F5D4895A]) [    ] o.a.s.c.ChaosMonkey monkey: init - expire sessions:false cause connection loss:false
   [junit4]   2> 1744658 INFO  (TEST-TestSolrConfigHandlerCloud.test-seed#[866252D1F5D4895A]) [    ] o.a.s.c.AbstractFullDistribZkTestBase Creating collection1 with stateFormat=2
   [junit4]   2> 1744658 INFO  (TEST-TestSolrConfigHandlerCloud.test-seed#[866252D1F5D4895A]) [    ] o.a.s.c.c.SolrZkClient Using default ZkCredentialsProvider
   [junit4]   2> 1744658 INFO  (TEST-TestSolrConfigHandlerCloud.test-seed#[866252D1F5D4895A]) [    ] o.a.s.c.c.ConnectionManager Waiting for client to connect to ZooKeeper
   [junit4]   2> 1744659 INFO  (zkCallback-1895-thread-1) [    ] o.a.s.c.c.ConnectionManager Watcher org.apache.solr.common.cloud.ConnectionManager@3e9a5a1a name:ZooKeeperConnection Watcher:127.0.0.1:41532/solr got event WatchedEvent state:SyncConnected type:None path:null path:null type:None
   [junit4]   2> 1744659 INFO  (TEST-TestSolrConfigHandlerCloud.test-seed#[866252D1F5D4895A]) [    ] o.a.s.c.c.ConnectionManager Client is connected to ZooKeeper
   [junit4]   2> 1744660 INFO  (TEST-TestSolrConfigHandlerCloud.test-seed#[866252D1F5D4895A]) [    ] o.a.s.c.c.SolrZkClient Using default ZkACLProvider
   [junit4]   2> 1744661 INFO  (OverseerStateUpdate-95844925628874756-127.0.0.1:41581_pdrc-n_0000000000) [n:127.0.0.1:41581_pdrc    ] o.a.s.c.Overseer processMessage: queueSize: 1, message = {
   [junit4]   2>   "operation":"create",
   [junit4]   2>   "name":"collection1",
   [junit4]   2>   "numShards":"2",
   [junit4]   2>   "stateFormat":"2"} current state version: 3
   [junit4]   2> 1744661 INFO  (OverseerStateUpdate-95844925628874756-127.0.0.1:41581_pdrc-n_0000000000) [n:127.0.0.1:41581_pdrc    ] o.a.s.c.o.ClusterStateMutator building a new cName: collection1
   [junit4]   2> 1744711 INFO  (TEST-TestSolrConfigHandlerCloud.test-seed#[866252D1F5D4895A]) [    ] o.a.s.SolrTestCaseJ4 Writing core.properties file to /x1/jenkins/jenkins-slave/workspace/Lucene-Solr-Tests-5.5-Java7/solr/build/solr-core/test/J1/temp/solr.handler.TestSolrConfigHandlerCloud_866252D1F5D4895A-001/shard-1-001/cores/collection1
   [junit4]   2> 1744712 INFO  (TEST-TestSolrConfigHandlerCloud.test-seed#[866252D1F5D4895A]) [    ] o.a.s.c.AbstractFullDistribZkTestBase create jetty 1 in directory /x1/jenkins/jenkins-slave/workspace/Lucene-Solr-Tests-5.5-Java7/solr/build/solr-core/test/J1/temp/solr.handler.TestSolrConfigHandlerCloud_866252D1F5D4895A-001/shard-1-001
   [junit4]   2> 1744712 INFO  (TEST-TestSolrConfigHandlerCloud.test-seed#[866252D1F5D4895A]) [    ] o.e.j.s.Server jetty-9.2.13.v20150730
   [junit4]   2> 1744722 INFO  (TEST-TestSolrConfigHandlerCloud.test-seed#[866252D1F5D4895A]) [    ] o.e.j.s.h.ContextHandler Started o.e.j.s.ServletContextHandler@c855f09{/pdrc,null,AVAILABLE}
   [junit4]   2> 1744723 INFO  (TEST-TestSolrConfigHandlerCloud.test-seed#[866252D1F5D4895A]) [    ] o.e.j.s.ServerConnector Started ServerConnector@4422219{HTTP/1.1}{127.0.0.1:44373}
   [junit4]   2> 1744723 INFO  (TEST-TestSolrConfigHandlerCloud.test-seed#[866252D1F5D4895A]) [    ] o.e.j.s.Server Started @1746582ms
   [junit4]   2> 1744723 INFO  (TEST-TestSolrConfigHandlerCloud.test-seed#[866252D1F5D4895A]) [    ] o.a.s.c.s.e.JettySolrRunner Jetty properties: {hostContext=/pdrc, hostPort=44373, coreRootDirectory=/x1/jenkins/jenkins-slave/workspace/Lucene-Solr-Tests-5.5-Java7/solr/build/solr-core/test/J1/temp/solr.handler.TestSolrConfigHandlerCloud_866252D1F5D4895A-001/shard-1-001/cores, solr.data.dir=/x1/jenkins/jenkins-slave/workspace/Lucene-Solr-Tests-5.5-Java7/solr/build/solr-core/test/J1/temp/solr.handler.TestSolrConfigHandlerCloud_866252D1F5D4895A-001/tempDir-001/jetty1, solrconfig=solrconfig.xml}
   [junit4]   2> 1744723 INFO  (TEST-TestSolrConfigHandlerCloud.test-seed#[866252D1F5D4895A]) [    ] o.a.s.s.SolrDispatchFilter SolrDispatchFilter.init(): sun.misc.Launcher$AppClassLoader@3827de24
   [junit4]   2> 1744723 INFO  (TEST-TestSolrConfigHandlerCloud.test-seed#[866252D1F5D4895A]) [    ] o.a.s.c.SolrResourceLoader new SolrResourceLoader for directory: '/x1/jenkins/jenkins-slave/workspace/Lucene-Solr-Tests-5.5-Java7/solr/build/solr-core/test/J1/temp/solr.handler.TestSolrConfigHandlerCloud_866252D1F5D4895A-001/shard-1-001'
   [junit4]   2> 1744723 INFO  (TEST-TestSolrConfigHandlerCloud.test-seed#[866252D1F5D4895A]) [    ] o.a.s.c.SolrResourceLoader JNDI not configured for solr (NoInitialContextEx)
   [junit4]   2> 1744723 INFO  (TEST-TestSolrConfigHandlerCloud.test-seed#[866252D1F5D4895A]) [    ] o.a.s.c.SolrResourceLoader solr home defaulted to 'solr/' (could not find system property or JNDI)
   [junit4]   2> 1744724 INFO  (TEST-TestSolrConfigHandlerCloud.test-seed#[866252D1F5D4895A]) [    ] o.a.s.c.c.SolrZkClient Using default ZkCredentialsProvider
   [junit4]   2> 1744724 INFO  (TEST-TestSolrConfigHandlerCloud.test-seed#[866252D1F5D4895A]) [    ] o.a.s.c.c.ConnectionManager Waiting for client to connect to ZooKeeper
   [junit4]   2> 1744725 INFO  (zkCallback-1896-thread-1) [    ] o.a.s.c.c.ConnectionManager Watcher org.apache.solr.common.cloud.ConnectionManager@1c3f2d40 name:ZooKeeperConnection Watcher:127.0.0.1:41532/solr got event WatchedEvent state:SyncConnected type:None path:null path:null type:None
   [junit4]   2> 1744725 INFO  (TEST-TestSolrConfigHandlerCloud.test-seed#[866252D1F5D4895A]) [    ] o.a.s.c.c.ConnectionManager Client is connected to ZooKeeper
   [junit4]   2> 1744725 INFO  (TEST-TestSolrConfigHandlerCloud.test-seed#[866252D1F5D4895A]) [    ] o.a.s.c.c.SolrZkClient Using default ZkACLProvider
   [junit4]   2> 1744726 INFO  (TEST-TestSolrConfigHandlerCloud.test-seed#[866252D1F5D4895A]) [    ] o.a.s.s.SolrDispatchFilter Loading solr.xml from SolrHome (not found in ZooKeeper)
   [junit4]   2> 1744726 INFO  (TEST-TestSolrConfigHandlerCloud.test-seed#[866252D1F5D4895A]) [    ] o.a.s.c.SolrXmlConfig Loading container configuration from /x1/jenkins/jenkins-slave/workspace/Lucene-Solr-Tests-5.5-Java7/solr/build/solr-core/test/J1/temp/solr.handler.TestSolrConfigHandlerCloud_866252D1F5D4895A-001/shard-1-001/solr.xml
   [junit4]   2> 1744735 INFO  (TEST-TestSolrConfigHandlerCloud.test-seed#[866252D1F5D4895A]) [    ] o.a.s.c.CorePropertiesLocator Config-defined core root directory: /x1/jenkins/jenkins-slave/workspace/Lucene-Solr-Tests-5.5-Java7/solr/build/solr-core/test/J1/temp/solr.handler.TestSolrConfigHandlerCloud_866252D1F5D4895A-001/shard-1-001/cores
   [junit4]   2> 1744735 INFO  (TEST-TestSolrConfigHandlerCloud.test-seed#[866252D1F5D4895A]) [    ] o.a.s.c.CoreContainer New CoreContainer 692126745
   [junit4]   2> 1744735 INFO  (TEST-TestSolrConfigHandlerCloud.test-seed#[866252D1F5D4895A]) [    ] o.a.s.c.CoreContainer Loading cores into CoreContainer [instanceDir=/x1/jenkins/jenkins-slave/workspace/Lucene-Solr-Tests-5.5-Java7/solr/build/solr-core/test/J1/temp/solr.handler.TestSolrConfigHandlerCloud_866252D1F5D4895A-001/shard-1-001]
   [junit4]   2> 1744736 WARN  (TEST-TestSolrConfigHandlerCloud.test-seed#[866252D1F5D4895A]) [    ] o.a.s.c.CoreContainer Couldn't add files from /x1/jenkins/jenkins-slave/workspace/Lucene-Solr-Tests-5.5-Java7/solr/build/solr-core/test/J1/temp/solr.handler.TestSolrConfigHandlerCloud_866252D1F5D4895A-001/shard-1-001/lib to classpath: /x1/jenkins/jenkins-slave/workspace/Lucene-Solr-Tests-5.5-Java7/solr/build/solr-core/test/J1/temp/solr.handler.TestSolrConfigHandlerCloud_866252D1F5D4895A-001/shard-1-001/lib
   [junit4]   2> 1744736 INFO  (TEST-TestSolrConfigHandlerCloud.test-seed#[866252D1F5D4895A]) [    ] o.a.s.h.c.HttpShardHandlerFactory created with socketTimeout : 90000,urlScheme : ,connTimeout : 15000,maxConnectionsPerHost : 20,maxConnections : 10000,corePoolSize : 0,maximumPoolSize : 2147483647,maxThreadIdleTime : 5,sizeOfQueue : -1,fairnessPolicy : false,useRetries : false,
   [junit4]   2> 1744737 INFO  (TEST-TestSolrConfigHandlerCloud.test-seed#[866252D1F5D4895A]) [    ] o.a.s.u.UpdateShardHandler Creating UpdateShardHandler HTTP client with params: socketTimeout=340000&connTimeout=45000&retry=true
   [junit4]   2> 1744737 INFO  (TEST-TestSolrConfigHandlerCloud.test-seed#[866252D1F5D4895A]) [    ] o.a.s.l.LogWatcher SLF4J impl is org.slf4j.impl.Log4jLoggerFactory
   [junit4]   2> 1744737 INFO  (TEST-TestSolrConfigHandlerCloud.test-seed#[866252D1F5D4895A]) [    ] o.a.s.l.LogWatcher Registering Log Listener [Log4j (org.slf4j.impl.Log4jLoggerFactory)]
   [junit4]   2> 1744737 INFO  (TEST-TestSolrConfigHandlerCloud.test-seed#[866252D1F5D4895A]) [    ] o.a.s.c.ZkContainer Zookeeper client=127.0.0.1:41532/solr
   [junit4]   2> 1744737 INFO  (TEST-TestSolrConfigHandlerCloud.test-seed#[866252D1F5D4895A]) [    ] o.a.s.c.ZkController zkHost includes chroot
   [junit4]   2> 1744737 INFO  (TEST-TestSolrConfigHandlerCloud.test-seed#[866252D1F5D4895A]) [    ] o.a.s.c.c.SolrZkClient Using default ZkCredentialsProvider
   [junit4]   2> 1744738 INFO  (TEST-TestSolrConfigHandlerCloud.test-seed#[866252D1F5D4895A]) [    ] o.a.s.c.c.ConnectionManager Waiting for client to connect to ZooKeeper
   [junit4]   2> 1744739 INFO  (zkCallback-1899-thread-1) [    ] o.a.s.c.c.ConnectionManager Watcher org.apache.solr.common.cloud.ConnectionManager@51c8ae05 name:ZooKeeperConnection Watcher:127.0.0.1:41532 got event WatchedEvent state:SyncConnected type:None path:null path:null type:None
   [junit4]   2> 1744739 INFO  (TEST-TestSolrConfigHandlerCloud.test-seed#[866252D1F5D4895A]) [    ] o.a.s.c.c.ConnectionManager Client is connected to ZooKeeper
   [junit4]   2> 1744739 INFO  (TEST-TestSolrConfigHandlerCloud.test-seed#[866252D1F5D4895A]) [    ] o.a.s.c.c.SolrZkClient Using default ZkACLProvider
   [junit4]   2> 1744740 INFO  (TEST-TestSolrConfigHandlerCloud.test-seed#[866252D1F5D4895A]) [n:127.0.0.1:44373_pdrc    ] o.a.s.c.ZkController Added new OnReconnect listener org.apache.solr.cloud.ZkController$6@2b65bc1a
   [junit4]   2> 1744740 INFO  (TEST-TestSolrConfigHandlerCloud.test-seed#[866252D1F5D4895A]) [n:127.0.0.1:44373_pdrc    ] o.a.s.c.c.ConnectionManager Waiting for client to connect to ZooKeeper
   [junit4]   2> 1744741 INFO  (zkCallback-1900-thread-1-processing-n:127.0.0.1:44373_pdrc) [n:127.0.0.1:44373_pdrc    ] o.a.s.c.c.ConnectionManager Watcher org.apache.solr.common.cloud.ConnectionManager@60f7baaa name:ZooKeeperConnection Watcher:127.0.0.1:41532/solr got event WatchedEvent state:SyncConnected type:None path:null path:null type:None
   [junit4]   2> 1744741 INFO  (TEST-TestSolrConfigHandlerCloud.test-seed#[866252D1F5D4895A]) [n:127.0.0.1:44373_pdrc    ] o.a.s.c.c.ConnectionManager Client is connected to ZooKeeper
   [junit4]   2> 1744744 INFO  (TEST-TestSolrConfigHandlerCloud.test-seed#[866252D1F5D4895A]) [n:127.0.0.1:44373_pdrc    ] o.a.s.c.c.ZkStateReader Updating cluster state from ZooKeeper... 
   [junit4]   2> 1744762 INFO  (OverseerStateUpdate-95844925628874756-127.0.0.1:41581_pdrc-n_0000000000) [n:127.0.0.1:41581_pdrc    ] o.a.s.c.o.ZkStateWriter going to create_collection /collections/collection1/state.json
   [junit4]   2> 1745747 INFO  (TEST-TestSolrConfigHandlerCloud.test-seed#[866252D1F5D4895A]) [n:127.0.0.1:44373_pdrc    ] o.a.s.c.ZkController Register node as live in ZooKeeper:/live_nodes/127.0.0.1:44373_pdrc
   [junit4]   2> 1745747 INFO  (TEST-TestSolrConfigHandlerCloud.test-seed#[866252D1F5D4895A]) [n:127.0.0.1:44373_pdrc    ] o.a.s.c.c.SolrZkClient makePath: /live_nodes/127.0.0.1:44373_pdrc
   [junit4]   2> 1745748 INFO  (zkCallback-1900-thread-1-processing-n:127.0.0.1:44373_pdrc) [n:127.0.0.1:44373_pdrc    ] o.a.s.c.c.ZkStateReader A live node change: [WatchedEvent state:SyncConnected type:NodeChildrenChanged path:/live_nodes], has occurred - updating... (live nodes size: [1])
   [junit4]   2> 1745748 INFO  (zkCallback-1894-thread-1) [    ] o.a.s.c.c.ZkStateReader A live node change: [WatchedEvent state:SyncConnected type:NodeChildrenChanged path:/live_nodes], has occurred - updating... (live nodes size: [1])
   [junit4]   2> 1745748 INFO  (zkCallback-1892-thread-1-processing-n:127.0.0.1:41581_pdrc) [n:127.0.0.1:41581_pdrc    ] o.a.s.c.c.ZkStateReader A live node change: [WatchedEvent state:SyncConnected type:NodeChildrenChanged path:/live_nodes], has occurred - updating... (live nodes size: [1])
   [junit4]   2> 1745749 INFO  (TEST-TestSolrConfigHandlerCloud.test-seed#[866252D1F5D4895A]) [n:127.0.0.1:44373_pdrc    ] o.a.s.c.Overseer Overseer (id=null) closing
   [junit4]   2> 1745750 INFO  (TEST-TestSolrConfigHandlerCloud.test-seed#[866252D1F5D4895A]) [n:127.0.0.1:44373_pdrc    ] o.a.s.c.LeaderElector Joined leadership election with path: /overseer_elect/election/95844925628874761-127.0.0.1:44373_pdrc-n_0000000001
   [junit4]   2> 1745750 INFO  (TEST-TestSolrConfigHandlerCloud.test-seed#[866252D1F5D4895A]) [n:127.0.0.1:44373_pdrc    ] o.a.s.c.LeaderElector Watching path /overseer_elect/election/95844925628874756-127.0.0.1:41581_pdrc-n_0000000000 to know if I could be the leader
   [junit4]   2> 1745758 INFO  (TEST-TestSolrConfigHandlerCloud.test-seed#[866252D1F5D4895A]) [n:127.0.0.1:44373_pdrc    ] o.a.s.c.CoreContainer Security conf doesn't exist. Skipping setup for authorization module.
   [junit4]   2> 1745758 INFO  (TEST-TestSolrConfigHandlerCloud.test-seed#[866252D1F5D4895A]) [n:127.0.0.1:44373_pdrc    ] o.a.s.c.CoreContainer No authentication plugin used.
   [junit4]   2> 1745758 INFO  (TEST-TestSolrConfigHandlerCloud.test-seed#[866252D1F5D4895A]) [n:127.0.0.1:44373_pdrc    ] o.a.s.c.CorePropertiesLocator Looking for core definitions underneath /x1/jenkins/jenkins-slave/workspace/Lucene-Solr-Tests-5.5-Java7/solr/build/solr-core/test/J1/temp/solr.handler.TestSolrConfigHandlerCloud_866252D1F5D4895A-001/shard-1-001/cores
   [junit4]   2> 1745759 INFO  (TEST-TestSolrConfigHandlerCloud.test-seed#[866252D1F5D4895A]) [n:127.0.0.1:44373_pdrc    ] o.a.s.c.CoreDescriptor Created CoreDescriptor: {coreNodeName=, transient=false, config=solrconfig.xml, shard=, collection=collection1, loadOnStartup=true, schema=schema.xml, configSetProperties=configsetprops.json, dataDir=data/, name=collection1}
   [junit4]   2> 1745759 INFO  (TEST-TestSolrConfigHandlerCloud.test-seed#[866252D1F5D4895A]) [n:127.0.0.1:44373_pdrc    ] o.a.s.c.CorePropertiesLocator Found core collection1 in /x1/jenkins/jenkins-slave/workspace/Lucene-Solr-Tests-5.5-Java7/solr/build/solr-core/test/J1/temp/solr.handler.TestSolrConfigHandlerCloud_866252D1F5D4895A-001/shard-1-001/cores/collection1
   [junit4]   2> 1745759 INFO  (TEST-TestSolrConfigHandlerCloud.test-seed#[866252D1F5D4895A]) [n:127.0.0.1:44373_pdrc    ] o.a.s.c.CorePropertiesLocator Found 1 core definitions
   [junit4]   2> 1745760 INFO  (TEST-TestSolrConfigHandlerCloud.test-seed#[866252D1F5D4895A]) [n:127.0.0.1:44373_pdrc    ] o.a.s.s.SolrDispatchFilter user.dir=/x1/jenkins/jenkins-slave/workspace/Lucene-Solr-Tests-5.5-Java7/solr/build/solr-core/test/J1
   [junit4]   2> 1745760 INFO  (TEST-TestSolrConfigHandlerCloud.test-seed#[866252D1F5D4895A]) [n:127.0.0.1:44373_pdrc    ] o.a.s.s.SolrDispatchFilter SolrDispatchFilter.init() done
   [junit4]   2> 1745760 INFO  (coreLoadExecutor-7012-thread-1-processing-n:127.0.0.1:44373_pdrc) [n:127.0.0.1:44373_pdrc c:collection1   x:collection1] o.a.s.c.ZkController publishing state=down
   [junit4]   2> 1745760 INFO  (coreLoadExecutor-7012-thread-1-processing-n:127.0.0.1:44373_pdrc) [n:127.0.0.1:44373_pdrc c:collection1   x:collection1] o.a.s.c.ZkController numShards not found on descriptor - reading it from system property
   [junit4]   2> 1745761 INFO  (coreLoadExecutor-7012-thread-1-processing-n:127.0.0.1:44373_pdrc) [n:127.0.0.1:44373_pdrc c:collection1   x:collection1] o.a.s.c.ZkController Registering watch for collection collection1
   [junit4]   2> 1745761 INFO  (coreLoadExecutor-7012-thread-1-processing-n:127.0.0.1:44373_pdrc) [n:127.0.0.1:44373_pdrc c:collection1   x:collection1] o.a.s.c.c.ZkStateReader addZkWatch [collection1]
   [junit4]   2> 1745761 INFO  (OverseerStateUpdate-95844925628874756-127.0.0.1:41581_pdrc-n_0000000000) [n:127.0.0.1:41581_pdrc    ] o.a.s.c.Overseer processMessage: queueSize: 1, message = {
   [junit4]   2>   "collection":"collection1",
   [junit4]   2>   "roles":null,
   [junit4]   2>   "state":"down",
   [junit4]   2>   "node_name":"127.0.0.1:44373_pdrc",
   [junit4]   2>   "numShards":"2",
   [junit4]   2>   "shard":null,
   [junit4]   2>   "operation":"state",
   [junit4]   2>   "core":"collection1",
   [junit4]   2>   "base_url":"http://127.0.0.1:44373/pdrc"} current state version: 3
   [junit4]   2> 1745761 INFO  (OverseerStateUpdate-95844925628874756-127.0.0.1:41581_pdrc-n_0000000000) [n:127.0.0.1:41581_pdrc    ] o.a.s.c.o.ReplicaMutator Update state numShards=2 message={
   [junit4]   2>   "collection":"collection1",
   [junit4]   2>   "roles":null,
   [junit4]   2>   "state":"down",
   [junit4]   2>   "node_name":"127.0.0.1:44373_pdrc",
   [junit4]   2>   "numShards":"2",
   [junit4]   2>   "shard":null,
   [junit4]   2>   "operation":"state",
   [junit4]   2>   "core":"collection1",
   [junit4]   2>   "base_url":"http://127.0.0.1:44373/pdrc"}
   [junit4]   2> 1745761 INFO  (coreLoadExecutor-7012-thread-1-processing-n:127.0.0.1:44373_pdrc) [n:127.0.0.1:44373_pdrc c:collection1   x:collection1] o.a.s.c.c.ZkStateReader Add data for [collection1] ver [0]
   [junit4]   2> 1745761 INFO  (OverseerStateUpdate-95844925628874756-127.0.0.1:41581_pdrc-n_0000000000) [n:127.0.0.1:41581_pdrc    ] o.a.s.c.o.ReplicaMutator Collection already exists with numShards=2
   [junit4]   2> 1745761 INFO  (coreLoadExecutor-7012-thread-1-processing-n:127.0.0.1:44373_pdrc) [n:127.0.0.1:44373_pdrc c:collection1   x:collection1] o.a.s.c.ZkController look for our core node name
   [junit4]   2> 1745762 INFO  (OverseerStateUpdate-95844925628874756-127.0.0.1:41581_pdrc-n_0000000000) [n:127.0.0.1:41581_pdrc    ] o.a.s.c.o.ReplicaMutator Assigning new node to shard shard=shard2
   [junit4]   2> 1745863 INFO  (OverseerStateUpdate-95844925628874756-127.0.0.1:41581_pdrc-n_0000000000) [n:127.0.0.1:41581_pdrc    ] o.a.s.c.o.ZkStateWriter going to update_collection /collections/collection1/state.json version: 0
   [junit4]   2> 1745864 INFO  (zkCallback-1900-thread-1-processing-n:127.0.0.1:44373_pdrc) [n:127.0.0.1:44373_pdrc    ] o.a.s.c.c.ZkStateReader A cluster state change: [WatchedEvent state:SyncConnected type:NodeDataChanged path:/collections/collection1/state.json] for collection [collection1] has occurred - updating... (live nodes size: [2])
   [junit4]   2> 1745865 INFO  (zkCallback-1900-thread-1-processing-n:127.0.0.1:44373_pdrc) [n:127.0.0.1:44373_pdrc    ] o.a.s.c.c.ZkStateReader Updating data for [collection1] from [0] to [1]
   [junit4]   2> 1746762 INFO  (coreLoadExecutor-7012-thread-1-processing-n:127.0.0.1:44373_pdrc) [n:127.0.0.1:44373_pdrc c:collection1   x:collection1] o.a.s.c.ZkController waiting to find shard id in clusterstate for collection1
   [junit4]   2> 1746762 INFO  (coreLoadExecutor-7012-thread-1-processing-n:127.0.0.1:44373_pdrc) [n:127.0.0.1:44373_pdrc c:collection1   x:collection1] o.a.s.c.ZkController Check for collection zkNode:collection1
   [junit4]   2> 1746762 INFO  (coreLoadExecutor-7012-thread-1-processing-n:127.0.0.1:44373_pdrc) [n:127.0.0.1:44373_pdrc c:collection1   x:collection1] o.a.s.c.ZkController Collection zkNode exists
   [junit4]   2> 1746762 INFO  (coreLoadExecutor-7012-thread-1-processing-n:127.0.0.1:44373_pdrc) [n:127.0.0.1:44373_pdrc c:collection1   x:collection1] o.a.s.c.c.ZkStateReader Load collection config from: [/collections/collection1]
   [junit4]   2> 1746763 INFO  (coreLoadExecutor-7012-thread-1-processing-n:127.0.0.1:44373_pdrc) [n:127.0.0.1:44373_pdrc c:collection1   x:collection1] o.a.s.c.c.ZkStateReader path=[/collections/collection1] [configName]=[conf1] specified config exists in ZooKeeper
   [junit4]   2> 1746763 INFO  (coreLoadExecutor-7012-thread-1-processing-n:127.0.0.1:44373_pdrc) [n:127.0.0.1:44373_pdrc c:collection1   x:collection1] o.a.s.c.SolrResourceLoader new SolrResourceLoader for directory: '/x1/jenkins/jenkins-slave/workspace/Lucene-Solr-Tests-5.5-Java7/solr/build/solr-core/test/J1/temp/solr.handler.TestSolrConfigHandlerCloud_866252D1F5D4895A-001/shard-1-001/cores/collection1'
   [junit4]   2> 1746763 INFO  (coreLoadExecutor-7012-thread-1-processing-n:127.0.0.1:44373_pdrc) [n:127.0.0.1:44373_pdrc c:collection1   x:collection1] o.a.s.c.SolrResourceLoader JNDI not configured for solr (NoInitialContextEx)
   [junit4]   2> 1746763 INFO  (coreLoadExecutor-7012-thread-1-processing-n:127.0.0.1:44373_pdrc) [n:127.0.0.1:44373_pdrc c:collection1   x:collection1] o.a.s.c.SolrResourceLoader solr home defaulted to 'solr/' (could not find system property or JNDI)
   [junit4]   2> 1746764 INFO  (coreLoadExecutor-7012-thread-1-processing-n:127.0.0.1:44373_pdrc) [n:127.0.0.1:44373_pdrc c:collection1   x:collection1] o.a.s.c.Config loaded config solrconfig.xml with version 0 
   [junit4]   2> 1746768 INFO  (coreLoadExecutor-7012-thread-1-processing-n:127.0.0.1:44373_pdrc) [n:127.0.0.1:44373_pdrc c:collection1   x:collection1] o.a.s.c.SolrConfig current version of requestparams : -1
   [junit4]   2> 1746777 INFO  (coreLoadExecutor-7012-thread-1-processing-n:127.0.0.1:44373_pdrc) [n:127.0.0.1:44373_pdrc c:collection1   x:collection1] o.a.s.c.SolrConfig Using Lucene MatchVersion: 5.5.1
   [junit4]   2> 1746795 INFO  (coreLoadExecutor-7012-thread-1-processing-n:127.0.0.1:44373_pdrc) [n:127.0.0.1:44373_pdrc c:collection1   x:collection1] o.a.s.c.SolrConfig Loaded SolrConfig: solrconfig.xml
   [junit4]   2> 1746800 INFO  (coreLoadExecutor-7012-thread-1-processing-n:127.0.0.1:44373_pdrc) [n:127.0.0.1:44373_pdrc c:collection1   x:collection1] o.a.s.s.IndexSchema [collection1] Schema name=test
   [junit4]   2> 1746954 INFO  (coreLoadExecutor-7012-thread-1-processing-n:127.0.0.1:44373_pdrc) [n:127.0.0.1:44373_pdrc c:collection1   x:collection1] o.a.s.s.OpenExchangeRatesOrgProvider Initialized with rates=open-exchange-rates.json, refreshInterval=1440.
   [junit4]   2> 1746959 INFO  (coreLoadExecutor-7012-thread-1-processing-n:127.0.0.1:44373_pdrc) [n:127.0.0.1:44373_pdrc c:collection1   x:collection1] o.a.s.s.IndexSchema default search field in schema is text
   [junit4]   2> 1746960 INFO  (coreLoadExecutor-7012-thread-1-processing-n:127.0.0.1:44373_pdrc) [n:127.0.0.1:44373_pdrc c:collection1   x:collection1] o.a.s.s.IndexSchema unique key field: id
   [junit4]   2> 1746965 INFO  (coreLoadExecutor-7012-thread-1-processing-n:127.0.0.1:44373_pdrc) [n:127.0.0.1:44373_pdrc c:collection1   x:collection1] o.a.s.s.FileExchangeRateProvider Reloading exchange rates from file currency.xml
   [junit4]   2> 1746967 INFO  (coreLoadExecutor-7012-thread-1-processing-n:127.0.0.1:44373_pdrc) [n:127.0.0.1:44373_pdrc c:collection1   x:collection1] o.a.s.s.FileExchangeRateProvider Reloading exchange rates from file currency.xml
   [junit4]   2> 1746968 INFO  (coreLoadExecutor-7012-thread-1-processing-n:127.0.0.1:44373_pdrc) [n:127.0.0.1:44373_pdrc c:collection1   x:collection1] o.a.s.s.OpenExchangeRatesOrgProvider Reloading exchange rates from open-exchange-rates.json
   [junit4]   2> 1746969 INFO  (coreLoadExecutor-7012-thread-1-processing-n:127.0.0.1:44373_pdrc) [n:127.0.0.1:44373_pdrc c:collection1   x:collection1] o.a.s.s.OpenExchangeRatesOrgProvider Reloading exchange rates from open-exchange-rates.json
   [junit4]   2> 1746970 INFO  (coreLoadExecutor-7012-thread-1-processing-n:127.0.0.1:44373_pdrc) [n:127.0.0.1:44373_pdrc c:collection1   x:collection1] o.a.s.c.ConfigSetProperties Did not find ConfigSet properties, assuming default properties: Can't find resource 'configsetprops.json' in classpath or '/configs/conf1', cwd=/x1/jenkins/jenkins-slave/workspace/Lucene-Solr-Tests-5.5-Java7/solr/build/solr-core/test/J1
   [junit4]   2> 1746970 INFO  (coreLoadExecutor-7012-thread-1-processing-n:127.0.0.1:44373_pdrc) [n:127.0.0.1:44373_pdrc c:collection1   x:collection1] o.a.s.c.CoreContainer Creating SolrCore 'collection1' using configuration from collection collection1
   [junit4]   2> 1746970 INFO  (coreLoadExecutor-7012-thread-1-processing-n:127.0.0.1:44373_pdrc) [n:127.0.0.1:44373_pdrc c:collection1 s:shard2 r:core_node1 x:collection1] o.a.s.c.SolrCore org.apache.solr.core.MockDirectoryFactory
   [junit4]   2> 1746970

[...truncated too long message...]

,total=531628032
   [junit4]   2> NOTE: All tests run in this JVM: [SpellPossibilityIteratorTest, TestRuleBasedAuthorizationPlugin, TestManagedSchema, TestCopyFieldCollectionResource, TestJsonFacets, TestRandomRequestDistribution, TestNoOpRegenerator, DocumentBuilderTest, AnalyticsQueryTest, TestWordDelimiterFilterFactory, ReplicationFactorTest, TestDownShardTolerantSearch, TestSurroundQueryParser, MBeansHandlerTest, SimpleMLTQParserTest, TestManagedSchemaFieldResource, SharedFSAutoReplicaFailoverTest, SolrInfoMBeanTest, DistanceUnitsTest, TestSolrCloudWithKerberosAlt, DeleteStatusTest, IndexBasedSpellCheckerTest, TestSolrQueryParserResource, TestRequestForwarding, CollectionTooManyReplicasTest, DistanceFunctionTest, SpellCheckCollatorTest, TestCoreContainer, SparseHLLTest, SimplePostToolTest, SolrCmdDistributorTest, TestSolrDeletionPolicy2, TermVectorComponentTest, LeaderInitiatedRecoveryOnCommitTest, ShardRoutingTest, TestScoreJoinQPScore, ConjunctionSolrSpellCheckerTest, DistributedExpandComponentTest, SoftAutoCommitTest, ZkControllerTest, SolrIndexSplitterTest, DistributedQueryComponentCustomSortTest, TestSolrCoreProperties, SolrCloudExampleTest, TestHashPartitioner, DirectSolrSpellCheckerTest, DistributedIntervalFacetingTest, OverseerCollectionConfigSetProcessorTest, FastVectorHighlighterTest, MoreLikeThisHandlerTest, CollectionsAPIDistributedZkTest, HdfsRestartWhileUpdatingTest, RequestLoggingTest, TestUpdate, LoggingHandlerTest, OpenCloseCoreStressTest, TestDFRSimilarityFactory, PKIAuthenticationIntegrationTest, WordBreakSolrSpellCheckerTest, TestExactStatsCache, TestSmileRequest, TestCollectionAPI, AsyncMigrateRouteKeyTest, DistributedFacetPivotSmallAdvancedTest, TestNonDefinedSimilarityFactory, ZkSolrClientTest, NotRequiredUniqueKeyTest, ChaosMonkeySafeLeaderTest, TestSortByMinMaxFunction, ShardRoutingCustomTest, DistribJoinFromCollectionTest, TestPartialUpdateDeduplication, ForceLeaderTest, TestLMJelinekMercerSimilarityFactory, TestConfigSetsAPIZkFailure, CSVRequestHandlerTest, TestCustomSort, TestDocumentBuilder, DeleteLastCustomShardedReplicaTest, DateRangeFieldTest, SuggesterFSTTest, TestRawResponseWriter, FileUtilsTest, TestInitQParser, TestSimpleTrackingShardHandler, BigEndianAscendingWordSerializerTest, SpellCheckComponentTest, TestCursorMarkWithoutUniqueKey, HdfsChaosMonkeyNothingIsSafeTest, TestSystemIdResolver, BasicZkTest, RecoveryZkTest, ClusterStateUpdateTest, TestRandomFaceting, ZkCLITest, AutoCommitTest, TestDistributedGrouping, TestRecovery, TermVectorComponentDistributedTest, TestStressReorder, TestReload, TestStressVersions, DistributedTermsComponentTest, TestRangeQuery, SimpleFacetsTest, SolrCoreTest, TestGroupingSearch, QueryElevationComponentTest, PeerSyncTest, ConvertedLegacyTest, TestFiltering, BasicFunctionalityTest, TestLazyCores, TestIndexSearcher, ShowFileRequestHandlerTest, DistributedQueryElevationComponentTest, TestFoldingMultitermQuery, SuggesterTest, TestTrie, SpatialFilterTest, TestCSVLoader, PolyFieldTest, SchemaVersionSpecificBehaviorTest, TestPseudoReturnFields, FieldMutatingUpdateProcessorTest, TestAtomicUpdateErrorCases, DefaultValueUpdateProcessorTest, StatelessScriptUpdateProcessorFactoryTest, SortByFunctionTest, TestRemoteStreaming, TestSolrDeletionPolicy1, CacheHeaderTest, LukeRequestHandlerTest, TestQueryUtils, StandardRequestHandlerTest, TestWriterPerf, TestQueryTypes, TermsComponentTest, RequestHandlersTest, TestValueSourceCache, TestIndexingPerformance, RequiredFieldsTest, FieldAnalysisRequestHandlerTest, TestSolrQueryParser, TestArbitraryIndexDir, SolrPluginUtilsTest, TestJmxIntegration, UpdateRequestProcessorFactoryTest, TestCSVResponseWriter, UniqFieldsUpdateProcessorFactoryTest, PingRequestHandlerTest, TestQuerySenderListener, UpdateParamsTest, TestQuerySenderNoQuery, CopyFieldTest, SolrIndexConfigTest, TestStressRecovery, ResourceLoaderTest, OpenExchangeRatesOrgProviderTest, TestFastLRUCache, ChaosMonkeyNothingIsSafeTest, AssignTest, AsyncCallRequestStatusResponseTest, CleanupOldIndexTest, CollectionReloadTest, DistribCursorPagingTest, OutOfBoxZkACLAndCredentialsProvidersTest, OverseerRolesTest, OverseerTaskQueueTest, SSLMigrationTest, TestCloudDeleteByQuery, TestCloudInspectUtil, TestCloudPivotFacet, TestMiniSolrCloudClusterSSL, TestOnReconnectListenerSupport, VMParamsZkACLAndCredentialsProvidersTest, HdfsBasicDistributedZk2Test, HdfsChaosMonkeySafeLeaderTest, HdfsNNFailoverTest, CachingDirectoryFactoryTest, DirectoryFactoryTest, ExitableDirectoryReaderTest, HdfsDirectoryFactoryTest, TestImplicitCoreProperties, TestInitParams, TestNRTOpen, TestSolrConfigHandler, TestBlobHandler, TestReplicationHandlerBackup, TestSolrConfigHandlerCloud]
   [junit4]   2> NOTE: reproduce with: ant test  -Dtestcase=TestSolrConfigHandlerCloud -Dtests.seed=866252D1F5D4895A -Dtests.multiplier=2 -Dtests.slow=true -Dtests.locale=es -Dtests.timezone=Africa/Accra -Dtests.asserts=true -Dtests.file.encoding=US-ASCII
   [junit4] ERROR   0.00s J1 | TestSolrConfigHandlerCloud (suite) <<<
   [junit4]    > Throwable #1: com.carrotsearch.randomizedtesting.ThreadLeakError: 3 threads leaked from SUITE scope at org.apache.solr.handler.TestSolrConfigHandlerCloud: 
   [junit4]    >    1) Thread[id=14171, name=Thread-5460, state=TIMED_WAITING, group=TGRP-TestSolrConfigHandlerCloud]
   [junit4]    >         at java.lang.Thread.sleep(Native Method)
   [junit4]    >         at org.apache.solr.cloud.ZkSolrResourceLoader.openResource(ZkSolrResourceLoader.java:101)
   [junit4]    >         at org.apache.solr.core.SolrResourceLoader.openSchema(SolrResourceLoader.java:355)
   [junit4]    >         at org.apache.solr.schema.IndexSchemaFactory.create(IndexSchemaFactory.java:48)
   [junit4]    >         at org.apache.solr.schema.IndexSchemaFactory.buildIndexSchema(IndexSchemaFactory.java:70)
   [junit4]    >         at org.apache.solr.core.ConfigSetService.createIndexSchema(ConfigSetService.java:108)
   [junit4]    >         at org.apache.solr.core.ConfigSetService.getConfig(ConfigSetService.java:79)
   [junit4]    >         at org.apache.solr.core.CoreContainer.reload(CoreContainer.java:915)
   [junit4]    >         at org.apache.solr.core.SolrCore$11.run(SolrCore.java:2603)
   [junit4]    >         at org.apache.solr.cloud.ZkController$5.run(ZkController.java:2479)
   [junit4]    >    2) Thread[id=13761, name=Thread-5403, state=TIMED_WAITING, group=TGRP-TestSolrConfigHandlerCloud]
   [junit4]    >         at java.lang.Thread.sleep(Native Method)
   [junit4]    >         at org.apache.solr.cloud.ZkSolrResourceLoader.openResource(ZkSolrResourceLoader.java:101)
   [junit4]    >         at org.apache.solr.core.SolrResourceLoader.openSchema(SolrResourceLoader.java:355)
   [junit4]    >         at org.apache.solr.schema.IndexSchemaFactory.create(IndexSchemaFactory.java:48)
   [junit4]    >         at org.apache.solr.schema.IndexSchemaFactory.buildIndexSchema(IndexSchemaFactory.java:70)
   [junit4]    >         at org.apache.solr.core.ConfigSetService.createIndexSchema(ConfigSetService.java:108)
   [junit4]    >         at org.apache.solr.core.ConfigSetService.getConfig(ConfigSetService.java:79)
   [junit4]    >         at org.apache.solr.core.CoreContainer.reload(CoreContainer.java:915)
   [junit4]    >         at org.apache.solr.core.SolrCore$11.run(SolrCore.java:2603)
   [junit4]    >         at org.apache.solr.cloud.ZkController$5.run(ZkController.java:2479)
   [junit4]    >    3) Thread[id=14567, name=Thread-5505, state=TIMED_WAITING, group=TGRP-TestSolrConfigHandlerCloud]
   [junit4]    >         at java.lang.Thread.sleep(Native Method)
   [junit4]    >         at org.apache.solr.cloud.ZkSolrResourceLoader.openResource(ZkSolrResourceLoader.java:101)
   [junit4]    >         at org.apache.solr.core.SolrResourceLoader.openSchema(SolrResourceLoader.java:355)
   [junit4]    >         at org.apache.solr.schema.IndexSchemaFactory.create(IndexSchemaFactory.java:48)
   [junit4]    >         at org.apache.solr.schema.IndexSchemaFactory.buildIndexSchema(IndexSchemaFactory.java:70)
   [junit4]    >         at org.apache.solr.core.ConfigSetService.createIndexSchema(ConfigSetService.java:108)
   [junit4]    >         at org.apache.solr.core.ConfigSetService.getConfig(ConfigSetService.java:79)
   [junit4]    >         at org.apache.solr.core.CoreContainer.reload(CoreContainer.java:915)
   [junit4]    >         at org.apache.solr.core.SolrCore$11.run(SolrCore.java:2603)
   [junit4]    >         at org.apache.solr.cloud.ZkController$5.run(ZkController.java:2479)
   [junit4]    > 	at __randomizedtesting.SeedInfo.seed([866252D1F5D4895A]:0)
   [junit4] Completed [504/572 (1!)] on J1 in 67.72s, 1 test, 1 error <<< FAILURES!

[...truncated 229 lines...]
BUILD FAILED
/x1/jenkins/jenkins-slave/workspace/Lucene-Solr-Tests-5.5-Java7/build.xml:750: The following error occurred while executing this line:
/x1/jenkins/jenkins-slave/workspace/Lucene-Solr-Tests-5.5-Java7/build.xml:694: The following error occurred while executing this line:
/x1/jenkins/jenkins-slave/workspace/Lucene-Solr-Tests-5.5-Java7/build.xml:59: The following error occurred while executing this line:
/x1/jenkins/jenkins-slave/workspace/Lucene-Solr-Tests-5.5-Java7/solr/build.xml:233: The following error occurred while executing this line:
/x1/jenkins/jenkins-slave/workspace/Lucene-Solr-Tests-5.5-Java7/solr/common-build.xml:534: The following error occurred while executing this line:
/x1/jenkins/jenkins-slave/workspace/Lucene-Solr-Tests-5.5-Java7/lucene/common-build.xml:1477: The following error occurred while executing this line:
/x1/jenkins/jenkins-slave/workspace/Lucene-Solr-Tests-5.5-Java7/lucene/common-build.xml:1033: There were test failures: 572 suites (7 ignored), 2293 tests, 1 suite-level error, 55 ignored (39 assumptions) [seed: 866252D1F5D4895A]

Total time: 56 minutes 49 seconds
Build step 'Invoke Ant' marked build as failure
Archiving artifacts
Recording test results
Email was triggered for: Failure - Any
Sending email for trigger: Failure - Any




Mime
View raw message