lucene-dev mailing list archives

Site index · List index
Message view « Date » · « Thread »
Top « Date » · « Thread »
From Policeman Jenkins Server <jenk...@thetaphi.de>
Subject [JENKINS] Lucene-Solr-master-Solaris (64bit/jdk1.8.0) - Build # 604 - Failure!
Date Wed, 25 May 2016 22:26:42 GMT
Build: http://jenkins.thetaphi.de/job/Lucene-Solr-master-Solaris/604/
Java: 64bit/jdk1.8.0 -XX:+UseCompressedOops -XX:+UseParallelGC

2 tests failed.
FAILED:  org.apache.solr.core.TestArbitraryIndexDir.testLoadNewIndexDir

Error Message:
Exception during query

Stack Trace:
java.lang.RuntimeException: Exception during query
	at __randomizedtesting.SeedInfo.seed([67B4CF6A6ADDF8CE:8EEE7452F4446866]:0)
	at org.apache.solr.SolrTestCaseJ4.assertQ(SolrTestCaseJ4.java:785)
	at org.apache.solr.core.TestArbitraryIndexDir.testLoadNewIndexDir(TestArbitraryIndexDir.java:107)
	at sun.reflect.NativeMethodAccessorImpl.invoke0(Native Method)
	at sun.reflect.NativeMethodAccessorImpl.invoke(NativeMethodAccessorImpl.java:62)
	at sun.reflect.DelegatingMethodAccessorImpl.invoke(DelegatingMethodAccessorImpl.java:43)
	at java.lang.reflect.Method.invoke(Method.java:498)
	at com.carrotsearch.randomizedtesting.RandomizedRunner.invoke(RandomizedRunner.java:1764)
	at com.carrotsearch.randomizedtesting.RandomizedRunner$8.evaluate(RandomizedRunner.java:871)
	at com.carrotsearch.randomizedtesting.RandomizedRunner$9.evaluate(RandomizedRunner.java:907)
	at com.carrotsearch.randomizedtesting.RandomizedRunner$10.evaluate(RandomizedRunner.java:921)
	at com.carrotsearch.randomizedtesting.rules.SystemPropertiesRestoreRule$1.evaluate(SystemPropertiesRestoreRule.java:57)
	at com.carrotsearch.randomizedtesting.rules.SystemPropertiesRestoreRule$1.evaluate(SystemPropertiesRestoreRule.java:57)
	at org.apache.lucene.util.TestRuleSetupTeardownChained$1.evaluate(TestRuleSetupTeardownChained.java:49)
	at org.apache.lucene.util.AbstractBeforeAfterRule$1.evaluate(AbstractBeforeAfterRule.java:45)
	at org.apache.lucene.util.TestRuleThreadAndTestName$1.evaluate(TestRuleThreadAndTestName.java:48)
	at org.apache.lucene.util.TestRuleIgnoreAfterMaxFailures$1.evaluate(TestRuleIgnoreAfterMaxFailures.java:64)
	at org.apache.lucene.util.TestRuleMarkFailure$1.evaluate(TestRuleMarkFailure.java:47)
	at com.carrotsearch.randomizedtesting.rules.StatementAdapter.evaluate(StatementAdapter.java:36)
	at com.carrotsearch.randomizedtesting.ThreadLeakControl$StatementRunner.run(ThreadLeakControl.java:367)
	at com.carrotsearch.randomizedtesting.ThreadLeakControl.forkTimeoutingTask(ThreadLeakControl.java:809)
	at com.carrotsearch.randomizedtesting.ThreadLeakControl$3.evaluate(ThreadLeakControl.java:460)
	at com.carrotsearch.randomizedtesting.RandomizedRunner.runSingleTest(RandomizedRunner.java:880)
	at com.carrotsearch.randomizedtesting.RandomizedRunner$5.evaluate(RandomizedRunner.java:781)
	at com.carrotsearch.randomizedtesting.RandomizedRunner$6.evaluate(RandomizedRunner.java:816)
	at com.carrotsearch.randomizedtesting.RandomizedRunner$7.evaluate(RandomizedRunner.java:827)
	at com.carrotsearch.randomizedtesting.rules.StatementAdapter.evaluate(StatementAdapter.java:36)
	at com.carrotsearch.randomizedtesting.rules.SystemPropertiesRestoreRule$1.evaluate(SystemPropertiesRestoreRule.java:57)
	at org.apache.lucene.util.AbstractBeforeAfterRule$1.evaluate(AbstractBeforeAfterRule.java:45)
	at com.carrotsearch.randomizedtesting.rules.StatementAdapter.evaluate(StatementAdapter.java:36)
	at org.apache.lucene.util.TestRuleStoreClassName$1.evaluate(TestRuleStoreClassName.java:41)
	at com.carrotsearch.randomizedtesting.rules.NoShadowingOrOverridesOnMethodsRule$1.evaluate(NoShadowingOrOverridesOnMethodsRule.java:40)
	at com.carrotsearch.randomizedtesting.rules.NoShadowingOrOverridesOnMethodsRule$1.evaluate(NoShadowingOrOverridesOnMethodsRule.java:40)
	at com.carrotsearch.randomizedtesting.rules.StatementAdapter.evaluate(StatementAdapter.java:36)
	at com.carrotsearch.randomizedtesting.rules.StatementAdapter.evaluate(StatementAdapter.java:36)
	at com.carrotsearch.randomizedtesting.rules.StatementAdapter.evaluate(StatementAdapter.java:36)
	at org.apache.lucene.util.TestRuleAssertionsRequired$1.evaluate(TestRuleAssertionsRequired.java:53)
	at org.apache.lucene.util.TestRuleMarkFailure$1.evaluate(TestRuleMarkFailure.java:47)
	at org.apache.lucene.util.TestRuleIgnoreAfterMaxFailures$1.evaluate(TestRuleIgnoreAfterMaxFailures.java:64)
	at org.apache.lucene.util.TestRuleIgnoreTestSuites$1.evaluate(TestRuleIgnoreTestSuites.java:54)
	at com.carrotsearch.randomizedtesting.rules.StatementAdapter.evaluate(StatementAdapter.java:36)
	at com.carrotsearch.randomizedtesting.ThreadLeakControl$StatementRunner.run(ThreadLeakControl.java:367)
	at java.lang.Thread.run(Thread.java:745)
Caused by: java.lang.RuntimeException: REQUEST FAILED: xpath=*[count(//doc)=1]
	xml response was: <?xml version="1.0" encoding="UTF-8"?>
<response>
<lst name="responseHeader"><int name="status">0</int><int name="QTime">0</int></lst><result name="response" numFound="0" start="0"></result>
</response>

	request was:q=id:2&qt=standard&start=0&rows=20&version=2.2
	at org.apache.solr.SolrTestCaseJ4.assertQ(SolrTestCaseJ4.java:778)
	... 41 more


FAILED:  org.apache.solr.schema.TestManagedSchemaAPI.test

Error Message:
Error from server at http://127.0.0.1:46487/solr/testschemaapi_shard1_replica2: ERROR: [doc=2] unknown field 'myNewField1'

Stack Trace:
org.apache.solr.client.solrj.impl.CloudSolrClient$RouteException: Error from server at http://127.0.0.1:46487/solr/testschemaapi_shard1_replica2: ERROR: [doc=2] unknown field 'myNewField1'
	at __randomizedtesting.SeedInfo.seed([67B4CF6A6ADDF8CE:EFE0F0B0C4219536]:0)
	at org.apache.solr.client.solrj.impl.CloudSolrClient.directUpdate(CloudSolrClient.java:697)
	at org.apache.solr.client.solrj.impl.CloudSolrClient.sendRequest(CloudSolrClient.java:1109)
	at org.apache.solr.client.solrj.impl.CloudSolrClient.requestWithRetryOnStaleState(CloudSolrClient.java:998)
	at org.apache.solr.client.solrj.impl.CloudSolrClient.request(CloudSolrClient.java:934)
	at org.apache.solr.schema.TestManagedSchemaAPI.testAddFieldAndDocument(TestManagedSchemaAPI.java:86)
	at org.apache.solr.schema.TestManagedSchemaAPI.test(TestManagedSchemaAPI.java:55)
	at sun.reflect.NativeMethodAccessorImpl.invoke0(Native Method)
	at sun.reflect.NativeMethodAccessorImpl.invoke(NativeMethodAccessorImpl.java:62)
	at sun.reflect.DelegatingMethodAccessorImpl.invoke(DelegatingMethodAccessorImpl.java:43)
	at java.lang.reflect.Method.invoke(Method.java:498)
	at com.carrotsearch.randomizedtesting.RandomizedRunner.invoke(RandomizedRunner.java:1764)
	at com.carrotsearch.randomizedtesting.RandomizedRunner$8.evaluate(RandomizedRunner.java:871)
	at com.carrotsearch.randomizedtesting.RandomizedRunner$9.evaluate(RandomizedRunner.java:907)
	at com.carrotsearch.randomizedtesting.RandomizedRunner$10.evaluate(RandomizedRunner.java:921)
	at com.carrotsearch.randomizedtesting.rules.SystemPropertiesRestoreRule$1.evaluate(SystemPropertiesRestoreRule.java:57)
	at org.apache.lucene.util.TestRuleSetupTeardownChained$1.evaluate(TestRuleSetupTeardownChained.java:49)
	at org.apache.lucene.util.AbstractBeforeAfterRule$1.evaluate(AbstractBeforeAfterRule.java:45)
	at org.apache.lucene.util.TestRuleThreadAndTestName$1.evaluate(TestRuleThreadAndTestName.java:48)
	at org.apache.lucene.util.TestRuleIgnoreAfterMaxFailures$1.evaluate(TestRuleIgnoreAfterMaxFailures.java:64)
	at org.apache.lucene.util.TestRuleMarkFailure$1.evaluate(TestRuleMarkFailure.java:47)
	at com.carrotsearch.randomizedtesting.rules.StatementAdapter.evaluate(StatementAdapter.java:36)
	at com.carrotsearch.randomizedtesting.ThreadLeakControl$StatementRunner.run(ThreadLeakControl.java:367)
	at com.carrotsearch.randomizedtesting.ThreadLeakControl.forkTimeoutingTask(ThreadLeakControl.java:809)
	at com.carrotsearch.randomizedtesting.ThreadLeakControl$3.evaluate(ThreadLeakControl.java:460)
	at com.carrotsearch.randomizedtesting.RandomizedRunner.runSingleTest(RandomizedRunner.java:880)
	at com.carrotsearch.randomizedtesting.RandomizedRunner$5.evaluate(RandomizedRunner.java:781)
	at com.carrotsearch.randomizedtesting.RandomizedRunner$6.evaluate(RandomizedRunner.java:816)
	at com.carrotsearch.randomizedtesting.RandomizedRunner$7.evaluate(RandomizedRunner.java:827)
	at com.carrotsearch.randomizedtesting.rules.StatementAdapter.evaluate(StatementAdapter.java:36)
	at com.carrotsearch.randomizedtesting.rules.SystemPropertiesRestoreRule$1.evaluate(SystemPropertiesRestoreRule.java:57)
	at org.apache.lucene.util.AbstractBeforeAfterRule$1.evaluate(AbstractBeforeAfterRule.java:45)
	at com.carrotsearch.randomizedtesting.rules.StatementAdapter.evaluate(StatementAdapter.java:36)
	at org.apache.lucene.util.TestRuleStoreClassName$1.evaluate(TestRuleStoreClassName.java:41)
	at com.carrotsearch.randomizedtesting.rules.NoShadowingOrOverridesOnMethodsRule$1.evaluate(NoShadowingOrOverridesOnMethodsRule.java:40)
	at com.carrotsearch.randomizedtesting.rules.NoShadowingOrOverridesOnMethodsRule$1.evaluate(NoShadowingOrOverridesOnMethodsRule.java:40)
	at com.carrotsearch.randomizedtesting.rules.StatementAdapter.evaluate(StatementAdapter.java:36)
	at com.carrotsearch.randomizedtesting.rules.StatementAdapter.evaluate(StatementAdapter.java:36)
	at com.carrotsearch.randomizedtesting.rules.StatementAdapter.evaluate(StatementAdapter.java:36)
	at org.apache.lucene.util.TestRuleAssertionsRequired$1.evaluate(TestRuleAssertionsRequired.java:53)
	at org.apache.lucene.util.TestRuleMarkFailure$1.evaluate(TestRuleMarkFailure.java:47)
	at org.apache.lucene.util.TestRuleIgnoreAfterMaxFailures$1.evaluate(TestRuleIgnoreAfterMaxFailures.java:64)
	at org.apache.lucene.util.TestRuleIgnoreTestSuites$1.evaluate(TestRuleIgnoreTestSuites.java:54)
	at com.carrotsearch.randomizedtesting.rules.StatementAdapter.evaluate(StatementAdapter.java:36)
	at com.carrotsearch.randomizedtesting.ThreadLeakControl$StatementRunner.run(ThreadLeakControl.java:367)
	at java.lang.Thread.run(Thread.java:745)
Caused by: org.apache.solr.client.solrj.impl.HttpSolrClient$RemoteSolrException: Error from server at http://127.0.0.1:46487/solr/testschemaapi_shard1_replica2: ERROR: [doc=2] unknown field 'myNewField1'
	at org.apache.solr.client.solrj.impl.HttpSolrClient.executeMethod(HttpSolrClient.java:606)
	at org.apache.solr.client.solrj.impl.HttpSolrClient.request(HttpSolrClient.java:259)
	at org.apache.solr.client.solrj.impl.HttpSolrClient.request(HttpSolrClient.java:248)
	at org.apache.solr.client.solrj.impl.LBHttpSolrClient.doRequest(LBHttpSolrClient.java:413)
	at org.apache.solr.client.solrj.impl.LBHttpSolrClient.request(LBHttpSolrClient.java:366)
	at org.apache.solr.client.solrj.impl.CloudSolrClient.lambda$directUpdate$0(CloudSolrClient.java:674)
	at java.util.concurrent.FutureTask.run(FutureTask.java:266)
	at org.apache.solr.common.util.ExecutorUtil$MDCAwareThreadPoolExecutor.lambda$execute$0(ExecutorUtil.java:229)
	at java.util.concurrent.ThreadPoolExecutor.runWorker(ThreadPoolExecutor.java:1142)
	at java.util.concurrent.ThreadPoolExecutor$Worker.run(ThreadPoolExecutor.java:617)
	... 1 more




Build Log:
[...truncated 10689 lines...]
   [junit4] Suite: org.apache.solr.schema.TestManagedSchemaAPI
   [junit4]   2> Creating dataDir: /export/home/jenkins/workspace/Lucene-Solr-master-Solaris/solr/build/solr-core/test/J1/temp/solr.schema.TestManagedSchemaAPI_67B4CF6A6ADDF8CE-001/init-core-data-001
   [junit4]   2> 380730 INFO  (SUITE-TestManagedSchemaAPI-seed#[67B4CF6A6ADDF8CE]-worker) [    ] o.a.s.SolrTestCaseJ4 Randomized ssl (false) and clientAuth (false)
   [junit4]   2> 380735 INFO  (SUITE-TestManagedSchemaAPI-seed#[67B4CF6A6ADDF8CE]-worker) [    ] o.a.s.c.ZkTestServer STARTING ZK TEST SERVER
   [junit4]   2> 380735 INFO  (Thread-1416) [    ] o.a.s.c.ZkTestServer client port:0.0.0.0/0.0.0.0:0
   [junit4]   2> 380735 INFO  (Thread-1416) [    ] o.a.s.c.ZkTestServer Starting server
   [junit4]   2> 380835 INFO  (SUITE-TestManagedSchemaAPI-seed#[67B4CF6A6ADDF8CE]-worker) [    ] o.a.s.c.ZkTestServer start zk server on port:35237
   [junit4]   2> 380835 INFO  (SUITE-TestManagedSchemaAPI-seed#[67B4CF6A6ADDF8CE]-worker) [    ] o.a.s.c.c.SolrZkClient Using default ZkCredentialsProvider
   [junit4]   2> 380836 INFO  (SUITE-TestManagedSchemaAPI-seed#[67B4CF6A6ADDF8CE]-worker) [    ] o.a.s.c.c.ConnectionManager Waiting for client to connect to ZooKeeper
   [junit4]   2> 380851 INFO  (zkCallback-531-thread-1) [    ] o.a.s.c.c.ConnectionManager Watcher org.apache.solr.common.cloud.ConnectionManager@c4d1fe name:ZooKeeperConnection Watcher:127.0.0.1:35237 got event WatchedEvent state:SyncConnected type:None path:null path:null type:None
   [junit4]   2> 380851 INFO  (SUITE-TestManagedSchemaAPI-seed#[67B4CF6A6ADDF8CE]-worker) [    ] o.a.s.c.c.ConnectionManager Client is connected to ZooKeeper
   [junit4]   2> 380851 INFO  (SUITE-TestManagedSchemaAPI-seed#[67B4CF6A6ADDF8CE]-worker) [    ] o.a.s.c.c.SolrZkClient Using default ZkACLProvider
   [junit4]   2> 380851 INFO  (SUITE-TestManagedSchemaAPI-seed#[67B4CF6A6ADDF8CE]-worker) [    ] o.a.s.c.c.SolrZkClient makePath: /solr/solr.xml
   [junit4]   2> 380858 INFO  (jetty-launcher-530-thread-1) [    ] o.e.j.s.Server jetty-9.3.8.v20160314
   [junit4]   2> 380860 INFO  (jetty-launcher-530-thread-1) [    ] o.e.j.s.h.ContextHandler Started o.e.j.s.ServletContextHandler@b17647e{/solr,null,AVAILABLE}
   [junit4]   2> 380861 INFO  (jetty-launcher-530-thread-1) [    ] o.e.j.s.ServerConnector Started ServerConnector@70065788{HTTP/1.1,[http/1.1]}{127.0.0.1:64176}
   [junit4]   2> 380862 INFO  (jetty-launcher-530-thread-1) [    ] o.e.j.s.Server Started @383649ms
   [junit4]   2> 380862 INFO  (jetty-launcher-530-thread-1) [    ] o.a.s.c.s.e.JettySolrRunner Jetty properties: {hostContext=/solr, hostPort=64176}
   [junit4]   2> 380862 INFO  (jetty-launcher-530-thread-1) [    ] o.a.s.s.SolrDispatchFilter SolrDispatchFilter.init(): sun.misc.Launcher$AppClassLoader@6d06d69c
   [junit4]   2> 380862 INFO  (jetty-launcher-530-thread-1) [    ] o.a.s.c.SolrResourceLoader new SolrResourceLoader for directory: '/export/home/jenkins/workspace/Lucene-Solr-master-Solaris/solr/build/solr-core/test/J1/temp/solr.schema.TestManagedSchemaAPI_67B4CF6A6ADDF8CE-001/tempDir-001/node1'
   [junit4]   2> 380862 INFO  (jetty-launcher-530-thread-1) [    ] o.a.s.c.SolrResourceLoader JNDI not configured for solr (NoInitialContextEx)
   [junit4]   2> 380862 INFO  (jetty-launcher-530-thread-1) [    ] o.a.s.c.SolrResourceLoader solr home defaulted to 'solr/' (could not find system property or JNDI)
   [junit4]   2> 380862 INFO  (jetty-launcher-530-thread-1) [    ] o.a.s.c.c.SolrZkClient Using default ZkCredentialsProvider
   [junit4]   2> 380863 INFO  (jetty-launcher-530-thread-1) [    ] o.a.s.c.c.ConnectionManager Waiting for client to connect to ZooKeeper
   [junit4]   2> 380864 INFO  (jetty-launcher-530-thread-2) [    ] o.e.j.s.Server jetty-9.3.8.v20160314
   [junit4]   2> 380866 INFO  (jetty-launcher-530-thread-2) [    ] o.e.j.s.h.ContextHandler Started o.e.j.s.ServletContextHandler@7c3adec{/solr,null,AVAILABLE}
   [junit4]   2> 380867 INFO  (jetty-launcher-530-thread-2) [    ] o.e.j.s.ServerConnector Started ServerConnector@4c0e124c{HTTP/1.1,[http/1.1]}{127.0.0.1:46487}
   [junit4]   2> 380867 INFO  (jetty-launcher-530-thread-2) [    ] o.e.j.s.Server Started @383654ms
   [junit4]   2> 380867 INFO  (jetty-launcher-530-thread-2) [    ] o.a.s.c.s.e.JettySolrRunner Jetty properties: {hostContext=/solr, hostPort=46487}
   [junit4]   2> 380868 INFO  (jetty-launcher-530-thread-2) [    ] o.a.s.s.SolrDispatchFilter SolrDispatchFilter.init(): sun.misc.Launcher$AppClassLoader@6d06d69c
   [junit4]   2> 380868 INFO  (jetty-launcher-530-thread-2) [    ] o.a.s.c.SolrResourceLoader new SolrResourceLoader for directory: '/export/home/jenkins/workspace/Lucene-Solr-master-Solaris/solr/build/solr-core/test/J1/temp/solr.schema.TestManagedSchemaAPI_67B4CF6A6ADDF8CE-001/tempDir-001/node2'
   [junit4]   2> 380868 INFO  (jetty-launcher-530-thread-2) [    ] o.a.s.c.SolrResourceLoader JNDI not configured for solr (NoInitialContextEx)
   [junit4]   2> 380868 INFO  (jetty-launcher-530-thread-2) [    ] o.a.s.c.SolrResourceLoader solr home defaulted to 'solr/' (could not find system property or JNDI)
   [junit4]   2> 380868 INFO  (jetty-launcher-530-thread-2) [    ] o.a.s.c.c.SolrZkClient Using default ZkCredentialsProvider
   [junit4]   2> 380868 INFO  (jetty-launcher-530-thread-2) [    ] o.a.s.c.c.ConnectionManager Waiting for client to connect to ZooKeeper
   [junit4]   2> 380874 INFO  (zkCallback-533-thread-1) [    ] o.a.s.c.c.ConnectionManager Watcher org.apache.solr.common.cloud.ConnectionManager@3bb30343 name:ZooKeeperConnection Watcher:127.0.0.1:35237/solr got event WatchedEvent state:SyncConnected type:None path:null path:null type:None
   [junit4]   2> 380874 INFO  (jetty-launcher-530-thread-2) [    ] o.a.s.c.c.ConnectionManager Client is connected to ZooKeeper
   [junit4]   2> 380875 INFO  (jetty-launcher-530-thread-2) [    ] o.a.s.c.c.SolrZkClient Using default ZkACLProvider
   [junit4]   2> 380875 INFO  (jetty-launcher-530-thread-2) [    ] o.a.s.s.SolrDispatchFilter solr.xml found in ZooKeeper. Loading...
   [junit4]   2> 380879 INFO  (zkCallback-532-thread-1) [    ] o.a.s.c.c.ConnectionManager Watcher org.apache.solr.common.cloud.ConnectionManager@7f854879 name:ZooKeeperConnection Watcher:127.0.0.1:35237/solr got event WatchedEvent state:SyncConnected type:None path:null path:null type:None
   [junit4]   2> 380879 INFO  (jetty-launcher-530-thread-1) [    ] o.a.s.c.c.ConnectionManager Client is connected to ZooKeeper
   [junit4]   2> 380879 INFO  (jetty-launcher-530-thread-1) [    ] o.a.s.c.c.SolrZkClient Using default ZkACLProvider
   [junit4]   2> 380880 INFO  (jetty-launcher-530-thread-1) [    ] o.a.s.s.SolrDispatchFilter solr.xml found in ZooKeeper. Loading...
   [junit4]   2> 380923 INFO  (jetty-launcher-530-thread-1) [    ] o.a.s.c.CorePropertiesLocator Config-defined core root directory: /export/home/jenkins/workspace/Lucene-Solr-master-Solaris/solr/build/solr-core/test/J1/temp/solr.schema.TestManagedSchemaAPI_67B4CF6A6ADDF8CE-001/tempDir-001/node1/.
   [junit4]   2> 380923 INFO  (jetty-launcher-530-thread-1) [    ] o.a.s.c.CoreContainer New CoreContainer 1145097350
   [junit4]   2> 380923 INFO  (jetty-launcher-530-thread-1) [    ] o.a.s.c.CoreContainer Loading cores into CoreContainer [instanceDir=/export/home/jenkins/workspace/Lucene-Solr-master-Solaris/solr/build/solr-core/test/J1/temp/solr.schema.TestManagedSchemaAPI_67B4CF6A6ADDF8CE-001/tempDir-001/node1]
   [junit4]   2> 380923 WARN  (jetty-launcher-530-thread-1) [    ] o.a.s.c.CoreContainer Couldn't add files from /export/home/jenkins/workspace/Lucene-Solr-master-Solaris/solr/build/solr-core/test/J1/temp/solr.schema.TestManagedSchemaAPI_67B4CF6A6ADDF8CE-001/tempDir-001/node1/lib to classpath: /export/home/jenkins/workspace/Lucene-Solr-master-Solaris/solr/build/solr-core/test/J1/temp/solr.schema.TestManagedSchemaAPI_67B4CF6A6ADDF8CE-001/tempDir-001/node1/lib
   [junit4]   2> 380924 INFO  (jetty-launcher-530-thread-1) [    ] o.a.s.h.c.HttpShardHandlerFactory created with socketTimeout : 90000,urlScheme : ,connTimeout : 15000,maxConnectionsPerHost : 20,maxConnections : 10000,corePoolSize : 0,maximumPoolSize : 2147483647,maxThreadIdleTime : 5,sizeOfQueue : -1,fairnessPolicy : false,
   [junit4]   2> 380925 INFO  (jetty-launcher-530-thread-1) [    ] o.a.s.u.UpdateShardHandler Creating UpdateShardHandler HTTP client with params: 
   [junit4]   2> 380926 INFO  (jetty-launcher-530-thread-1) [    ] o.a.s.l.LogWatcher SLF4J impl is org.slf4j.impl.Log4jLoggerFactory
   [junit4]   2> 380926 INFO  (jetty-launcher-530-thread-1) [    ] o.a.s.l.LogWatcher Registering Log Listener [Log4j (org.slf4j.impl.Log4jLoggerFactory)]
   [junit4]   2> 380926 INFO  (jetty-launcher-530-thread-1) [    ] o.a.s.c.ZkContainer Zookeeper client=127.0.0.1:35237/solr
   [junit4]   2> 380926 INFO  (jetty-launcher-530-thread-1) [    ] o.a.s.c.ZkController zkHost includes chroot
   [junit4]   2> 380926 INFO  (jetty-launcher-530-thread-1) [    ] o.a.s.c.c.SolrZkClient Using default ZkCredentialsProvider
   [junit4]   2> 380927 INFO  (jetty-launcher-530-thread-1) [    ] o.a.s.c.c.ConnectionManager Waiting for client to connect to ZooKeeper
   [junit4]   2> 380931 INFO  (zkCallback-536-thread-1) [    ] o.a.s.c.c.ConnectionManager Watcher org.apache.solr.common.cloud.ConnectionManager@723fccc9 name:ZooKeeperConnection Watcher:127.0.0.1:35237 got event WatchedEvent state:SyncConnected type:None path:null path:null type:None
   [junit4]   2> 380931 INFO  (jetty-launcher-530-thread-2) [    ] o.a.s.c.CorePropertiesLocator Config-defined core root directory: /export/home/jenkins/workspace/Lucene-Solr-master-Solaris/solr/build/solr-core/test/J1/temp/solr.schema.TestManagedSchemaAPI_67B4CF6A6ADDF8CE-001/tempDir-001/node2/.
   [junit4]   2> 380931 INFO  (jetty-launcher-530-thread-2) [    ] o.a.s.c.CoreContainer New CoreContainer 1578444710
   [junit4]   2> 380931 INFO  (jetty-launcher-530-thread-2) [    ] o.a.s.c.CoreContainer Loading cores into CoreContainer [instanceDir=/export/home/jenkins/workspace/Lucene-Solr-master-Solaris/solr/build/solr-core/test/J1/temp/solr.schema.TestManagedSchemaAPI_67B4CF6A6ADDF8CE-001/tempDir-001/node2]
   [junit4]   2> 380931 WARN  (jetty-launcher-530-thread-2) [    ] o.a.s.c.CoreContainer Couldn't add files from /export/home/jenkins/workspace/Lucene-Solr-master-Solaris/solr/build/solr-core/test/J1/temp/solr.schema.TestManagedSchemaAPI_67B4CF6A6ADDF8CE-001/tempDir-001/node2/lib to classpath: /export/home/jenkins/workspace/Lucene-Solr-master-Solaris/solr/build/solr-core/test/J1/temp/solr.schema.TestManagedSchemaAPI_67B4CF6A6ADDF8CE-001/tempDir-001/node2/lib
   [junit4]   2> 380932 INFO  (jetty-launcher-530-thread-2) [    ] o.a.s.h.c.HttpShardHandlerFactory created with socketTimeout : 90000,urlScheme : ,connTimeout : 15000,maxConnectionsPerHost : 20,maxConnections : 10000,corePoolSize : 0,maximumPoolSize : 2147483647,maxThreadIdleTime : 5,sizeOfQueue : -1,fairnessPolicy : false,
   [junit4]   2> 380933 INFO  (jetty-launcher-530-thread-2) [    ] o.a.s.u.UpdateShardHandler Creating UpdateShardHandler HTTP client with params: 
   [junit4]   2> 380933 INFO  (jetty-launcher-530-thread-2) [    ] o.a.s.l.LogWatcher SLF4J impl is org.slf4j.impl.Log4jLoggerFactory
   [junit4]   2> 380933 INFO  (jetty-launcher-530-thread-2) [    ] o.a.s.l.LogWatcher Registering Log Listener [Log4j (org.slf4j.impl.Log4jLoggerFactory)]
   [junit4]   2> 380933 INFO  (jetty-launcher-530-thread-2) [    ] o.a.s.c.ZkContainer Zookeeper client=127.0.0.1:35237/solr
   [junit4]   2> 380933 INFO  (jetty-launcher-530-thread-2) [    ] o.a.s.c.ZkController zkHost includes chroot
   [junit4]   2> 380933 INFO  (jetty-launcher-530-thread-2) [    ] o.a.s.c.c.SolrZkClient Using default ZkCredentialsProvider
   [junit4]   2> 380934 INFO  (jetty-launcher-530-thread-2) [    ] o.a.s.c.c.ConnectionManager Waiting for client to connect to ZooKeeper
   [junit4]   2> 380934 INFO  (jetty-launcher-530-thread-1) [    ] o.a.s.c.c.ConnectionManager Client is connected to ZooKeeper
   [junit4]   2> 380934 INFO  (jetty-launcher-530-thread-1) [    ] o.a.s.c.c.SolrZkClient Using default ZkACLProvider
   [junit4]   2> 380936 INFO  (jetty-launcher-530-thread-1) [n:127.0.0.1:64176_solr    ] o.a.s.c.ZkController Added new OnReconnect listener org.apache.solr.cloud.ZkController$$Lambda$34/1863150499@121d76f1
   [junit4]   2> 380937 INFO  (jetty-launcher-530-thread-1) [n:127.0.0.1:64176_solr    ] o.a.s.c.c.ConnectionManager Waiting for client to connect to ZooKeeper
   [junit4]   2> 380943 INFO  (zkCallback-540-thread-1-processing-n:127.0.0.1:64176_solr) [n:127.0.0.1:64176_solr    ] o.a.s.c.c.ConnectionManager Watcher org.apache.solr.common.cloud.ConnectionManager@63a6fe26 name:ZooKeeperConnection Watcher:127.0.0.1:35237/solr got event WatchedEvent state:SyncConnected type:None path:null path:null type:None
   [junit4]   2> 380977 INFO  (jetty-launcher-530-thread-1) [n:127.0.0.1:64176_solr    ] o.a.s.c.c.ConnectionManager Client is connected to ZooKeeper
   [junit4]   2> 380997 INFO  (jetty-launcher-530-thread-1) [n:127.0.0.1:64176_solr    ] o.a.s.c.c.SolrZkClient makePath: /overseer/queue
   [junit4]   2> 380999 INFO  (jetty-launcher-530-thread-1) [n:127.0.0.1:64176_solr    ] o.a.s.c.c.SolrZkClient makePath: /overseer/collection-queue-work
   [junit4]   2> 381003 INFO  (jetty-launcher-530-thread-1) [n:127.0.0.1:64176_solr    ] o.a.s.c.c.SolrZkClient makePath: /overseer/collection-map-running
   [junit4]   2> 381006 INFO  (jetty-launcher-530-thread-1) [n:127.0.0.1:64176_solr    ] o.a.s.c.c.SolrZkClient makePath: /overseer/collection-map-completed
   [junit4]   2> 381008 INFO  (jetty-launcher-530-thread-1) [n:127.0.0.1:64176_solr    ] o.a.s.c.c.SolrZkClient makePath: /overseer/collection-map-failure
   [junit4]   2> 381011 INFO  (jetty-launcher-530-thread-1) [n:127.0.0.1:64176_solr    ] o.a.s.c.c.SolrZkClient makePath: /live_nodes
   [junit4]   2> 381013 INFO  (jetty-launcher-530-thread-1) [n:127.0.0.1:64176_solr    ] o.a.s.c.c.SolrZkClient makePath: /collections
   [junit4]   2> 381015 INFO  (jetty-launcher-530-thread-1) [n:127.0.0.1:64176_solr    ] o.a.s.c.c.SolrZkClient makePath: /aliases.json
   [junit4]   2> 381017 INFO  (jetty-launcher-530-thread-1) [n:127.0.0.1:64176_solr    ] o.a.s.c.c.SolrZkClient makePath: /clusterstate.json
   [junit4]   2> 381018 INFO  (jetty-launcher-530-thread-1) [n:127.0.0.1:64176_solr    ] o.a.s.c.c.SolrZkClient makePath: /security.json
   [junit4]   2> 381020 INFO  (jetty-launcher-530-thread-1) [n:127.0.0.1:64176_solr    ] o.a.s.c.c.ZkStateReader Updating cluster state from ZooKeeper... 
   [junit4]   2> 381023 INFO  (jetty-launcher-530-thread-1) [n:127.0.0.1:64176_solr    ] o.a.s.c.c.ZkStateReader Loaded empty cluster properties
   [junit4]   2> 381024 INFO  (jetty-launcher-530-thread-1) [n:127.0.0.1:64176_solr    ] o.a.s.c.c.ZkStateReader Updated live nodes from ZooKeeper... (0) -> (0)
   [junit4]   2> 381028 INFO  (jetty-launcher-530-thread-1) [n:127.0.0.1:64176_solr    ] o.a.s.c.c.SolrZkClient makePath: /overseer_elect
   [junit4]   2> 381030 INFO  (jetty-launcher-530-thread-1) [n:127.0.0.1:64176_solr    ] o.a.s.c.c.SolrZkClient makePath: /overseer_elect/election
   [junit4]   2> 381031 INFO  (zkCallback-539-thread-1) [    ] o.a.s.c.c.ConnectionManager Watcher org.apache.solr.common.cloud.ConnectionManager@26a93462 name:ZooKeeperConnection Watcher:127.0.0.1:35237 got event WatchedEvent state:SyncConnected type:None path:null path:null type:None
   [junit4]   2> 381031 INFO  (jetty-launcher-530-thread-2) [    ] o.a.s.c.c.ConnectionManager Client is connected to ZooKeeper
   [junit4]   2> 381032 INFO  (jetty-launcher-530-thread-2) [    ] o.a.s.c.c.SolrZkClient Using default ZkACLProvider
   [junit4]   2> 381034 INFO  (jetty-launcher-530-thread-2) [n:127.0.0.1:46487_solr    ] o.a.s.c.ZkController Added new OnReconnect listener org.apache.solr.cloud.ZkController$$Lambda$34/1863150499@1623d291
   [junit4]   2> 381035 INFO  (jetty-launcher-530-thread-2) [n:127.0.0.1:46487_solr    ] o.a.s.c.c.ConnectionManager Waiting for client to connect to ZooKeeper
   [junit4]   2> 381051 INFO  (zkCallback-542-thread-1-processing-n:127.0.0.1:46487_solr) [n:127.0.0.1:46487_solr    ] o.a.s.c.c.ConnectionManager Watcher org.apache.solr.common.cloud.ConnectionManager@64d1a5eb name:ZooKeeperConnection Watcher:127.0.0.1:35237/solr got event WatchedEvent state:SyncConnected type:None path:null path:null type:None
   [junit4]   2> 381051 INFO  (jetty-launcher-530-thread-2) [n:127.0.0.1:46487_solr    ] o.a.s.c.c.ConnectionManager Client is connected to ZooKeeper
   [junit4]   2> 381066 INFO  (jetty-launcher-530-thread-1) [n:127.0.0.1:64176_solr    ] o.a.s.c.Overseer Overseer (id=null) closing
   [junit4]   2> 381066 INFO  (jetty-launcher-530-thread-1) [n:127.0.0.1:64176_solr    ] o.a.s.c.LeaderElector Joined leadership election with path: /overseer_elect/election/95958571544674308-127.0.0.1:64176_solr-n_0000000000
   [junit4]   2> 381067 INFO  (jetty-launcher-530-thread-1) [n:127.0.0.1:64176_solr    ] o.a.s.c.OverseerElectionContext I am going to be the leader 127.0.0.1:64176_solr
   [junit4]   2> 381067 INFO  (jetty-launcher-530-thread-1) [n:127.0.0.1:64176_solr    ] o.a.s.c.c.SolrZkClient makePath: /overseer_elect/leader
   [junit4]   2> 381068 INFO  (jetty-launcher-530-thread-1) [n:127.0.0.1:64176_solr    ] o.a.s.c.Overseer Overseer (id=95958571544674308-127.0.0.1:64176_solr-n_0000000000) starting
   [junit4]   2> 381073 INFO  (jetty-launcher-530-thread-2) [n:127.0.0.1:46487_solr    ] o.a.s.c.c.ZkStateReader Updating cluster state from ZooKeeper... 
   [junit4]   2> 381074 INFO  (jetty-launcher-530-thread-1) [n:127.0.0.1:64176_solr    ] o.a.s.c.c.SolrZkClient makePath: /overseer/queue-work
   [junit4]   2> 381075 INFO  (jetty-launcher-530-thread-2) [n:127.0.0.1:46487_solr    ] o.a.s.c.c.ZkStateReader Loaded empty cluster properties
   [junit4]   2> 381081 INFO  (jetty-launcher-530-thread-2) [n:127.0.0.1:46487_solr    ] o.a.s.c.c.ZkStateReader Updated live nodes from ZooKeeper... (0) -> (0)
   [junit4]   2> 381085 INFO  (jetty-launcher-530-thread-1) [n:127.0.0.1:64176_solr    ] o.a.s.c.OverseerAutoReplicaFailoverThread Starting OverseerAutoReplicaFailoverThread autoReplicaFailoverWorkLoopDelay=10000 autoReplicaFailoverWaitAfterExpiration=30000 autoReplicaFailoverBadNodeExpiration=60000
   [junit4]   2> 381085 INFO  (OverseerCollectionConfigSetProcessor-95958571544674308-127.0.0.1:64176_solr-n_0000000000) [n:127.0.0.1:64176_solr    ] o.a.s.c.OverseerTaskProcessor Process current queue of overseer operations
   [junit4]   2> 381086 INFO  (jetty-launcher-530-thread-1) [n:127.0.0.1:64176_solr    ] o.a.s.c.ZkController Register node as live in ZooKeeper:/live_nodes/127.0.0.1:64176_solr
   [junit4]   2> 381087 INFO  (OverseerStateUpdate-95958571544674308-127.0.0.1:64176_solr-n_0000000000) [n:127.0.0.1:64176_solr    ] o.a.s.c.Overseer Starting to work on the main queue
   [junit4]   2> 381088 INFO  (jetty-launcher-530-thread-1) [n:127.0.0.1:64176_solr    ] o.a.s.c.c.SolrZkClient makePath: /live_nodes/127.0.0.1:64176_solr
   [junit4]   2> 381112 INFO  (zkCallback-540-thread-1-processing-n:127.0.0.1:64176_solr) [n:127.0.0.1:64176_solr    ] o.a.s.c.c.ZkStateReader A live node change: [WatchedEvent state:SyncConnected type:NodeChildrenChanged path:/live_nodes], has occurred - updating... (live nodes size: [0])
   [junit4]   2> 381116 INFO  (OverseerStateUpdate-95958571544674308-127.0.0.1:64176_solr-n_0000000000) [n:127.0.0.1:64176_solr    ] o.a.s.c.c.ZkStateReader Updated live nodes from ZooKeeper... (0) -> (1)
   [junit4]   2> 381117 INFO  (zkCallback-540-thread-1-processing-n:127.0.0.1:64176_solr) [n:127.0.0.1:64176_solr    ] o.a.s.c.c.ZkStateReader Updated live nodes from ZooKeeper... (1) -> (1)
   [junit4]   2> 381118 INFO  (zkCallback-542-thread-1-processing-n:127.0.0.1:46487_solr) [n:127.0.0.1:46487_solr    ] o.a.s.c.c.ZkStateReader A live node change: [WatchedEvent state:SyncConnected type:NodeChildrenChanged path:/live_nodes], has occurred - updating... (live nodes size: [0])
   [junit4]   2> 381124 INFO  (jetty-launcher-530-thread-2) [n:127.0.0.1:46487_solr    ] o.a.s.c.Overseer Overseer (id=null) closing
   [junit4]   2> 381184 INFO  (zkCallback-542-thread-1-processing-n:127.0.0.1:46487_solr) [n:127.0.0.1:46487_solr    ] o.a.s.c.c.ZkStateReader Updated live nodes from ZooKeeper... (0) -> (1)
   [junit4]   2> 381186 INFO  (jetty-launcher-530-thread-2) [n:127.0.0.1:46487_solr    ] o.a.s.c.LeaderElector Joined leadership election with path: /overseer_elect/election/95958571544674310-127.0.0.1:46487_solr-n_0000000001
   [junit4]   2> 381187 INFO  (jetty-launcher-530-thread-2) [n:127.0.0.1:46487_solr    ] o.a.s.c.LeaderElector Watching path /overseer_elect/election/95958571544674308-127.0.0.1:64176_solr-n_0000000000 to know if I could be the leader
   [junit4]   2> 381187 INFO  (jetty-launcher-530-thread-2) [n:127.0.0.1:46487_solr    ] o.a.s.c.ZkController Publish node=127.0.0.1:46487_solr as DOWN
   [junit4]   2> 381219 INFO  (OverseerStateUpdate-95958571544674308-127.0.0.1:64176_solr-n_0000000000) [n:127.0.0.1:64176_solr    ] o.a.s.c.Overseer processMessage: queueSize: 1, message = {
   [junit4]   2>   "operation":"downnode",
   [junit4]   2>   "node_name":"127.0.0.1:46487_solr"} current state version: 0
   [junit4]   2> 381219 INFO  (OverseerStateUpdate-95958571544674308-127.0.0.1:64176_solr-n_0000000000) [n:127.0.0.1:64176_solr    ] o.a.s.c.o.NodeMutator DownNode state invoked for node: 127.0.0.1:46487_solr
   [junit4]   2> 381224 INFO  (jetty-launcher-530-thread-1) [n:127.0.0.1:64176_solr    ] o.a.s.c.CoreContainer Security conf doesn't exist. Skipping setup for authorization module.
   [junit4]   2> 381224 INFO  (jetty-launcher-530-thread-1) [n:127.0.0.1:64176_solr    ] o.a.s.c.CoreContainer No authentication plugin used.
   [junit4]   2> 381225 INFO  (jetty-launcher-530-thread-1) [n:127.0.0.1:64176_solr    ] o.a.s.c.CorePropertiesLocator Looking for core definitions underneath /export/home/jenkins/workspace/Lucene-Solr-master-Solaris/solr/build/solr-core/test/J1/temp/solr.schema.TestManagedSchemaAPI_67B4CF6A6ADDF8CE-001/tempDir-001/node1/.
   [junit4]   2> 381225 INFO  (jetty-launcher-530-thread-1) [n:127.0.0.1:64176_solr    ] o.a.s.c.CorePropertiesLocator Found 0 core definitions
   [junit4]   2> 381226 INFO  (jetty-launcher-530-thread-1) [n:127.0.0.1:64176_solr    ] o.a.s.s.SolrDispatchFilter user.dir=/export/home/jenkins/workspace/Lucene-Solr-master-Solaris/solr/build/solr-core/test/J1
   [junit4]   2> 381226 INFO  (jetty-launcher-530-thread-1) [n:127.0.0.1:64176_solr    ] o.a.s.s.SolrDispatchFilter SolrDispatchFilter.init() done
   [junit4]   2> 382210 INFO  (jetty-launcher-530-thread-2) [n:127.0.0.1:46487_solr    ] o.a.s.c.ZkController Register node as live in ZooKeeper:/live_nodes/127.0.0.1:46487_solr
   [junit4]   2> 382210 INFO  (jetty-launcher-530-thread-2) [n:127.0.0.1:46487_solr    ] o.a.s.c.c.SolrZkClient makePath: /live_nodes/127.0.0.1:46487_solr
   [junit4]   2> 382212 INFO  (zkCallback-542-thread-1-processing-n:127.0.0.1:46487_solr) [n:127.0.0.1:46487_solr    ] o.a.s.c.c.ZkStateReader A live node change: [WatchedEvent state:SyncConnected type:NodeChildrenChanged path:/live_nodes], has occurred - updating... (live nodes size: [1])
   [junit4]   2> 382212 INFO  (zkCallback-540-thread-1-processing-n:127.0.0.1:64176_solr) [n:127.0.0.1:64176_solr    ] o.a.s.c.c.ZkStateReader A live node change: [WatchedEvent state:SyncConnected type:NodeChildrenChanged path:/live_nodes], has occurred - updating... (live nodes size: [1])
   [junit4]   2> 382212 INFO  (zkCallback-542-thread-1-processing-n:127.0.0.1:46487_solr) [n:127.0.0.1:46487_solr    ] o.a.s.c.c.ZkStateReader Updated live nodes from ZooKeeper... (1) -> (2)
   [junit4]   2> 382212 INFO  (zkCallback-540-thread-1-processing-n:127.0.0.1:64176_solr) [n:127.0.0.1:64176_solr    ] o.a.s.c.c.ZkStateReader Updated live nodes from ZooKeeper... (1) -> (2)
   [junit4]   2> 382229 INFO  (jetty-launcher-530-thread-2) [n:127.0.0.1:46487_solr    ] o.a.s.c.CoreContainer Security conf doesn't exist. Skipping setup for authorization module.
   [junit4]   2> 382229 INFO  (jetty-launcher-530-thread-2) [n:127.0.0.1:46487_solr    ] o.a.s.c.CoreContainer No authentication plugin used.
   [junit4]   2> 382230 INFO  (jetty-launcher-530-thread-2) [n:127.0.0.1:46487_solr    ] o.a.s.c.CorePropertiesLocator Looking for core definitions underneath /export/home/jenkins/workspace/Lucene-Solr-master-Solaris/solr/build/solr-core/test/J1/temp/solr.schema.TestManagedSchemaAPI_67B4CF6A6ADDF8CE-001/tempDir-001/node2/.
   [junit4]   2> 382230 INFO  (jetty-launcher-530-thread-2) [n:127.0.0.1:46487_solr    ] o.a.s.c.CorePropertiesLocator Found 0 core definitions
   [junit4]   2> 382231 INFO  (jetty-launcher-530-thread-2) [n:127.0.0.1:46487_solr    ] o.a.s.s.SolrDispatchFilter user.dir=/export/home/jenkins/workspace/Lucene-Solr-master-Solaris/solr/build/solr-core/test/J1
   [junit4]   2> 382231 INFO  (jetty-launcher-530-thread-2) [n:127.0.0.1:46487_solr    ] o.a.s.s.SolrDispatchFilter SolrDispatchFilter.init() done
   [junit4]   2> 382232 INFO  (SUITE-TestManagedSchemaAPI-seed#[67B4CF6A6ADDF8CE]-worker) [    ] o.a.s.c.c.SolrZkClient Using default ZkCredentialsProvider
   [junit4]   2> 382232 INFO  (SUITE-TestManagedSchemaAPI-seed#[67B4CF6A6ADDF8CE]-worker) [    ] o.a.s.c.c.ConnectionManager Waiting for client to connect to ZooKeeper
   [junit4]   2> 382234 INFO  (zkCallback-544-thread-1) [    ] o.a.s.c.c.ConnectionManager Watcher org.apache.solr.common.cloud.ConnectionManager@7ddc43ea name:ZooKeeperConnection Watcher:127.0.0.1:35237 got event WatchedEvent state:SyncConnected type:None path:null path:null type:None
   [junit4]   2> 382235 INFO  (SUITE-TestManagedSchemaAPI-seed#[67B4CF6A6ADDF8CE]-worker) [    ] o.a.s.c.c.ConnectionManager Client is connected to ZooKeeper
   [junit4]   2> 382235 INFO  (SUITE-TestManagedSchemaAPI-seed#[67B4CF6A6ADDF8CE]-worker) [    ] o.a.s.c.c.SolrZkClient Using default ZkACLProvider
   [junit4]   2> 382236 INFO  (SUITE-TestManagedSchemaAPI-seed#[67B4CF6A6ADDF8CE]-worker) [    ] o.a.s.c.s.i.CloudSolrClient Final constructed zkHost string: 127.0.0.1:35237/solr
   [junit4]   2> 382237 INFO  (SUITE-TestManagedSchemaAPI-seed#[67B4CF6A6ADDF8CE]-worker) [    ] o.a.s.c.c.SolrZkClient Using default ZkCredentialsProvider
   [junit4]   2> 382237 INFO  (SUITE-TestManagedSchemaAPI-seed#[67B4CF6A6ADDF8CE]-worker) [    ] o.a.s.c.c.ConnectionManager Waiting for client to connect to ZooKeeper
   [junit4]   2> 382239 INFO  (zkCallback-547-thread-1) [    ] o.a.s.c.c.ConnectionManager Watcher org.apache.solr.common.cloud.ConnectionManager@65063209 name:ZooKeeperConnection Watcher:127.0.0.1:35237/solr got event WatchedEvent state:SyncConnected type:None path:null path:null type:None
   [junit4]   2> 382239 INFO  (SUITE-TestManagedSchemaAPI-seed#[67B4CF6A6ADDF8CE]-worker) [    ] o.a.s.c.c.ConnectionManager Client is connected to ZooKeeper
   [junit4]   2> 382239 INFO  (SUITE-TestManagedSchemaAPI-seed#[67B4CF6A6ADDF8CE]-worker) [    ] o.a.s.c.c.SolrZkClient Using default ZkACLProvider
   [junit4]   2> 382239 INFO  (SUITE-TestManagedSchemaAPI-seed#[67B4CF6A6ADDF8CE]-worker) [    ] o.a.s.c.c.ZkStateReader Updating cluster state from ZooKeeper... 
   [junit4]   2> 382240 INFO  (SUITE-TestManagedSchemaAPI-seed#[67B4CF6A6ADDF8CE]-worker) [    ] o.a.s.c.c.ZkStateReader Loaded empty cluster properties
   [junit4]   2> 382241 INFO  (SUITE-TestManagedSchemaAPI-seed#[67B4CF6A6ADDF8CE]-worker) [    ] o.a.s.c.c.ZkStateReader Updated live nodes from ZooKeeper... (0) -> (2)
   [junit4]   2> 382243 INFO  (SUITE-TestManagedSchemaAPI-seed#[67B4CF6A6ADDF8CE]-worker) [    ] o.a.s.c.c.SolrZkClient makePath: /configs/conf1/managed-schema
   [junit4]   2> 382247 INFO  (SUITE-TestManagedSchemaAPI-seed#[67B4CF6A6ADDF8CE]-worker) [    ] o.a.s.c.c.SolrZkClient makePath: /configs/conf1/solrconfig.xml
   [junit4]   2> 382268 INFO  (TEST-TestManagedSchemaAPI.test-seed#[67B4CF6A6ADDF8CE]) [    ] o.a.s.SolrTestCaseJ4 ###Starting test
   [junit4]   2> 382274 INFO  (qtp1725322822-3615) [n:127.0.0.1:46487_solr    ] o.a.s.h.a.CollectionsHandler Invoked Collection Action :create with params replicationFactor=2&collection.configName=conf1&name=testschemaapi&action=CREATE&numShards=1&wt=javabin&version=2 and sendToOCPQueue=true
   [junit4]   2> 382281 INFO  (OverseerCollectionConfigSetProcessor-95958571544674308-127.0.0.1:64176_solr-n_0000000000) [n:127.0.0.1:64176_solr    ] o.a.s.c.OverseerTaskProcessor Overseer Collection Message Handler: Get the message id:/overseer/collection-queue-work/qn-0000000000 message:{
   [junit4]   2>   "name":"testschemaapi",
   [junit4]   2>   "fromApi":"true",
   [junit4]   2>   "replicationFactor":"2",
   [junit4]   2>   "collection.configName":"conf1",
   [junit4]   2>   "numShards":"1",
   [junit4]   2>   "stateFormat":"2",
   [junit4]   2>   "operation":"create"}
   [junit4]   2> 382287 INFO  (OverseerThreadFactory-1831-thread-1-processing-n:127.0.0.1:64176_solr) [n:127.0.0.1:64176_solr    ] o.a.s.c.OverseerCollectionMessageHandler OverseerCollectionMessageHandler.processMessage : create , {
   [junit4]   2>   "name":"testschemaapi",
   [junit4]   2>   "fromApi":"true",
   [junit4]   2>   "replicationFactor":"2",
   [junit4]   2>   "collection.configName":"conf1",
   [junit4]   2>   "numShards":"1",
   [junit4]   2>   "stateFormat":"2",
   [junit4]   2>   "operation":"create"}
   [junit4]   2> 382287 INFO  (OverseerThreadFactory-1831-thread-1-processing-n:127.0.0.1:64176_solr) [n:127.0.0.1:64176_solr    ] o.a.s.c.OverseerCollectionMessageHandler Create collection testschemaapi
   [junit4]   2> 382288 INFO  (OverseerThreadFactory-1831-thread-1-processing-n:127.0.0.1:64176_solr) [n:127.0.0.1:64176_solr    ] o.a.s.c.OverseerCollectionMessageHandler creating collections conf node /collections/testschemaapi 
   [junit4]   2> 382289 INFO  (OverseerThreadFactory-1831-thread-1-processing-n:127.0.0.1:64176_solr) [n:127.0.0.1:64176_solr    ] o.a.s.c.c.SolrZkClient makePath: /collections/testschemaapi
   [junit4]   2> 382294 INFO  (zkCallback-540-thread-1-processing-n:127.0.0.1:64176_solr) [n:127.0.0.1:64176_solr    ] o.a.s.c.c.ZkStateReader A collections change: [WatchedEvent state:SyncConnected type:NodeChildrenChanged path:/collections], has occurred - updating...
   [junit4]   2> 382294 INFO  (zkCallback-547-thread-1) [    ] o.a.s.c.c.ZkStateReader A collections change: [WatchedEvent state:SyncConnected type:NodeChildrenChanged path:/collections], has occurred - updating...
   [junit4]   2> 382294 INFO  (zkCallback-542-thread-1-processing-n:127.0.0.1:46487_solr) [n:127.0.0.1:46487_solr    ] o.a.s.c.c.ZkStateReader A collections change: [WatchedEvent state:SyncConnected type:NodeChildrenChanged path:/collections], has occurred - updating...
   [junit4]   2> 382298 INFO  (OverseerStateUpdate-95958571544674308-127.0.0.1:64176_solr-n_0000000000) [n:127.0.0.1:64176_solr    ] o.a.s.c.Overseer processMessage: queueSize: 1, message = {
   [junit4]   2>   "name":"testschemaapi",
   [junit4]   2>   "fromApi":"true",
   [junit4]   2>   "replicationFactor":"2",
   [junit4]   2>   "collection.configName":"conf1",
   [junit4]   2>   "numShards":"1",
   [junit4]   2>   "stateFormat":"2",
   [junit4]   2>   "operation":"create"} current state version: 0
   [junit4]   2> 382298 INFO  (OverseerStateUpdate-95958571544674308-127.0.0.1:64176_solr-n_0000000000) [n:127.0.0.1:64176_solr    ] o.a.s.c.o.ClusterStateMutator building a new cName: testschemaapi
   [junit4]   2> 382300 INFO  (OverseerStateUpdate-95958571544674308-127.0.0.1:64176_solr-n_0000000000) [n:127.0.0.1:64176_solr    ] o.a.s.c.o.ZkStateWriter going to create_collection /collections/testschemaapi/state.json
   [junit4]   2> 382398 INFO  (OverseerThreadFactory-1831-thread-1-processing-n:127.0.0.1:64176_solr) [n:127.0.0.1:64176_solr    ] o.a.s.c.OverseerCollectionMessageHandler Creating SolrCores for new collection testschemaapi, shardNames [shard1] , replicationFactor : 2
   [junit4]   2> 382398 INFO  (OverseerThreadFactory-1831-thread-1-processing-n:127.0.0.1:64176_solr) [n:127.0.0.1:64176_solr    ] o.a.s.c.OverseerCollectionMessageHandler Creating core testschemaapi_shard1_replica2 as part of shard shard1 of collection testschemaapi on 127.0.0.1:46487_solr
   [junit4]   2> 382398 INFO  (OverseerThreadFactory-1831-thread-1-processing-n:127.0.0.1:64176_solr) [n:127.0.0.1:64176_solr    ] o.a.s.c.OverseerCollectionMessageHandler Creating core testschemaapi_shard1_replica1 as part of shard shard1 of collection testschemaapi on 127.0.0.1:64176_solr
   [junit4]   2> 382401 INFO  (qtp1725322822-3616) [n:127.0.0.1:46487_solr    ] o.a.s.h.a.CoreAdminOperation core create command qt=/admin/cores&collection.configName=conf1&name=testschemaapi_shard1_replica2&action=CREATE&numShards=1&collection=testschemaapi&shard=shard1&wt=javabin&version=2
   [junit4]   2> 382402 INFO  (qtp1504145202-3601) [n:127.0.0.1:64176_solr    ] o.a.s.h.a.CoreAdminOperation core create command qt=/admin/cores&collection.configName=conf1&name=testschemaapi_shard1_replica1&action=CREATE&numShards=1&collection=testschemaapi&shard=shard1&wt=javabin&version=2
   [junit4]   2> 382406 INFO  (qtp1504145202-3601) [n:127.0.0.1:64176_solr    ] o.a.s.c.CoreDescriptor Created CoreDescriptor: {name=testschemaapi_shard1_replica1, collection.configName=conf1, config=solrconfig.xml, transient=false, schema=schema.xml, loadOnStartup=true, configSetProperties=configsetprops.json, collection=testschemaapi, numShards=1, dataDir=data/, shard=shard1}
   [junit4]   2> 382406 INFO  (qtp1725322822-3616) [n:127.0.0.1:46487_solr    ] o.a.s.c.CoreDescriptor Created CoreDescriptor: {name=testschemaapi_shard1_replica2, collection.configName=conf1, config=solrconfig.xml, transient=false, schema=schema.xml, loadOnStartup=true, configSetProperties=configsetprops.json, collection=testschemaapi, numShards=1, dataDir=data/, shard=shard1}
   [junit4]   2> 382410 INFO  (qtp1725322822-3616) [n:127.0.0.1:46487_solr c:testschemaapi s:shard1  x:testschemaapi_shard1_replica2] o.a.s.c.ZkController publishing state=down
   [junit4]   2> 382410 INFO  (qtp1504145202-3601) [n:127.0.0.1:64176_solr c:testschemaapi s:shard1  x:testschemaapi_shard1_replica1] o.a.s.c.ZkController publishing state=down
   [junit4]   2> 382411 INFO  (qtp1504145202-3601) [n:127.0.0.1:64176_solr c:testschemaapi s:shard1  x:testschemaapi_shard1_replica1] o.a.s.c.ZkController Registering watch for collection testschemaapi
   [junit4]   2> 382411 INFO  (qtp1725322822-3616) [n:127.0.0.1:46487_solr c:testschemaapi s:shard1  x:testschemaapi_shard1_replica2] o.a.s.c.ZkController Registering watch for collection testschemaapi
   [junit4]   2> 382412 INFO  (qtp1504145202-3601) [n:127.0.0.1:64176_solr c:testschemaapi s:shard1  x:testschemaapi_shard1_replica1] o.a.s.c.c.ZkStateReader Add data for [testschemaapi] ver [0]
   [junit4]   2> 382412 INFO  (qtp1504145202-3601) [n:127.0.0.1:64176_solr c:testschemaapi s:shard1  x:testschemaapi_shard1_replica1] o.a.s.c.ZkController look for our core node name
   [junit4]   2> 382412 INFO  (OverseerStateUpdate-95958571544674308-127.0.0.1:64176_solr-n_0000000000) [n:127.0.0.1:64176_solr    ] o.a.s.c.Overseer processMessage: queueSize: 2, message = {
   [junit4]   2>   "core":"testschemaapi_shard1_replica2",
   [junit4]   2>   "roles":null,
   [junit4]   2>   "base_url":"http://127.0.0.1:46487/solr",
   [junit4]   2>   "node_name":"127.0.0.1:46487_solr",
   [junit4]   2>   "numShards":"1",
   [junit4]   2>   "state":"down",
   [junit4]   2>   "shard":"shard1",
   [junit4]   2>   "collection":"testschemaapi",
   [junit4]   2>   "operation":"state"} current state version: 0
   [junit4]   2> 382413 INFO  (OverseerStateUpdate-95958571544674308-127.0.0.1:64176_solr-n_0000000000) [n:127.0.0.1:64176_solr    ] o.a.s.c.o.ReplicaMutator Update state numShards=1 message={
   [junit4]   2>   "core":"testschemaapi_shard1_replica2",
   [junit4]   2>   "roles":null,
   [junit4]   2>   "base_url":"http://127.0.0.1:46487/solr",
   [junit4]   2>   "node_name":"127.0.0.1:46487_solr",
   [junit4]   2>   "numShards":"1",
   [junit4]   2>   "state":"down",
   [junit4]   2>   "shard":"shard1",
   [junit4]   2>   "collection":"testschemaapi",
   [junit4]   2>   "operation":"state"}
   [junit4]   2> 382413 INFO  (qtp1725322822-3616) [n:127.0.0.1:46487_solr c:testschemaapi s:shard1  x:testschemaapi_shard1_replica2] o.a.s.c.c.ZkStateReader Add data for [testschemaapi] ver [0]
   [junit4]   2> 382413 INFO  (qtp1725322822-3616) [n:127.0.0.1:46487_solr c:testschemaapi s:shard1  x:testschemaapi_shard1_replica2] o.a.s.c.ZkController look for our core node name
   [junit4]   2> 382416 INFO  (OverseerStateUpdate-95958571544674308-127.0.0.1:64176_solr-n_0000000000) [n:127.0.0.1:64176_solr    ] o.a.s.c.Overseer processMessage: queueSize: 2, message = {
   [junit4]   2>   "core":"testschemaapi_shard1_replica1",
   [junit4]   2>   "roles":null,
   [junit4]   2>   "base_url":"http://127.0.0.1:64176/solr",
   [junit4]   2>   "node_name":"127.0.0.1:64176_solr",
   [junit4]   2>   "numShards":"1",
   [junit4]   2>   "state":"down",
   [junit4]   2>   "shard":"shard1",
   [junit4]   2>   "collection":"testschemaapi",
   [junit4]   2>   "operation":"state"} current state version: 0
   [junit4]   2> 382416 INFO  (OverseerStateUpdate-95958571544674308-127.0.0.1:64176_solr-n_0000000000) [n:127.0.0.1:64176_solr    ] o.a.s.c.o.ReplicaMutator Update state numShards=1 message={
   [junit4]   2>   "core":"testschemaapi_shard1_replica1",
   [junit4]   2>   "roles":null,
   [junit4]   2>   "base_url":"http://127.0.0.1:64176/solr",
   [junit4]   2>   "node_name":"127.0.0.1:64176_solr",
   [junit4]   2>   "numShards":"1",
   [junit4]   2>   "state":"down",
   [junit4]   2>   "shard":"shard1",
   [junit4]   2>   "collection":"testschemaapi",
   [junit4]   2>   "operation":"state"}
   [junit4]   2> 382519 INFO  (OverseerStateUpdate-95958571544674308-127.0.0.1:64176_solr-n_0000000000) [n:127.0.0.1:64176_solr    ] o.a.s.c.o.ZkStateWriter going to update_collection /collections/testschemaapi/state.json version: 0
   [junit4]   2> 382520 INFO  (zkCallback-540-thread-1-processing-n:127.0.0.1:64176_solr) [n:127.0.0.1:64176_solr    ] o.a.s.c.c.ZkStateReader A cluster state change: [WatchedEvent state:SyncConnected type:NodeDataChanged path:/collections/testschemaapi/state.json] for collection [testschemaapi] has occurred - updating... (live nodes size: [2])
   [junit4]   2> 382520 INFO  (zkCallback-542-thread-1-processing-n:127.0.0.1:46487_solr) [n:127.0.0.1:46487_solr    ] o.a.s.c.c.ZkStateReader A cluster state change: [WatchedEvent state:SyncConnected type:NodeDataChanged path:/collections/testschemaapi/state.json] for collection [testschemaapi] has occurred - updating... (live nodes size: [2])
   [junit4]   2> 382520 INFO  (zkCallback-540-thread-1-processing-n:127.0.0.1:64176_solr) [n:127.0.0.1:64176_solr    ] o.a.s.c.c.ZkStateReader Updating data for [testschemaapi] from [0] to [1]
   [junit4]   2> 382521 INFO  (zkCallback-542-thread-1-processing-n:127.0.0.1:46487_solr) [n:127.0.0.1:46487_solr    ] o.a.s.c.c.ZkStateReader Updating data for [testschemaapi] from [0] to [1]
   [junit4]   2> 383413 INFO  (qtp1504145202-3601) [n:127.0.0.1:64176_solr c:testschemaapi s:shard1  x:testschemaapi_shard1_replica1] o.a.s.c.ZkController waiting to find shard id in clusterstate for testschemaapi_shard1_replica1
   [junit4]   2> 383413 INFO  (qtp1504145202-3601) [n:127.0.0.1:64176_solr c:testschemaapi s:shard1  x:testschemaapi_shard1_replica1] o.a.s.c.ZkController Check for collection zkNode:testschemaapi
   [junit4]   2> 383414 INFO  (qtp1725322822-3616) [n:127.0.0.1:46487_solr c:testschemaapi s:shard1  x:testschemaapi_shard1_replica2] o.a.s.c.ZkController waiting to find shard id in clusterstate for testschemaapi_shard1_replica2
   [junit4]   2> 383414 INFO  (qtp1725322822-3616) [n:127.0.0.1:46487_solr c:testschemaapi s:shard1  x:testschemaapi_shard1_replica2] o.a.s.c.ZkController Check for collection zkNode:testschemaapi
   [junit4]   2> 383414 INFO  (qtp1504145202-3601) [n:127.0.0.1:64176_solr c:testschemaapi s:shard1  x:testschemaapi_shard1_replica1] o.a.s.c.ZkController Collection zkNode exists
   [junit4]   2> 383414 INFO  (qtp1504145202-3601) [n:127.0.0.1:64176_solr c:testschemaapi s:shard1  x:testschemaapi_shard1_replica1] o.a.s.c.c.ZkStateReader Load collection config from: [/collections/testschemaapi]
   [junit4]   2> 383414 INFO  (qtp1725322822-3616) [n:127.0.0.1:46487_solr c:testschemaapi s:shard1  x:testschemaapi_shard1_replica2] o.a.s.c.ZkController Collection zkNode exists
   [junit4]   2> 383414 INFO  (qtp1725322822-3616) [n:127.0.0.1:46487_solr c:testschemaapi s:shard1  x:testschemaapi_shard1_replica2] o.a.s.c.c.ZkStateReader Load collection config from: [/collections/testschemaapi]
   [junit4]   2> 383415 INFO  (qtp1725322822-3616) [n:127.0.0.1:46487_solr c:testschemaapi s:shard1  x:testschemaapi_shard1_replica2] o.a.s.c.c.ZkStateReader path=[/collections/testschemaapi] [configName]=[conf1] specified config exists in ZooKeeper
   [junit4]   2> 383415 INFO  (qtp1725322822-3616) [n:127.0.0.1:46487_solr c:testschemaapi s:shard1  x:testschemaapi_shard1_replica2] o.a.s.c.SolrResourceLoader new SolrResourceLoader for directory: '/export/home/jenkins/workspace/Lucene-Solr-master-Solaris/solr/build/solr-core/test/J1/temp/solr.schema.TestManagedSchemaAPI_67B4CF6A6ADDF8CE-001/tempDir-001/node2/testschemaapi_shard1_replica2'
   [junit4]   2> 383415 INFO  (qtp1725322822-3616) [n:127.0.0.1:46487_solr c:testschemaapi s:shard1  x:testschemaapi_shard1_replica2] o.a.s.c.SolrResourceLoader JNDI not configured for solr (NoInitialContextEx)
   [junit4]   2> 383415 INFO  (qtp1504145202-3601) [n:127.0.0.1:64176_solr c:testschemaapi s:shard1  x:testschemaapi_shard1_replica1] o.a.s.c.c.ZkStateReader path=[/collections/testschemaapi] [configName]=[conf1] specified config exists in ZooKeeper
   [junit4]   2> 383415 INFO  (qtp1725322822-3616) [n:127.0.0.1:46487_solr c:testschemaapi s:shard1  x:testschemaapi_shard1_replica2] o.a.s.c.SolrResourceLoader solr home defaulted to 'solr/' (could not find system property or JNDI)
   [junit4]   2> 383415 INFO  (qtp1504145202-3601) [n:127.0.0.1:64176_solr c:testschemaapi s:shard1  x:testschemaapi_shard1_replica1] o.a.s.c.SolrResourceLoader new SolrResourceLoader for directory: '/export/home/jenkins/workspace/Lucene-Solr-master-Solaris/solr/build/solr-core/test/J1/temp/solr.schema.TestManagedSchemaAPI_67B4CF6A6ADDF8CE-001/tempDir-001/node1/testschemaapi_shard1_replica1'
   [junit4]   2> 383415 INFO  (qtp1504145202-3601) [n:127.0.0.1:64176_solr c:testschemaapi s:shard1  x:testschemaapi_shard1_replica1] o.a.s.c.SolrResourceLoader JNDI not configured for solr (NoInitialContextEx)
   [junit4]   2> 383415 INFO  (qtp1504145202-3601) [n:127.0.0.1:64176_solr c:testschemaapi s:shard1  x:testschemaapi_shard1_replica1] o.a.s.c.SolrResourceLoader solr home defaulted to 'solr/' (could not find system property or JNDI)
   [junit4]   2> 383417 INFO  (qtp1725322822-3616) [n:127.0.0.1:46487_solr c:testschemaapi s:shard1  x:testschemaapi_shard1_replica2] o.a.s.c.Config loaded config solrconfig.xml with version 0 
   [junit4]   2> 383417 INFO  (qtp1504145202-3601) [n:127.0.0.1:64176_solr c:testschemaapi s:shard1  x:testschemaapi_shard1_replica1] o.a.s.c.Config loaded config solrconfig.xml with version 0 
   [junit4]   2> 383420 INFO  (qtp1725322822-3616) [n:127.0.0.1:46487_solr c:testschemaapi s:shard1  x:testschemaapi_shard1_replica2] o.a.s.c.SolrConfig current version of requestparams : -1
   [junit4]   2> 383420 INFO  (qtp1504145202-3601) [n:127.0.0.1:64176_solr c:testschemaapi s:shard1  x:testschemaapi_shard1_replica1] o.a.s.c.SolrConfig current version of requestparams : -1
   [junit4]   2> 383421 INFO  (qtp1725322822-3616) [n:127.0.0.1:46487_solr c:testschemaapi s:shard1  x:testschemaapi_shard1_replica2] o.a.s.c.SolrConfig Using Lucene MatchVersion: 7.0.0
   [junit4]   2> 383422 INFO  (qtp1504145202-3601) [n:127.0.0.1:64176_solr c:testschemaapi s:shard1  x:testschemaapi_shard1_replica1] o.a.s.c.SolrConfig Using Lucene MatchVersion: 7.0.0
   [junit4]   2> 383425 INFO  (qtp1725322822-3616) [n:127.0.0.1:46487_solr c:testschemaapi s:shard1  x:testschemaapi_shard1_replica2] o.a.s.c.SolrConfig Loaded SolrConfig: solrconfig.xml
   [junit4]   2> 383425 INFO  (qtp1504145202-3601) [n:127.0.0.1:64176_solr c:testschemaapi s:shard1  x:testschemaapi_shard1_replica1] o.a.s.c.SolrConfig Loaded SolrConfig: solrconfig.xml
   [junit4]   2> 383428 INFO  (qtp1725322822-3616) [n:127.0.0.1:46487_solr c:testschemaapi s:shard1  x:testschemaapi_shard1_replica2] o.a.s.s.IndexSchema [testschemaapi_shard1_replica2] Schema name=minimal
   [junit4]   2> 383430 INFO  (qtp1725322822-3616) [n:127.0.0.1:46487_solr c:testschemaapi s:shard1  x:testschemaapi_shard1_replica2] o.a.s.s.IndexSchema unique key field: id
   [junit4]   2> 383431 INFO  (qtp1725322822-3616) [n:127.0.0.1:46487_solr c:testschemaapi s:shard1  x:testschemaapi_shard1_replica2] o.a.s.c.ConfigSetProperties Did not find ConfigSet properties, assuming default properties: Can't find resource 'configsetprops.json' in classpath or '/configs/conf1', cwd=/export/home/jenkins/workspace/Lucene-Solr-master-Solaris/solr/build/solr-core/test/J1
   [junit4]   2> 383431 INFO  (qtp1725322822-3616) [n:127.0.0.1:46487_solr c:testschemaapi s:shard1  x:testschemaapi_shard1_replica2] o.a.s.c.CoreContainer Creating SolrCore 'testschemaapi_shard1_replica2' using configuration from collection testschemaapi
   [junit4]   2> 383432 INFO  (qtp1725322822-3616) [n:127.0.0.1:46487_solr c:testschemaapi s:shard1 r:core_node1 x:testschemaapi_shard1_replica2] o.a.s.c.SolrCore org.apache.solr.core.MockDirectoryFactory
   [junit4]   2> 383432 INFO  (qtp1725322822-3616) [n:127.0.0.1:46487_solr c:testschemaapi s:shard1 r:core_node1 x:testschemaapi_shard1_replica2] o.a.s.c.SolrCore [[testschemaapi_shard1_replica2] ] Opening new SolrCore at [/export/home/jenkins/workspace/Lucene-Solr-master-Solaris/solr/build/solr-core/test/J1/temp/solr.schema.TestManagedSchemaAPI_67B4CF6A6ADDF8CE-001/tempDir-001/node2/testschemaapi_shard1_replica2], dataDir=[/export/home/jenkins/workspace/Lucene-Solr-master-Solaris/solr/build/solr-core/test/J1/temp/solr.schema.TestManagedSchemaAPI_67B4CF6A6ADDF8CE-001/tempDir-001/node2/./testschemaapi_shard1_replica2/data/]
   [junit4]   2> 383432 INFO  (qtp1725322822-3616) [n:127.0.0.1:46487_solr c:testschemaapi s:shard1 r:core_node1 x:testschemaapi_shard1_replica2] o.a.s.c.SolrCore JMX monitoring not detected for core: testschemaapi_shard1_replica2
   [junit4]   2> 383432 INFO  (qtp1725322822-3616) [n:127.0.0.1:46487_solr c:testschemaapi s:shard1 r:core_node1 x:testschemaapi_shard1_replica2] o.a.s.c.CachingDirectoryFactory return new directory for /export/home/jenkins/workspace/Lucene-Solr-master-Solaris/solr/build/solr-core/test/J1/temp/solr.schema.TestManagedSchemaAPI_67B4CF6A6ADDF8CE-001/tempDir-001/node2/./testschemaapi_shard1_replica2/data
   [junit4]   2> 383432 INFO  (qtp1725322822-3616) [n:127.0.0.1:46487_solr c:testschemaapi s:shard1 r:core_node1 x:testschemaapi_shard1_replica2] o.a.s.c.SolrCore New index directory detected: old=null new=/export/home/jenkins/workspace/Lucene-Solr-master-Solaris/solr/build/solr-core/test/J1/temp/solr.schema.TestManagedSchemaAPI_67B4CF6A6ADDF8CE-001/tempDir-001/node2/./testschemaapi_shard1_replica2/data/index/
   [junit4]   2> 383432 WARN  (qtp1725322822-3616) [n:127.0.0.1:46487_solr c:testschemaapi s:shard1 r:core_node1 x:testschemaapi_shard1_replica2] o.a.s.c.SolrCore [testschemaapi_shard1_replica2] Solr index directory '/export/home/jenkins/workspace/Lucene-Solr-master-Solaris/solr/build/solr-core/test/J1/temp/solr.schema.TestManagedSchemaAPI_67B4CF6A6ADDF8CE-001/tempDir-001/node2/./testschemaapi_shard1_replica2/data/index' doesn't exist. Creating new index...
   [junit4]   2> 383433 INFO  (qtp1725322822-3616) [n:127.0.0.1:46487_solr c:testschemaapi s:shard1 r:core_node1 x:testschemaapi_shard1_replica2] o.a.s.c.CachingDirectoryFactory return new directory for /export/home/jenkins/workspace/Lucene-Solr-master-Solaris/solr/build/solr-core/test/J1/temp/solr.schema.TestManagedSchemaAPI_67B4CF6A6ADDF8CE-001/tempDir-001/node2/./testschemaapi_shard1_replica2/data/index
   [junit4]   2> 383433 INFO  (qtp1725322822-3616) [n:127.0.0.1:46487_solr c:testschemaapi s:shard1 r:core_node1 x:testschemaapi_shard1_replica2] o.a.s.c.SolrDeletionPolicy SolrDeletionPolicy.onCommit: commits: num=1
   [junit4]   2> 	commit{dir=MockDirectoryWrapper(RAMDirectory@61ff0353 lockFactory=org.apache.lucene.store.SingleInstanceLockFactory@5bf7e364),segFN=segments_1,generation=1}
   [junit4]   2> 383433 INFO  (qtp1725322822-3616) [n:127.0.0.1:46487_solr c:testschemaapi s:shard1 r:core_node1 x:testschemaapi_shard1_replica2] o.a.s.c.SolrDeletionPolicy newest commit generation = 1
   [junit4]   2> 383434 INFO  (OldIndexDirectoryCleanupThreadForCore-testschemaapi_shard1_replica2) [n:127.0.0.1:46487_solr c:testschemaapi s:shard1 r:core_node1 x:testschemaapi_shard1_replica2] o.a.s.c.SolrCore Looking for old index directories to cleanup for core testschemaapi_shard1_replica2 in /export/home/jenkins/workspace/Lucene-Solr-master-Solaris/solr/build/solr-core/test/J1/temp/solr.schema.TestManagedSchemaAPI_67B4CF6A6ADDF8CE-001/tempDir-001/node2/./testschemaapi_shard1_replica2/data/
   [junit4]   2> 383434 WARN  (OldIndexDirectoryCleanupThreadForCore-testschemaapi_shard1_replica2) [n:127.0.0.1:46487_solr c:testschemaapi s:shard1 r:core_node1 x:testschemaapi_shard1_replica2] o.a.s.c.DirectoryFactory /export/home/jenkins/workspace/Lucene-Solr-master-Solaris/solr/build/solr-core/test/J1/temp/solr.schema.TestManagedSchemaAPI_67B4CF6A6ADDF8CE-001/tempDir-001/node2/./testschemaapi_shard1_replica2/data/ does not point to a valid data directory; skipping clean-up of old index directories.
   [junit4]   2> 383435 INFO  (qtp1725322822-3616) [n:127.0.0.1:46487_solr c:testschemaapi s:shard1 r:core_node1 x:testschemaapi_shard1_replica2] o.a.s.c.SolrCore no updateRequestProcessorChain defined as default, creating implicit default
   [junit4]   2> 383436 INFO  (qtp1725322822-3616) [n:127.0.0.1:46487_solr c:testschemaapi s:shard1 r:core_node1 x:testschemaapi_shard1_replica2] o.a.s.h.l.XMLLoader xsltCacheLifetimeSeconds=60
   [junit4]   2> 383437 INFO  (qtp1725322822-3616) [n:127.0.0.1:46487_solr c:testschemaapi s:shard1 r:core_node1 x:testschemaapi_shard1_replica2] o.a.s.h.l.XMLLoader xsltCacheLifetimeSeconds=60
   [junit4]   2> 383438 INFO  (qtp1725322822-3616) [n:127.0.0.1:46487_solr c:testschemaapi s:shard1 r:core_node1 x:testschemaapi_shard1_replica2] o.a.s.h.l.XMLLoader xsltCacheLifetimeSeconds=60
   [junit4]   2> 383439 INFO  (qtp1725322822-3616) [n:127.0.0.1:46487_solr c:testschemaapi s:shard1 r:core_node1 x:testschemaapi_shard1_replica2] o.a.s.h.l.XMLLoader xsltCacheLifetimeSeconds=60
   [junit4]   2> 383440 INFO  (qtp1725322822-3616) [n:127.0.0.1:46487_solr c:testschemaapi s:shard1 r:core_node1 x:testschemaapi_shard1_replica2] o.a.s.c.RequestHandlers Registered paths: /admin/mbeans,/update/csv,/sql,/update/json/docs,/admin/luke,/graph,/export,/select,/admin/segments,/get,/admin/system,/replication,/admin/properties,/config,/stream,/schema,/admin/plugins,/admin/logging,/update/json,/admin/ping,/admin/threads,/update,/admin/file
   [junit4]   2> 383440 INFO  (qtp1725322822-3616) [n:127.0.0.1:46487_solr c:testschemaapi s:shard1 r:core_node1 x:testschemaapi_shard1_replica2] o.a.s.c.SolrCore Using default statsCache cache: org.apache.solr.search.stats.LocalStatsCache
   [junit4]   2> 383441 INFO  (qtp1725322822-3616) [n:127.0.0.1:46487_solr c:testschemaapi s:shard1 r:core_node1 x:testschemaapi_shard1_replica2] o.a.s.u.UpdateHandler Using UpdateLog implementation: org.apache.solr.update.UpdateLog
   [junit4]   2> 383441 INFO  (qtp1725322822-3616) [n:127.0.0.1:46487_solr c:testschemaapi s:shard1 r:core_node1 x:testschemaapi_shard1_replica2] o.a.s.u.UpdateLog Initializing UpdateLog: dataDir=null defaultSyncLevel=FLUSH numRecordsToKeep=100 maxNumLogsToKeep=10 numVersionBuckets=65536
   [junit4]   2> 383442 INFO  (qtp1725322822-3616) [n:127.0.0.1:46487_solr c:testschemaapi s:shard1 r:core_node1 x:testschemaapi_shard1_replica2] o.a.s.u.CommitTracker Hard AutoCommit: disabled
   [junit4]   2> 383442 INFO  (qtp1725322822-3616) [n:127.0.0.1:46487_solr c:testschemaapi s:shard1 r:core_node1 x:testschemaapi_shard1_replica2] o.a.s.u.CommitTracker Soft AutoCommit: disabled
   [junit4]   2> 383442 INFO  (qtp1725322822-3616) [n:127.0.0.1:46487_solr c:testschemaapi s:shard1 r:core_node1 x:testschemaapi_shard1_replica2] o.a.s.c.SolrDeletionPolicy SolrDeletionPolicy.onInit: commits: num=1
   [junit4]   2> 	commit{dir=MockDirectoryWrapper(RAMDirectory@61ff0353 lockFactory=org.apache.lucene.store.SingleInstanceLockFactory@5bf7e364),segFN=segments_1,generation=1}
   [junit4]   2> 383442 INFO  (qtp1725322822-3616) [n:127.0.0.1:46487_solr c:testschemaapi s:shard1 r:core_node1 x:testschemaapi_shard1_replica2] o.a.s.c.SolrDeletionPolicy newest commit generation = 1
   [junit4]   2> 383442 INFO  (qtp1725322822-3616) [n:127.0.0.1:46487_solr c:testschemaapi s:shard1 r:core_node1 x:testschemaapi_shard1_replica2] o.a.s.s.SolrIndexSearcher Opening [Searcher@297ea72c[testschemaapi_shard1_replica2] main]
   [junit4]   2> 383442 INFO  (qtp1725322822-3616) [n:127.0.0.1:46487_solr c:testschemaapi s:shard1 r:core_node1 x:testschemaapi_shard1_replica2] o.a.s.c.c.ZkStateReader Load collection config from: [/collections/testschemaapi]
   [junit4]   2> 383443 INFO  (qtp1725322822-3616) [n:127.0.0.1:46487_solr c:testschemaapi s:shard1 r:core_node1 x:testschemaapi_shard1_replica2] o.a.s.c.c.ZkStateReader path=[/collections/testschemaapi] [configName]=[conf1] specified config exists in ZooKeeper
   [junit4]   2> 383443 INFO  (qtp1725322822-3616) [n:127.0.0.1:46487_solr c:testschemaapi s:shard1 r:core_node1 x:testschemaapi_shard1_replica2] o.a.s.r.ManagedResourceStorage Setting up ZooKeeper-based storage for the RestManager with znodeBase: /configs/conf1
   [junit4]   2> 383443 INFO  (qtp1725322822-3616) [n:127.0.0.1:46487_solr c:testschemaapi s:shard1 r:core_node1 x:testschemaapi_shard1_replica2] o.a.s.r.ManagedResourceStorage Configured ZooKeeperStorageIO with znodeBase: /configs/conf1
   [junit4]   2> 383443 INFO  (qtp1725322822-3616) [n:127.0.0.1:46487_solr c:testschemaapi s:shard1 r:core_node1 x:testschemaapi_shard1_replica2] o.a.s.r.RestManager Initializing RestManager with initArgs: {}
   [junit4]   2> 383443 INFO  (qtp1725322822-3616) [n:127.0.0.1:46487_solr c:testschemaapi s:shard1 r:core_node1 x:testschemaapi_shard1_replica2] o.a.s.r.ManagedResourceStorage Reading _rest_managed.json using ZooKeeperStorageIO:path=/configs/conf1
   [junit4]   2> 383444 INFO  (qtp1725322822-3616) [n:127.0.0.1:46487_solr c:testschemaapi s:shard1 r:core_node1 x:testschemaapi_shard1_replica2] o.a.s.r.ManagedResourceStorage No data found for znode /configs/conf1/_rest_managed.json
   [junit4]   2> 383444 INFO  (qtp1725322822-3616) [n:127.0.0.1:46487_solr c:testschemaapi s:shard1 r:core_node1 x:testschemaapi_shard1_replica2] o.a.s.r.ManagedResourceStorage Loaded null at path _rest_managed.json using ZooKeeperStorageIO:path=/configs/conf1
   [junit4]   2> 383444 INFO  (qtp1725322822-3616) [n:127.0.0.1:46487_solr c:testschemaapi s:shard1 r:core_node1 x:testschemaapi_shard1_replica2] o.a.s.r.RestManager Initializing 0 registered ManagedResources
   [junit4]   2> 383447 INFO  (qtp1725322822-3616) [n:127.0.0.1:46487_solr c:testschemaapi s:shard1 r:core_node1 x:testschemaapi_shard1_replica2] o.a.s.s.ZkIndexSchemaReader Creating ZooKeeper watch for the managed schema at /configs/conf1/managed-schema
   [junit4]   2> 383448 INFO  (qtp1725322822-3616) [n:127.0.0.1:46487_solr c:testschemaapi s:shard1 r:core_node1 x:testschemaapi_shard1_replica2] o.a.s.c.ZkController Added new OnReconnect listener ZkIndexSchemaReader: /configs/conf1/managed-schema, uniqueCoreId: testschemaapi_shard1_replica2:1670650455774473
   [junit4]   2> 383449 INFO  (qtp1725322822-3616) [n:127.0.0.1:46487_solr c:testschemaapi s:shard1 r:core_node1 x:testschemaapi_shard1_replica2] o.a.s.h.ReplicationHandler Commits will be reserved for  10000
   [junit4]   2> 383449 INFO  (qtp1725322822-3616) [n:127.0.0.1:46487_solr c:testschemaapi s:shard1 r:core_node1 x:testschemaapi_shard1_replica2] o.a.s.u.UpdateLog Looking up max value of version field to seed version buckets
   [junit4]   2> 383449 INFO  (searcherExecutor-1836-thread-1-processing-n:127.0.0.1:46487_solr x:testschemaapi_shard1_replica2 s:shard1 c:testschemaapi r:core_node1) [n:127.0.0.1:46487_solr c:testschemaapi s:shard1 r:core_node1 x:testschemaapi_shard1_replica2] o.a.s.c.SolrCore [testschemaapi_shard1_replica2] Registered new searcher Searcher@297ea72c[testschemaapi_shard1_replica2] main{ExitableDirectoryReader(UninvertingDirectoryReader())}
   [junit4]   2> 383449 INFO  (qtp1725322822-3616) [n:127.0.0.1:46487_solr c:testschemaapi s:shard1 r:core_node1 x:testschemaapi_shard1_replica2] o.a.s.u.VersionInfo Refreshing highest value of _version_ for 65536 version buckets from index
   [junit4]   2> 383449 INFO  (qtp1725322822-3616) [n:127.0.0.1:46487_solr c:testschemaapi s:shard1 r:core_node1 x:testschemaapi_shard1_replica2] o.a.s.u.VersionInfo No terms found for _version_, cannot seed version bucket highest value from index
   [junit4]   2> 383449 INFO  (qtp1725322822-3616) [n:127.0.0.1:46487_solr c:testschemaapi s:shard1 r:core_node1 x:testschemaapi_shard1_replica2] o.a.s.u.UpdateLog Could not find max version in index or recent updates, using new clock 1535337147558526976
   [junit4]   2> 383450 INFO  (qtp1725322822-3616) [n:127.0.0.1:46487_solr c:testschemaapi s:shard1 r:core_node1 x:testschemaapi_shard1_replica2] o.a.s.u.UpdateLog Took 1.0ms to seed version buckets with highest version 1535337147558526976
   [junit4]   2> 383451 INFO  (qtp1725322822-3616) [n:127.0.0.1:46487_solr c:testschemaapi s:shard1 r:core_node1 x:testschemaapi_shard1_replica2] o.a.s.c.ZkController watch zkdir /configs/conf1
   [junit4]   2> 383453 INFO  (qtp1725322822-3616) [n:127.0.0.1:46487_solr c:testschemaapi s:shard1 r:core_node1 x:testschemaapi_shard1_replica2] o.a.s.c.CoreContainer registering core: testschemaapi_shard1_replica2
   [junit4]   2> 383453 INFO  (qtp1725322822-3616) [n:127.0.0.1:46487_solr c:testschemaapi s:shard1 r:core_node1 x:testschemaapi_shard1_replica2] o.a.s.c.ZkController Register replica - core:testschemaapi_shard1_replica2 address:http://127.0.0.1:46487/solr collection:testschemaapi shard:shard1
   [junit4]   2> 383454 INFO  (qtp1725322822-3616) [n:127.0.0.1:46487_solr c:testschemaapi s:shard1 r:core_node1 x:testschemaapi_shard1_replica2] o.a.s.c.c.SolrZkClient makePath: /collections/testschemaapi/leader_elect/shard1/election
   [junit4]   2> 383457 INFO  (qtp1504145202-3601) [n:127.0.0.1:64176_solr c:testschemaapi s:shard1  x:testschemaapi_shard1_replica1] o.a.s.s.IndexSchema [testschemaapi_shard1_replica1] Schema name=minimal
   [junit4]   2> 383459 INFO  (qtp1725322822-3616) [n:127.0.0.1:46487_solr c:testschemaapi s:shard1 r:core_node1 x:testschemaapi_shard1_replica2] o.a.s.c.LeaderElector Joined leadership election with path: /collections/testschemaapi/leader_elect/shard1/election/95958571544674310-core_node1-n_0000000000
   [junit4]   2> 383460 INFO  (qtp1725322822-3616) [n:127.0.0.1:46487_solr c:testschemaapi s:shard1 r:core_node1 x:testschemaapi_shard1_replica2] o.a.s.c.ShardLeaderElectionContext Running the leader process for shard=shard1 and weAreReplacement=false and leaderVoteWait=10000
   [junit4]   2> 383461 INFO  (qtp1725322822-3616) [n:127.0.0.1:46487_solr c:testschemaapi s:shard1 r:core_node1 x:testschemaapi_shard1_replica2] o.a.s.c.ShardLeaderElectionContext Waiting until we see more replicas up for shard shard1: total=2 found=1 timeoutin=9999ms
   [junit4]   2> 383462 INFO  (qtp1504145202-3601) [n:127.0.0.1:64176_solr c:testschemaapi s:shard1  x:testschemaapi_shard1_replica1] o.a.s.s.IndexSchema unique key field: id
   [junit4]   2> 383463 INFO  (qtp1504145202-3601) [n:127.0.0.1:64176_solr c:testschemaapi s:shard1  x:testschemaapi_shard1_replica1] o.a.s.c.ConfigSetProperties Did not find ConfigSet properties, assuming default properties: Can't find resource 'configsetprops.json' in classpath or '/configs/conf1', cwd=/export/home/jenkins/workspace/Lucene-Solr-master-Solaris/solr/build/solr-core/test/J1
   [junit4]   2> 383463 INFO  (qtp1504145202-3601) [n:127.0.0.1:64176_solr c:testschemaapi s:shard1  x:testschemaapi_shard1_replica1] o.a.s.c.CoreContainer Creating SolrCore 'testschemaapi_shard1_replica1' using configuration from collection testschemaapi
   [junit4]   2> 383463 INFO  (OverseerStateUpdate-95958571544674308-127.0.0.1:64176_solr-n_0000000000) [n:127.0.0.1:64176_solr    ] o.a.s.c.Overseer processMessage: queueSize: 1, message = {
   [junit4]   2>   "operation":"leader",
   [junit4]   2>   "shard":"shard1",
   [junit4]   2>   "collection":"testschemaapi"} current state version: 0
   [junit4]   2> 383463 INFO  (qtp1504145202-3601) [n:127.0.0.1:64176_solr c:testschemaapi s:shard1 r:core_node2 x:testschemaapi_shard1_replica1] o.a.s.c.SolrCore org.apache.solr.core.MockDirectoryFactory
   [junit4]   2> 383464 INFO  (qtp1504145202-3601) [n:127.0.0.1:64176_solr c:testschemaapi s:shard1 r:core_node2 x:testschemaapi_shard1_replica1] o.a.s.c.SolrCore [[testschemaapi_shard1_replica1] ] Opening new SolrCore at [/export/home/jenkins/workspace/Lucene-Solr-master-Solaris/solr/build/solr-core/test/J1/temp/solr.schema.TestManagedSchemaAPI_67B4CF6A6ADDF8CE-001/tempDir-001/node1/testschemaapi_shard1_replica1], dataDir=[/export/home/jenkins/workspace/Lucene-Solr-master-Solaris/solr/build/solr-core/test/J1/temp/solr.schema.TestManagedSchemaAPI_67B4CF6A6ADDF8CE-001/tempDir-001/node1/./testschemaapi_shard1_replica1/data/]
   [junit4]   2> 383464 INFO  (qtp1504145202-3601) [n:127.0.0.1:64176_solr c:testschemaapi s:shard1 r:core_node2 x:testschemaapi_shard1_replica1] o.a.s.c.SolrCore JMX monitoring not detected for core: testschemaapi_shard1_replica1
   [junit4]   2> 383464 INFO  (qtp1504145202-3601) [n:127.0.0.1:64176_solr c:testschemaapi s:shard1 r:core_node2 x:testschemaapi_shard1_replica1] o.a.s.c.CachingDirectoryFactory return new directory for /export/home/jenkins/workspace/Lucene-Solr-master-Solaris/solr/build/solr-core/test/J1/temp/solr.schema.TestManagedSchemaAPI_67B4CF6A6ADDF8CE-001/tempDir-001/node1/./testschemaapi_shard1_replica1/data
   [junit4]   2> 383464 INFO  (qtp1504145202-3601) [n:127.0.0.1:64176_solr c:testschemaapi s:shard1 r:core_node2 x:testschemaapi_shard1_replica1] o.a.s.c.SolrCore New index directory detected: old=null new=/export/home/jenkins/workspace/Lucene-Solr-master-Solaris/solr/build/solr-core/test/J1/temp/solr.schema.TestManagedSchemaAPI_67B4CF6A6ADDF8CE-001/tempDir-001/node1/./testschemaapi_shard1_replica1/data/index/
   [junit4]   2> 383464 WARN  (qtp1504145202-3601) [n:127.0.0.1:64176_solr c:testschemaapi s:shard1 r:core_node2 x:testschemaapi_shard1_replica1] o.a.s.c.SolrCore [testschemaapi_shard1_replica1] Solr index directory '/export/home/jenkins/workspace/Lucene-Solr-master-Solaris/solr/build/solr-core/test/J1/temp/solr.schema.TestManagedSchemaAPI_67B4CF6A6ADDF8CE-001/tempDir-001/node1/./testschemaapi_shard1_replica1/data/index' doesn't exist. Creating new index...
   [junit4]   2> 383465 INFO  (qtp1504145202-3601) [n:127.0.0.1:64176_solr c:testschemaapi s:shard1 r:core_node2 x:testschemaapi_shard1_replica1] o.a.s.c.CachingDirectoryFactory return new directory for /export/home/jenkins/workspace/Lucene-Solr-master-Solaris/solr/build/solr-core/test/J1/temp/solr.schema.TestManagedSchemaAPI_67B4CF6A6ADDF8CE-001/tempDir-001/node1/./testschemaapi_shard1_replica1/data/index
   [junit4]   2> 383465 INFO  (qtp1504145202-3601) [n:127.0.0.1:64176_solr c:testschemaapi s:shard1 r:core_node2 x:testschemaapi_shard1_replica1] o.a.s.c.SolrDeletionPolicy SolrDeletionPolicy.onCommit: commits: num=1
   [junit4]   2> 	commit{dir=MockDirectoryWrapper(RAMDirectory@7feef612 lockFactory=org.apache.lucene.store.SingleInstanceLockFactory@31b7aab0),segFN=segments_1,generation=1}
   [junit4]   2> 383465 INFO  (qtp1504145202-3601) [n:127.0.0.1:64176_solr c:testschemaapi s:shard1 r:core_node2 x:testschemaapi_shard1_replica1] o.a.s.c.SolrDeletionPolicy newest commit generation = 1
   [junit4]   2> 383466 INFO  (OldIndexDirectoryCleanupThreadForCore-testschemaapi_shard1_replica1) [n:127.0.0.1:64176_solr c:testschemaapi s:shard1 r:core_node2 x:testschemaapi_shard1_replica1] o.a.s.c.SolrCore Looking for old index directories to cleanup for core testschemaapi_shard1_replica1 in /export/home/jenkins/workspace/Lucene-Solr-master-Solaris/solr/build/solr-core/test/J1/temp/solr.schema.TestManagedSchemaAPI_67B4CF6A6ADDF8CE-001/tempDir-001/node1/./testschemaapi_shard1_replica1/data/
   [junit4]   2> 383466 WARN  (OldIndexDirectoryCleanupThreadForCore-testschemaapi_shard1_replica1) [n:127.0.0.1:64176_solr c:testschemaapi s:shard1 r:core_node2 x:testschemaapi_shard1_replica1] o.a.s.c.DirectoryFactory /export/home/jenkins/workspace/Lucene-Solr-master-Solaris/solr/build/solr-core/test/J1/temp/solr.schema.TestManagedSchemaAPI_67B4CF6A6ADDF8CE-001/tempDir-001/node1/./testschemaapi_shard1_replica1/data/ does not point to a valid data directory; skipping clean-up of old index directories.
   [junit4]   2> 383467 INFO  (qtp1504145202-3601) [n:127.0.0.1:64176_solr c:testschemaapi s:shard1 r:core_node2 x:testschemaapi_shard1_replica1] o.a.s.c.SolrCore no updateRequestProcessorChain defined as default, creating implicit default
   [junit4]   2> 383468 INFO  (qtp1504145202-3601) [n:127.0.0.1:64176_solr c:testschemaapi s:shard1 r:core_node2 x:testschemaapi_shard1_replica1] o.a.s.h.l.XMLLoader xsltCacheLifetimeSeconds=60
   [junit4]   2> 383470 INFO  (qtp1504145202-3601) [n:127.0.0.1:64176_solr c:testschemaapi s:shard1 r:core_node2 x:testschemaapi_shard1_replica1] o.a.s.h.l.XMLLoader xsltCacheLifetimeSeconds=60
   [junit4]   2> 383471 INFO  (qtp1504145202-3601) [n:127.0.0.1:64176_solr c:testschemaapi s:shard1 r:core_node2 x:testschemaapi_shard1_replica1] o.a.s.h.l.XMLLoader xsltCacheLifetimeSeconds=60
   [junit4]   2> 383471 INFO  (qtp1504145202-3601) [n:127.0.0.1:64176_solr c:testschemaapi s:shard1 r:core_node2 x:testschemaapi_shard1_replica1] o.a.s.h.l.XMLLoader xsltCacheLifetimeSeconds=60
   [junit4]   2> 383473 INFO  (qtp1504145202-3601) [n:127.0.0.1:64176_solr c:testschemaapi s:shard1 r:core_node2 x:testschemaapi_shard1_replica1] o.a.s.c.RequestHandlers Registered paths: /admin/mbeans,/update/csv,/sql,/update/json/docs,/admin/luke,/graph,/export,/select,/admin/segments,/get,/admin/system,/replication,/admin/properties,/config,/stream,/schema,/admin/plugins,/admin/logging,/update/json,/admin/ping,/admin/threads,/update,/admin/file
   [junit4]   2> 383473 INFO  (qtp1504145202-3601) [n:127.0.0.1:64176_solr c:testschemaapi s:shard1 r:core_node2 x:testschemaapi_shard1_replica1] o.a.s.c.SolrCore Using default statsCache cache: org.apache.solr.search.stats.LocalStatsCache
   [junit4]   2> 383474 INFO  (qtp1504145202-3601) [n:127.0.0.1:64176_solr c:testschemaapi s:shard1 r:core_node2 x:testschemaapi_shard1_replica1] o.a.s.u.UpdateHandler Using UpdateLog implementation: org.apache.solr.update.UpdateLog
   [junit4]   2> 383474 INFO  (qtp1504145202-3601) [n:127.0.0.1:64176_solr c:testschemaapi s:shard1 r:core_node2 x:testschemaapi_shard1_replica1] o.a.s.u.UpdateLog Initializing UpdateLog: dataDir=null defaultSyncLevel=FLUSH numRecordsToKeep=100 maxNumLogsToKeep=10 numVersionBuckets=65536
   [junit4]   2> 383474 INFO  (qtp1504145202-3601) [n:127.0.0.1:64176_solr c:testschemaapi s:shard1 r:core_node2 x:testschemaapi_shard1_replica1] o.a.s.u.CommitTracker Hard AutoCommit: disabled
   [junit4]   2> 383474 INFO  (qtp1504145202-3601) [n:127.0.0.1:64176_solr c:testschemaapi s:shard1 r:core_node2 x:testschemaapi_shard1_replica1] o.a.s.u.CommitTracker Soft AutoCommit: disabled
   [junit4]   2> 383475 INFO  (qtp1504145202-3601) [n:127.0.0.1:64176_solr c:testschemaapi s:shard1 r:core_node2 x:testschemaapi_shard1_replica1] o.a.s.c.SolrDeletionPolicy SolrDeletionPolicy.onInit: commits: num=1
   [junit4]   2> 	commit{dir=MockDirectoryWrapper(RAMDirectory@7feef612 lockFactory=org.apache.lucene.store.SingleInstanceLockFactory@31b7aab0),segFN=segments_1,generation=1}
   [junit4]   2> 383475 INFO  (qtp1504145202-3601) [n:127.0.0.1:64176_solr c:testschemaapi s:shard1 r:core_node2 x:testschemaapi_shard1_replica1] o.a.s.c.SolrDeletionPolicy newest commit generation = 1
   [junit4]   2> 383475 INFO  (qtp1504145202-3601) [n:127.0.0.1:64176_solr c:testschemaapi s:shard1 r:core_node2 x:testschemaapi_shard1_replica1] o.a.s.s.SolrIndexSearcher Opening [Searcher@217e8f9e[testschemaapi_shard1_replica1] main]
   [junit4]   2> 383475 INFO  (qtp1504145202-3601) [n:127.0.0.1:64176_solr c:testschemaapi s:shard1 r:core_node2 x:testschemaapi_shard1_replica1] o.a.s.c.c.ZkStateReader Load collection config from: [/collections/testschemaapi]
   [junit4]   2> 383477 INFO  (qtp1504145202-3601) [n:127.0.0.1:64176_solr c:testschemaapi s:shard1 r:core_node2 x:testschemaapi_shard1_replica1] o.a.s.c.c.ZkStateReader path=[/collections/testschemaapi] [configName]=[conf1] specified config exists in ZooKeeper
   [junit4]   2> 383477 INFO  (qtp1504145202-3601) [n:127.0.0.1:64176_solr c:testschemaapi s:shard1 r:core_node2 x:testschemaapi_shard1_replica1] o.a.s.r.ManagedResourceStorage Setting up ZooKeeper-based storage for the RestManager with znodeBase: /configs/conf1
   [junit4]   2> 383478 INFO  (qtp1504145202-3601) [n:127.0.0.1:64176_solr c:testschemaapi s:shard1 r:core_node2 x:testschemaapi_shard1_replica1] o.a.s.r.ManagedResourceStorage Configured ZooKeeperStorageIO with znodeBase: /configs/conf1
   [junit4]   2> 383478 INFO  (qtp1504145202-3601) [n:127.0.0.1:64176_solr c:testschemaapi s:shard1 r:core_node2 x:testschemaapi_shard1_replica1] o.a.s.r.RestManager Initializing RestManager with initArgs: {}
   [junit4]   2> 383478 INFO  (qtp1504145202-3601) [n:127.0.0.1:64176_solr c:testschemaapi s:shard1 r:core_node2 x:testschemaapi_shard1_replica1] o.a.s.r.ManagedResourceStorage Reading _rest_managed.json using ZooKeeperStorageIO:path=/configs/conf1
   [junit4]   2> 383478 INFO  (qtp1504145202-3601) [n:127.0.0.1:64176_solr c:testschemaapi s:shard1 r:core_node2 x:testschemaapi_shard1_replica1] o.a.s.r.ManagedResourceStorage No data found for znode /configs/conf1/_rest_managed.json
   [junit4]   2> 383479 INFO  (qtp1504145202-3601) [n:127.0.0.1:64176_solr c:testschemaapi s:shard1 r:core_node2 x:testschemaapi_shard1_replica1] o.a.s.r.ManagedResourceStorage Loaded null at path _rest_managed.json using ZooKeeperStorageIO:path=/configs/conf1
   [junit4]   2> 383479 INFO  (qtp1504145202-3601) [n:127.0.0.1:64176_solr c:testschemaapi s:shard1 r:core_node2 x:testschemaapi_shard1_replica1] o.a.s.r.RestManager Initializing 0 registered ManagedResources
   [junit4]   2> 383479 INFO  (qtp1504145202-3601) [n:127.0.0.1:64176_solr c:testschemaapi s:shard1 r:core_node2 x:testschemaapi_shard1_replica1] o.a.s.s.ZkIndexSchemaReader Creating ZooKeeper watch for the managed schema at /configs/conf1/managed-schema
   [junit4]   2> 383479 INFO  (qtp1504145202-3601) [n:127.0.0.1:64176_solr c:testschemaapi s:shard1 r:core_node2 x:testschemaapi_shard1_replica1] o.a.s.c.ZkController Added new OnReconnect listener ZkIndexSchemaReader: /configs/conf1/managed-schema, uniqueCoreId: testschemaapi_shard1_replica1:1670650487651613
   [junit4]   2> 383479 INFO  (qtp1504145202-3601) [n:127.0.0.1:64176_solr c:testschemaapi s:shard1 r:core_node2 x:testschemaapi_shard1_replica1] o.a.s.h.ReplicationHandler Commits will be reserved for  10000
   [junit4]   2> 383479 INFO  (qtp1504145202-3601) [n:127.0.0.1:64176_solr c:testschemaapi s:shard1 r:core_node2 x:testschemaapi_shard1_replica1] o.a.s.u.UpdateLog Looking up max value of version field to seed version buckets
   [junit4]   2> 383479 INFO  (searcherExecutor-1841-thread-1-processing-n:127.0.0.1:64176_solr x:testschemaapi_shard1_replica1 s:shard1 c:testschemaapi r:core_node2) [n:127.0.0.1:64176_solr c:testschemaapi s:shard1 r:core_node2 x:testschemaapi_shard1_replica1] o.a.s.c.SolrCore [testschemaapi_shard1_replica1] Registered new searcher Searcher@217e8f9e[testschemaapi_shard1_replica1] main{ExitableDirectoryReader(UninvertingDirectoryReader())}
   [junit4]   2> 383479 INFO  (qtp1504145202-3601) [n:127.0.0.1:64176_solr c:testschemaapi s:shard1 r:core_node2 x:testschemaapi_shard1_replica1] o.a.s.u.VersionInfo Refreshing highest value of _version_ for 65536 version buckets from index
   [junit4]   2> 383480 INFO  (qtp1504145202-3601) [n:127.0.0.1:64176_solr c:testschemaapi s:shard1 r:core_node2 x:testschemaapi_shard1_replica1] o.a.s.u.VersionInfo No terms found for _version_, cannot seed version bucket highest value from index
   [junit4]   2> 383480 INFO  (qtp1504145202-3601) [n:127.0.0.1:64176_solr c:testschemaapi s:shard1 r:core_node2 x:testschemaapi_shard1_replica1] o.a.s.u.UpdateLog Could not find max version in index or recent updates, using new clock 1535337147591032832
   [junit4]   2> 383481 INFO  (qtp1504145202-3601) [n:127.0.0.1:64176_solr c:testschemaapi s:shard1 r:core_node2 x:testschemaapi_shard1_replica1] o.a.s.u.UpdateLog Took 2.0ms to seed version buckets with highest version 1535337147591032832
   [junit4]   2> 383482 INFO  (qtp1504145202-3601) [n:127.0.0.1:64176_solr c:testschemaapi s:shard1 r:core_node2 x:testschemaapi_shard1_replica1] o.a.s.c.ZkController watch zkdir /configs/conf1
   [junit4]   2> 383482 INFO  (qtp1504145202-3601) [n:127.0.0.1:64176_solr c:testschemaapi s:shard1 r:core_node2 x:testschemaapi_shard1_replica1] o.a.s.c.CoreContainer registering core: testschemaapi_shard1_replica1
   [junit4]   2> 383482 INFO  (qtp1504145202-3601) [n:127.0.0.1:64176_solr c:testschemaapi s:shard1 r:core_node2 x:testschemaapi_shard1_replica1] o.a.s.c.ZkController Register replica - core:testschemaapi_shard1_replica1 address:http://127.0.0.1:64176/solr collection:testschemaapi shard:shard1
   [junit4]   2> 383484 INFO  (qtp1504145202-3601) [n:127.0.0.1:64176_solr c:testschemaapi s:shard1 r:core_node2 x:testschemaapi_shard1_replica1] o.a.s.c.LeaderElector Joined leadership election with path: /collections/testschemaapi/leader_elect/shard1/election/95958571544674308-core_node2-n_0000000001
   [junit4]   2> 383485 INFO  (qtp1504145202-3601) [n:127.0.0.1:64176_solr c:testschemaapi s:shard1 r:core_node2 x:testschemaapi_shard1_replica1] o.a.s.c.LeaderElector Watching path /collections/testschemaapi/leader_elect/shard1/election/95958571544674310-core_node1-n_0000000000 to know if I could be the leader
   [junit4]   2> 383569 INFO  (OverseerStateUpdate-95958571544674308-127.0.0.1:64176_solr-n_0000000000) [n:127.0.0.1:64176_solr    ] o.a.s.c.o.ZkStateWriter going to update_collection /collections/testschemaapi/state.json version: 1
   [junit4]   2> 383570 INFO  (zkCallback-542-thread-1-processing-n:127.0.0.1:46487_solr) [n:127.0.0.1:46487_solr    ] o.a.s.c.c.ZkStateReader A cluster state change: [WatchedEvent state:SyncConnected type:NodeDataChanged path:/collections/testschemaapi/state.json] for collection [testschemaapi] has occurred - updating... (live nodes size: [2])
   [junit4]   2> 383570 INFO  (zkCallback-540-thread-1-processing-n:127.0.0.1:64176_solr) [n:127.0.0.1:64176_solr    ] o.a.s.c.c.ZkStateReader A cluster state change: [WatchedEvent state:SyncConnected type:NodeDataChanged path:/collections/testschemaapi/state.json] for collection [testschemaapi] has occurred - updating... (live nodes size: [2])
   [junit4]   2> 383571 INFO  (zkCallback-542-thread-1-processing-n:127.0.0.1:46487_solr) [n:127.0.0.1:46487_solr    ] o.a.s.c.c.ZkStateReader Updating data for [testschemaapi] from [1] to [2]
   [junit4]   2> 383571 INFO  (zkCallback-540-thread-1-processing-n:127.0.0.1:64176_solr) [n:127.0.0.1:64176_solr    ] o.a.s.c.c.ZkStateReader Updating data for [testschemaapi] from [1] to [2]
   [junit4]   2> 383963 INFO  (qtp1725322822-3616) [n:127.0.0.1:46487_solr c:testschemaapi s:shard1 r:core_node1 x:testschemaapi_shard1_replica2] o.a.s.c.ShardLeaderElectionContext Enough replicas found to continue.
   [junit4]   2> 383963 INFO  (qtp1725322822-3616) [n:127.0.0.1:46487_solr c:testschemaapi s:shard1 r:core_node1 x:testschemaapi_shard1_replica2] o.a.s.c.ShardLeaderElectionContext I may be the new leader - try and sync
   [junit4]   2> 383963 INFO  (qtp1725322822-3616) [n:127.0.0.1:46487_solr c:testschemaapi s:shard1 r:core_node1 x:testschemaapi_shard1_replica2] o.a.s.c.SyncStrategy Sync replicas to http://127.0.0.1:46487/solr/testschemaapi_shard1_replica2/
   [junit4]   2> 383963 INFO  (qtp1725322822-3616) [n:127.0.0.1:46487_solr c:testschemaapi s:shard1 r:core_node1 x:testschemaapi_shard1_replica2] o.a.s.u.PeerSync PeerSync: core=testschemaapi_shard1_replica2 url=http://127.0.0.1:46487/solr START replicas=[http://127.0.0.1:64176/solr/testschemaapi_shard1_replica1/] nUpdates=100
   [junit4]   2> 383963 INFO  (qtp1725322822-3616) [n:127.0.0.1:46487_solr c:testschemaapi s:shard1 r:core_node1 x:testschemaapi_shard1_replica2] o.a.s.u.PeerSync PeerSync: core=testschemaapi_shard1_replica2 url=http://127.0.0.1:46487/solr DONE.  We have no versions.  sync failed.
   [junit4]   2> 383963 INFO  (qtp1725322822-3616) [n:127.0.0.1:46487_solr c:testschemaapi s:shard1 r:core_node1 x:testschemaapi_shard1_replica2] o.a.s.c.SyncStrategy Leader's attempt to sync with shard failed, moving to the next candidate
   [junit4]   2> 383963 INFO  (qtp1725322822-3616) [n:127.0.0.1:46487_solr c:testschemaapi s:shard1 r:core_node1 x:testschemaapi_shard1_replica2] o.a.s.c.ShardLeaderElectionContext We failed sync, but we have no versions - we can't sync in that case - we were active before, so become leader anyway
   [junit4]   2> 383964 INFO  (qtp1725322822-3616) [n:127.0.0.1:46487_solr c:testschemaapi s:shard1 r:core_node1 x:testschemaapi_shard1_replica2] o.a.s.c.c.SolrZkClient makePath: /collections/testschemaapi/leaders/shard1
   [junit4]   2> 383967 INFO  (qtp1504145202-3602) [n:127.0.0.1:64176_solr c:testschemaapi s:shard1 r:core_node2 x:testschemaapi_shard1_replica1] o.a.s.c.S.Request [testschemaapi_shard1_replica1]  webapp=/solr path=/get params={distrib=false&qt=/get&fingerprint=false&getVersions=100&wt=javabin&version=2} status=0 QTime=0
   [junit4]   2> 383968 INFO  (qtp1725322822-3616) [n:127.0.0.1:46487_solr c:testschemaapi s:shard1 r:core_node1 x:testschemaapi_shard1_replica2] o.a.s.c.ShardLeaderElectionContextBase Creating leader registration node /collections/testschemaapi/leaders/shard1/leader after winning as /collections/testschemaapi/leader_elect/shard1/election/95958571544674310-core_node1-n_0000000000
   [junit4]   2> 383970 INFO  (qtp1725322822-3616) [n:127.0.0.1:46487_solr c:testschemaapi s:shard1 r:core_node1 x:testschemaapi_shard1_replica2] 

[...truncated too long message...]

8
   [junit4] ERROR   0.79s J0 | TestArbitraryIndexDir.testLoadNewIndexDir <<<
   [junit4]    > Throwable #1: java.lang.RuntimeException: Exception during query
   [junit4]    > 	at __randomizedtesting.SeedInfo.seed([67B4CF6A6ADDF8CE:8EEE7452F4446866]:0)
   [junit4]    > 	at org.apache.solr.SolrTestCaseJ4.assertQ(SolrTestCaseJ4.java:785)
   [junit4]    > 	at org.apache.solr.core.TestArbitraryIndexDir.testLoadNewIndexDir(TestArbitraryIndexDir.java:107)
   [junit4]    > 	at java.lang.Thread.run(Thread.java:745)
   [junit4]    > Caused by: java.lang.RuntimeException: REQUEST FAILED: xpath=*[count(//doc)=1]
   [junit4]    > 	xml response was: <?xml version="1.0" encoding="UTF-8"?>
   [junit4]    > <response>
   [junit4]    > <lst name="responseHeader"><int name="status">0</int><int name="QTime">0</int></lst><result name="response" numFound="0" start="0"></result>
   [junit4]    > </response>
   [junit4]    > 	request was:q=id:2&qt=standard&start=0&rows=20&version=2.2
   [junit4]    > 	at org.apache.solr.SolrTestCaseJ4.assertQ(SolrTestCaseJ4.java:778)
   [junit4]    > 	... 41 more
   [junit4]   2> 795541 INFO  (SUITE-TestArbitraryIndexDir-seed#[67B4CF6A6ADDF8CE]-worker) [    x:collection1] o.a.s.SolrTestCaseJ4 ###deleteCore
   [junit4]   2> 795541 INFO  (searcherExecutor-2273-thread-1-processing-x:collection1) [    x:collection1] o.a.s.h.c.SpellCheckComponent Loading spell index for spellchecker: perDict
   [junit4]   2> 795541 INFO  (SUITE-TestArbitraryIndexDir-seed#[67B4CF6A6ADDF8CE]-worker) [    x:collection1] o.a.s.c.CoreContainer Shutting down CoreContainer instance=1628326023
   [junit4]   2> 795542 INFO  (searcherExecutor-2273-thread-1-processing-x:collection1) [    x:collection1] o.a.s.c.SolrCore [collection1] Registered new searcher Searcher@5e454e41[collection1] main{ExitableDirectoryReader(UninvertingDirectoryReader(Uninverting(_0(7.0.0):c1)))}
   [junit4]   2> 795542 INFO  (coreCloseExecutor-2277-thread-1-processing-x:collection1) [    x:collection1] o.a.s.c.SolrCore [collection1]  CLOSING SolrCore org.apache.solr.core.SolrCore@1017bce0
   [junit4]   2> 795542 INFO  (coreCloseExecutor-2277-thread-1-processing-x:collection1) [    x:collection1] o.a.s.u.DirectUpdateHandler2 closing DirectUpdateHandler2{commits=0,autocommits=0,soft autocommits=0,optimizes=0,rollbacks=0,expungeDeletes=0,docsPending=0,adds=0,deletesById=0,deletesByQuery=0,errors=0,cumulative_adds=0,cumulative_deletesById=0,cumulative_deletesByQuery=0,cumulative_errors=0}
   [junit4]   2> 795542 INFO  (coreCloseExecutor-2277-thread-1-processing-x:collection1) [    x:collection1] o.a.s.u.SolrCoreState Closing SolrCoreState
   [junit4]   2> 795542 INFO  (coreCloseExecutor-2277-thread-1-processing-x:collection1) [    x:collection1] o.a.s.u.DefaultSolrCoreState SolrCoreState ref count has reached 0 - closing IndexWriter
   [junit4]   2> 795542 INFO  (coreCloseExecutor-2277-thread-1-processing-x:collection1) [    x:collection1] o.a.s.u.DefaultSolrCoreState closing IndexWriter with IndexWriterCloser
   [junit4]   2> 795545 INFO  (coreCloseExecutor-2277-thread-1-processing-x:collection1) [    x:collection1] o.a.s.c.SolrCore [collection1] Closing main searcher on request.
   [junit4]   2> 795553 INFO  (coreCloseExecutor-2277-thread-1-processing-x:collection1) [    x:collection1] o.a.s.c.CachingDirectoryFactory Closing MockFSDirectoryFactory - 3 directories currently being tracked
   [junit4]   2> 795553 INFO  (coreCloseExecutor-2277-thread-1-processing-x:collection1) [    x:collection1] o.a.s.c.CachingDirectoryFactory looking to close /export/home/jenkins/workspace/Lucene-Solr-master-Solaris/solr/build/solr-core/test/J0/temp/solr.core.TestArbitraryIndexDir_67B4CF6A6ADDF8CE-001/init-core-data-001 [CachedDir<<refCount=0;path=/export/home/jenkins/workspace/Lucene-Solr-master-Solaris/solr/build/solr-core/test/J0/temp/solr.core.TestArbitraryIndexDir_67B4CF6A6ADDF8CE-001/init-core-data-001;done=false>>]
   [junit4]   2> 795553 INFO  (coreCloseExecutor-2277-thread-1-processing-x:collection1) [    x:collection1] o.a.s.c.CachingDirectoryFactory Closing directory, CoreContainer#isShutdown=true
   [junit4]   2> 795553 INFO  (coreCloseExecutor-2277-thread-1-processing-x:collection1) [    x:collection1] o.a.s.c.CachingDirectoryFactory Closing directory: /export/home/jenkins/workspace/Lucene-Solr-master-Solaris/solr/build/solr-core/test/J0/temp/solr.core.TestArbitraryIndexDir_67B4CF6A6ADDF8CE-001/init-core-data-001
   [junit4]   2> 795553 INFO  (coreCloseExecutor-2277-thread-1-processing-x:collection1) [    x:collection1] o.a.s.c.CachingDirectoryFactory looking to close /export/home/jenkins/workspace/Lucene-Solr-master-Solaris/solr/build/solr-core/test/J0/temp/solr.core.TestArbitraryIndexDir_67B4CF6A6ADDF8CE-001/init-core-data-001/index_temp [CachedDir<<refCount=0;path=/export/home/jenkins/workspace/Lucene-Solr-master-Solaris/solr/build/solr-core/test/J0/temp/solr.core.TestArbitraryIndexDir_67B4CF6A6ADDF8CE-001/init-core-data-001/index_temp;done=false>>]
   [junit4]   2> 795554 INFO  (coreCloseExecutor-2277-thread-1-processing-x:collection1) [    x:collection1] o.a.s.c.CachingDirectoryFactory Closing directory, CoreContainer#isShutdown=true
   [junit4]   2> 795554 INFO  (coreCloseExecutor-2277-thread-1-processing-x:collection1) [    x:collection1] o.a.s.c.CachingDirectoryFactory Closing directory: /export/home/jenkins/workspace/Lucene-Solr-master-Solaris/solr/build/solr-core/test/J0/temp/solr.core.TestArbitraryIndexDir_67B4CF6A6ADDF8CE-001/init-core-data-001/index_temp
   [junit4]   2> 795557 INFO  (coreCloseExecutor-2277-thread-1-processing-x:collection1) [    x:collection1] o.a.s.c.CachingDirectoryFactory looking to close /export/home/jenkins/workspace/Lucene-Solr-master-Solaris/solr/build/solr-core/test/J0/temp/solr.core.TestArbitraryIndexDir_67B4CF6A6ADDF8CE-001/init-core-data-001/index [CachedDir<<refCount=0;path=/export/home/jenkins/workspace/Lucene-Solr-master-Solaris/solr/build/solr-core/test/J0/temp/solr.core.TestArbitraryIndexDir_67B4CF6A6ADDF8CE-001/init-core-data-001/index;done=false>>]
   [junit4]   2> 795557 INFO  (coreCloseExecutor-2277-thread-1-processing-x:collection1) [    x:collection1] o.a.s.c.CachingDirectoryFactory Closing directory, CoreContainer#isShutdown=true
   [junit4]   2> 795557 INFO  (coreCloseExecutor-2277-thread-1-processing-x:collection1) [    x:collection1] o.a.s.c.CachingDirectoryFactory Closing directory: /export/home/jenkins/workspace/Lucene-Solr-master-Solaris/solr/build/solr-core/test/J0/temp/solr.core.TestArbitraryIndexDir_67B4CF6A6ADDF8CE-001/init-core-data-001/index
   [junit4]   2> NOTE: leaving temporary files on disk at: /export/home/jenkins/workspace/Lucene-Solr-master-Solaris/solr/build/solr-core/test/J0/temp/solr.core.TestArbitraryIndexDir_67B4CF6A6ADDF8CE-001
   [junit4]   2> NOTE: test params are: codec=CheapBastard, sim=ClassicSimilarity, locale=mt-MT, timezone=Asia/Brunei
   [junit4]   2> NOTE: SunOS 5.11 amd64/Oracle Corporation 1.8.0_92 (64-bit)/cpus=3,threads=1,free=215299120,total=377487360
   [junit4]   2> NOTE: All tests run in this JVM: [SuggestComponentContextFilterQueryTest, TestSolrQueryResponse, TestSimpleQParserPlugin, TestFieldCacheReopen, TestCollectionAPI, TestQuerySenderNoQuery, TestConfigSets, RegexBoostProcessorTest, TestCryptoKeys, TestSlowCompositeReaderWrapper, TestRebalanceLeaders, HLLUtilTest, TestScoreJoinQPScore, TestAuthorizationFramework, TestLeaderElectionZkExpiry, TestGraphTermsQParserPlugin, TestJsonFacets, TestGeoJSONResponseWriter, TestCoreContainer, SpatialFilterTest, TestComplexPhraseQParserPlugin, TestMacros, TestMergePolicyConfig, BlockDirectoryTest, PathHierarchyTokenizerFactoryTest, AlternateDirectoryTest, TestSweetSpotSimilarityFactory, AnalysisAfterCoreReloadTest, ConnectionManagerTest, TestFieldTypeResource, QueryEqualityTest, TestHighlightDedupGrouping, TestFieldCacheSort, TestRawResponseWriter, TestExtendedDismaxParser, CursorPagingTest, TimeZoneUtilsTest, DistribJoinFromCollectionTest, SimpleFacetsTest, SimpleCollectionCreateDeleteTest, CoreMergeIndexesAdminHandlerTest, AnalyticsQueryTest, ClassificationUpdateProcessorFactoryTest, RecoveryZkTest, BasicAuthIntegrationTest, SharedFSAutoReplicaFailoverTest, TestMiniSolrCloudCluster, MigrateRouteKeyTest, TestStandardQParsers, TestLegacyFieldCache, JSONWriterTest, TestCloudBackupRestore, BigEndianAscendingWordDeserializerTest, TestReloadAndDeleteDocs, TestRestManager, RecoveryAfterSoftCommitTest, PolyFieldTest, TestSubQueryTransformerCrossCore, QueryResultKeyTest, TestDistributedSearch, XsltUpdateRequestHandlerTest, TestArbitraryIndexDir]
   [junit4] Completed [133/611 (2!)] on J0 in 0.82s, 1 test, 1 error <<< FAILURES!

[...truncated 1578 lines...]
BUILD FAILED
/export/home/jenkins/workspace/Lucene-Solr-master-Solaris/build.xml:740: The following error occurred while executing this line:
/export/home/jenkins/workspace/Lucene-Solr-master-Solaris/build.xml:684: The following error occurred while executing this line:
/export/home/jenkins/workspace/Lucene-Solr-master-Solaris/build.xml:59: The following error occurred while executing this line:
/export/home/jenkins/workspace/Lucene-Solr-master-Solaris/solr/build.xml:233: The following error occurred while executing this line:
/export/home/jenkins/workspace/Lucene-Solr-master-Solaris/solr/common-build.xml:531: The following error occurred while executing this line:
/export/home/jenkins/workspace/Lucene-Solr-master-Solaris/lucene/common-build.xml:1427: The following error occurred while executing this line:
/export/home/jenkins/workspace/Lucene-Solr-master-Solaris/lucene/common-build.xml:984: There were test failures: 611 suites (10 ignored), 2554 tests, 2 errors, 88 ignored (73 assumptions) [seed: 67B4CF6A6ADDF8CE]

Total time: 83 minutes 45 seconds
Build step 'Invoke Ant' marked build as failure
Archiving artifacts
[WARNINGS] Skipping publisher since build result is FAILURE
Recording test results
Email was triggered for: Failure - Any
Sending email for trigger: Failure - Any



Mime
View raw message