lucene-dev mailing list archives

Site index · List index
Message view « Date » · « Thread »
Top « Date » · « Thread »
From Policeman Jenkins Server <jenk...@thetaphi.de>
Subject [JENKINS] Lucene-Solr-6.x-Windows (32bit/jdk1.8.0_92) - Build # 150 - Still Failing!
Date Mon, 02 May 2016 12:00:51 GMT
Build: http://jenkins.thetaphi.de/job/Lucene-Solr-6.x-Windows/150/
Java: 32bit/jdk1.8.0_92 -client -XX:+UseG1GC

2 tests failed.
FAILED:  junit.framework.TestSuite.org.apache.solr.schema.TestManagedSchemaAPI

Error Message:
ObjectTracker found 4 object(s) that were not released!!! [TransactionLog, MockDirectoryWrapper, MDCAwareThreadPoolExecutor, MockDirectoryWrapper]

Stack Trace:
java.lang.AssertionError: ObjectTracker found 4 object(s) that were not released!!! [TransactionLog, MockDirectoryWrapper, MDCAwareThreadPoolExecutor, MockDirectoryWrapper]
	at __randomizedtesting.SeedInfo.seed([683C4E53BDFACF9A]:0)
	at org.junit.Assert.fail(Assert.java:93)
	at org.junit.Assert.assertTrue(Assert.java:43)
	at org.junit.Assert.assertNull(Assert.java:551)
	at org.apache.solr.SolrTestCaseJ4.afterClass(SolrTestCaseJ4.java:256)
	at sun.reflect.GeneratedMethodAccessor21.invoke(Unknown Source)
	at sun.reflect.DelegatingMethodAccessorImpl.invoke(DelegatingMethodAccessorImpl.java:43)
	at java.lang.reflect.Method.invoke(Method.java:498)
	at com.carrotsearch.randomizedtesting.RandomizedRunner.invoke(RandomizedRunner.java:1764)
	at com.carrotsearch.randomizedtesting.RandomizedRunner$7.evaluate(RandomizedRunner.java:834)
	at com.carrotsearch.randomizedtesting.rules.StatementAdapter.evaluate(StatementAdapter.java:36)
	at com.carrotsearch.randomizedtesting.rules.SystemPropertiesRestoreRule$1.evaluate(SystemPropertiesRestoreRule.java:57)
	at org.apache.lucene.util.AbstractBeforeAfterRule$1.evaluate(AbstractBeforeAfterRule.java:45)
	at com.carrotsearch.randomizedtesting.rules.StatementAdapter.evaluate(StatementAdapter.java:36)
	at org.apache.lucene.util.TestRuleStoreClassName$1.evaluate(TestRuleStoreClassName.java:41)
	at com.carrotsearch.randomizedtesting.rules.NoShadowingOrOverridesOnMethodsRule$1.evaluate(NoShadowingOrOverridesOnMethodsRule.java:40)
	at com.carrotsearch.randomizedtesting.rules.NoShadowingOrOverridesOnMethodsRule$1.evaluate(NoShadowingOrOverridesOnMethodsRule.java:40)
	at com.carrotsearch.randomizedtesting.rules.StatementAdapter.evaluate(StatementAdapter.java:36)
	at com.carrotsearch.randomizedtesting.rules.StatementAdapter.evaluate(StatementAdapter.java:36)
	at com.carrotsearch.randomizedtesting.rules.StatementAdapter.evaluate(StatementAdapter.java:36)
	at org.apache.lucene.util.TestRuleAssertionsRequired$1.evaluate(TestRuleAssertionsRequired.java:53)
	at org.apache.lucene.util.TestRuleMarkFailure$1.evaluate(TestRuleMarkFailure.java:47)
	at org.apache.lucene.util.TestRuleIgnoreAfterMaxFailures$1.evaluate(TestRuleIgnoreAfterMaxFailures.java:64)
	at org.apache.lucene.util.TestRuleIgnoreTestSuites$1.evaluate(TestRuleIgnoreTestSuites.java:54)
	at com.carrotsearch.randomizedtesting.rules.StatementAdapter.evaluate(StatementAdapter.java:36)
	at com.carrotsearch.randomizedtesting.ThreadLeakControl$StatementRunner.run(ThreadLeakControl.java:367)
	at java.lang.Thread.run(Thread.java:745)


FAILED:  junit.framework.TestSuite.org.apache.solr.schema.TestManagedSchemaAPI

Error Message:
Could not remove the following files (in the order of attempts):    C:\Users\jenkins\workspace\Lucene-Solr-6.x-Windows\solr\build\solr-core\test\J0\temp\solr.schema.TestManagedSchemaAPI_683C4E53BDFACF9A-001\tempDir-001\node1\testschemaapi_shard1_replica2\data\tlog\tlog.0000000000000000000: java.nio.file.FileSystemException: C:\Users\jenkins\workspace\Lucene-Solr-6.x-Windows\solr\build\solr-core\test\J0\temp\solr.schema.TestManagedSchemaAPI_683C4E53BDFACF9A-001\tempDir-001\node1\testschemaapi_shard1_replica2\data\tlog\tlog.0000000000000000000: The process cannot access the file because it is being used by another process.     C:\Users\jenkins\workspace\Lucene-Solr-6.x-Windows\solr\build\solr-core\test\J0\temp\solr.schema.TestManagedSchemaAPI_683C4E53BDFACF9A-001\tempDir-001\node1\testschemaapi_shard1_replica2\data\tlog: java.nio.file.DirectoryNotEmptyException: C:\Users\jenkins\workspace\Lucene-Solr-6.x-Windows\solr\build\solr-core\test\J0\temp\solr.schema.TestManagedSchemaAPI_683C4E53BDFACF9A-001\tempDir-001\node1\testschemaapi_shard1_replica2\data\tlog    C:\Users\jenkins\workspace\Lucene-Solr-6.x-Windows\solr\build\solr-core\test\J0\temp\solr.schema.TestManagedSchemaAPI_683C4E53BDFACF9A-001\tempDir-001\node1\testschemaapi_shard1_replica2\data: java.nio.file.DirectoryNotEmptyException: C:\Users\jenkins\workspace\Lucene-Solr-6.x-Windows\solr\build\solr-core\test\J0\temp\solr.schema.TestManagedSchemaAPI_683C4E53BDFACF9A-001\tempDir-001\node1\testschemaapi_shard1_replica2\data    C:\Users\jenkins\workspace\Lucene-Solr-6.x-Windows\solr\build\solr-core\test\J0\temp\solr.schema.TestManagedSchemaAPI_683C4E53BDFACF9A-001\tempDir-001\node1\testschemaapi_shard1_replica2: java.nio.file.DirectoryNotEmptyException: C:\Users\jenkins\workspace\Lucene-Solr-6.x-Windows\solr\build\solr-core\test\J0\temp\solr.schema.TestManagedSchemaAPI_683C4E53BDFACF9A-001\tempDir-001\node1\testschemaapi_shard1_replica2    C:\Users\jenkins\workspace\Lucene-Solr-6.x-Windows\solr\build\solr-core\test\J0\temp\solr.schema.TestManagedSchemaAPI_683C4E53BDFACF9A-001\tempDir-001\node1: java.nio.file.DirectoryNotEmptyException: C:\Users\jenkins\workspace\Lucene-Solr-6.x-Windows\solr\build\solr-core\test\J0\temp\solr.schema.TestManagedSchemaAPI_683C4E53BDFACF9A-001\tempDir-001\node1    C:\Users\jenkins\workspace\Lucene-Solr-6.x-Windows\solr\build\solr-core\test\J0\temp\solr.schema.TestManagedSchemaAPI_683C4E53BDFACF9A-001\tempDir-001: java.nio.file.DirectoryNotEmptyException: C:\Users\jenkins\workspace\Lucene-Solr-6.x-Windows\solr\build\solr-core\test\J0\temp\solr.schema.TestManagedSchemaAPI_683C4E53BDFACF9A-001\tempDir-001    C:\Users\jenkins\workspace\Lucene-Solr-6.x-Windows\solr\build\solr-core\test\J0\temp\solr.schema.TestManagedSchemaAPI_683C4E53BDFACF9A-001: java.nio.file.DirectoryNotEmptyException: C:\Users\jenkins\workspace\Lucene-Solr-6.x-Windows\solr\build\solr-core\test\J0\temp\solr.schema.TestManagedSchemaAPI_683C4E53BDFACF9A-001 

Stack Trace:
java.io.IOException: Could not remove the following files (in the order of attempts):
   C:\Users\jenkins\workspace\Lucene-Solr-6.x-Windows\solr\build\solr-core\test\J0\temp\solr.schema.TestManagedSchemaAPI_683C4E53BDFACF9A-001\tempDir-001\node1\testschemaapi_shard1_replica2\data\tlog\tlog.0000000000000000000: java.nio.file.FileSystemException: C:\Users\jenkins\workspace\Lucene-Solr-6.x-Windows\solr\build\solr-core\test\J0\temp\solr.schema.TestManagedSchemaAPI_683C4E53BDFACF9A-001\tempDir-001\node1\testschemaapi_shard1_replica2\data\tlog\tlog.0000000000000000000: The process cannot access the file because it is being used by another process.

   C:\Users\jenkins\workspace\Lucene-Solr-6.x-Windows\solr\build\solr-core\test\J0\temp\solr.schema.TestManagedSchemaAPI_683C4E53BDFACF9A-001\tempDir-001\node1\testschemaapi_shard1_replica2\data\tlog: java.nio.file.DirectoryNotEmptyException: C:\Users\jenkins\workspace\Lucene-Solr-6.x-Windows\solr\build\solr-core\test\J0\temp\solr.schema.TestManagedSchemaAPI_683C4E53BDFACF9A-001\tempDir-001\node1\testschemaapi_shard1_replica2\data\tlog
   C:\Users\jenkins\workspace\Lucene-Solr-6.x-Windows\solr\build\solr-core\test\J0\temp\solr.schema.TestManagedSchemaAPI_683C4E53BDFACF9A-001\tempDir-001\node1\testschemaapi_shard1_replica2\data: java.nio.file.DirectoryNotEmptyException: C:\Users\jenkins\workspace\Lucene-Solr-6.x-Windows\solr\build\solr-core\test\J0\temp\solr.schema.TestManagedSchemaAPI_683C4E53BDFACF9A-001\tempDir-001\node1\testschemaapi_shard1_replica2\data
   C:\Users\jenkins\workspace\Lucene-Solr-6.x-Windows\solr\build\solr-core\test\J0\temp\solr.schema.TestManagedSchemaAPI_683C4E53BDFACF9A-001\tempDir-001\node1\testschemaapi_shard1_replica2: java.nio.file.DirectoryNotEmptyException: C:\Users\jenkins\workspace\Lucene-Solr-6.x-Windows\solr\build\solr-core\test\J0\temp\solr.schema.TestManagedSchemaAPI_683C4E53BDFACF9A-001\tempDir-001\node1\testschemaapi_shard1_replica2
   C:\Users\jenkins\workspace\Lucene-Solr-6.x-Windows\solr\build\solr-core\test\J0\temp\solr.schema.TestManagedSchemaAPI_683C4E53BDFACF9A-001\tempDir-001\node1: java.nio.file.DirectoryNotEmptyException: C:\Users\jenkins\workspace\Lucene-Solr-6.x-Windows\solr\build\solr-core\test\J0\temp\solr.schema.TestManagedSchemaAPI_683C4E53BDFACF9A-001\tempDir-001\node1
   C:\Users\jenkins\workspace\Lucene-Solr-6.x-Windows\solr\build\solr-core\test\J0\temp\solr.schema.TestManagedSchemaAPI_683C4E53BDFACF9A-001\tempDir-001: java.nio.file.DirectoryNotEmptyException: C:\Users\jenkins\workspace\Lucene-Solr-6.x-Windows\solr\build\solr-core\test\J0\temp\solr.schema.TestManagedSchemaAPI_683C4E53BDFACF9A-001\tempDir-001
   C:\Users\jenkins\workspace\Lucene-Solr-6.x-Windows\solr\build\solr-core\test\J0\temp\solr.schema.TestManagedSchemaAPI_683C4E53BDFACF9A-001: java.nio.file.DirectoryNotEmptyException: C:\Users\jenkins\workspace\Lucene-Solr-6.x-Windows\solr\build\solr-core\test\J0\temp\solr.schema.TestManagedSchemaAPI_683C4E53BDFACF9A-001

	at org.apache.lucene.util.IOUtils.rm(IOUtils.java:323)
	at org.apache.lucene.util.TestRuleTemporaryFilesCleanup.afterAlways(TestRuleTemporaryFilesCleanup.java:216)
	at com.carrotsearch.randomizedtesting.rules.TestRuleAdapter$1.afterAlways(TestRuleAdapter.java:31)
	at com.carrotsearch.randomizedtesting.rules.StatementAdapter.evaluate(StatementAdapter.java:43)
	at com.carrotsearch.randomizedtesting.rules.StatementAdapter.evaluate(StatementAdapter.java:36)
	at org.apache.lucene.util.TestRuleAssertionsRequired$1.evaluate(TestRuleAssertionsRequired.java:53)
	at org.apache.lucene.util.TestRuleMarkFailure$1.evaluate(TestRuleMarkFailure.java:47)
	at org.apache.lucene.util.TestRuleIgnoreAfterMaxFailures$1.evaluate(TestRuleIgnoreAfterMaxFailures.java:64)
	at org.apache.lucene.util.TestRuleIgnoreTestSuites$1.evaluate(TestRuleIgnoreTestSuites.java:54)
	at com.carrotsearch.randomizedtesting.rules.StatementAdapter.evaluate(StatementAdapter.java:36)
	at com.carrotsearch.randomizedtesting.ThreadLeakControl$StatementRunner.run(ThreadLeakControl.java:367)
	at java.lang.Thread.run(Thread.java:745)




Build Log:
[...truncated 11155 lines...]
   [junit4] Suite: org.apache.solr.schema.TestManagedSchemaAPI
   [junit4]   2> Creating dataDir: C:\Users\jenkins\workspace\Lucene-Solr-6.x-Windows\solr\build\solr-core\test\J0\temp\solr.schema.TestManagedSchemaAPI_683C4E53BDFACF9A-001\init-core-data-001
   [junit4]   2> 1295563 INFO  (SUITE-TestManagedSchemaAPI-seed#[683C4E53BDFACF9A]-worker) [    ] o.a.s.SolrTestCaseJ4 Randomized ssl (true) and clientAuth (false)
   [junit4]   2> 1295574 INFO  (SUITE-TestManagedSchemaAPI-seed#[683C4E53BDFACF9A]-worker) [    ] o.a.s.c.ZkTestServer STARTING ZK TEST SERVER
   [junit4]   2> 1295574 INFO  (Thread-2606) [    ] o.a.s.c.ZkTestServer client port:0.0.0.0/0.0.0.0:0
   [junit4]   2> 1295574 INFO  (Thread-2606) [    ] o.a.s.c.ZkTestServer Starting server
   [junit4]   2> 1295675 INFO  (SUITE-TestManagedSchemaAPI-seed#[683C4E53BDFACF9A]-worker) [    ] o.a.s.c.ZkTestServer start zk server on port:52140
   [junit4]   2> 1295675 INFO  (SUITE-TestManagedSchemaAPI-seed#[683C4E53BDFACF9A]-worker) [    ] o.a.s.c.c.SolrZkClient Using default ZkCredentialsProvider
   [junit4]   2> 1295677 INFO  (SUITE-TestManagedSchemaAPI-seed#[683C4E53BDFACF9A]-worker) [    ] o.a.s.c.c.ConnectionManager Waiting for client to connect to ZooKeeper
   [junit4]   2> 1295684 INFO  (zkCallback-1045-thread-1) [    ] o.a.s.c.c.ConnectionManager Watcher org.apache.solr.common.cloud.ConnectionManager@1b4b525 name:ZooKeeperConnection Watcher:127.0.0.1:52140 got event WatchedEvent state:SyncConnected type:None path:null path:null type:None
   [junit4]   2> 1295685 INFO  (SUITE-TestManagedSchemaAPI-seed#[683C4E53BDFACF9A]-worker) [    ] o.a.s.c.c.ConnectionManager Client is connected to ZooKeeper
   [junit4]   2> 1295685 INFO  (SUITE-TestManagedSchemaAPI-seed#[683C4E53BDFACF9A]-worker) [    ] o.a.s.c.c.SolrZkClient Using default ZkACLProvider
   [junit4]   2> 1295685 INFO  (SUITE-TestManagedSchemaAPI-seed#[683C4E53BDFACF9A]-worker) [    ] o.a.s.c.c.SolrZkClient makePath: /solr/solr.xml
   [junit4]   2> 1295696 INFO  (SUITE-TestManagedSchemaAPI-seed#[683C4E53BDFACF9A]-worker) [    ] o.a.s.c.c.SolrZkClient makePath: /solr/clusterprops.json
   [junit4]   2> 1295709 INFO  (jetty-launcher-1044-thread-2) [    ] o.e.j.s.Server jetty-9.3.8.v20160314
   [junit4]   2> 1295711 INFO  (jetty-launcher-1044-thread-2) [    ] o.e.j.s.h.ContextHandler Started o.e.j.s.ServletContextHandler@126fdc3{/solr,null,AVAILABLE}
   [junit4]   2> 1295711 INFO  (jetty-launcher-1044-thread-1) [    ] o.e.j.s.Server jetty-9.3.8.v20160314
   [junit4]   2> 1295712 INFO  (jetty-launcher-1044-thread-2) [    ] o.e.j.u.s.SslContextFactory x509=X509@1e3aa64(solrtest,h=[],w=[]) for SslContextFactory@1b8d915(file:///C:/Users/jenkins/workspace/Lucene-Solr-6.x-Windows/solr/server/etc/test/solrtest.keystore,null)
   [junit4]   2> 1295718 INFO  (jetty-launcher-1044-thread-1) [    ] o.e.j.s.h.ContextHandler Started o.e.j.s.ServletContextHandler@1cf6a1f{/solr,null,AVAILABLE}
   [junit4]   2> 1295730 INFO  (jetty-launcher-1044-thread-2) [    ] o.e.j.s.ServerConnector Started ServerConnector@1fa7bdd{SSL,[ssl, http/1.1]}{127.0.0.1:52144}
   [junit4]   2> 1295731 INFO  (jetty-launcher-1044-thread-2) [    ] o.e.j.s.Server Started @1299927ms
   [junit4]   2> 1295731 INFO  (jetty-launcher-1044-thread-2) [    ] o.a.s.c.s.e.JettySolrRunner Jetty properties: {hostContext=/solr, hostPort=52144}
   [junit4]   2> 1295731 INFO  (jetty-launcher-1044-thread-2) [    ] o.a.s.s.SolrDispatchFilter SolrDispatchFilter.init(): sun.misc.Launcher$AppClassLoader@1d16e93
   [junit4]   2> 1295731 INFO  (jetty-launcher-1044-thread-2) [    ] o.a.s.c.SolrResourceLoader new SolrResourceLoader for directory: 'C:\Users\jenkins\workspace\Lucene-Solr-6.x-Windows\solr\build\solr-core\test\J0\temp\solr.schema.TestManagedSchemaAPI_683C4E53BDFACF9A-001\tempDir-001\node2'
   [junit4]   2> 1295731 INFO  (jetty-launcher-1044-thread-2) [    ] o.a.s.c.SolrResourceLoader JNDI not configured for solr (NoInitialContextEx)
   [junit4]   2> 1295731 INFO  (jetty-launcher-1044-thread-2) [    ] o.a.s.c.SolrResourceLoader solr home defaulted to 'solr/' (could not find system property or JNDI)
   [junit4]   2> 1295732 INFO  (jetty-launcher-1044-thread-2) [    ] o.a.s.c.c.SolrZkClient Using default ZkCredentialsProvider
   [junit4]   2> 1295733 INFO  (jetty-launcher-1044-thread-1) [    ] o.e.j.u.s.SslContextFactory x509=X509@96e3d8(solrtest,h=[],w=[]) for SslContextFactory@d6378f(file:///C:/Users/jenkins/workspace/Lucene-Solr-6.x-Windows/solr/server/etc/test/solrtest.keystore,null)
   [junit4]   2> 1295733 INFO  (jetty-launcher-1044-thread-2) [    ] o.a.s.c.c.ConnectionManager Waiting for client to connect to ZooKeeper
   [junit4]   2> 1295748 INFO  (jetty-launcher-1044-thread-1) [    ] o.e.j.s.ServerConnector Started ServerConnector@298000{SSL,[ssl, http/1.1]}{127.0.0.1:52147}
   [junit4]   2> 1295749 INFO  (jetty-launcher-1044-thread-1) [    ] o.e.j.s.Server Started @1299946ms
   [junit4]   2> 1295749 INFO  (jetty-launcher-1044-thread-1) [    ] o.a.s.c.s.e.JettySolrRunner Jetty properties: {hostContext=/solr, hostPort=52147}
   [junit4]   2> 1295749 INFO  (jetty-launcher-1044-thread-1) [    ] o.a.s.s.SolrDispatchFilter SolrDispatchFilter.init(): sun.misc.Launcher$AppClassLoader@1d16e93
   [junit4]   2> 1295749 INFO  (jetty-launcher-1044-thread-1) [    ] o.a.s.c.SolrResourceLoader new SolrResourceLoader for directory: 'C:\Users\jenkins\workspace\Lucene-Solr-6.x-Windows\solr\build\solr-core\test\J0\temp\solr.schema.TestManagedSchemaAPI_683C4E53BDFACF9A-001\tempDir-001\node1'
   [junit4]   2> 1295749 INFO  (jetty-launcher-1044-thread-1) [    ] o.a.s.c.SolrResourceLoader JNDI not configured for solr (NoInitialContextEx)
   [junit4]   2> 1295754 INFO  (jetty-launcher-1044-thread-1) [    ] o.a.s.c.SolrResourceLoader solr home defaulted to 'solr/' (could not find system property or JNDI)
   [junit4]   2> 1295756 INFO  (jetty-launcher-1044-thread-1) [    ] o.a.s.c.c.SolrZkClient Using default ZkCredentialsProvider
   [junit4]   2> 1295758 INFO  (jetty-launcher-1044-thread-1) [    ] o.a.s.c.c.ConnectionManager Waiting for client to connect to ZooKeeper
   [junit4]   2> 1295768 INFO  (zkCallback-1047-thread-1) [    ] o.a.s.c.c.ConnectionManager Watcher org.apache.solr.common.cloud.ConnectionManager@1f88d09 name:ZooKeeperConnection Watcher:127.0.0.1:52140/solr got event WatchedEvent state:SyncConnected type:None path:null path:null type:None
   [junit4]   2> 1295768 INFO  (jetty-launcher-1044-thread-1) [    ] o.a.s.c.c.ConnectionManager Client is connected to ZooKeeper
   [junit4]   2> 1295768 INFO  (zkCallback-1046-thread-1) [    ] o.a.s.c.c.ConnectionManager Watcher org.apache.solr.common.cloud.ConnectionManager@972b42 name:ZooKeeperConnection Watcher:127.0.0.1:52140/solr got event WatchedEvent state:SyncConnected type:None path:null path:null type:None
   [junit4]   2> 1295768 INFO  (jetty-launcher-1044-thread-2) [    ] o.a.s.c.c.ConnectionManager Client is connected to ZooKeeper
   [junit4]   2> 1295769 INFO  (jetty-launcher-1044-thread-1) [    ] o.a.s.c.c.SolrZkClient Using default ZkACLProvider
   [junit4]   2> 1295769 INFO  (jetty-launcher-1044-thread-2) [    ] o.a.s.c.c.SolrZkClient Using default ZkACLProvider
   [junit4]   2> 1295769 INFO  (jetty-launcher-1044-thread-1) [    ] o.a.s.s.SolrDispatchFilter solr.xml found in ZooKeeper. Loading...
   [junit4]   2> 1295770 INFO  (jetty-launcher-1044-thread-2) [    ] o.a.s.s.SolrDispatchFilter solr.xml found in ZooKeeper. Loading...
   [junit4]   2> 1295817 WARN  (NIOServerCxn.Factory:0.0.0.0/0.0.0.0:0) [    ] o.a.z.s.NIOServerCnxn caught end of stream exception
   [junit4]   2> EndOfStreamException: Unable to read additional data from client sessionid 0x15471385f1c0002, likely client has closed socket
   [junit4]   2> 	at org.apache.zookeeper.server.NIOServerCnxn.doIO(NIOServerCnxn.java:228)
   [junit4]   2> 	at org.apache.zookeeper.server.NIOServerCnxnFactory.run(NIOServerCnxnFactory.java:208)
   [junit4]   2> 	at java.lang.Thread.run(Thread.java:745)
   [junit4]   2> 1295817 INFO  (jetty-launcher-1044-thread-2) [    ] o.a.s.c.CorePropertiesLocator Config-defined core root directory: C:\Users\jenkins\workspace\Lucene-Solr-6.x-Windows\solr\build\solr-core\test\J0\temp\solr.schema.TestManagedSchemaAPI_683C4E53BDFACF9A-001\tempDir-001\node2\.
   [junit4]   2> 1295818 INFO  (jetty-launcher-1044-thread-2) [    ] o.a.s.c.CoreContainer New CoreContainer 5313139
   [junit4]   2> 1295818 INFO  (jetty-launcher-1044-thread-2) [    ] o.a.s.c.CoreContainer Loading cores into CoreContainer [instanceDir=C:\Users\jenkins\workspace\Lucene-Solr-6.x-Windows\solr\build\solr-core\test\J0\temp\solr.schema.TestManagedSchemaAPI_683C4E53BDFACF9A-001\tempDir-001\node2]
   [junit4]   2> 1295818 WARN  (jetty-launcher-1044-thread-2) [    ] o.a.s.c.CoreContainer Couldn't add files from C:\Users\jenkins\workspace\Lucene-Solr-6.x-Windows\solr\build\solr-core\test\J0\temp\solr.schema.TestManagedSchemaAPI_683C4E53BDFACF9A-001\tempDir-001\node2\lib to classpath: C:\Users\jenkins\workspace\Lucene-Solr-6.x-Windows\solr\build\solr-core\test\J0\temp\solr.schema.TestManagedSchemaAPI_683C4E53BDFACF9A-001\tempDir-001\node2\lib
   [junit4]   2> 1295818 INFO  (jetty-launcher-1044-thread-2) [    ] o.a.s.h.c.HttpShardHandlerFactory created with socketTimeout : 90000,urlScheme : https,connTimeout : 15000,maxConnectionsPerHost : 20,maxConnections : 10000,corePoolSize : 0,maximumPoolSize : 2147483647,maxThreadIdleTime : 5,sizeOfQueue : -1,fairnessPolicy : false,useRetries : false,
   [junit4]   2> 1295820 WARN  (NIOServerCxn.Factory:0.0.0.0/0.0.0.0:0) [    ] o.a.z.s.NIOServerCnxn caught end of stream exception
   [junit4]   2> EndOfStreamException: Unable to read additional data from client sessionid 0x15471385f1c0001, likely client has closed socket
   [junit4]   2> 	at org.apache.zookeeper.server.NIOServerCnxn.doIO(NIOServerCnxn.java:228)
   [junit4]   2> 	at org.apache.zookeeper.server.NIOServerCnxnFactory.run(NIOServerCnxnFactory.java:208)
   [junit4]   2> 	at java.lang.Thread.run(Thread.java:745)
   [junit4]   2> 1295824 INFO  (jetty-launcher-1044-thread-1) [    ] o.a.s.c.CorePropertiesLocator Config-defined core root directory: C:\Users\jenkins\workspace\Lucene-Solr-6.x-Windows\solr\build\solr-core\test\J0\temp\solr.schema.TestManagedSchemaAPI_683C4E53BDFACF9A-001\tempDir-001\node1\.
   [junit4]   2> 1295826 INFO  (jetty-launcher-1044-thread-1) [    ] o.a.s.c.CoreContainer New CoreContainer 23277866
   [junit4]   2> 1295826 INFO  (jetty-launcher-1044-thread-1) [    ] o.a.s.c.CoreContainer Loading cores into CoreContainer [instanceDir=C:\Users\jenkins\workspace\Lucene-Solr-6.x-Windows\solr\build\solr-core\test\J0\temp\solr.schema.TestManagedSchemaAPI_683C4E53BDFACF9A-001\tempDir-001\node1]
   [junit4]   2> 1295827 WARN  (jetty-launcher-1044-thread-1) [    ] o.a.s.c.CoreContainer Couldn't add files from C:\Users\jenkins\workspace\Lucene-Solr-6.x-Windows\solr\build\solr-core\test\J0\temp\solr.schema.TestManagedSchemaAPI_683C4E53BDFACF9A-001\tempDir-001\node1\lib to classpath: C:\Users\jenkins\workspace\Lucene-Solr-6.x-Windows\solr\build\solr-core\test\J0\temp\solr.schema.TestManagedSchemaAPI_683C4E53BDFACF9A-001\tempDir-001\node1\lib
   [junit4]   2> 1295828 INFO  (jetty-launcher-1044-thread-1) [    ] o.a.s.h.c.HttpShardHandlerFactory created with socketTimeout : 90000,urlScheme : https,connTimeout : 15000,maxConnectionsPerHost : 20,maxConnections : 10000,corePoolSize : 0,maximumPoolSize : 2147483647,maxThreadIdleTime : 5,sizeOfQueue : -1,fairnessPolicy : false,useRetries : false,
   [junit4]   2> 1295830 INFO  (jetty-launcher-1044-thread-1) [    ] o.a.s.u.UpdateShardHandler Creating UpdateShardHandler HTTP client with params: socketTimeout=340000&connTimeout=45000&retry=true
   [junit4]   2> 1295831 INFO  (jetty-launcher-1044-thread-1) [    ] o.a.s.l.LogWatcher SLF4J impl is org.slf4j.impl.Log4jLoggerFactory
   [junit4]   2> 1295831 INFO  (jetty-launcher-1044-thread-1) [    ] o.a.s.l.LogWatcher Registering Log Listener [Log4j (org.slf4j.impl.Log4jLoggerFactory)]
   [junit4]   2> 1295831 INFO  (jetty-launcher-1044-thread-2) [    ] o.a.s.u.UpdateShardHandler Creating UpdateShardHandler HTTP client with params: socketTimeout=340000&connTimeout=45000&retry=true
   [junit4]   2> 1295832 INFO  (jetty-launcher-1044-thread-1) [    ] o.a.s.c.ZkContainer Zookeeper client=127.0.0.1:52140/solr
   [junit4]   2> 1295833 INFO  (jetty-launcher-1044-thread-1) [    ] o.a.s.c.ZkController zkHost includes chroot
   [junit4]   2> 1295833 INFO  (jetty-launcher-1044-thread-1) [    ] o.a.s.c.c.SolrZkClient Using default ZkCredentialsProvider
   [junit4]   2> 1295833 INFO  (jetty-launcher-1044-thread-2) [    ] o.a.s.l.LogWatcher SLF4J impl is org.slf4j.impl.Log4jLoggerFactory
   [junit4]   2> 1295834 INFO  (jetty-launcher-1044-thread-2) [    ] o.a.s.l.LogWatcher Registering Log Listener [Log4j (org.slf4j.impl.Log4jLoggerFactory)]
   [junit4]   2> 1295834 INFO  (jetty-launcher-1044-thread-2) [    ] o.a.s.c.ZkContainer Zookeeper client=127.0.0.1:52140/solr
   [junit4]   2> 1295834 INFO  (jetty-launcher-1044-thread-2) [    ] o.a.s.c.ZkController zkHost includes chroot
   [junit4]   2> 1295834 INFO  (jetty-launcher-1044-thread-2) [    ] o.a.s.c.c.SolrZkClient Using default ZkCredentialsProvider
   [junit4]   2> 1295835 INFO  (jetty-launcher-1044-thread-1) [    ] o.a.s.c.c.ConnectionManager Waiting for client to connect to ZooKeeper
   [junit4]   2> 1295836 INFO  (jetty-launcher-1044-thread-2) [    ] o.a.s.c.c.ConnectionManager Waiting for client to connect to ZooKeeper
   [junit4]   2> 1295842 INFO  (zkCallback-1052-thread-1) [    ] o.a.s.c.c.ConnectionManager Watcher org.apache.solr.common.cloud.ConnectionManager@be08c name:ZooKeeperConnection Watcher:127.0.0.1:52140 got event WatchedEvent state:SyncConnected type:None path:null path:null type:None
   [junit4]   2> 1295843 INFO  (zkCallback-1053-thread-1) [    ] o.a.s.c.c.ConnectionManager Watcher org.apache.solr.common.cloud.ConnectionManager@6dd94d name:ZooKeeperConnection Watcher:127.0.0.1:52140 got event WatchedEvent state:SyncConnected type:None path:null path:null type:None
   [junit4]   2> 1295843 INFO  (jetty-launcher-1044-thread-2) [    ] o.a.s.c.c.ConnectionManager Client is connected to ZooKeeper
   [junit4]   2> 1295843 INFO  (jetty-launcher-1044-thread-1) [    ] o.a.s.c.c.ConnectionManager Client is connected to ZooKeeper
   [junit4]   2> 1295843 INFO  (jetty-launcher-1044-thread-2) [    ] o.a.s.c.c.SolrZkClient Using default ZkACLProvider
   [junit4]   2> 1295843 INFO  (jetty-launcher-1044-thread-1) [    ] o.a.s.c.c.SolrZkClient Using default ZkACLProvider
   [junit4]   2> 1295846 WARN  (NIOServerCxn.Factory:0.0.0.0/0.0.0.0:0) [    ] o.a.z.s.NIOServerCnxn caught end of stream exception
   [junit4]   2> EndOfStreamException: Unable to read additional data from client sessionid 0x15471385f1c0003, likely client has closed socket
   [junit4]   2> 	at org.apache.zookeeper.server.NIOServerCnxn.doIO(NIOServerCnxn.java:228)
   [junit4]   2> 	at org.apache.zookeeper.server.NIOServerCnxnFactory.run(NIOServerCnxnFactory.java:208)
   [junit4]   2> 	at java.lang.Thread.run(Thread.java:745)
   [junit4]   2> 1295847 INFO  (jetty-launcher-1044-thread-1) [n:127.0.0.1:52147_solr    ] o.a.s.c.ZkController Added new OnReconnect listener org.apache.solr.cloud.ZkController$$Lambda$62/11118516@1fb94f0
   [junit4]   2> 1295849 INFO  (jetty-launcher-1044-thread-2) [n:127.0.0.1:52144_solr    ] o.a.s.c.ZkController Added new OnReconnect listener org.apache.solr.cloud.ZkController$$Lambda$62/11118516@6d1559
   [junit4]   2> 1295850 INFO  (jetty-launcher-1044-thread-1) [n:127.0.0.1:52147_solr    ] o.a.s.c.c.ConnectionManager Waiting for client to connect to ZooKeeper
   [junit4]   2> 1295851 INFO  (jetty-launcher-1044-thread-2) [n:127.0.0.1:52144_solr    ] o.a.s.c.c.ConnectionManager Waiting for client to connect to ZooKeeper
   [junit4]   2> 1295853 INFO  (zkCallback-1054-thread-1-processing-n:127.0.0.1:52147_solr) [n:127.0.0.1:52147_solr    ] o.a.s.c.c.ConnectionManager Watcher org.apache.solr.common.cloud.ConnectionManager@37568a name:ZooKeeperConnection Watcher:127.0.0.1:52140/solr got event WatchedEvent state:SyncConnected type:None path:null path:null type:None
   [junit4]   2> 1295853 INFO  (jetty-launcher-1044-thread-1) [n:127.0.0.1:52147_solr    ] o.a.s.c.c.ConnectionManager Client is connected to ZooKeeper
   [junit4]   2> 1295857 INFO  (jetty-launcher-1044-thread-1) [n:127.0.0.1:52147_solr    ] o.a.s.c.c.SolrZkClient makePath: /overseer/queue
   [junit4]   2> 1295858 INFO  (zkCallback-1055-thread-1-processing-n:127.0.0.1:52144_solr) [n:127.0.0.1:52144_solr    ] o.a.s.c.c.ConnectionManager Watcher org.apache.solr.common.cloud.ConnectionManager@18b7ef3 name:ZooKeeperConnection Watcher:127.0.0.1:52140/solr got event WatchedEvent state:SyncConnected type:None path:null path:null type:None
   [junit4]   2> 1295858 INFO  (jetty-launcher-1044-thread-2) [n:127.0.0.1:52144_solr    ] o.a.s.c.c.ConnectionManager Client is connected to ZooKeeper
   [junit4]   2> 1295865 INFO  (jetty-launcher-1044-thread-2) [n:127.0.0.1:52144_solr    ] o.a.s.c.c.SolrZkClient makePath: /overseer/collection-queue-work
   [junit4]   2> 1295865 INFO  (jetty-launcher-1044-thread-1) [n:127.0.0.1:52147_solr    ] o.a.s.c.c.SolrZkClient makePath: /overseer/collection-queue-work
   [junit4]   2> 1295875 INFO  (jetty-launcher-1044-thread-1) [n:127.0.0.1:52147_solr    ] o.a.s.c.c.SolrZkClient makePath: /overseer/collection-map-running
   [junit4]   2> 1295881 INFO  (jetty-launcher-1044-thread-1) [n:127.0.0.1:52147_solr    ] o.a.s.c.c.SolrZkClient makePath: /overseer/collection-map-completed
   [junit4]   2> 1295882 INFO  (jetty-launcher-1044-thread-2) [n:127.0.0.1:52144_solr    ] o.a.s.c.c.SolrZkClient makePath: /overseer/collection-map-completed
   [junit4]   2> 1295889 INFO  (jetty-launcher-1044-thread-1) [n:127.0.0.1:52147_solr    ] o.a.s.c.c.SolrZkClient makePath: /overseer/collection-map-failure
   [junit4]   2> 1295891 INFO  (jetty-launcher-1044-thread-2) [n:127.0.0.1:52144_solr    ] o.a.s.c.c.SolrZkClient makePath: /overseer/collection-map-failure
   [junit4]   2> 1295896 INFO  (jetty-launcher-1044-thread-1) [n:127.0.0.1:52147_solr    ] o.a.s.c.c.SolrZkClient makePath: /live_nodes
   [junit4]   2> 1295900 INFO  (jetty-launcher-1044-thread-1) [n:127.0.0.1:52147_solr    ] o.a.s.c.c.SolrZkClient makePath: /collections
   [junit4]   2> 1295900 INFO  (jetty-launcher-1044-thread-2) [n:127.0.0.1:52144_solr    ] o.a.s.c.c.SolrZkClient makePath: /collections
   [junit4]   2> 1295904 INFO  (jetty-launcher-1044-thread-1) [n:127.0.0.1:52147_solr    ] o.a.s.c.c.SolrZkClient makePath: /aliases.json
   [junit4]   2> 1295904 INFO  (jetty-launcher-1044-thread-2) [n:127.0.0.1:52144_solr    ] o.a.s.c.c.SolrZkClient makePath: /aliases.json
   [junit4]   2> 1295907 INFO  (jetty-launcher-1044-thread-1) [n:127.0.0.1:52147_solr    ] o.a.s.c.c.SolrZkClient makePath: /clusterstate.json
   [junit4]   2> 1295911 INFO  (jetty-launcher-1044-thread-1) [n:127.0.0.1:52147_solr    ] o.a.s.c.c.SolrZkClient makePath: /security.json
   [junit4]   2> 1295912 INFO  (jetty-launcher-1044-thread-2) [n:127.0.0.1:52144_solr    ] o.a.s.c.c.SolrZkClient makePath: /security.json
   [junit4]   2> 1295914 INFO  (jetty-launcher-1044-thread-1) [n:127.0.0.1:52147_solr    ] o.a.s.c.c.ZkStateReader Updating cluster state from ZooKeeper... 
   [junit4]   2> 1295915 INFO  (jetty-launcher-1044-thread-2) [n:127.0.0.1:52144_solr    ] o.a.s.c.c.ZkStateReader Updating cluster state from ZooKeeper... 
   [junit4]   2> 1295918 INFO  (jetty-launcher-1044-thread-1) [n:127.0.0.1:52147_solr    ] o.a.s.c.c.ZkStateReader Updated live nodes from ZooKeeper... (0) -> (0)
   [junit4]   2> 1295919 INFO  (jetty-launcher-1044-thread-2) [n:127.0.0.1:52144_solr    ] o.a.s.c.c.ZkStateReader Updated live nodes from ZooKeeper... (0) -> (0)
   [junit4]   2> 1295925 INFO  (jetty-launcher-1044-thread-1) [n:127.0.0.1:52147_solr    ] o.a.s.c.c.SolrZkClient makePath: /overseer_elect
   [junit4]   2> 1295926 INFO  (jetty-launcher-1044-thread-2) [n:127.0.0.1:52144_solr    ] o.a.s.c.c.SolrZkClient makePath: /overseer_elect
   [junit4]   2> 1295930 INFO  (jetty-launcher-1044-thread-1) [n:127.0.0.1:52147_solr    ] o.a.s.c.c.SolrZkClient makePath: /overseer_elect/election
   [junit4]   2> 1295933 INFO  (jetty-launcher-1044-thread-2) [n:127.0.0.1:52144_solr    ] o.a.s.c.c.SolrZkClient makePath: /overseer_elect/election
   [junit4]   2> 1295934 INFO  (jetty-launcher-1044-thread-1) [n:127.0.0.1:52147_solr    ] o.a.s.c.Overseer Overseer (id=null) closing
   [junit4]   2> 1295935 INFO  (jetty-launcher-1044-thread-1) [n:127.0.0.1:52147_solr    ] o.a.s.c.LeaderElector Joined leadership election with path: /overseer_elect/election/95825979009400837-127.0.0.1:52147_solr-n_0000000000
   [junit4]   2> 1295936 INFO  (jetty-launcher-1044-thread-2) [n:127.0.0.1:52144_solr    ] o.a.s.c.Overseer Overseer (id=null) closing
   [junit4]   2> 1295937 INFO  (jetty-launcher-1044-thread-1) [n:127.0.0.1:52147_solr    ] o.a.s.c.OverseerElectionContext I am going to be the leader 127.0.0.1:52147_solr
   [junit4]   2> 1295938 INFO  (jetty-launcher-1044-thread-1) [n:127.0.0.1:52147_solr    ] o.a.s.c.c.SolrZkClient makePath: /overseer_elect/leader
   [junit4]   2> 1295938 INFO  (jetty-launcher-1044-thread-2) [n:127.0.0.1:52144_solr    ] o.a.s.c.LeaderElector Joined leadership election with path: /overseer_elect/election/95825979009400838-127.0.0.1:52144_solr-n_0000000001
   [junit4]   2> 1295941 INFO  (jetty-launcher-1044-thread-2) [n:127.0.0.1:52144_solr    ] o.a.s.c.LeaderElector Watching path /overseer_elect/election/95825979009400837-127.0.0.1:52147_solr-n_0000000000 to know if I could be the leader
   [junit4]   2> 1295942 INFO  (jetty-launcher-1044-thread-1) [n:127.0.0.1:52147_solr    ] o.a.s.c.Overseer Overseer (id=95825979009400837-127.0.0.1:52147_solr-n_0000000000) starting
   [junit4]   2> 1295942 INFO  (jetty-launcher-1044-thread-2) [n:127.0.0.1:52144_solr    ] o.a.s.c.ZkController Register node as live in ZooKeeper:/live_nodes/127.0.0.1:52144_solr
   [junit4]   2> 1295945 INFO  (jetty-launcher-1044-thread-2) [n:127.0.0.1:52144_solr    ] o.a.s.c.c.SolrZkClient makePath: /live_nodes/127.0.0.1:52144_solr
   [junit4]   2> 1295947 INFO  (jetty-launcher-1044-thread-1) [n:127.0.0.1:52147_solr    ] o.a.s.c.c.SolrZkClient makePath: /overseer/queue-work
   [junit4]   2> 1295950 INFO  (zkCallback-1054-thread-1-processing-n:127.0.0.1:52147_solr) [n:127.0.0.1:52147_solr    ] o.a.s.c.c.ZkStateReader A live node change: [WatchedEvent state:SyncConnected type:NodeChildrenChanged path:/live_nodes], has occurred - updating... (live nodes size: [0])
   [junit4]   2> 1295950 INFO  (zkCallback-1055-thread-1-processing-n:127.0.0.1:52144_solr) [n:127.0.0.1:52144_solr    ] o.a.s.c.c.ZkStateReader A live node change: [WatchedEvent state:SyncConnected type:NodeChildrenChanged path:/live_nodes], has occurred - updating... (live nodes size: [0])
   [junit4]   2> 1295951 INFO  (zkCallback-1054-thread-1-processing-n:127.0.0.1:52147_solr) [n:127.0.0.1:52147_solr    ] o.a.s.c.c.ZkStateReader Updated live nodes from ZooKeeper... (0) -> (1)
   [junit4]   2> 1295952 INFO  (zkCallback-1055-thread-1-processing-n:127.0.0.1:52144_solr) [n:127.0.0.1:52144_solr    ] o.a.s.c.c.ZkStateReader Updated live nodes from ZooKeeper... (0) -> (1)
   [junit4]   2> 1295974 INFO  (jetty-launcher-1044-thread-1) [n:127.0.0.1:52147_solr    ] o.a.s.c.OverseerAutoReplicaFailoverThread Starting OverseerAutoReplicaFailoverThread autoReplicaFailoverWorkLoopDelay=10000 autoReplicaFailoverWaitAfterExpiration=30000 autoReplicaFailoverBadNodeExpiration=60000
   [junit4]   2> 1295975 INFO  (jetty-launcher-1044-thread-1) [n:127.0.0.1:52147_solr    ] o.a.s.c.ZkController Publish node=127.0.0.1:52147_solr as DOWN
   [junit4]   2> 1295976 INFO  (OverseerCollectionConfigSetProcessor-95825979009400837-127.0.0.1:52147_solr-n_0000000000) [n:127.0.0.1:52147_solr    ] o.a.s.c.OverseerTaskProcessor Process current queue of overseer operations
   [junit4]   2> 1295978 INFO  (OverseerStateUpdate-95825979009400837-127.0.0.1:52147_solr-n_0000000000) [n:127.0.0.1:52147_solr    ] o.a.s.c.Overseer Starting to work on the main queue
   [junit4]   2> 1295988 INFO  (OverseerStateUpdate-95825979009400837-127.0.0.1:52147_solr-n_0000000000) [n:127.0.0.1:52147_solr    ] o.a.s.c.c.ZkStateReader Updated live nodes from ZooKeeper... (1) -> (1)
   [junit4]   2> 1295996 INFO  (OverseerStateUpdate-95825979009400837-127.0.0.1:52147_solr-n_0000000000) [n:127.0.0.1:52147_solr    ] o.a.s.c.Overseer processMessage: queueSize: 1, message = {
   [junit4]   2>   "operation":"downnode",
   [junit4]   2>   "node_name":"127.0.0.1:52147_solr"} current state version: 0
   [junit4]   2> 1295996 INFO  (OverseerStateUpdate-95825979009400837-127.0.0.1:52147_solr-n_0000000000) [n:127.0.0.1:52147_solr    ] o.a.s.c.o.NodeMutator DownNode state invoked for node: 127.0.0.1:52147_solr
   [junit4]   2> 1296007 INFO  (jetty-launcher-1044-thread-2) [n:127.0.0.1:52144_solr    ] o.a.s.c.CoreContainer Security conf doesn't exist. Skipping setup for authorization module.
   [junit4]   2> 1296007 INFO  (jetty-launcher-1044-thread-2) [n:127.0.0.1:52144_solr    ] o.a.s.c.CoreContainer No authentication plugin used.
   [junit4]   2> 1296009 INFO  (jetty-launcher-1044-thread-2) [n:127.0.0.1:52144_solr    ] o.a.s.c.CorePropertiesLocator Looking for core definitions underneath C:\Users\jenkins\workspace\Lucene-Solr-6.x-Windows\solr\build\solr-core\test\J0\temp\solr.schema.TestManagedSchemaAPI_683C4E53BDFACF9A-001\tempDir-001\node2\.
   [junit4]   2> 1296011 INFO  (jetty-launcher-1044-thread-2) [n:127.0.0.1:52144_solr    ] o.a.s.c.CorePropertiesLocator Found 0 core definitions
   [junit4]   2> 1296012 INFO  (jetty-launcher-1044-thread-2) [n:127.0.0.1:52144_solr    ] o.a.s.s.SolrDispatchFilter user.dir=C:\Users\jenkins\workspace\Lucene-Solr-6.x-Windows\solr\build\solr-core\test\J0
   [junit4]   2> 1296012 INFO  (jetty-launcher-1044-thread-2) [n:127.0.0.1:52144_solr    ] o.a.s.s.SolrDispatchFilter SolrDispatchFilter.init() done
   [junit4]   2> 1296980 INFO  (jetty-launcher-1044-thread-1) [n:127.0.0.1:52147_solr    ] o.a.s.c.ZkController Register node as live in ZooKeeper:/live_nodes/127.0.0.1:52147_solr
   [junit4]   2> 1296981 INFO  (jetty-launcher-1044-thread-1) [n:127.0.0.1:52147_solr    ] o.a.s.c.c.SolrZkClient makePath: /live_nodes/127.0.0.1:52147_solr
   [junit4]   2> 1296988 INFO  (zkCallback-1055-thread-1-processing-n:127.0.0.1:52144_solr) [n:127.0.0.1:52144_solr    ] o.a.s.c.c.ZkStateReader A live node change: [WatchedEvent state:SyncConnected type:NodeChildrenChanged path:/live_nodes], has occurred - updating... (live nodes size: [1])
   [junit4]   2> 1296990 INFO  (zkCallback-1054-thread-1-processing-n:127.0.0.1:52147_solr) [n:127.0.0.1:52147_solr    ] o.a.s.c.c.ZkStateReader A live node change: [WatchedEvent state:SyncConnected type:NodeChildrenChanged path:/live_nodes], has occurred - updating... (live nodes size: [1])
   [junit4]   2> 1296990 INFO  (zkCallback-1055-thread-1-processing-n:127.0.0.1:52144_solr) [n:127.0.0.1:52144_solr    ] o.a.s.c.c.ZkStateReader Updated live nodes from ZooKeeper... (1) -> (2)
   [junit4]   2> 1296993 INFO  (zkCallback-1054-thread-1-processing-n:127.0.0.1:52147_solr) [n:127.0.0.1:52147_solr    ] o.a.s.c.c.ZkStateReader Updated live nodes from ZooKeeper... (1) -> (2)
   [junit4]   2> 1297027 INFO  (jetty-launcher-1044-thread-1) [n:127.0.0.1:52147_solr    ] o.a.s.c.CoreContainer Security conf doesn't exist. Skipping setup for authorization module.
   [junit4]   2> 1297027 INFO  (jetty-launcher-1044-thread-1) [n:127.0.0.1:52147_solr    ] o.a.s.c.CoreContainer No authentication plugin used.
   [junit4]   2> 1297030 INFO  (jetty-launcher-1044-thread-1) [n:127.0.0.1:52147_solr    ] o.a.s.c.CorePropertiesLocator Looking for core definitions underneath C:\Users\jenkins\workspace\Lucene-Solr-6.x-Windows\solr\build\solr-core\test\J0\temp\solr.schema.TestManagedSchemaAPI_683C4E53BDFACF9A-001\tempDir-001\node1\.
   [junit4]   2> 1297031 INFO  (jetty-launcher-1044-thread-1) [n:127.0.0.1:52147_solr    ] o.a.s.c.CorePropertiesLocator Found 0 core definitions
   [junit4]   2> 1297033 INFO  (jetty-launcher-1044-thread-1) [n:127.0.0.1:52147_solr    ] o.a.s.s.SolrDispatchFilter user.dir=C:\Users\jenkins\workspace\Lucene-Solr-6.x-Windows\solr\build\solr-core\test\J0
   [junit4]   2> 1297033 INFO  (jetty-launcher-1044-thread-1) [n:127.0.0.1:52147_solr    ] o.a.s.s.SolrDispatchFilter SolrDispatchFilter.init() done
   [junit4]   2> 1297033 INFO  (SUITE-TestManagedSchemaAPI-seed#[683C4E53BDFACF9A]-worker) [    ] o.a.s.c.c.SolrZkClient Using default ZkCredentialsProvider
   [junit4]   2> 1297036 INFO  (SUITE-TestManagedSchemaAPI-seed#[683C4E53BDFACF9A]-worker) [    ] o.a.s.c.c.ConnectionManager Waiting for client to connect to ZooKeeper
   [junit4]   2> 1297041 INFO  (zkCallback-1056-thread-1) [    ] o.a.s.c.c.ConnectionManager Watcher org.apache.solr.common.cloud.ConnectionManager@134a677 name:ZooKeeperConnection Watcher:127.0.0.1:52140 got event WatchedEvent state:SyncConnected type:None path:null path:null type:None
   [junit4]   2> 1297041 INFO  (SUITE-TestManagedSchemaAPI-seed#[683C4E53BDFACF9A]-worker) [    ] o.a.s.c.c.ConnectionManager Client is connected to ZooKeeper
   [junit4]   2> 1297041 INFO  (SUITE-TestManagedSchemaAPI-seed#[683C4E53BDFACF9A]-worker) [    ] o.a.s.c.c.SolrZkClient Using default ZkACLProvider
   [junit4]   2> 1297044 WARN  (NIOServerCxn.Factory:0.0.0.0/0.0.0.0:0) [    ] o.a.z.s.NIOServerCnxn caught end of stream exception
   [junit4]   2> EndOfStreamException: Unable to read additional data from client sessionid 0x15471385f1c0007, likely client has closed socket
   [junit4]   2> 	at org.apache.zookeeper.server.NIOServerCnxn.doIO(NIOServerCnxn.java:228)
   [junit4]   2> 	at org.apache.zookeeper.server.NIOServerCnxnFactory.run(NIOServerCnxnFactory.java:208)
   [junit4]   2> 	at java.lang.Thread.run(Thread.java:745)
   [junit4]   2> 1297046 INFO  (SUITE-TestManagedSchemaAPI-seed#[683C4E53BDFACF9A]-worker) [    ] o.a.s.c.s.i.CloudSolrClient Final constructed zkHost string: 127.0.0.1:52140/solr
   [junit4]   2> 1297046 INFO  (SUITE-TestManagedSchemaAPI-seed#[683C4E53BDFACF9A]-worker) [    ] o.a.s.c.c.SolrZkClient Using default ZkCredentialsProvider
   [junit4]   2> 1297047 INFO  (SUITE-TestManagedSchemaAPI-seed#[683C4E53BDFACF9A]-worker) [    ] o.a.s.c.c.ConnectionManager Waiting for client to connect to ZooKeeper
   [junit4]   2> 1297051 INFO  (zkCallback-1058-thread-1) [    ] o.a.s.c.c.ConnectionManager Watcher org.apache.solr.common.cloud.ConnectionManager@125c890 name:ZooKeeperConnection Watcher:127.0.0.1:52140/solr got event WatchedEvent state:SyncConnected type:None path:null path:null type:None
   [junit4]   2> 1297051 INFO  (SUITE-TestManagedSchemaAPI-seed#[683C4E53BDFACF9A]-worker) [    ] o.a.s.c.c.ConnectionManager Client is connected to ZooKeeper
   [junit4]   2> 1297053 INFO  (SUITE-TestManagedSchemaAPI-seed#[683C4E53BDFACF9A]-worker) [    ] o.a.s.c.c.SolrZkClient Using default ZkACLProvider
   [junit4]   2> 1297053 INFO  (SUITE-TestManagedSchemaAPI-seed#[683C4E53BDFACF9A]-worker) [    ] o.a.s.c.c.ZkStateReader Updating cluster state from ZooKeeper... 
   [junit4]   2> 1297056 INFO  (SUITE-TestManagedSchemaAPI-seed#[683C4E53BDFACF9A]-worker) [    ] o.a.s.c.c.ZkStateReader Updated live nodes from ZooKeeper... (0) -> (2)
   [junit4]   2> 1297060 INFO  (SUITE-TestManagedSchemaAPI-seed#[683C4E53BDFACF9A]-worker) [    ] o.a.s.c.c.SolrZkClient makePath: /configs/conf1/managed-schema
   [junit4]   2> 1297066 INFO  (SUITE-TestManagedSchemaAPI-seed#[683C4E53BDFACF9A]-worker) [    ] o.a.s.c.c.SolrZkClient makePath: /configs/conf1/solrconfig.xml
   [junit4]   2> 1297090 INFO  (TEST-TestManagedSchemaAPI.test-seed#[683C4E53BDFACF9A]) [    ] o.a.s.SolrTestCaseJ4 ###Starting test
   [junit4]   2> 1297175 INFO  (qtp33200825-7398) [n:127.0.0.1:52147_solr    ] o.a.s.h.a.CollectionsHandler Invoked Collection Action :create with params replicationFactor=2&collection.configName=conf1&name=testschemaapi&action=CREATE&numShards=1&wt=javabin&version=2 and sendToOCPQueue=true
   [junit4]   2> 1297181 INFO  (OverseerCollectionConfigSetProcessor-95825979009400837-127.0.0.1:52147_solr-n_0000000000) [n:127.0.0.1:52147_solr    ] o.a.s.c.OverseerTaskProcessor Overseer Collection Message Handler: Get the message id:/overseer/collection-queue-work/qn-0000000000 message:{
   [junit4]   2>   "name":"testschemaapi",
   [junit4]   2>   "fromApi":"true",
   [junit4]   2>   "replicationFactor":"2",
   [junit4]   2>   "collection.configName":"conf1",
   [junit4]   2>   "numShards":"1",
   [junit4]   2>   "stateFormat":"2",
   [junit4]   2>   "operation":"create"}
   [junit4]   2> 1297185 INFO  (OverseerThreadFactory-3577-thread-1-processing-n:127.0.0.1:52147_solr) [n:127.0.0.1:52147_solr    ] o.a.s.c.OverseerCollectionMessageHandler OverseerCollectionMessageHandler.processMessage : create , {
   [junit4]   2>   "name":"testschemaapi",
   [junit4]   2>   "fromApi":"true",
   [junit4]   2>   "replicationFactor":"2",
   [junit4]   2>   "collection.configName":"conf1",
   [junit4]   2>   "numShards":"1",
   [junit4]   2>   "stateFormat":"2",
   [junit4]   2>   "operation":"create"}
   [junit4]   2> 1297185 INFO  (OverseerThreadFactory-3577-thread-1-processing-n:127.0.0.1:52147_solr) [n:127.0.0.1:52147_solr    ] o.a.s.c.OverseerCollectionMessageHandler Create collection testschemaapi
   [junit4]   2> 1297188 INFO  (OverseerThreadFactory-3577-thread-1-processing-n:127.0.0.1:52147_solr) [n:127.0.0.1:52147_solr    ] o.a.s.c.OverseerCollectionMessageHandler creating collections conf node /collections/testschemaapi 
   [junit4]   2> 1297190 INFO  (OverseerThreadFactory-3577-thread-1-processing-n:127.0.0.1:52147_solr) [n:127.0.0.1:52147_solr    ] o.a.s.c.c.SolrZkClient makePath: /collections/testschemaapi
   [junit4]   2> 1297192 INFO  (zkCallback-1055-thread-1-processing-n:127.0.0.1:52144_solr) [n:127.0.0.1:52144_solr    ] o.a.s.c.c.ZkStateReader A collections change: [WatchedEvent state:SyncConnected type:NodeChildrenChanged path:/collections], has occurred - updating...
   [junit4]   2> 1297192 INFO  (zkCallback-1054-thread-1-processing-n:127.0.0.1:52147_solr) [n:127.0.0.1:52147_solr    ] o.a.s.c.c.ZkStateReader A collections change: [WatchedEvent state:SyncConnected type:NodeChildrenChanged path:/collections], has occurred - updating...
   [junit4]   2> 1297192 INFO  (zkCallback-1058-thread-1) [    ] o.a.s.c.c.ZkStateReader A collections change: [WatchedEvent state:SyncConnected type:NodeChildrenChanged path:/collections], has occurred - updating...
   [junit4]   2> 1297198 INFO  (OverseerStateUpdate-95825979009400837-127.0.0.1:52147_solr-n_0000000000) [n:127.0.0.1:52147_solr    ] o.a.s.c.Overseer processMessage: queueSize: 1, message = {
   [junit4]   2>   "name":"testschemaapi",
   [junit4]   2>   "fromApi":"true",
   [junit4]   2>   "replicationFactor":"2",
   [junit4]   2>   "collection.configName":"conf1",
   [junit4]   2>   "numShards":"1",
   [junit4]   2>   "stateFormat":"2",
   [junit4]   2>   "operation":"create"} current state version: 0
   [junit4]   2> 1297198 INFO  (OverseerStateUpdate-95825979009400837-127.0.0.1:52147_solr-n_0000000000) [n:127.0.0.1:52147_solr    ] o.a.s.c.o.ClusterStateMutator building a new cName: testschemaapi
   [junit4]   2> 1297201 INFO  (OverseerStateUpdate-95825979009400837-127.0.0.1:52147_solr-n_0000000000) [n:127.0.0.1:52147_solr    ] o.a.s.c.o.ZkStateWriter going to create_collection /collections/testschemaapi/state.json
   [junit4]   2> 1297297 INFO  (OverseerThreadFactory-3577-thread-1-processing-n:127.0.0.1:52147_solr) [n:127.0.0.1:52147_solr    ] o.a.s.c.OverseerCollectionMessageHandler Creating SolrCores for new collection testschemaapi, shardNames [shard1] , replicationFactor : 2
   [junit4]   2> 1297297 INFO  (OverseerThreadFactory-3577-thread-1-processing-n:127.0.0.1:52147_solr) [n:127.0.0.1:52147_solr    ] o.a.s.c.OverseerCollectionMessageHandler Creating core testschemaapi_shard1_replica2 as part of shard shard1 of collection testschemaapi on 127.0.0.1:52147_solr
   [junit4]   2> 1297301 INFO  (OverseerThreadFactory-3577-thread-1-processing-n:127.0.0.1:52147_solr) [n:127.0.0.1:52147_solr    ] o.a.s.c.OverseerCollectionMessageHandler Creating core testschemaapi_shard1_replica1 as part of shard shard1 of collection testschemaapi on 127.0.0.1:52144_solr
   [junit4]   2> 1297320 INFO  (qtp33200825-7379) [n:127.0.0.1:52147_solr    ] o.a.s.h.a.CoreAdminOperation core create command qt=/admin/cores&collection.configName=conf1&name=testschemaapi_shard1_replica2&action=CREATE&numShards=1&collection=testschemaapi&shard=shard1&wt=javabin&version=2
   [junit4]   2> 1297321 INFO  (qtp33200825-7379) [n:127.0.0.1:52147_solr    ] o.a.s.c.CoreDescriptor Created CoreDescriptor: {name=testschemaapi_shard1_replica2, collection.configName=conf1, config=solrconfig.xml, transient=false, schema=schema.xml, loadOnStartup=true, configSetProperties=configsetprops.json, collection=testschemaapi, numShards=1, dataDir=data\, shard=shard1}
   [junit4]   2> 1297341 INFO  (qtp33200825-7379) [n:127.0.0.1:52147_solr c:testschemaapi s:shard1  x:testschemaapi_shard1_replica2] o.a.s.c.ZkController publishing state=down
   [junit4]   2> 1297344 INFO  (qtp33200825-7379) [n:127.0.0.1:52147_solr c:testschemaapi s:shard1  x:testschemaapi_shard1_replica2] o.a.s.c.ZkController Registering watch for collection testschemaapi
   [junit4]   2> 1297344 INFO  (qtp33200825-7379) [n:127.0.0.1:52147_solr c:testschemaapi s:shard1  x:testschemaapi_shard1_replica2] o.a.s.c.c.ZkStateReader addZkWatch [testschemaapi]
   [junit4]   2> 1297346 INFO  (qtp33200825-7379) [n:127.0.0.1:52147_solr c:testschemaapi s:shard1  x:testschemaapi_shard1_replica2] o.a.s.c.c.ZkStateReader Add data for [testschemaapi] ver [0]
   [junit4]   2> 1297346 INFO  (qtp33200825-7379) [n:127.0.0.1:52147_solr c:testschemaapi s:shard1  x:testschemaapi_shard1_replica2] o.a.s.c.ZkController look for our core node name
   [junit4]   2> 1297351 INFO  (OverseerStateUpdate-95825979009400837-127.0.0.1:52147_solr-n_0000000000) [n:127.0.0.1:52147_solr    ] o.a.s.c.Overseer processMessage: queueSize: 1, message = {
   [junit4]   2>   "core":"testschemaapi_shard1_replica2",
   [junit4]   2>   "roles":null,
   [junit4]   2>   "base_url":"https://127.0.0.1:52147/solr",
   [junit4]   2>   "node_name":"127.0.0.1:52147_solr",
   [junit4]   2>   "numShards":"1",
   [junit4]   2>   "state":"down",
   [junit4]   2>   "shard":"shard1",
   [junit4]   2>   "collection":"testschemaapi",
   [junit4]   2>   "operation":"state"} current state version: 0
   [junit4]   2> 1297358 INFO  (OverseerStateUpdate-95825979009400837-127.0.0.1:52147_solr-n_0000000000) [n:127.0.0.1:52147_solr    ] o.a.s.c.o.ReplicaMutator Update state numShards=1 message={
   [junit4]   2>   "core":"testschemaapi_shard1_replica2",
   [junit4]   2>   "roles":null,
   [junit4]   2>   "base_url":"https://127.0.0.1:52147/solr",
   [junit4]   2>   "node_name":"127.0.0.1:52147_solr",
   [junit4]   2>   "numShards":"1",
   [junit4]   2>   "state":"down",
   [junit4]   2>   "shard":"shard1",
   [junit4]   2>   "collection":"testschemaapi",
   [junit4]   2>   "operation":"state"}
   [junit4]   2> 1297402 INFO  (qtp20746163-7391) [n:127.0.0.1:52144_solr    ] o.a.s.h.a.CoreAdminOperation core create command qt=/admin/cores&collection.configName=conf1&name=testschemaapi_shard1_replica1&action=CREATE&numShards=1&collection=testschemaapi&shard=shard1&wt=javabin&version=2
   [junit4]   2> 1297403 INFO  (qtp20746163-7391) [n:127.0.0.1:52144_solr    ] o.a.s.c.CoreDescriptor Created CoreDescriptor: {name=testschemaapi_shard1_replica1, collection.configName=conf1, config=solrconfig.xml, transient=false, schema=schema.xml, loadOnStartup=true, configSetProperties=configsetprops.json, collection=testschemaapi, numShards=1, dataDir=data\, shard=shard1}
   [junit4]   2> 1297406 INFO  (qtp20746163-7391) [n:127.0.0.1:52144_solr c:testschemaapi s:shard1  x:testschemaapi_shard1_replica1] o.a.s.c.ZkController publishing state=down
   [junit4]   2> 1297409 INFO  (qtp20746163-7391) [n:127.0.0.1:52144_solr c:testschemaapi s:shard1  x:testschemaapi_shard1_replica1] o.a.s.c.ZkController Registering watch for collection testschemaapi
   [junit4]   2> 1297409 INFO  (qtp20746163-7391) [n:127.0.0.1:52144_solr c:testschemaapi s:shard1  x:testschemaapi_shard1_replica1] o.a.s.c.c.ZkStateReader addZkWatch [testschemaapi]
   [junit4]   2> 1297409 INFO  (qtp20746163-7391) [n:127.0.0.1:52144_solr c:testschemaapi s:shard1  x:testschemaapi_shard1_replica1] o.a.s.c.c.ZkStateReader Add data for [testschemaapi] ver [0]
   [junit4]   2> 1297409 INFO  (qtp20746163-7391) [n:127.0.0.1:52144_solr c:testschemaapi s:shard1  x:testschemaapi_shard1_replica1] o.a.s.c.ZkController look for our core node name
   [junit4]   2> 1297410 INFO  (OverseerStateUpdate-95825979009400837-127.0.0.1:52147_solr-n_0000000000) [n:127.0.0.1:52147_solr    ] o.a.s.c.Overseer processMessage: queueSize: 1, message = {
   [junit4]   2>   "core":"testschemaapi_shard1_replica1",
   [junit4]   2>   "roles":null,
   [junit4]   2>   "base_url":"https://127.0.0.1:52144/solr",
   [junit4]   2>   "node_name":"127.0.0.1:52144_solr",
   [junit4]   2>   "numShards":"1",
   [junit4]   2>   "state":"down",
   [junit4]   2>   "shard":"shard1",
   [junit4]   2>   "collection":"testschemaapi",
   [junit4]   2>   "operation":"state"} current state version: 0
   [junit4]   2> 1297412 INFO  (OverseerStateUpdate-95825979009400837-127.0.0.1:52147_solr-n_0000000000) [n:127.0.0.1:52147_solr    ] o.a.s.c.o.ReplicaMutator Update state numShards=1 message={
   [junit4]   2>   "core":"testschemaapi_shard1_replica1",
   [junit4]   2>   "roles":null,
   [junit4]   2>   "base_url":"https://127.0.0.1:52144/solr",
   [junit4]   2>   "node_name":"127.0.0.1:52144_solr",
   [junit4]   2>   "numShards":"1",
   [junit4]   2>   "state":"down",
   [junit4]   2>   "shard":"shard1",
   [junit4]   2>   "collection":"testschemaapi",
   [junit4]   2>   "operation":"state"}
   [junit4]   2> 1297517 INFO  (OverseerStateUpdate-95825979009400837-127.0.0.1:52147_solr-n_0000000000) [n:127.0.0.1:52147_solr    ] o.a.s.c.o.ZkStateWriter going to update_collection /collections/testschemaapi/state.json version: 0
   [junit4]   2> 1297518 INFO  (zkCallback-1055-thread-1-processing-n:127.0.0.1:52144_solr) [n:127.0.0.1:52144_solr    ] o.a.s.c.c.ZkStateReader A cluster state change: [WatchedEvent state:SyncConnected type:NodeDataChanged path:/collections/testschemaapi/state.json] for collection [testschemaapi] has occurred - updating... (live nodes size: [2])
   [junit4]   2> 1297518 INFO  (zkCallback-1054-thread-1-processing-n:127.0.0.1:52147_solr) [n:127.0.0.1:52147_solr    ] o.a.s.c.c.ZkStateReader A cluster state change: [WatchedEvent state:SyncConnected type:NodeDataChanged path:/collections/testschemaapi/state.json] for collection [testschemaapi] has occurred - updating... (live nodes size: [2])
   [junit4]   2> 1297520 INFO  (zkCallback-1055-thread-1-processing-n:127.0.0.1:52144_solr) [n:127.0.0.1:52144_solr    ] o.a.s.c.c.ZkStateReader Updating data for [testschemaapi] from [0] to [1]
   [junit4]   2> 1297520 INFO  (zkCallback-1054-thread-1-processing-n:127.0.0.1:52147_solr) [n:127.0.0.1:52147_solr    ] o.a.s.c.c.ZkStateReader Updating data for [testschemaapi] from [0] to [1]
   [junit4]   2> 1298347 INFO  (qtp33200825-7379) [n:127.0.0.1:52147_solr c:testschemaapi s:shard1  x:testschemaapi_shard1_replica2] o.a.s.c.ZkController waiting to find shard id in clusterstate for testschemaapi_shard1_replica2
   [junit4]   2> 1298347 INFO  (qtp33200825-7379) [n:127.0.0.1:52147_solr c:testschemaapi s:shard1  x:testschemaapi_shard1_replica2] o.a.s.c.ZkController Check for collection zkNode:testschemaapi
   [junit4]   2> 1298350 INFO  (qtp33200825-7379) [n:127.0.0.1:52147_solr c:testschemaapi s:shard1  x:testschemaapi_shard1_replica2] o.a.s.c.ZkController Collection zkNode exists
   [junit4]   2> 1298350 INFO  (qtp33200825-7379) [n:127.0.0.1:52147_solr c:testschemaapi s:shard1  x:testschemaapi_shard1_replica2] o.a.s.c.c.ZkStateReader Load collection config from: [/collections/testschemaapi]
   [junit4]   2> 1298351 INFO  (qtp33200825-7379) [n:127.0.0.1:52147_solr c:testschemaapi s:shard1  x:testschemaapi_shard1_replica2] o.a.s.c.c.ZkStateReader path=[/collections/testschemaapi] [configName]=[conf1] specified config exists in ZooKeeper
   [junit4]   2> 1298352 INFO  (qtp33200825-7379) [n:127.0.0.1:52147_solr c:testschemaapi s:shard1  x:testschemaapi_shard1_replica2] o.a.s.c.SolrResourceLoader new SolrResourceLoader for directory: 'C:\Users\jenkins\workspace\Lucene-Solr-6.x-Windows\solr\build\solr-core\test\J0\temp\solr.schema.TestManagedSchemaAPI_683C4E53BDFACF9A-001\tempDir-001\node1\testschemaapi_shard1_replica2'
   [junit4]   2> 1298352 INFO  (qtp33200825-7379) [n:127.0.0.1:52147_solr c:testschemaapi s:shard1  x:testschemaapi_shard1_replica2] o.a.s.c.SolrResourceLoader JNDI not configured for solr (NoInitialContextEx)
   [junit4]   2> 1298352 INFO  (qtp33200825-7379) [n:127.0.0.1:52147_solr c:testschemaapi s:shard1  x:testschemaapi_shard1_replica2] o.a.s.c.SolrResourceLoader solr home defaulted to 'solr/' (could not find system property or JNDI)
   [junit4]   2> 1298358 INFO  (qtp33200825-7379) [n:127.0.0.1:52147_solr c:testschemaapi s:shard1  x:testschemaapi_shard1_replica2] o.a.s.c.Config loaded config solrconfig.xml with version 0 
   [junit4]   2> 1298375 INFO  (qtp33200825-7379) [n:127.0.0.1:52147_solr c:testschemaapi s:shard1  x:testschemaapi_shard1_replica2] o.a.s.c.SolrConfig current version of requestparams : -1
   [junit4]   2> 1298381 INFO  (qtp33200825-7379) [n:127.0.0.1:52147_solr c:testschemaapi s:shard1  x:testschemaapi_shard1_replica2] o.a.s.c.SolrConfig Using Lucene MatchVersion: 6.1.0
   [junit4]   2> 1298410 INFO  (qtp20746163-7391) [n:127.0.0.1:52144_solr c:testschemaapi s:shard1  x:testschemaapi_shard1_replica1] o.a.s.c.ZkController waiting to find shard id in clusterstate for testschemaapi_shard1_replica1
   [junit4]   2> 1298410 INFO  (qtp20746163-7391) [n:127.0.0.1:52144_solr c:testschemaapi s:shard1  x:testschemaapi_shard1_replica1] o.a.s.c.ZkController Check for collection zkNode:testschemaapi
   [junit4]   2> 1298417 INFO  (qtp20746163-7391) [n:127.0.0.1:52144_solr c:testschemaapi s:shard1  x:testschemaapi_shard1_replica1] o.a.s.c.ZkController Collection zkNode exists
   [junit4]   2> 1298417 INFO  (qtp20746163-7391) [n:127.0.0.1:52144_solr c:testschemaapi s:shard1  x:testschemaapi_shard1_replica1] o.a.s.c.c.ZkStateReader Load collection config from: [/collections/testschemaapi]
   [junit4]   2> 1298422 INFO  (qtp20746163-7391) [n:127.0.0.1:52144_solr c:testschemaapi s:shard1  x:testschemaapi_shard1_replica1] o.a.s.c.c.ZkStateReader path=[/collections/testschemaapi] [configName]=[conf1] specified config exists in ZooKeeper
   [junit4]   2> 1298422 INFO  (qtp20746163-7391) [n:127.0.0.1:52144_solr c:testschemaapi s:shard1  x:testschemaapi_shard1_replica1] o.a.s.c.SolrResourceLoader new SolrResourceLoader for directory: 'C:\Users\jenkins\workspace\Lucene-Solr-6.x-Windows\solr\build\solr-core\test\J0\temp\solr.schema.TestManagedSchemaAPI_683C4E53BDFACF9A-001\tempDir-001\node2\testschemaapi_shard1_replica1'
   [junit4]   2> 1298422 INFO  (qtp20746163-7391) [n:127.0.0.1:52144_solr c:testschemaapi s:shard1  x:testschemaapi_shard1_replica1] o.a.s.c.SolrResourceLoader JNDI not configured for solr (NoInitialContextEx)
   [junit4]   2> 1298422 INFO  (qtp20746163-7391) [n:127.0.0.1:52144_solr c:testschemaapi s:shard1  x:testschemaapi_shard1_replica1] o.a.s.c.SolrResourceLoader solr home defaulted to 'solr/' (could not find system property or JNDI)
   [junit4]   2> 1298429 INFO  (qtp20746163-7391) [n:127.0.0.1:52144_solr c:testschemaapi s:shard1  x:testschemaapi_shard1_replica1] o.a.s.c.Config loaded config solrconfig.xml with version 0 
   [junit4]   2> 1298431 INFO  (qtp33200825-7379) [n:127.0.0.1:52147_solr c:testschemaapi s:shard1  x:testschemaapi_shard1_replica2] o.a.s.c.SolrConfig Loaded SolrConfig: solrconfig.xml
   [junit4]   2> 1298442 INFO  (qtp20746163-7391) [n:127.0.0.1:52144_solr c:testschemaapi s:shard1  x:testschemaapi_shard1_replica1] o.a.s.c.SolrConfig current version of requestparams : -1
   [junit4]   2> 1298448 INFO  (qtp20746163-7391) [n:127.0.0.1:52144_solr c:testschemaapi s:shard1  x:testschemaapi_shard1_replica1] o.a.s.c.SolrConfig Using Lucene MatchVersion: 6.1.0
   [junit4]   2> 1298449 INFO  (qtp33200825-7379) [n:127.0.0.1:52147_solr c:testschemaapi s:shard1  x:testschemaapi_shard1_replica2] o.a.s.s.IndexSchema [testschemaapi_shard1_replica2] Schema name=minimal
   [junit4]   2> 1298463 INFO  (qtp20746163-7391) [n:127.0.0.1:52144_solr c:testschemaapi s:shard1  x:testschemaapi_shard1_replica1] o.a.s.c.SolrConfig Loaded SolrConfig: solrconfig.xml
   [junit4]   2> 1298465 INFO  (qtp33200825-7379) [n:127.0.0.1:52147_solr c:testschemaapi s:shard1  x:testschemaapi_shard1_replica2] o.a.s.s.IndexSchema unique key field: id
   [junit4]   2> 1298475 INFO  (qtp33200825-7379) [n:127.0.0.1:52147_solr c:testschemaapi s:shard1  x:testschemaapi_shard1_replica2] o.a.s.c.ConfigSetProperties Did not find ConfigSet properties, assuming default properties: Can't find resource 'configsetprops.json' in classpath or '/configs/conf1', cwd=C:\Users\jenkins\workspace\Lucene-Solr-6.x-Windows\solr\build\solr-core\test\J0
   [junit4]   2> 1298475 INFO  (qtp33200825-7379) [n:127.0.0.1:52147_solr c:testschemaapi s:shard1  x:testschemaapi_shard1_replica2] o.a.s.c.CoreContainer Creating SolrCore 'testschemaapi_shard1_replica2' using configuration from collection testschemaapi
   [junit4]   2> 1298476 INFO  (qtp20746163-7391) [n:127.0.0.1:52144_solr c:testschemaapi s:shard1  x:testschemaapi_shard1_replica1] o.a.s.s.IndexSchema [testschemaapi_shard1_replica1] Schema name=minimal
   [junit4]   2> 1298477 INFO  (qtp33200825-7379) [n:127.0.0.1:52147_solr c:testschemaapi s:shard1 r:core_node1 x:testschemaapi_shard1_replica2] o.a.s.c.SolrCore org.apache.solr.core.MockDirectoryFactory
   [junit4]   2> 1298477 INFO  (qtp33200825-7379) [n:127.0.0.1:52147_solr c:testschemaapi s:shard1 r:core_node1 x:testschemaapi_shard1_replica2] o.a.s.c.SolrCore [[testschemaapi_shard1_replica2] ] Opening new SolrCore at [C:\Users\jenkins\workspace\Lucene-Solr-6.x-Windows\solr\build\solr-core\test\J0\temp\solr.schema.TestManagedSchemaAPI_683C4E53BDFACF9A-001\tempDir-001\node1\testschemaapi_shard1_replica2], dataDir=[C:\Users\jenkins\workspace\Lucene-Solr-6.x-Windows\solr\build\solr-core\test\J0\temp\solr.schema.TestManagedSchemaAPI_683C4E53BDFACF9A-001\tempDir-001\node1\.\testschemaapi_shard1_replica2\data\]
   [junit4]   2> 1298477 INFO  (qtp33200825-7379) [n:127.0.0.1:52147_solr c:testschemaapi s:shard1 r:core_node1 x:testschemaapi_shard1_replica2] o.a.s.c.SolrCore JMX monitoring not detected for core: testschemaapi_shard1_replica2
   [junit4]   2> 1298478 INFO  (qtp33200825-7379) [n:127.0.0.1:52147_solr c:testschemaapi s:shard1 r:core_node1 x:testschemaapi_shard1_replica2] o.a.s.c.CachingDirectoryFactory return new directory for C:\Users\jenkins\workspace\Lucene-Solr-6.x-Windows\solr\build\solr-core\test\J0\temp\solr.schema.TestManagedSchemaAPI_683C4E53BDFACF9A-001\tempDir-001\node1\.\testschemaapi_shard1_replica2\data\
   [junit4]   2> 1298479 INFO  (qtp33200825-7379) [n:127.0.0.1:52147_solr c:testschemaapi s:shard1 r:core_node1 x:testschemaapi_shard1_replica2] o.a.s.c.SolrCore New index directory detected: old=null new=C:\Users\jenkins\workspace\Lucene-Solr-6.x-Windows\solr\build\solr-core\test\J0\temp\solr.schema.TestManagedSchemaAPI_683C4E53BDFACF9A-001\tempDir-001\node1\.\testschemaapi_shard1_replica2\data\index/
   [junit4]   2> 1298479 WARN  (qtp33200825-7379) [n:127.0.0.1:52147_solr c:testschemaapi s:shard1 r:core_node1 x:testschemaapi_shard1_replica2] o.a.s.c.SolrCore [testschemaapi_shard1_replica2] Solr index directory 'C:\Users\jenkins\workspace\Lucene-Solr-6.x-Windows\solr\build\solr-core\test\J0\temp\solr.schema.TestManagedSchemaAPI_683C4E53BDFACF9A-001\tempDir-001\node1\.\testschemaapi_shard1_replica2\data\index' doesn't exist. Creating new index...
   [junit4]   2> 1298481 INFO  (qtp33200825-7379) [n:127.0.0.1:52147_solr c:testschemaapi s:shard1 r:core_node1 x:testschemaapi_shard1_replica2] o.a.s.c.CachingDirectoryFactory return new directory for C:\Users\jenkins\workspace\Lucene-Solr-6.x-Windows\solr\build\solr-core\test\J0\temp\solr.schema.TestManagedSchemaAPI_683C4E53BDFACF9A-001\tempDir-001\node1\.\testschemaapi_shard1_replica2\data\index
   [junit4]   2> 1298484 INFO  (qtp20746163-7391) [n:127.0.0.1:52144_solr c:testschemaapi s:shard1  x:testschemaapi_shard1_replica1] o.a.s.s.IndexSchema unique key field: id
   [junit4]   2> 1298486 INFO  (qtp20746163-7391) [n:127.0.0.1:52144_solr c:testschemaapi s:shard1  x:testschemaapi_shard1_replica1] o.a.s.c.ConfigSetProperties Did not find ConfigSet properties, assuming default properties: Can't find resource 'configsetprops.json' in classpath or '/configs/conf1', cwd=C:\Users\jenkins\workspace\Lucene-Solr-6.x-Windows\solr\build\solr-core\test\J0
   [junit4]   2> 1298486 INFO  (qtp20746163-7391) [n:127.0.0.1:52144_solr c:testschemaapi s:shard1  x:testschemaapi_shard1_replica1] o.a.s.c.CoreContainer Creating SolrCore 'testschemaapi_shard1_replica1' using configuration from collection testschemaapi
   [junit4]   2> 1298487 INFO  (qtp33200825-7379) [n:127.0.0.1:52147_solr c:testschemaapi s:shard1 r:core_node1 x:testschemaapi_shard1_replica2] o.a.s.c.SolrDeletionPolicy SolrDeletionPolicy.onCommit: commits: num=1
   [junit4]   2> 	commit{dir=MockDirectoryWrapper(RAMDirectory@1c363ef lockFactory=org.apache.lucene.store.SingleInstanceLockFactory@2bf775),segFN=segments_1,generation=1}
   [junit4]   2> 1298487 INFO  (qtp33200825-7379) [n:127.0.0.1:52147_solr c:testschemaapi s:shard1 r:core_node1 x:testschemaapi_shard1_replica2] o.a.s.c.SolrDeletionPolicy newest commit generation = 1
   [junit4]   2> 1298487 INFO  (qtp20746163-7391) [n:127.0.0.1:52144_solr c:testschemaapi s:shard1 r:core_node2 x:testschemaapi_shard1_replica1] o.a.s.c.SolrCore org.apache.solr.core.MockDirectoryFactory
   [junit4]   2> 1298487 INFO  (qtp20746163-7391) [n:127.0.0.1:52144_solr c:testschemaapi s:shard1 r:core_node2 x:testschemaapi_shard1_replica1] o.a.s.c.SolrCore [[testschemaapi_shard1_replica1] ] Opening new SolrCore at [C:\Users\jenkins\workspace\Lucene-Solr-6.x-Windows\solr\build\solr-core\test\J0\temp\solr.schema.TestManagedSchemaAPI_683C4E53BDFACF9A-001\tempDir-001\node2\testschemaapi_shard1_replica1], dataDir=[C:\Users\jenkins\workspace\Lucene-Solr-6.x-Windows\solr\build\solr-core\test\J0\temp\solr.schema.TestManagedSchemaAPI_683C4E53BDFACF9A-001\tempDir-001\node2\.\testschemaapi_shard1_replica1\data\]
   [junit4]   2> 1298487 INFO  (qtp20746163-7391) [n:127.0.0.1:52144_solr c:testschemaapi s:shard1 r:core_node2 x:testschemaapi_shard1_replica1] o.a.s.c.SolrCore JMX monitoring not detected for core: testschemaapi_shard1_replica1
   [junit4]   2> 1298489 INFO  (qtp20746163-7391) [n:127.0.0.1:52144_solr c:testschemaapi s:shard1 r:core_node2 x:testschemaapi_shard1_replica1] o.a.s.c.CachingDirectoryFactory return new directory for C:\Users\jenkins\workspace\Lucene-Solr-6.x-Windows\solr\build\solr-core\test\J0\temp\solr.schema.TestManagedSchemaAPI_683C4E53BDFACF9A-001\tempDir-001\node2\.\testschemaapi_shard1_replica1\data\
   [junit4]   2> 1298489 INFO  (qtp20746163-7391) [n:127.0.0.1:52144_solr c:testschemaapi s:shard1 r:core_node2 x:testschemaapi_shard1_replica1] o.a.s.c.SolrCore New index directory detected: old=null new=C:\Users\jenkins\workspace\Lucene-Solr-6.x-Windows\solr\build\solr-core\test\J0\temp\solr.schema.TestManagedSchemaAPI_683C4E53BDFACF9A-001\tempDir-001\node2\.\testschemaapi_shard1_replica1\data\index/
   [junit4]   2> 1298489 WARN  (qtp20746163-7391) [n:127.0.0.1:52144_solr c:testschemaapi s:shard1 r:core_node2 x:testschemaapi_shard1_replica1] o.a.s.c.SolrCore [testschemaapi_shard1_replica1] Solr index directory 'C:\Users\jenkins\workspace\Lucene-Solr-6.x-Windows\solr\build\solr-core\test\J0\temp\solr.schema.TestManagedSchemaAPI_683C4E53BDFACF9A-001\tempDir-001\node2\.\testschemaapi_shard1_replica1\data\index' doesn't exist. Creating new index...
   [junit4]   2> 1298490 INFO  (qtp20746163-7391) [n:127.0.0.1:52144_solr c:testschemaapi s:shard1 r:core_node2 x:testschemaapi_shard1_replica1] o.a.s.c.CachingDirectoryFactory return new directory for C:\Users\jenkins\workspace\Lucene-Solr-6.x-Windows\solr\build\solr-core\test\J0\temp\solr.schema.TestManagedSchemaAPI_683C4E53BDFACF9A-001\tempDir-001\node2\.\testschemaapi_shard1_replica1\data\index
   [junit4]   2> 1298490 INFO  (OldIndexDirectoryCleanupThreadForCore-testschemaapi_shard1_replica2) [n:127.0.0.1:52147_solr c:testschemaapi s:shard1 r:core_node1 x:testschemaapi_shard1_replica2] o.a.s.c.SolrCore Looking for old index directories to cleanup for core testschemaapi_shard1_replica2 in C:\Users\jenkins\workspace\Lucene-Solr-6.x-Windows\solr\build\solr-core\test\J0\temp\solr.schema.TestManagedSchemaAPI_683C4E53BDFACF9A-001\tempDir-001\node1\.\testschemaapi_shard1_replica2\data\
   [junit4]   2> 1298493 INFO  (qtp20746163-7391) [n:127.0.0.1:52144_solr c:testschemaapi s:shard1 r:core_node2 x:testschemaapi_shard1_replica1] o.a.s.c.SolrDeletionPolicy SolrDeletionPolicy.onCommit: commits: num=1
   [junit4]   2> 	commit{dir=MockDirectoryWrapper(RAMDirectory@110a6a1 lockFactory=org.apache.lucene.store.SingleInstanceLockFactory@bd7a89),segFN=segments_1,generation=1}
   [junit4]   2> 1298493 INFO  (qtp20746163-7391) [n:127.0.0.1:52144_solr c:testschemaapi s:shard1 r:core_node2 x:testschemaapi_shard1_replica1] o.a.s.c.SolrDeletionPolicy newest commit generation = 1
   [junit4]   2> 1298497 INFO  (qtp33200825-7379) [n:127.0.0.1:52147_solr c:testschemaapi s:shard1 r:core_node1 x:testschemaapi_shard1_replica2] o.a.s.c.SolrCore no updateRequestProcessorChain defined as default, creating implicit default
   [junit4]   2> 1298497 WARN  (OldIndexDirectoryCleanupThreadForCore-testschemaapi_shard1_replica2) [n:127.0.0.1:52147_solr c:testschemaapi s:shard1 r:core_node1 x:testschemaapi_shard1_replica2] o.a.s.c.DirectoryFactory C:\Users\jenkins\workspace\Lucene-Solr-6.x-Windows\solr\build\solr-core\test\J0\temp\solr.schema.TestManagedSchemaAPI_683C4E53BDFACF9A-001\tempDir-001\node1\.\testschemaapi_shard1_replica2\data\ does not point to a valid data directory; skipping clean-up of old index directories.
   [junit4]   2> 1298502 INFO  (OldIndexDirectoryCleanupThreadForCore-testschemaapi_shard1_replica1) [n:127.0.0.1:52144_solr c:testschemaapi s:shard1 r:core_node2 x:testschemaapi_shard1_replica1] o.a.s.c.SolrCore Looking for old index directories to cleanup for core testschemaapi_shard1_replica1 in C:\Users\jenkins\workspace\Lucene-Solr-6.x-Windows\solr\build\solr-core\test\J0\temp\solr.schema.TestManagedSchemaAPI_683C4E53BDFACF9A-001\tempDir-001\node2\.\testschemaapi_shard1_replica1\data\
   [junit4]   2> 1298505 WARN  (OldIndexDirectoryCleanupThreadForCore-testschemaapi_shard1_replica1) [n:127.0.0.1:52144_solr c:testschemaapi s:shard1 r:core_node2 x:testschemaapi_shard1_replica1] o.a.s.c.DirectoryFactory C:\Users\jenkins\workspace\Lucene-Solr-6.x-Windows\solr\build\solr-core\test\J0\temp\solr.schema.TestManagedSchemaAPI_683C4E53BDFACF9A-001\tempDir-001\node2\.\testschemaapi_shard1_replica1\data\ does not point to a valid data directory; skipping clean-up of old index directories.
   [junit4]   2> 1298509 INFO  (qtp20746163-7391) [n:127.0.0.1:52144_solr c:testschemaapi s:shard1 r:core_node2 x:testschemaapi_shard1_replica1] o.a.s.c.SolrCore no updateRequestProcessorChain defined as default, creating implicit default
   [junit4]   2> 1298514 INFO  (qtp33200825-7379) [n:127.0.0.1:52147_solr c:testschemaapi s:shard1 r:core_node1 x:testschemaapi_shard1_replica2] o.a.s.h.l.XMLLoader xsltCacheLifetimeSeconds=60
   [junit4]   2> 1298515 INFO  (qtp20746163-7391) [n:127.0.0.1:52144_solr c:testschemaapi s:shard1 r:core_node2 x:testschemaapi_shard1_replica1] o.a.s.h.l.XMLLoader xsltCacheLifetimeSeconds=60
   [junit4]   2> 1298516 INFO  (qtp33200825-7379) [n:127.0.0.1:52147_solr c:testschemaapi s:shard1 r:core_node1 x:testschemaapi_shard1_replica2] o.a.s.h.l.XMLLoader xsltCacheLifetimeSeconds=60
   [junit4]   2> 1298518 INFO  (qtp33200825-7379) [n:127.0.0.1:52147_solr c:testschemaapi s:shard1 r:core_node1 x:testschemaapi_shard1_replica2] o.a.s.h.l.XMLLoader xsltCacheLifetimeSeconds=60
   [junit4]   2> 1298521 INFO  (qtp20746163-7391) [n:127.0.0.1:52144_solr c:testschemaapi s:shard1 r:core_node2 x:testschemaapi_shard1_replica1] o.a.s.h.l.XMLLoader xsltCacheLifetimeSeconds=60
   [junit4]   2> 1298521 INFO  (qtp33200825-7379) [n:127.0.0.1:52147_solr c:testschemaapi s:shard1 r:core_node1 x:testschemaapi_shard1_replica2] o.a.s.h.l.XMLLoader xsltCacheLifetimeSeconds=60
   [junit4]   2> 1298523 INFO  (qtp33200825-7379) [n:127.0.0.1:52147_solr c:testschemaapi s:shard1 r:core_node1 x:testschemaapi_shard1_replica2] o.a.s.c.RequestHandlers Registered paths: /admin/mbeans,/update/csv,/sql,/update/json/docs,/admin/luke,/export,/select,/admin/segments,/get,/admin/system,/replication,/admin/properties,/config,/stream,/schema,/admin/plugins,/admin/logging,/update/json,/admin/ping,/admin/threads,/update,/admin/file
   [junit4]   2> 1298524 INFO  (qtp33200825-7379) [n:127.0.0.1:52147_solr c:testschemaapi s:shard1 r:core_node1 x:testschemaapi_shard1_replica2] o.a.s.c.SolrCore Using default statsCache cache: org.apache.solr.search.stats.LocalStatsCache
   [junit4]   2> 1298525 INFO  (qtp20746163-7391) [n:127.0.0.1:52144_solr c:testschemaapi s:shard1 r:core_node2 x:testschemaapi_shard1_replica1] o.a.s.h.l.XMLLoader xsltCacheLifetimeSeconds=60
   [junit4]   2> 1298526 INFO  (qtp33200825-7379) [n:127.0.0.1:52147_solr c:testschemaapi s:shard1 r:core_node1 x:testschemaapi_shard1_replica2] o.a.s.u.UpdateHandler Using UpdateLog implementation: org.apache.solr.update.UpdateLog
   [junit4]   2> 1298526 INFO  (qtp33200825-7379) [n:127.0.0.1:52147_solr c:testschemaapi s:shard1 r:core_node1 x:testschemaapi_shard1_replica2] o.a.s.u.UpdateLog Initializing UpdateLog: dataDir=null defaultSyncLevel=FLUSH numRecordsToKeep=100 maxNumLogsToKeep=10 numVersionBuckets=65536
   [junit4]   2> 1298529 INFO  (qtp33200825-7379) [n:127.0.0.1:52147_solr c:testschemaapi s:shard1 r:core_node1 x:testschemaapi_shard1_replica2] o.a.s.u.CommitTracker Hard AutoCommit: disabled
   [junit4]   2> 1298529 INFO  (qtp33200825-7379) [n:127.0.0.1:52147_solr c:testschemaapi s:shard1 r:core_node1 x:testschemaapi_shard1_replica2] o.a.s.u.CommitTracker Soft AutoCommit: disabled
   [junit4]   2> 1298530 INFO  (qtp33200825-7379) [n:127.0.0.1:52147_solr c:testschemaapi s:shard1 r:core_node1 x:testschemaapi_shard1_replica2] o.a.s.c.SolrDeletionPolicy SolrDeletionPolicy.onInit: commits: num=1
   [junit4]   2> 	commit{dir=MockDirectoryWrapper(RAMDirectory@1c363ef lockFactory=org.apache.lucene.store.SingleInstanceLockFactory@2bf775),segFN=segments_1,generation=1}
   [junit4]   2> 1298530 INFO  (qtp33200825-7379) [n:127.0.0.1:52147_solr c:testschemaapi s:shard1 r:core_node1 x:testschemaapi_shard1_replica2] o.a.s.c.SolrDeletionPolicy newest commit generation = 1
   [junit4]   2> 1298531 INFO  (qtp33200825-7379) [n:127.0.0.1:52147_solr c:testschemaapi s:shard1 r:core_node1 x:testschemaapi_shard1_replica2] o.a.s.s.SolrIndexSearcher Opening [Searcher@e26314[testschemaapi_shard1_replica2] main]
   [junit4]   2> 1298531 INFO  (qtp20746163-7391) [n:127.0.0.1:52144_solr c:testschemaapi s:shard1 r:core_node2 x:testschemaapi_shard1_replica1] o.a.s.h.l.XMLLoader xsltCacheLifetimeSeconds=60
   [junit4]   2> 1298531 INFO  (qtp33200825-7379) [n:127.0.0.1:52147_solr c:testschemaapi s:shard1 r:core_node1 x:testschemaapi_shard1_replica2] o.a.s.c.c.ZkStateReader Load collection config from: [/collections/testschemaapi]
   [junit4]   2> 1298534 INFO  (qtp20746163-7391) [n:127.0.0.1:52144_solr c:testschemaapi s:shard1 r:core_node2 x:testschemaapi_shard1_replica1] o.a.s.c.RequestHandlers Registered paths: /admin/mbeans,/update/csv,/sql,/update/json/docs,/admin/luke,/export,/select,/admin/segments,/get,/admin/system,/replication,/admin/properties,/config,/stream,/schema,/admin/plugins,/admin/logging,/update/json,/admin/ping,/admin/threads,/update,/admin/file
   [junit4]   2> 1298534 INFO  (qtp20746163-7391) [n:127.0.0.1:52144_solr c:testschemaapi s:shard1 r:core_node2 x:testschemaapi_shard1_replica1] o.a.s.c.SolrCore Using default statsCache cache: org.apache.solr.search.stats.LocalStatsCache
   [junit4]   2> 1298535 INFO  (qtp33200825-7379) [n:127.0.0.1:52147_solr c:testschemaapi s:shard1 r:core_node1 x:testschemaapi_shard1_replica2] o.a.s.c.c.ZkStateReader path=[/collections/testschemaapi] [configName]=[conf1] specified config exists in ZooKeeper
   [junit4]   2> 1298537 INFO  (qtp33200825-7379) [n:127.0.0.1:52147_solr c:testschemaapi s:shard1 r:core_node1 x:testschemaapi_shard1_replica2] o.a.s.r.ManagedResourceStorage Setting up ZooKeeper-based storage for the RestManager with znodeBase: /configs/conf1
   [junit4]   2> 1298537 INFO  (qtp20746163-7391) [n:127.0.0.1:52144_solr c:testschemaapi s:shard1 r:core_node2 x:testschemaapi_shard1_replica1] o.a.s.u.UpdateHandler Using UpdateLog implementation: org.apache.solr.update.UpdateLog
   [junit4]   2> 1298537 INFO  (qtp20746163-7391) [n:127.0.0.1:52144_solr c:testschemaapi s:shard1 r:core_node2 x:testschemaapi_shard1_replica1] o.a.s.u.UpdateLog Initializing UpdateLog: dataDir=null defaultSyncLevel=FLUSH numRecordsToKeep=100 maxNumLogsToKeep=10 numVersionBuckets=65536
   [junit4]   2> 1298537 INFO  (qtp33200825-7379) [n:127.0.0.1:52147_solr c:testschemaapi s:shard1 r:core_node1 x:testschemaapi_shard1_replica2] o.a.s.r.ManagedResourceStorage Configured ZooKeeperStorageIO with znodeBase: /configs/conf1
   [junit4]   2> 1298537 INFO  (qtp33200825-7379) [n:127.0.0.1:52147_solr c:testschemaapi s:shard1 r:core_node1 x:testschemaapi_shard1_replica2] o.a.s.r.RestManager Initializing RestManager with initArgs: {}
   [junit4]   2> 1298538 INFO  (qtp33200825-7379) [n:127.0.0.1:52147_solr c:testschemaapi s:shard1 r:core_node1 x:testschemaapi_shard1_replica2] o.a.s.r.ManagedResourceStorage Reading _rest_managed.json using ZooKeeperStorageIO:path=/configs/conf1
   [junit4]   2> 1298539 INFO  (qtp20746163-7391) [n:127.0.0.1:52144_solr c:testschemaapi s:shard1 r:core_node2 x:testschemaapi_shard1_replica1] o.a.s.u.CommitTracker Hard AutoCommit: disabled
   [junit4]   2> 1298540 INFO  (qtp20746163-7391) [n:127.0.0.1:52144_solr c:testschemaapi s:shard1 r:core_node2 x:testschemaapi_shard1_replica1] o.a.s.u.CommitTracker Soft AutoCommit: disabled
   [junit4]   2> 1298540 INFO  (qtp33200825-7379) [n:127.0.0.1:52147_solr c:testschemaapi s:shard1 r:core_node1 x:testschemaapi_shard1_replica2] o.a.s.r.ManagedResourceStorage No data found for znode /configs/conf1/_rest_managed.json
   [junit4]   2> 1298540 INFO  (qtp33200825-7379) [n:127.0.0.1:52147_solr c:testschemaapi s:shard1 r:core_node1 x:testschemaapi_shard1_replica2] o.a.s.r.ManagedResourceStorage Loaded null at path _rest_managed.json using ZooKeeperStorageIO:path=/configs/conf1
   [junit4]   2> 1298540 INFO  (qtp33200825-7379) [n:127.0.0.1:52147_solr c:testschemaapi s:shard1 r:core_node1 x:testschemaapi_shard1_replica2] o.a.s.r.RestManager Initializing 0 registered ManagedResources
   [junit4]   2> 1298540 INFO  (qtp33200825-7379) [n:127.0.0.1:52147_solr c:testschemaapi s:shard1 r:core_node1 x:testschemaapi_shard1_replica2] o.a.s.s.ZkIndexSchemaReader Creating ZooKeeper watch for the managed schema at /configs/conf1/managed-schema
   [junit4]   2> 1298541 INFO  (qtp33200825-7379) [n:127.0.0.1:52147_solr c:testschemaapi s:shard1 r:core_node1 x:testschemaapi_shard1_replica2] o.a.s.c.ZkController Added new OnReconnect listener ZkIndexSchemaReader: /configs/conf1/managed-schema, uniqueCoreId: testschemaapi_shard1_replica2:68499080925722
   [junit4]   2> 1298541 INFO  (qtp33200825-7379) [n:127.0.0.1:52147_solr c:testschemaapi s:shard1 r:core_node1 x:testschemaapi_shard1_replica2] o.a.s.h.ReplicationHandler Commits will be reserved for  10000
   [junit4]   2> 1298541 INFO  (qtp33200825-7379) [n:127.0.0.1:52147_solr c:testschemaapi s:shard1 r:core_node1 x:testschemaapi_shard1_replica2] o.a.s.u.UpdateLog Looking up max value of version field to seed version buckets
   [junit4]   2> 1298541 INFO  (qtp33200825-7379) [n:127.0.0.1:52147_solr c:testschemaapi s:shard1 r:core_node1 x:testschemaapi_shard1_replica2] o.a.s.u.VersionInfo Refreshing highest value of _version_ for 65536 version buckets from index
   [junit4]   2> 1298541 INFO  (qtp33200825-7379) [n:127.0.0.1:52147_solr c:testschemaapi s:shard1 r:core_node1 x:testschemaapi_shard1_replica2] o.a.s.u.VersionInfo No terms found for _version_, cannot seed version bucket highest value from index
   [junit4]   2> 1298542 INFO  (qtp33200825-7379) [n:127.0.0.1:52147_solr c:testschemaapi s:shard1 r:core_node1 x:testschemaapi_shard1_replica2] o.a.s.u.UpdateLog Could not find max version in index or recent updates, using new clock 1533215667257344000
   [junit4]   2> 1298541 INFO  (searcherExecutor-3582-thread-1-processing-n:127.0.0.1:52147_solr x:testschemaapi_shard1_replica2 s:shard1 c:testschemaapi r:core_node1) [n:127.0.0.1:52147_solr c:testschemaapi s:shard1 r:core_node1 x:testschemaapi_shard1_replica2] o.a.s.c.SolrCore [testschemaapi_shard1_replica2] Registered new searcher Searcher@e26314[testschemaapi_shard1_replica2] main{ExitableDirectoryReader(UninvertingDirectoryReader())}
   [junit4]   2> 1298542 INFO  (qtp20746163-7391) [n:127.0.0.1:52144_solr c:testschemaapi s:shard1 r:core_node2 x:testschemaapi_shard1_replica1] o.a.s.c.SolrDeletionPolicy SolrDeletionPolicy.onInit: commits: num=1
   [junit4]   2> 	commit{dir=MockDirectoryWrapper(RAMDirectory@110a6a1 lockFactory=org.apache.lucene.store.SingleInstanceLockFactory@bd7a89),segFN=segments_1,generation=1}
   [junit4]   2> 1298542 INFO  (qtp20746163-7391) [n:127.0.0.1:52144_solr c:testschemaapi s:shard1 r:core_node2 x:testschemaapi_shard1_replica1] o.a.s.c.SolrDeletionPolicy newest commit generation = 1
   [junit4]   2> 1298543 INFO  (qtp20746163-7391) [n:127.0.0.1:52144_solr c:testschemaapi s:shard1 r:core_node2 x:testschemaapi_shard1_replica1] o.a.s.s.SolrIndexSearcher Opening [Searcher@d798f2[testschemaapi_shard1_replica1] main]
   [junit4]   2> 1298543 INFO  (qtp20746163-7391) [n:127.0.0.1:52144_solr c:testschemaapi s:shard1 r:core_node2 x:testschemaapi_shard1_replica1] o.a.s.c.c.ZkStateReader Load collection config from: [/collections/testschemaapi]
   [junit4]   2> 1298544 INFO  (qtp33200825-7379) [n:127.0.0.1:52147_solr c:testschemaapi s:shard1 r:core_node1 x:testschemaapi_shard1_replica2] o.a.s.u.UpdateLog Took 2.0ms to seed version buckets with highest version 1533215667257344000
   [junit4]   2> 1298544 INFO  (qtp33200825-7379) [n:127.0.0.1:52147_solr c:testschemaapi s:shard1 r:core_node1 x:testschemaapi_shard1_replica2] o.a.s.c.ZkController watch zkdir /configs/conf1
   [junit4]   2> 1298545 INFO  (qtp33200825-7379) [n:127.0.0.1:52147_solr c:testschemaapi s:shard1 r:core_node1 x:testschemaapi_shard1_replica2] o.a.s.c.CoreContainer registering core: testschemaapi_shard1_replica2
   [junit4]   2> 1298545 INFO  (qtp33200825-7379) [n:127.0.0.1:52147_solr c:testschemaapi s:shard1 r:core_node1 x:testschemaapi_shard1_replica2] o.a.s.c.ZkController Register replica - core:testschemaapi_shard1_replica2 address:https://127.0.0.1:52147/solr collection:testschemaapi shard:shard1
   [junit4]   2> 1298545 INFO  (qtp20746163-7391) [n:127.0.0.1:52144_solr c:testschemaapi s:shard1 r:core_node2 x:testschemaapi_shard1_replica1] o.a.s.c.c.ZkStateReader path=[/collections/testschemaapi] [configName]=[conf1] specified config exists in ZooKeeper
   [junit4]   2> 1298545 INFO  (qtp20746163-7391) [n:127.0.0.1:52144_solr c:testschemaapi s:shard1 r:core_node2 x:testschemaapi_shard1_replica1] o.a.s.r.ManagedResourceStorage Setting up ZooKeeper-based storage for the RestManager with znodeBase: /configs/conf1
   [junit4]   2> 1298546 INFO  (qtp20746163-7391) [n:127.0.0.1:52144_solr c:testschemaapi s:shard1 r:core_node2 x:testschemaapi_shard1_replica1] o.a.s.r.ManagedResourceStorage Configured ZooKeeperStorageIO with znodeBase: /configs/conf1
   [junit4]   2> 1298546 INFO  (qtp20746163-7391) [n:127.0.0.1:52144_solr c:testschemaapi s:shard1 r:core_node2 x:testschemaapi_shard1_replica1] o.a.s.r.RestManager Initializing RestManager with initArgs: {}
   [junit4]   2> 1298547 INFO  (qtp20746163-7391) [n:127.0.0.1:52144_solr c:testschemaapi s:shard1 r:core_node2 x:testschemaapi_shard1_replica1] o.a.s.r.ManagedResourceStorage Reading _rest_managed.json using ZooKeeperStorageIO:path=/configs/conf1
   [junit4]   2> 1298547 INFO  (qtp33200825-7379) [n:127.0.0.1:52147_solr c:testschemaapi s:shard1 r:core_node1 x:testschemaapi_shard1_replica2] o.a.s.c.c.SolrZkClient makePath: /collections/testschemaapi/leader_elect/shard1/election
   [junit4]   2> 1298547 INFO  (qtp20746163-7391) [n:127.0.0.1:52144_solr c:testschemaapi s:shard1 r:core_node2 x:testschemaapi_shard1_replica1] o.a.s.r.ManagedResourceStorage No data found for znode /configs/conf1/_rest_managed.json
   [junit4]   2> 1298547 INFO  (qtp20746163-7391) [n:127.0.0.1:52144_solr c:testschemaapi s:shard1 r:core_node2 x:testschemaapi_shard1_replica1] o.a.s.r.ManagedResourceStorage Loaded null at path _rest_managed.json using ZooKeeperStorageIO:path=/configs/conf1
   [junit4]   2> 1298548 INFO  (qtp20746163-7391) [n:127.0.0.1:52144_solr c:testschemaapi s:shard1 r:core_node2 x:testschemaapi_shard1_replica1] o.a.s.r.RestManager Initializing 0 registered ManagedResources
   [junit4]   2> 1298548 INFO  (qtp20746163-7391) [n:127.0.0.1:52144_solr c:testschemaapi s:shard1 r:core_node2 x:testschemaapi_shard1_replica1] o.a.s.s.ZkIndexSchemaReader Creating ZooKeeper watch for the managed schema at /configs/conf1/managed-schema
   [junit4]   2> 1298549 INFO  (qtp20746163-7391) [n:127.0.0.1:52144_solr c:testschemaapi s:shard1 r:core_node2 x:testschemaapi_shard1_replica1] o.a.s.c.ZkController Added new OnReconnect listener ZkIndexSchemaReader: /configs/conf1/managed-schema, uniqueCoreId: testschemaapi_shard1_replica1:68499091949417
   [junit4]   2> 1298549 INFO  (qtp20746163-7391) [n:127.0.0.1:52144_solr c:testschemaapi s:shard1 r:core_node2 x:testschemaapi_shard1_replica1] o.a.s.h.ReplicationHandler Commits will be reserved for  10000
   [junit4]   2> 1298549 INFO  (qtp20746163-7391) [n:127.0.0.1:52144_solr c:testschemaapi s:shard1 r:core_node2 x:testschemaapi_shard1_replica1] o.a.s.u.UpdateLog Looking up max value of version field to seed version buckets
   [junit4]   2> 1298549 INFO  (searcherExecutor-3583-thread-1-processing-n:127.0.0.1:52144_solr x:testschemaapi_shard1_replica1 s:shard1 c:testschemaapi r:core_node2) [n:127.0.0.1:52144_solr c:testschemaapi s:shard1 r:core_node2 x:testschemaapi_shard1_replica1] o.a.s.c.SolrCore [testschemaapi_shard1_replica1] Registered new searcher Searcher@d798f2[testschemaapi_shard1_replica1] main{ExitableDirectoryReader(UninvertingDirectoryReader())}
   [junit4]   2> 1298549 INFO  (qtp20746163-7391) [n:127.0.0.1:52144_solr c:testschemaapi s:shard1 r:core_node2 x:testschemaapi_shard1_replica1] o.a.s.u.VersionInfo Refreshing highest value of _version_ for 65536 version buckets from index
   [junit4]   2> 1298550 INFO  (qtp20746163-7391) [n:127.0.0.1:52144_solr c:testschemaapi s:shard1 r:core_node2 x:testschemaapi_shard1_replica1] o.a.s.u.VersionInfo No terms found for _version_, cannot seed version bucket highest value from index
   [junit4]   2> 1298550 INFO  (qtp20746163-7391) [n:127.0.0.1:52144_solr c:testschemaapi s:shard1 r:core_node2 x:testschemaapi_shard1_replica1] o.a.s.u.UpdateLog Could not find max version in index or recent updates, using new clock 1533215667265732608
   [junit4]   2> 1298552 INFO  (qtp20746163-7391) [n:127.0.0.1:52144_solr c:testschemaapi s:shard1 r:core_node2 x:testschemaapi_shard1_replica1] o.a.s.u.UpdateLog Took 2.0ms to seed version buckets with highest version 1533215667265732608
   [junit4]   2> 1298552 INFO  (qtp20746163-7391) [n:127.0.0.1:52144_solr c:testschemaapi s:shard1 r:core_node2 x:testschemaapi_shard1_replica1] o.a.s.c.ZkController watch zkdir /configs/conf1
   [junit4]   2> 1298554 INFO  (qtp20746163-7391) [n:127.0.0.1:52144_solr c:testschemaapi s:shard1 r:core_node2 x:testschemaapi_shard1_replica1] o.a.s.c.CoreContainer registering core: testschemaapi_shard1_replica1
   [junit4]   2> 1298554 INFO  (qtp20746163-7391) [n:127.0.0.1:52144_solr c:testschemaapi s:shard1 r:core_node2 x:testschemaapi_shard1_replica1] o.a.s.c.ZkController Register replica - core:testschemaapi_shard1_replica1 address:https://127.0.0.1:52144/solr collection:testschemaapi shard:shard1
   [junit4]   2> 1298557 INFO  (qtp20746163-7391) [n:127.0.0.1:52144_solr c:testschemaapi s:shard1 r:core_node2 x:testschemaapi_shard1_replica1] o.a.s.c.LeaderElector Joined leadership election with path: /collections/testschemaapi/leader_elect/shard1/election/95825979009400838-core_node2-n_0000000000
   [junit4]   2> 1298558 INFO  (qtp33200825-7379) [n:127.0.0.1:52147_solr c:testschemaapi s:shard1 r:core_node1 x:testschemaapi_shard1_replica2] o.a.s.c.LeaderElector Joined leadership election with path: /collections/testschemaapi/leader_elect/shard1/election/95825979009400837-core_node1-n_0000000001
   [junit4]   2> 1298558 INFO  (qtp20746163-7391) [n:127.0.0.1:52144_solr c:testschemaapi s:shard1 r:core_node2 x:testschemaapi_shard1_replica1] o.a.s.c.ShardLeaderElectionContext Running the leader process for shard=shard1 and weAreReplacement=false and leaderVoteWait=10000
   [junit4]   2> 1298559 INFO  (qtp33200825-7379) [n:127.0.0.1:52147_solr c:testschemaapi s:shard1 r:core_node1 x:testschemaapi_shard1_replica2] o.a.s.c.LeaderElector Watching path /collections/testschemaapi/leader_elect/shard1/election/95825979009400838-core_node2-n_0000000000 to know if I could be the leader
   [junit4]   2> 1298561 INFO  (qtp20746163-7391) [n:127.0.0.1:52144_solr c:testschemaapi s:shard1 r:core_node2 x:testschemaapi_shard1_replica1] o.a.s.c.ShardLeaderElectionContext Enough replicas found to continue.
   [junit4]   2> 1298561 INFO  (qtp20746163-7391) [n:127.0.0.1:52144_solr c:testschemaapi s:shard1 r:core_node2 x:testschemaapi_shard1_replica1] o.a.s.c.ShardLeaderElectionContext I may be the new leader - try and sync
   [junit4]   2> 1298561 INFO  (qtp20746163-7391) [n:127.0.0.1:52144_solr c:testschemaapi s:shard1 r:core_node2 x:testschemaapi_shard1_replica1] o.a.s.c.SyncStrategy Sync replicas to https://127.0.0.1:52144/solr/testschemaapi_shard1_replica1/
   [junit4]   2> 1298561 INFO  (qtp20746163-7391) [n:127.0.0.1:52144_solr c:testschemaapi s:shard1 r:core_node2 x:testschemaapi_shard1_replica1] o.a.s.u.PeerSync PeerSync: core=testschemaapi_shard1_replica1 url=https://127.0.0.1:52144/solr START replicas=[https://127.0.0.1:52147/solr/testschemaapi_shard1_replica2/] nUpdates=100
   [junit4]   2> 1298561 INFO  (qtp20746163-7391) [n:127.0.0.1:52144_solr c:testschemaapi s:shard1 r:core_node2 x:testschemaapi_shard1_replica1] o.a.s.u.PeerSync PeerSync: core=testschemaapi_shard1_replica1 url=https://127.0.0.1:

[...truncated too long message...]

emaapi s:shard1 r:core_node1 x:testschemaapi_shard1_replica2] o.a.s.c.CachingDirectoryFactory Closing directory: C:\Users\jenkins\workspace\Lucene-Solr-6.x-Windows\solr\build\solr-core\test\J0\temp\solr.schema.TestManagedSchemaAPI_683C4E53BDFACF9A-001\tempDir-001\node1\.\testschemaapi_shard1_replica2\data\
   [junit4]   2> 1309447 WARN  (Thread-2644) [n:127.0.0.1:52147_solr c:testschemaapi s:shard1 r:core_node1 x:testschemaapi_shard1_replica2] o.a.s.c.ZkController listener throws error
   [junit4]   2> org.apache.solr.common.SolrException: Unable to reload core [testschemaapi_shard1_replica2]
   [junit4]   2> 	at org.apache.solr.core.CoreContainer.reload(CoreContainer.java:921)
   [junit4]   2> 	at org.apache.solr.core.SolrCore.lambda$getConfListener$6(SolrCore.java:2488)
   [junit4]   2> 	at org.apache.solr.cloud.ZkController$4.run(ZkController.java:2425)
   [junit4]   2> Caused by: org.apache.solr.common.SolrException: Could not find config name for collection:testschemaapi
   [junit4]   2> 	at org.apache.solr.core.SolrCore.<init>(SolrCore.java:772)
   [junit4]   2> 	at org.apache.solr.core.SolrCore.reload(SolrCore.java:461)
   [junit4]   2> 	at org.apache.solr.core.CoreContainer.reload(CoreContainer.java:915)
   [junit4]   2> 	... 2 more
   [junit4]   2> Caused by: org.apache.solr.common.SolrException: Could not find config name for collection:testschemaapi
   [junit4]   2> 	at org.apache.solr.rest.ManagedResourceStorage.newStorageIO(ManagedResourceStorage.java:101)
   [junit4]   2> 	at org.apache.solr.core.SolrCore.initRestManager(SolrCore.java:2283)
   [junit4]   2> 	at org.apache.solr.core.SolrCore.<init>(SolrCore.java:748)
   [junit4]   2> 	... 4 more
   [junit4]   2> NOTE: test params are: codec=Asserting(Lucene60): {_version_=TestBloomFilteredLucenePostings(BloomFilteringPostingsFormat(Lucene50(blocksize=128))), id=Lucene50(blocksize=128), myNewField1=Lucene50(blocksize=128), myNewField=BlockTreeOrds(blocksize=128)}, docValues:{}, maxPointsInLeafNode=354, maxMBSortInHeap=5.232195895052945, sim=RandomSimilarity(queryNorm=false,coord=yes): {}, locale=it, timezone=Europe/Copenhagen
   [junit4]   2> NOTE: Windows 10 10.0 x86/Oracle Corporation 1.8.0_92 (32-bit)/cpus=3,threads=1,free=289625552,total=536870912
   [junit4]   2> NOTE: All tests run in this JVM: [XmlUpdateRequestHandlerTest, TestSolrConfigHandler, TestTestInjection, AsyncMigrateRouteKeyTest, SchemaVersionSpecificBehaviorTest, PreAnalyzedUpdateProcessorTest, TestConfig, SoftAutoCommitTest, TestTolerantSearch, ChaosMonkeyNothingIsSafeTest, DisMaxRequestHandlerTest, TestPivotHelperCode, FastVectorHighlighterTest, TestRestoreCore, TestDistribDocBasedVersion, TestExclusionRuleCollectionAccess, RankQueryTest, DocValuesTest, TestTolerantUpdateProcessorCloud, TestFieldTypeCollectionResource, RuleEngineTest, UnloadDistributedZkTest, HdfsWriteToMultipleCollectionsTest, TestStressReorder, HdfsChaosMonkeySafeLeaderTest, TestLeaderInitiatedRecoveryThread, StandardRequestHandlerTest, TestConfigSets, DistributedVersionInfoTest, TestDocumentBuilder, TestGroupingSearch, TestBulkSchemaAPI, TlogReplayBufferedWhileIndexingTest, TestSolrCloudWithKerberosAlt, TestFastLRUCache, TestInitQParser, WrapperMergePolicyFactoryTest, CursorMarkTest, SpatialFilterTest, SampleTest, PrimUtilsTest, TestReloadDeadlock, TestCollationFieldDocValues, CurrencyFieldXmlFileTest, DistribJoinFromCollectionTest, CloudMLTQParserTest, TestPKIAuthenticationPlugin, StatelessScriptUpdateProcessorFactoryTest, CustomCollectionTest, ReturnFieldsTest, DistributedQueryElevationComponentTest, DocumentAnalysisRequestHandlerTest, SyncSliceTest, BasicDistributedZkTest, ExitableDirectoryReaderTest, SimplePostToolTest, TestLazyCores, TestMergePolicyConfig, TestDistributedSearch, ConnectionManagerTest, TestDynamicFieldCollectionResource, SolrIndexConfigTest, TestUpdate, CdcrReplicationDistributedZkTest, ExternalFileFieldSortTest, TestSchemaSimilarityResource, CloneFieldUpdateProcessorFactoryTest, TestIBSimilarityFactory, TestCustomSort, TestSortingResponseWriter, TestStressLucene, TestFilteredDocIdSet, TestReRankQParserPlugin, TestCSVLoader, RecoveryAfterSoftCommitTest, QueryResultKeyTest, OverseerTest, CircularListTest, TestCloudPivotFacet, TestLRUStatsCache, TestCloudDeleteByQuery, HdfsRecoveryZkTest, PeerSyncTest, RequiredFieldsTest, TestDefaultStatsCache, TestHighlightDedupGrouping, TestConfigSetsAPIZkFailure, TolerantUpdateProcessorTest, ZkStateWriterTest, HighlighterTest, XsltUpdateRequestHandlerTest, TestFreeTextSuggestions, ConcurrentDeleteAndCreateCollectionTest, SaslZkACLProviderTest, TestManagedSchemaAPI]
   [junit4]   2> NOTE: reproduce with: ant test  -Dtestcase=TestManagedSchemaAPI -Dtests.seed=683C4E53BDFACF9A -Dtests.slow=true -Dtests.locale=it -Dtests.timezone=Europe/Copenhagen -Dtests.asserts=true -Dtests.file.encoding=Cp1252
   [junit4] ERROR   0.00s J0 | TestManagedSchemaAPI (suite) <<<
   [junit4]    > Throwable #1: java.lang.AssertionError: ObjectTracker found 4 object(s) that were not released!!! [TransactionLog, MockDirectoryWrapper, MDCAwareThreadPoolExecutor, MockDirectoryWrapper]
   [junit4]    > 	at __randomizedtesting.SeedInfo.seed([683C4E53BDFACF9A]:0)
   [junit4]    > 	at org.apache.solr.SolrTestCaseJ4.afterClass(SolrTestCaseJ4.java:256)
   [junit4]    > 	at java.lang.Thread.run(Thread.java:745)Throwable #2: java.io.IOException: Could not remove the following files (in the order of attempts):
   [junit4]    >    C:\Users\jenkins\workspace\Lucene-Solr-6.x-Windows\solr\build\solr-core\test\J0\temp\solr.schema.TestManagedSchemaAPI_683C4E53BDFACF9A-001\tempDir-001\node1\testschemaapi_shard1_replica2\data\tlog\tlog.0000000000000000000: java.nio.file.FileSystemException: C:\Users\jenkins\workspace\Lucene-Solr-6.x-Windows\solr\build\solr-core\test\J0\temp\solr.schema.TestManagedSchemaAPI_683C4E53BDFACF9A-001\tempDir-001\node1\testschemaapi_shard1_replica2\data\tlog\tlog.0000000000000000000: The process cannot access the file because it is being used by another process.
   [junit4]    >    C:\Users\jenkins\workspace\Lucene-Solr-6.x-Windows\solr\build\solr-core\test\J0\temp\solr.schema.TestManagedSchemaAPI_683C4E53BDFACF9A-001\tempDir-001\node1\testschemaapi_shard1_replica2\data\tlog: java.nio.file.DirectoryNotEmptyException: C:\Users\jenkins\workspace\Lucene-Solr-6.x-Windows\solr\build\solr-core\test\J0\temp\solr.schema.TestManagedSchemaAPI_683C4E53BDFACF9A-001\tempDir-001\node1\testschemaapi_shard1_replica2\data\tlog
   [junit4]    >    C:\Users\jenkins\workspace\Lucene-Solr-6.x-Windows\solr\build\solr-core\test\J0\temp\solr.schema.TestManagedSchemaAPI_683C4E53BDFACF9A-001\tempDir-001\node1\testschemaapi_shard1_replica2\data: java.nio.file.DirectoryNotEmptyException: C:\Users\jenkins\workspace\Lucene-Solr-6.x-Windows\solr\build\solr-core\test\J0\temp\solr.schema.TestManagedSchemaAPI_683C4E53BDFACF9A-001\tempDir-001\node1\testschemaapi_shard1_replica2\data
   [junit4]    >    C:\Users\jenkins\workspace\Lucene-Solr-6.x-Windows\solr\build\solr-core\test\J0\temp\solr.schema.TestManagedSchemaAPI_683C4E53BDFACF9A-001\tempDir-001\node1\testschemaapi_shard1_replica2: java.nio.file.DirectoryNotEmptyException: C:\Users\jenkins\workspace\Lucene-Solr-6.x-Windows\solr\build\solr-core\test\J0\temp\solr.schema.TestManagedSchemaAPI_683C4E53BDFACF9A-001\tempDir-001\node1\testschemaapi_shard1_replica2
   [junit4]    >    C:\Users\jenkins\workspace\Lucene-Solr-6.x-Windows\solr\build\solr-core\test\J0\temp\solr.schema.TestManagedSchemaAPI_683C4E53BDFACF9A-001\tempDir-001\node1: java.nio.file.DirectoryNotEmptyException: C:\Users\jenkins\workspace\Lucene-Solr-6.x-Windows\solr\build\solr-core\test\J0\temp\solr.schema.TestManagedSchemaAPI_683C4E53BDFACF9A-001\tempDir-001\node1
   [junit4]    >    C:\Users\jenkins\workspace\Lucene-Solr-6.x-Windows\solr\build\solr-core\test\J0\temp\solr.schema.TestManagedSchemaAPI_683C4E53BDFACF9A-001\tempDir-001: java.nio.file.DirectoryNotEmptyException: C:\Users\jenkins\workspace\Lucene-Solr-6.x-Windows\solr\build\solr-core\test\J0\temp\solr.schema.TestManagedSchemaAPI_683C4E53BDFACF9A-001\tempDir-001
   [junit4]    >    C:\Users\jenkins\workspace\Lucene-Solr-6.x-Windows\solr\build\solr-core\test\J0\temp\solr.schema.TestManagedSchemaAPI_683C4E53BDFACF9A-001: java.nio.file.DirectoryNotEmptyException: C:\Users\jenkins\workspace\Lucene-Solr-6.x-Windows\solr\build\solr-core\test\J0\temp\solr.schema.TestManagedSchemaAPI_683C4E53BDFACF9A-001
   [junit4]    > 	at org.apache.lucene.util.IOUtils.rm(IOUtils.java:323)
   [junit4]    > 	at java.lang.Thread.run(Thread.java:745)
   [junit4] Completed [189/592 (1!)] on J0 in 14.67s, 1 test, 1 failure, 1 error <<< FAILURES!

[...truncated 1310 lines...]
BUILD FAILED
C:\Users\jenkins\workspace\Lucene-Solr-6.x-Windows\build.xml:740: The following error occurred while executing this line:
C:\Users\jenkins\workspace\Lucene-Solr-6.x-Windows\build.xml:684: The following error occurred while executing this line:
C:\Users\jenkins\workspace\Lucene-Solr-6.x-Windows\build.xml:59: The following error occurred while executing this line:
C:\Users\jenkins\workspace\Lucene-Solr-6.x-Windows\solr\build.xml:233: The following error occurred while executing this line:
C:\Users\jenkins\workspace\Lucene-Solr-6.x-Windows\solr\common-build.xml:529: The following error occurred while executing this line:
C:\Users\jenkins\workspace\Lucene-Solr-6.x-Windows\lucene\common-build.xml:1457: The following error occurred while executing this line:
C:\Users\jenkins\workspace\Lucene-Solr-6.x-Windows\lucene\common-build.xml:1014: There were test failures: 592 suites (10 ignored), 2399 tests, 2 suite-level errors, 124 ignored (80 assumptions) [seed: 683C4E53BDFACF9A]

Total time: 78 minutes 21 seconds
Build step 'Invoke Ant' marked build as failure
Archiving artifacts
[WARNINGS] Skipping publisher since build result is FAILURE
Recording test results
Email was triggered for: Failure - Any
Sending email for trigger: Failure - Any



Mime
View raw message