lucene-dev mailing list archives

Site index · List index
Message view « Date » · « Thread »
Top « Date » · « Thread »
From Policeman Jenkins Server <jenk...@thetaphi.de>
Subject [JENKINS] Lucene-Solr-6.x-MacOSX (64bit/jdk1.8.0) - Build # 140 - Still Failing!
Date Sun, 15 May 2016 11:21:07 GMT
Build: http://jenkins.thetaphi.de/job/Lucene-Solr-6.x-MacOSX/140/
Java: 64bit/jdk1.8.0 -XX:+UseCompressedOops -XX:+UseSerialGC

1 tests failed.
FAILED:  org.apache.solr.schema.TestManagedSchemaAPI.test

Error Message:
Error from server at http://127.0.0.1:54151/solr/testschemaapi_shard1_replica2: ERROR: [doc=2] unknown field 'myNewField1'

Stack Trace:
org.apache.solr.client.solrj.impl.CloudSolrClient$RouteException: Error from server at http://127.0.0.1:54151/solr/testschemaapi_shard1_replica2: ERROR: [doc=2] unknown field 'myNewField1'
	at __randomizedtesting.SeedInfo.seed([48CB1243F047CE4B:C09F2D995EBBA3B3]:0)
	at org.apache.solr.client.solrj.impl.CloudSolrClient.directUpdate(CloudSolrClient.java:697)
	at org.apache.solr.client.solrj.impl.CloudSolrClient.sendRequest(CloudSolrClient.java:1109)
	at org.apache.solr.client.solrj.impl.CloudSolrClient.requestWithRetryOnStaleState(CloudSolrClient.java:998)
	at org.apache.solr.client.solrj.impl.CloudSolrClient.request(CloudSolrClient.java:934)
	at org.apache.solr.schema.TestManagedSchemaAPI.testAddFieldAndDocument(TestManagedSchemaAPI.java:86)
	at org.apache.solr.schema.TestManagedSchemaAPI.test(TestManagedSchemaAPI.java:55)
	at sun.reflect.NativeMethodAccessorImpl.invoke0(Native Method)
	at sun.reflect.NativeMethodAccessorImpl.invoke(NativeMethodAccessorImpl.java:62)
	at sun.reflect.DelegatingMethodAccessorImpl.invoke(DelegatingMethodAccessorImpl.java:43)
	at java.lang.reflect.Method.invoke(Method.java:498)
	at com.carrotsearch.randomizedtesting.RandomizedRunner.invoke(RandomizedRunner.java:1764)
	at com.carrotsearch.randomizedtesting.RandomizedRunner$8.evaluate(RandomizedRunner.java:871)
	at com.carrotsearch.randomizedtesting.RandomizedRunner$9.evaluate(RandomizedRunner.java:907)
	at com.carrotsearch.randomizedtesting.RandomizedRunner$10.evaluate(RandomizedRunner.java:921)
	at com.carrotsearch.randomizedtesting.rules.SystemPropertiesRestoreRule$1.evaluate(SystemPropertiesRestoreRule.java:57)
	at org.apache.lucene.util.TestRuleSetupTeardownChained$1.evaluate(TestRuleSetupTeardownChained.java:49)
	at org.apache.lucene.util.AbstractBeforeAfterRule$1.evaluate(AbstractBeforeAfterRule.java:45)
	at org.apache.lucene.util.TestRuleThreadAndTestName$1.evaluate(TestRuleThreadAndTestName.java:48)
	at org.apache.lucene.util.TestRuleIgnoreAfterMaxFailures$1.evaluate(TestRuleIgnoreAfterMaxFailures.java:64)
	at org.apache.lucene.util.TestRuleMarkFailure$1.evaluate(TestRuleMarkFailure.java:47)
	at com.carrotsearch.randomizedtesting.rules.StatementAdapter.evaluate(StatementAdapter.java:36)
	at com.carrotsearch.randomizedtesting.ThreadLeakControl$StatementRunner.run(ThreadLeakControl.java:367)
	at com.carrotsearch.randomizedtesting.ThreadLeakControl.forkTimeoutingTask(ThreadLeakControl.java:809)
	at com.carrotsearch.randomizedtesting.ThreadLeakControl$3.evaluate(ThreadLeakControl.java:460)
	at com.carrotsearch.randomizedtesting.RandomizedRunner.runSingleTest(RandomizedRunner.java:880)
	at com.carrotsearch.randomizedtesting.RandomizedRunner$5.evaluate(RandomizedRunner.java:781)
	at com.carrotsearch.randomizedtesting.RandomizedRunner$6.evaluate(RandomizedRunner.java:816)
	at com.carrotsearch.randomizedtesting.RandomizedRunner$7.evaluate(RandomizedRunner.java:827)
	at com.carrotsearch.randomizedtesting.rules.StatementAdapter.evaluate(StatementAdapter.java:36)
	at com.carrotsearch.randomizedtesting.rules.SystemPropertiesRestoreRule$1.evaluate(SystemPropertiesRestoreRule.java:57)
	at org.apache.lucene.util.AbstractBeforeAfterRule$1.evaluate(AbstractBeforeAfterRule.java:45)
	at com.carrotsearch.randomizedtesting.rules.StatementAdapter.evaluate(StatementAdapter.java:36)
	at org.apache.lucene.util.TestRuleStoreClassName$1.evaluate(TestRuleStoreClassName.java:41)
	at com.carrotsearch.randomizedtesting.rules.NoShadowingOrOverridesOnMethodsRule$1.evaluate(NoShadowingOrOverridesOnMethodsRule.java:40)
	at com.carrotsearch.randomizedtesting.rules.NoShadowingOrOverridesOnMethodsRule$1.evaluate(NoShadowingOrOverridesOnMethodsRule.java:40)
	at com.carrotsearch.randomizedtesting.rules.StatementAdapter.evaluate(StatementAdapter.java:36)
	at com.carrotsearch.randomizedtesting.rules.StatementAdapter.evaluate(StatementAdapter.java:36)
	at com.carrotsearch.randomizedtesting.rules.StatementAdapter.evaluate(StatementAdapter.java:36)
	at org.apache.lucene.util.TestRuleAssertionsRequired$1.evaluate(TestRuleAssertionsRequired.java:53)
	at org.apache.lucene.util.TestRuleMarkFailure$1.evaluate(TestRuleMarkFailure.java:47)
	at org.apache.lucene.util.TestRuleIgnoreAfterMaxFailures$1.evaluate(TestRuleIgnoreAfterMaxFailures.java:64)
	at org.apache.lucene.util.TestRuleIgnoreTestSuites$1.evaluate(TestRuleIgnoreTestSuites.java:54)
	at com.carrotsearch.randomizedtesting.rules.StatementAdapter.evaluate(StatementAdapter.java:36)
	at com.carrotsearch.randomizedtesting.ThreadLeakControl$StatementRunner.run(ThreadLeakControl.java:367)
	at java.lang.Thread.run(Thread.java:745)
Caused by: org.apache.solr.client.solrj.impl.HttpSolrClient$RemoteSolrException: Error from server at http://127.0.0.1:54151/solr/testschemaapi_shard1_replica2: ERROR: [doc=2] unknown field 'myNewField1'
	at org.apache.solr.client.solrj.impl.HttpSolrClient.executeMethod(HttpSolrClient.java:590)
	at org.apache.solr.client.solrj.impl.HttpSolrClient.request(HttpSolrClient.java:259)
	at org.apache.solr.client.solrj.impl.HttpSolrClient.request(HttpSolrClient.java:248)
	at org.apache.solr.client.solrj.impl.LBHttpSolrClient.doRequest(LBHttpSolrClient.java:404)
	at org.apache.solr.client.solrj.impl.LBHttpSolrClient.request(LBHttpSolrClient.java:357)
	at org.apache.solr.client.solrj.impl.CloudSolrClient.lambda$directUpdate$0(CloudSolrClient.java:674)
	at java.util.concurrent.FutureTask.run(FutureTask.java:266)
	at org.apache.solr.common.util.ExecutorUtil$MDCAwareThreadPoolExecutor.lambda$execute$0(ExecutorUtil.java:229)
	at java.util.concurrent.ThreadPoolExecutor.runWorker(ThreadPoolExecutor.java:1142)
	at java.util.concurrent.ThreadPoolExecutor$Worker.run(ThreadPoolExecutor.java:617)
	... 1 more




Build Log:
[...truncated 12169 lines...]
   [junit4] Suite: org.apache.solr.schema.TestManagedSchemaAPI
   [junit4]   2> Creating dataDir: /Users/jenkins/workspace/Lucene-Solr-6.x-MacOSX/solr/build/solr-core/test/J1/temp/solr.schema.TestManagedSchemaAPI_48CB1243F047CE4B-001/init-core-data-001
   [junit4]   2> 3476448 INFO  (SUITE-TestManagedSchemaAPI-seed#[48CB1243F047CE4B]-worker) [    ] o.a.s.SolrTestCaseJ4 Randomized ssl (false) and clientAuth (false)
   [junit4]   2> 3476456 INFO  (SUITE-TestManagedSchemaAPI-seed#[48CB1243F047CE4B]-worker) [    ] o.a.s.c.ZkTestServer STARTING ZK TEST SERVER
   [junit4]   2> 3476456 INFO  (Thread-7066) [    ] o.a.s.c.ZkTestServer client port:0.0.0.0/0.0.0.0:0
   [junit4]   2> 3476456 INFO  (Thread-7066) [    ] o.a.s.c.ZkTestServer Starting server
   [junit4]   2> 3476560 INFO  (SUITE-TestManagedSchemaAPI-seed#[48CB1243F047CE4B]-worker) [    ] o.a.s.c.ZkTestServer start zk server on port:54149
   [junit4]   2> 3476561 INFO  (SUITE-TestManagedSchemaAPI-seed#[48CB1243F047CE4B]-worker) [    ] o.a.s.c.c.SolrZkClient Using default ZkCredentialsProvider
   [junit4]   2> 3476561 INFO  (SUITE-TestManagedSchemaAPI-seed#[48CB1243F047CE4B]-worker) [    ] o.a.s.c.c.ConnectionManager Waiting for client to connect to ZooKeeper
   [junit4]   2> 3476576 INFO  (zkCallback-11613-thread-1) [    ] o.a.s.c.c.ConnectionManager Watcher org.apache.solr.common.cloud.ConnectionManager@3cd75f53 name:ZooKeeperConnection Watcher:127.0.0.1:54149 got event WatchedEvent state:SyncConnected type:None path:null path:null type:None
   [junit4]   2> 3476576 INFO  (SUITE-TestManagedSchemaAPI-seed#[48CB1243F047CE4B]-worker) [    ] o.a.s.c.c.ConnectionManager Client is connected to ZooKeeper
   [junit4]   2> 3476576 INFO  (SUITE-TestManagedSchemaAPI-seed#[48CB1243F047CE4B]-worker) [    ] o.a.s.c.c.SolrZkClient Using default ZkACLProvider
   [junit4]   2> 3476577 INFO  (SUITE-TestManagedSchemaAPI-seed#[48CB1243F047CE4B]-worker) [    ] o.a.s.c.c.SolrZkClient makePath: /solr/solr.xml
   [junit4]   2> 3476586 INFO  (jetty-launcher-11612-thread-1) [    ] o.e.j.s.Server jetty-9.3.8.v20160314
   [junit4]   2> 3476587 INFO  (jetty-launcher-11612-thread-2) [    ] o.e.j.s.Server jetty-9.3.8.v20160314
   [junit4]   2> 3476599 INFO  (jetty-launcher-11612-thread-1) [    ] o.e.j.s.h.ContextHandler Started o.e.j.s.ServletContextHandler@6529cf17{/solr,null,AVAILABLE}
   [junit4]   2> 3476600 INFO  (jetty-launcher-11612-thread-1) [    ] o.e.j.s.ServerConnector Started ServerConnector@790e82b{HTTP/1.1,[http/1.1]}{127.0.0.1:54151}
   [junit4]   2> 3476600 INFO  (jetty-launcher-11612-thread-1) [    ] o.e.j.s.Server Started @3481844ms
   [junit4]   2> 3476600 INFO  (jetty-launcher-11612-thread-1) [    ] o.a.s.c.s.e.JettySolrRunner Jetty properties: {hostContext=/solr, hostPort=54151}
   [junit4]   2> 3476600 INFO  (jetty-launcher-11612-thread-1) [    ] o.a.s.s.SolrDispatchFilter SolrDispatchFilter.init(): sun.misc.Launcher$AppClassLoader@4554617c
   [junit4]   2> 3476601 INFO  (jetty-launcher-11612-thread-1) [    ] o.a.s.c.SolrResourceLoader new SolrResourceLoader for directory: '/Users/jenkins/workspace/Lucene-Solr-6.x-MacOSX/solr/build/solr-core/test/J1/temp/solr.schema.TestManagedSchemaAPI_48CB1243F047CE4B-001/tempDir-001/node1'
   [junit4]   2> 3476601 INFO  (jetty-launcher-11612-thread-1) [    ] o.a.s.c.SolrResourceLoader JNDI not configured for solr (NoInitialContextEx)
   [junit4]   2> 3476601 INFO  (jetty-launcher-11612-thread-1) [    ] o.a.s.c.SolrResourceLoader solr home defaulted to 'solr/' (could not find system property or JNDI)
   [junit4]   2> 3476601 INFO  (jetty-launcher-11612-thread-1) [    ] o.a.s.c.c.SolrZkClient Using default ZkCredentialsProvider
   [junit4]   2> 3476601 INFO  (jetty-launcher-11612-thread-2) [    ] o.e.j.s.h.ContextHandler Started o.e.j.s.ServletContextHandler@27b02a1e{/solr,null,AVAILABLE}
   [junit4]   2> 3476602 INFO  (jetty-launcher-11612-thread-1) [    ] o.a.s.c.c.ConnectionManager Waiting for client to connect to ZooKeeper
   [junit4]   2> 3476602 INFO  (jetty-launcher-11612-thread-2) [    ] o.e.j.s.ServerConnector Started ServerConnector@3ac77196{HTTP/1.1,[http/1.1]}{127.0.0.1:54152}
   [junit4]   2> 3476603 INFO  (jetty-launcher-11612-thread-2) [    ] o.e.j.s.Server Started @3481846ms
   [junit4]   2> 3476603 INFO  (jetty-launcher-11612-thread-2) [    ] o.a.s.c.s.e.JettySolrRunner Jetty properties: {hostContext=/solr, hostPort=54152}
   [junit4]   2> 3476603 INFO  (jetty-launcher-11612-thread-2) [    ] o.a.s.s.SolrDispatchFilter SolrDispatchFilter.init(): sun.misc.Launcher$AppClassLoader@4554617c
   [junit4]   2> 3476603 INFO  (jetty-launcher-11612-thread-2) [    ] o.a.s.c.SolrResourceLoader new SolrResourceLoader for directory: '/Users/jenkins/workspace/Lucene-Solr-6.x-MacOSX/solr/build/solr-core/test/J1/temp/solr.schema.TestManagedSchemaAPI_48CB1243F047CE4B-001/tempDir-001/node2'
   [junit4]   2> 3476604 INFO  (jetty-launcher-11612-thread-2) [    ] o.a.s.c.SolrResourceLoader JNDI not configured for solr (NoInitialContextEx)
   [junit4]   2> 3476604 INFO  (jetty-launcher-11612-thread-2) [    ] o.a.s.c.SolrResourceLoader solr home defaulted to 'solr/' (could not find system property or JNDI)
   [junit4]   2> 3476604 INFO  (jetty-launcher-11612-thread-2) [    ] o.a.s.c.c.SolrZkClient Using default ZkCredentialsProvider
   [junit4]   2> 3476605 INFO  (jetty-launcher-11612-thread-2) [    ] o.a.s.c.c.ConnectionManager Waiting for client to connect to ZooKeeper
   [junit4]   2> 3476606 INFO  (zkCallback-11614-thread-1) [    ] o.a.s.c.c.ConnectionManager Watcher org.apache.solr.common.cloud.ConnectionManager@5ae4b4ad name:ZooKeeperConnection Watcher:127.0.0.1:54149/solr got event WatchedEvent state:SyncConnected type:None path:null path:null type:None
   [junit4]   2> 3476606 INFO  (jetty-launcher-11612-thread-1) [    ] o.a.s.c.c.ConnectionManager Client is connected to ZooKeeper
   [junit4]   2> 3476606 INFO  (jetty-launcher-11612-thread-1) [    ] o.a.s.c.c.SolrZkClient Using default ZkACLProvider
   [junit4]   2> 3476606 INFO  (zkCallback-11615-thread-1) [    ] o.a.s.c.c.ConnectionManager Watcher org.apache.solr.common.cloud.ConnectionManager@21666d7a name:ZooKeeperConnection Watcher:127.0.0.1:54149/solr got event WatchedEvent state:SyncConnected type:None path:null path:null type:None
   [junit4]   2> 3476606 INFO  (jetty-launcher-11612-thread-2) [    ] o.a.s.c.c.ConnectionManager Client is connected to ZooKeeper
   [junit4]   2> 3476607 INFO  (jetty-launcher-11612-thread-2) [    ] o.a.s.c.c.SolrZkClient Using default ZkACLProvider
   [junit4]   2> 3476607 INFO  (jetty-launcher-11612-thread-1) [    ] o.a.s.s.SolrDispatchFilter solr.xml found in ZooKeeper. Loading...
   [junit4]   2> 3476607 INFO  (jetty-launcher-11612-thread-2) [    ] o.a.s.s.SolrDispatchFilter solr.xml found in ZooKeeper. Loading...
   [junit4]   2> 3476616 INFO  (jetty-launcher-11612-thread-1) [    ] o.a.s.c.CorePropertiesLocator Config-defined core root directory: /Users/jenkins/workspace/Lucene-Solr-6.x-MacOSX/solr/build/solr-core/test/J1/temp/solr.schema.TestManagedSchemaAPI_48CB1243F047CE4B-001/tempDir-001/node1/.
   [junit4]   2> 3476616 INFO  (jetty-launcher-11612-thread-2) [    ] o.a.s.c.CorePropertiesLocator Config-defined core root directory: /Users/jenkins/workspace/Lucene-Solr-6.x-MacOSX/solr/build/solr-core/test/J1/temp/solr.schema.TestManagedSchemaAPI_48CB1243F047CE4B-001/tempDir-001/node2/.
   [junit4]   2> 3476617 INFO  (jetty-launcher-11612-thread-1) [    ] o.a.s.c.CoreContainer New CoreContainer 2032095586
   [junit4]   2> 3476617 INFO  (jetty-launcher-11612-thread-2) [    ] o.a.s.c.CoreContainer New CoreContainer 1090397356
   [junit4]   2> 3476617 INFO  (jetty-launcher-11612-thread-2) [    ] o.a.s.c.CoreContainer Loading cores into CoreContainer [instanceDir=/Users/jenkins/workspace/Lucene-Solr-6.x-MacOSX/solr/build/solr-core/test/J1/temp/solr.schema.TestManagedSchemaAPI_48CB1243F047CE4B-001/tempDir-001/node2]
   [junit4]   2> 3476617 INFO  (jetty-launcher-11612-thread-1) [    ] o.a.s.c.CoreContainer Loading cores into CoreContainer [instanceDir=/Users/jenkins/workspace/Lucene-Solr-6.x-MacOSX/solr/build/solr-core/test/J1/temp/solr.schema.TestManagedSchemaAPI_48CB1243F047CE4B-001/tempDir-001/node1]
   [junit4]   2> 3476617 WARN  (jetty-launcher-11612-thread-2) [    ] o.a.s.c.CoreContainer Couldn't add files from /Users/jenkins/workspace/Lucene-Solr-6.x-MacOSX/solr/build/solr-core/test/J1/temp/solr.schema.TestManagedSchemaAPI_48CB1243F047CE4B-001/tempDir-001/node2/lib to classpath: /Users/jenkins/workspace/Lucene-Solr-6.x-MacOSX/solr/build/solr-core/test/J1/temp/solr.schema.TestManagedSchemaAPI_48CB1243F047CE4B-001/tempDir-001/node2/lib
   [junit4]   2> 3476617 WARN  (jetty-launcher-11612-thread-1) [    ] o.a.s.c.CoreContainer Couldn't add files from /Users/jenkins/workspace/Lucene-Solr-6.x-MacOSX/solr/build/solr-core/test/J1/temp/solr.schema.TestManagedSchemaAPI_48CB1243F047CE4B-001/tempDir-001/node1/lib to classpath: /Users/jenkins/workspace/Lucene-Solr-6.x-MacOSX/solr/build/solr-core/test/J1/temp/solr.schema.TestManagedSchemaAPI_48CB1243F047CE4B-001/tempDir-001/node1/lib
   [junit4]   2> 3476617 INFO  (jetty-launcher-11612-thread-2) [    ] o.a.s.h.c.HttpShardHandlerFactory created with socketTimeout : 90000,urlScheme : ,connTimeout : 15000,maxConnectionsPerHost : 20,maxConnections : 10000,corePoolSize : 0,maximumPoolSize : 2147483647,maxThreadIdleTime : 5,sizeOfQueue : -1,fairnessPolicy : false,useRetries : false,
   [junit4]   2> 3476617 INFO  (jetty-launcher-11612-thread-1) [    ] o.a.s.h.c.HttpShardHandlerFactory created with socketTimeout : 90000,urlScheme : ,connTimeout : 15000,maxConnectionsPerHost : 20,maxConnections : 10000,corePoolSize : 0,maximumPoolSize : 2147483647,maxThreadIdleTime : 5,sizeOfQueue : -1,fairnessPolicy : false,useRetries : false,
   [junit4]   2> 3476620 INFO  (jetty-launcher-11612-thread-2) [    ] o.a.s.u.UpdateShardHandler Creating UpdateShardHandler HTTP client with params: socketTimeout=340000&connTimeout=45000&retry=true
   [junit4]   2> 3476620 INFO  (jetty-launcher-11612-thread-1) [    ] o.a.s.u.UpdateShardHandler Creating UpdateShardHandler HTTP client with params: socketTimeout=340000&connTimeout=45000&retry=true
   [junit4]   2> 3476621 INFO  (jetty-launcher-11612-thread-2) [    ] o.a.s.l.LogWatcher SLF4J impl is org.slf4j.impl.Log4jLoggerFactory
   [junit4]   2> 3476621 INFO  (jetty-launcher-11612-thread-2) [    ] o.a.s.l.LogWatcher Registering Log Listener [Log4j (org.slf4j.impl.Log4jLoggerFactory)]
   [junit4]   2> 3476621 INFO  (jetty-launcher-11612-thread-1) [    ] o.a.s.l.LogWatcher SLF4J impl is org.slf4j.impl.Log4jLoggerFactory
   [junit4]   2> 3476621 INFO  (jetty-launcher-11612-thread-2) [    ] o.a.s.c.ZkContainer Zookeeper client=127.0.0.1:54149/solr
   [junit4]   2> 3476621 INFO  (jetty-launcher-11612-thread-1) [    ] o.a.s.l.LogWatcher Registering Log Listener [Log4j (org.slf4j.impl.Log4jLoggerFactory)]
   [junit4]   2> 3476621 INFO  (jetty-launcher-11612-thread-2) [    ] o.a.s.c.ZkController zkHost includes chroot
   [junit4]   2> 3476621 INFO  (jetty-launcher-11612-thread-2) [    ] o.a.s.c.c.SolrZkClient Using default ZkCredentialsProvider
   [junit4]   2> 3476622 INFO  (jetty-launcher-11612-thread-1) [    ] o.a.s.c.ZkContainer Zookeeper client=127.0.0.1:54149/solr
   [junit4]   2> 3476622 INFO  (jetty-launcher-11612-thread-1) [    ] o.a.s.c.ZkController zkHost includes chroot
   [junit4]   2> 3476622 INFO  (jetty-launcher-11612-thread-1) [    ] o.a.s.c.c.SolrZkClient Using default ZkCredentialsProvider
   [junit4]   2> 3476622 INFO  (jetty-launcher-11612-thread-2) [    ] o.a.s.c.c.ConnectionManager Waiting for client to connect to ZooKeeper
   [junit4]   2> 3476623 INFO  (jetty-launcher-11612-thread-1) [    ] o.a.s.c.c.ConnectionManager Waiting for client to connect to ZooKeeper
   [junit4]   2> 3476624 INFO  (zkCallback-11620-thread-1) [    ] o.a.s.c.c.ConnectionManager Watcher org.apache.solr.common.cloud.ConnectionManager@56838361 name:ZooKeeperConnection Watcher:127.0.0.1:54149 got event WatchedEvent state:SyncConnected type:None path:null path:null type:None
   [junit4]   2> 3476624 INFO  (jetty-launcher-11612-thread-2) [    ] o.a.s.c.c.ConnectionManager Client is connected to ZooKeeper
   [junit4]   2> 3476624 INFO  (zkCallback-11621-thread-1) [    ] o.a.s.c.c.ConnectionManager Watcher org.apache.solr.common.cloud.ConnectionManager@4f34d5f6 name:ZooKeeperConnection Watcher:127.0.0.1:54149 got event WatchedEvent state:SyncConnected type:None path:null path:null type:None
   [junit4]   2> 3476624 INFO  (jetty-launcher-11612-thread-2) [    ] o.a.s.c.c.SolrZkClient Using default ZkACLProvider
   [junit4]   2> 3476624 INFO  (jetty-launcher-11612-thread-1) [    ] o.a.s.c.c.ConnectionManager Client is connected to ZooKeeper
   [junit4]   2> 3476624 INFO  (jetty-launcher-11612-thread-1) [    ] o.a.s.c.c.SolrZkClient Using default ZkACLProvider
   [junit4]   2> 3476627 INFO  (jetty-launcher-11612-thread-2) [n:127.0.0.1:54152_solr    ] o.a.s.c.ZkController Added new OnReconnect listener org.apache.solr.cloud.ZkController$$Lambda$67/1499793302@6a79d3f5
   [junit4]   2> 3476627 INFO  (jetty-launcher-11612-thread-2) [n:127.0.0.1:54152_solr    ] o.a.s.c.c.ConnectionManager Waiting for client to connect to ZooKeeper
   [junit4]   2> 3476628 INFO  (jetty-launcher-11612-thread-1) [n:127.0.0.1:54151_solr    ] o.a.s.c.ZkController Added new OnReconnect listener org.apache.solr.cloud.ZkController$$Lambda$67/1499793302@143bd2aa
   [junit4]   2> 3476628 INFO  (jetty-launcher-11612-thread-1) [n:127.0.0.1:54151_solr    ] o.a.s.c.c.ConnectionManager Waiting for client to connect to ZooKeeper
   [junit4]   2> 3476629 INFO  (zkCallback-11622-thread-1-processing-n:127.0.0.1:54152_solr) [n:127.0.0.1:54152_solr    ] o.a.s.c.c.ConnectionManager Watcher org.apache.solr.common.cloud.ConnectionManager@6b403f55 name:ZooKeeperConnection Watcher:127.0.0.1:54149/solr got event WatchedEvent state:SyncConnected type:None path:null path:null type:None
   [junit4]   2> 3476629 INFO  (jetty-launcher-11612-thread-2) [n:127.0.0.1:54152_solr    ] o.a.s.c.c.ConnectionManager Client is connected to ZooKeeper
   [junit4]   2> 3476630 INFO  (zkCallback-11623-thread-1-processing-n:127.0.0.1:54151_solr) [n:127.0.0.1:54151_solr    ] o.a.s.c.c.ConnectionManager Watcher org.apache.solr.common.cloud.ConnectionManager@1839504c name:ZooKeeperConnection Watcher:127.0.0.1:54149/solr got event WatchedEvent state:SyncConnected type:None path:null path:null type:None
   [junit4]   2> 3476630 INFO  (jetty-launcher-11612-thread-1) [n:127.0.0.1:54151_solr    ] o.a.s.c.c.ConnectionManager Client is connected to ZooKeeper
   [junit4]   2> 3476631 INFO  (jetty-launcher-11612-thread-2) [n:127.0.0.1:54152_solr    ] o.a.s.c.c.SolrZkClient makePath: /overseer/queue
   [junit4]   2> 3476632 INFO  (jetty-launcher-11612-thread-1) [n:127.0.0.1:54151_solr    ] o.a.s.c.c.SolrZkClient makePath: /overseer/queue
   [junit4]   2> 3476635 INFO  (jetty-launcher-11612-thread-2) [n:127.0.0.1:54152_solr    ] o.a.s.c.c.SolrZkClient makePath: /overseer/collection-queue-work
   [junit4]   2> 3476635 INFO  (jetty-launcher-11612-thread-1) [n:127.0.0.1:54151_solr    ] o.a.s.c.c.SolrZkClient makePath: /overseer/collection-queue-work
   [junit4]   2> 3476641 INFO  (jetty-launcher-11612-thread-1) [n:127.0.0.1:54151_solr    ] o.a.s.c.c.SolrZkClient makePath: /overseer/collection-map-running
   [junit4]   2> 3476641 INFO  (jetty-launcher-11612-thread-2) [n:127.0.0.1:54152_solr    ] o.a.s.c.c.SolrZkClient makePath: /overseer/collection-map-running
   [junit4]   2> 3476644 INFO  (jetty-launcher-11612-thread-1) [n:127.0.0.1:54151_solr    ] o.a.s.c.c.SolrZkClient makePath: /overseer/collection-map-completed
   [junit4]   2> 3476644 INFO  (jetty-launcher-11612-thread-2) [n:127.0.0.1:54152_solr    ] o.a.s.c.c.SolrZkClient makePath: /overseer/collection-map-completed
   [junit4]   2> 3476647 INFO  (jetty-launcher-11612-thread-1) [n:127.0.0.1:54151_solr    ] o.a.s.c.c.SolrZkClient makePath: /overseer/collection-map-failure
   [junit4]   2> 3476648 INFO  (jetty-launcher-11612-thread-2) [n:127.0.0.1:54152_solr    ] o.a.s.c.c.SolrZkClient makePath: /overseer/collection-map-failure
   [junit4]   2> 3476651 INFO  (jetty-launcher-11612-thread-2) [n:127.0.0.1:54152_solr    ] o.a.s.c.c.SolrZkClient makePath: /live_nodes
   [junit4]   2> 3476651 INFO  (jetty-launcher-11612-thread-1) [n:127.0.0.1:54151_solr    ] o.a.s.c.c.SolrZkClient makePath: /live_nodes
   [junit4]   2> 3476653 INFO  (jetty-launcher-11612-thread-2) [n:127.0.0.1:54152_solr    ] o.a.s.c.c.SolrZkClient makePath: /collections
   [junit4]   2> 3476654 INFO  (jetty-launcher-11612-thread-1) [n:127.0.0.1:54151_solr    ] o.a.s.c.c.SolrZkClient makePath: /collections
   [junit4]   2> 3476655 INFO  (jetty-launcher-11612-thread-1) [n:127.0.0.1:54151_solr    ] o.a.s.c.c.SolrZkClient makePath: /aliases.json
   [junit4]   2> 3476655 INFO  (jetty-launcher-11612-thread-2) [n:127.0.0.1:54152_solr    ] o.a.s.c.c.SolrZkClient makePath: /aliases.json
   [junit4]   2> 3476657 INFO  (jetty-launcher-11612-thread-2) [n:127.0.0.1:54152_solr    ] o.a.s.c.c.SolrZkClient makePath: /clusterstate.json
   [junit4]   2> 3476658 INFO  (jetty-launcher-11612-thread-1) [n:127.0.0.1:54151_solr    ] o.a.s.c.c.SolrZkClient makePath: /clusterstate.json
   [junit4]   2> 3476660 INFO  (jetty-launcher-11612-thread-2) [n:127.0.0.1:54152_solr    ] o.a.s.c.c.SolrZkClient makePath: /security.json
   [junit4]   2> 3476660 INFO  (jetty-launcher-11612-thread-1) [n:127.0.0.1:54151_solr    ] o.a.s.c.c.SolrZkClient makePath: /security.json
   [junit4]   2> 3476663 INFO  (jetty-launcher-11612-thread-1) [n:127.0.0.1:54151_solr    ] o.a.s.c.c.ZkStateReader Updating cluster state from ZooKeeper... 
   [junit4]   2> 3476663 INFO  (jetty-launcher-11612-thread-2) [n:127.0.0.1:54152_solr    ] o.a.s.c.c.ZkStateReader Updating cluster state from ZooKeeper... 
   [junit4]   2> 3476664 INFO  (jetty-launcher-11612-thread-1) [n:127.0.0.1:54151_solr    ] o.a.s.c.c.ZkStateReader Loaded empty cluster properties
   [junit4]   2> 3476664 INFO  (jetty-launcher-11612-thread-2) [n:127.0.0.1:54152_solr    ] o.a.s.c.c.ZkStateReader Loaded empty cluster properties
   [junit4]   2> 3476665 INFO  (jetty-launcher-11612-thread-1) [n:127.0.0.1:54151_solr    ] o.a.s.c.c.ZkStateReader Updated live nodes from ZooKeeper... (0) -> (0)
   [junit4]   2> 3476666 INFO  (jetty-launcher-11612-thread-2) [n:127.0.0.1:54152_solr    ] o.a.s.c.c.ZkStateReader Updated live nodes from ZooKeeper... (0) -> (0)
   [junit4]   2> 3476670 INFO  (jetty-launcher-11612-thread-1) [n:127.0.0.1:54151_solr    ] o.a.s.c.c.SolrZkClient makePath: /overseer_elect
   [junit4]   2> 3476671 INFO  (jetty-launcher-11612-thread-2) [n:127.0.0.1:54152_solr    ] o.a.s.c.c.SolrZkClient makePath: /overseer_elect
   [junit4]   2> 3476672 INFO  (jetty-launcher-11612-thread-1) [n:127.0.0.1:54151_solr    ] o.a.s.c.c.SolrZkClient makePath: /overseer_elect/election
   [junit4]   2> 3476673 INFO  (jetty-launcher-11612-thread-2) [n:127.0.0.1:54152_solr    ] o.a.s.c.c.SolrZkClient makePath: /overseer_elect/election
   [junit4]   2> 3476675 INFO  (jetty-launcher-11612-thread-2) [n:127.0.0.1:54152_solr    ] o.a.s.c.Overseer Overseer (id=null) closing
   [junit4]   2> 3476675 INFO  (jetty-launcher-11612-thread-1) [n:127.0.0.1:54151_solr    ] o.a.s.c.Overseer Overseer (id=null) closing
   [junit4]   2> 3476676 INFO  (jetty-launcher-11612-thread-2) [n:127.0.0.1:54152_solr    ] o.a.s.c.LeaderElector Joined leadership election with path: /overseer_elect/election/95899556551655429-127.0.0.1:54152_solr-n_0000000001
   [junit4]   2> 3476676 INFO  (jetty-launcher-11612-thread-1) [n:127.0.0.1:54151_solr    ] o.a.s.c.LeaderElector Joined leadership election with path: /overseer_elect/election/95899556551655430-127.0.0.1:54151_solr-n_0000000000
   [junit4]   2> 3476676 INFO  (jetty-launcher-11612-thread-1) [n:127.0.0.1:54151_solr    ] o.a.s.c.OverseerElectionContext I am going to be the leader 127.0.0.1:54151_solr
   [junit4]   2> 3476677 INFO  (jetty-launcher-11612-thread-1) [n:127.0.0.1:54151_solr    ] o.a.s.c.c.SolrZkClient makePath: /overseer_elect/leader
   [junit4]   2> 3476677 INFO  (jetty-launcher-11612-thread-2) [n:127.0.0.1:54152_solr    ] o.a.s.c.LeaderElector Watching path /overseer_elect/election/95899556551655430-127.0.0.1:54151_solr-n_0000000000 to know if I could be the leader
   [junit4]   2> 3476678 INFO  (jetty-launcher-11612-thread-2) [n:127.0.0.1:54152_solr    ] o.a.s.c.ZkController Register node as live in ZooKeeper:/live_nodes/127.0.0.1:54152_solr
   [junit4]   2> 3476678 INFO  (jetty-launcher-11612-thread-2) [n:127.0.0.1:54152_solr    ] o.a.s.c.c.SolrZkClient makePath: /live_nodes/127.0.0.1:54152_solr
   [junit4]   2> 3476679 INFO  (jetty-launcher-11612-thread-1) [n:127.0.0.1:54151_solr    ] o.a.s.c.Overseer Overseer (id=95899556551655430-127.0.0.1:54151_solr-n_0000000000) starting
   [junit4]   2> 3476680 INFO  (zkCallback-11623-thread-1-processing-n:127.0.0.1:54151_solr) [n:127.0.0.1:54151_solr    ] o.a.s.c.c.ZkStateReader A live node change: [WatchedEvent state:SyncConnected type:NodeChildrenChanged path:/live_nodes], has occurred - updating... (live nodes size: [0])
   [junit4]   2> 3476680 INFO  (zkCallback-11622-thread-1-processing-n:127.0.0.1:54152_solr) [n:127.0.0.1:54152_solr    ] o.a.s.c.c.ZkStateReader A live node change: [WatchedEvent state:SyncConnected type:NodeChildrenChanged path:/live_nodes], has occurred - updating... (live nodes size: [0])
   [junit4]   2> 3476682 INFO  (zkCallback-11623-thread-1-processing-n:127.0.0.1:54151_solr) [n:127.0.0.1:54151_solr    ] o.a.s.c.c.ZkStateReader Updated live nodes from ZooKeeper... (0) -> (1)
   [junit4]   2> 3476682 INFO  (zkCallback-11622-thread-1-processing-n:127.0.0.1:54152_solr) [n:127.0.0.1:54152_solr    ] o.a.s.c.c.ZkStateReader Updated live nodes from ZooKeeper... (0) -> (1)
   [junit4]   2> 3476683 INFO  (jetty-launcher-11612-thread-1) [n:127.0.0.1:54151_solr    ] o.a.s.c.c.SolrZkClient makePath: /overseer/queue-work
   [junit4]   2> 3476692 INFO  (jetty-launcher-11612-thread-2) [n:127.0.0.1:54152_solr    ] o.a.s.c.CoreContainer Security conf doesn't exist. Skipping setup for authorization module.
   [junit4]   2> 3476692 INFO  (jetty-launcher-11612-thread-2) [n:127.0.0.1:54152_solr    ] o.a.s.c.CoreContainer No authentication plugin used.
   [junit4]   2> 3476696 INFO  (jetty-launcher-11612-thread-1) [n:127.0.0.1:54151_solr    ] o.a.s.c.OverseerAutoReplicaFailoverThread Starting OverseerAutoReplicaFailoverThread autoReplicaFailoverWorkLoopDelay=10000 autoReplicaFailoverWaitAfterExpiration=30000 autoReplicaFailoverBadNodeExpiration=60000
   [junit4]   2> 3476697 INFO  (jetty-launcher-11612-thread-2) [n:127.0.0.1:54152_solr    ] o.a.s.c.CorePropertiesLocator Looking for core definitions underneath /Users/jenkins/workspace/Lucene-Solr-6.x-MacOSX/solr/build/solr-core/test/J1/temp/solr.schema.TestManagedSchemaAPI_48CB1243F047CE4B-001/tempDir-001/node2/.
   [junit4]   2> 3476697 INFO  (jetty-launcher-11612-thread-2) [n:127.0.0.1:54152_solr    ] o.a.s.c.CorePropertiesLocator Found 0 core definitions
   [junit4]   2> 3476697 INFO  (OverseerCollectionConfigSetProcessor-95899556551655430-127.0.0.1:54151_solr-n_0000000000) [n:127.0.0.1:54151_solr    ] o.a.s.c.OverseerTaskProcessor Process current queue of overseer operations
   [junit4]   2> 3476698 INFO  (OverseerStateUpdate-95899556551655430-127.0.0.1:54151_solr-n_0000000000) [n:127.0.0.1:54151_solr    ] o.a.s.c.Overseer Starting to work on the main queue
   [junit4]   2> 3476699 INFO  (jetty-launcher-11612-thread-1) [n:127.0.0.1:54151_solr    ] o.a.s.c.ZkController Publish node=127.0.0.1:54151_solr as DOWN
   [junit4]   2> 3476699 INFO  (jetty-launcher-11612-thread-2) [n:127.0.0.1:54152_solr    ] o.a.s.s.SolrDispatchFilter user.dir=/Users/jenkins/workspace/Lucene-Solr-6.x-MacOSX/solr/build/solr-core/test/J1
   [junit4]   2> 3476699 INFO  (jetty-launcher-11612-thread-2) [n:127.0.0.1:54152_solr    ] o.a.s.s.SolrDispatchFilter SolrDispatchFilter.init() done
   [junit4]   2> 3476702 INFO  (OverseerStateUpdate-95899556551655430-127.0.0.1:54151_solr-n_0000000000) [n:127.0.0.1:54151_solr    ] o.a.s.c.c.ZkStateReader Updated live nodes from ZooKeeper... (1) -> (1)
   [junit4]   2> 3476703 INFO  (OverseerStateUpdate-95899556551655430-127.0.0.1:54151_solr-n_0000000000) [n:127.0.0.1:54151_solr    ] o.a.s.c.Overseer processMessage: queueSize: 1, message = {
   [junit4]   2>   "operation":"downnode",
   [junit4]   2>   "node_name":"127.0.0.1:54151_solr"} current state version: 0
   [junit4]   2> 3476703 INFO  (OverseerStateUpdate-95899556551655430-127.0.0.1:54151_solr-n_0000000000) [n:127.0.0.1:54151_solr    ] o.a.s.c.o.NodeMutator DownNode state invoked for node: 127.0.0.1:54151_solr
   [junit4]   2> 3477704 INFO  (jetty-launcher-11612-thread-1) [n:127.0.0.1:54151_solr    ] o.a.s.c.ZkController Register node as live in ZooKeeper:/live_nodes/127.0.0.1:54151_solr
   [junit4]   2> 3477705 INFO  (jetty-launcher-11612-thread-1) [n:127.0.0.1:54151_solr    ] o.a.s.c.c.SolrZkClient makePath: /live_nodes/127.0.0.1:54151_solr
   [junit4]   2> 3477708 INFO  (zkCallback-11623-thread-1-processing-n:127.0.0.1:54151_solr) [n:127.0.0.1:54151_solr    ] o.a.s.c.c.ZkStateReader A live node change: [WatchedEvent state:SyncConnected type:NodeChildrenChanged path:/live_nodes], has occurred - updating... (live nodes size: [1])
   [junit4]   2> 3477708 INFO  (zkCallback-11622-thread-1-processing-n:127.0.0.1:54152_solr) [n:127.0.0.1:54152_solr    ] o.a.s.c.c.ZkStateReader A live node change: [WatchedEvent state:SyncConnected type:NodeChildrenChanged path:/live_nodes], has occurred - updating... (live nodes size: [1])
   [junit4]   2> 3477709 INFO  (zkCallback-11623-thread-1-processing-n:127.0.0.1:54151_solr) [n:127.0.0.1:54151_solr    ] o.a.s.c.c.ZkStateReader Updated live nodes from ZooKeeper... (1) -> (2)
   [junit4]   2> 3477709 INFO  (zkCallback-11622-thread-1-processing-n:127.0.0.1:54152_solr) [n:127.0.0.1:54152_solr    ] o.a.s.c.c.ZkStateReader Updated live nodes from ZooKeeper... (1) -> (2)
   [junit4]   2> 3477721 INFO  (jetty-launcher-11612-thread-1) [n:127.0.0.1:54151_solr    ] o.a.s.c.CoreContainer Security conf doesn't exist. Skipping setup for authorization module.
   [junit4]   2> 3477721 INFO  (jetty-launcher-11612-thread-1) [n:127.0.0.1:54151_solr    ] o.a.s.c.CoreContainer No authentication plugin used.
   [junit4]   2> 3477723 INFO  (jetty-launcher-11612-thread-1) [n:127.0.0.1:54151_solr    ] o.a.s.c.CorePropertiesLocator Looking for core definitions underneath /Users/jenkins/workspace/Lucene-Solr-6.x-MacOSX/solr/build/solr-core/test/J1/temp/solr.schema.TestManagedSchemaAPI_48CB1243F047CE4B-001/tempDir-001/node1/.
   [junit4]   2> 3477723 INFO  (jetty-launcher-11612-thread-1) [n:127.0.0.1:54151_solr    ] o.a.s.c.CorePropertiesLocator Found 0 core definitions
   [junit4]   2> 3477724 INFO  (jetty-launcher-11612-thread-1) [n:127.0.0.1:54151_solr    ] o.a.s.s.SolrDispatchFilter user.dir=/Users/jenkins/workspace/Lucene-Solr-6.x-MacOSX/solr/build/solr-core/test/J1
   [junit4]   2> 3477725 INFO  (jetty-launcher-11612-thread-1) [n:127.0.0.1:54151_solr    ] o.a.s.s.SolrDispatchFilter SolrDispatchFilter.init() done
   [junit4]   2> 3477725 INFO  (SUITE-TestManagedSchemaAPI-seed#[48CB1243F047CE4B]-worker) [    ] o.a.s.c.c.SolrZkClient Using default ZkCredentialsProvider
   [junit4]   2> 3477726 INFO  (SUITE-TestManagedSchemaAPI-seed#[48CB1243F047CE4B]-worker) [    ] o.a.s.c.c.ConnectionManager Waiting for client to connect to ZooKeeper
   [junit4]   2> 3477727 INFO  (zkCallback-11626-thread-1) [    ] o.a.s.c.c.ConnectionManager Watcher org.apache.solr.common.cloud.ConnectionManager@5b186400 name:ZooKeeperConnection Watcher:127.0.0.1:54149 got event WatchedEvent state:SyncConnected type:None path:null path:null type:None
   [junit4]   2> 3477728 INFO  (SUITE-TestManagedSchemaAPI-seed#[48CB1243F047CE4B]-worker) [    ] o.a.s.c.c.ConnectionManager Client is connected to ZooKeeper
   [junit4]   2> 3477728 INFO  (SUITE-TestManagedSchemaAPI-seed#[48CB1243F047CE4B]-worker) [    ] o.a.s.c.c.SolrZkClient Using default ZkACLProvider
   [junit4]   2> 3477730 INFO  (SUITE-TestManagedSchemaAPI-seed#[48CB1243F047CE4B]-worker) [    ] o.a.s.c.s.i.CloudSolrClient Final constructed zkHost string: 127.0.0.1:54149/solr
   [junit4]   2> 3477730 INFO  (SUITE-TestManagedSchemaAPI-seed#[48CB1243F047CE4B]-worker) [    ] o.a.s.c.c.SolrZkClient Using default ZkCredentialsProvider
   [junit4]   2> 3477731 INFO  (SUITE-TestManagedSchemaAPI-seed#[48CB1243F047CE4B]-worker) [    ] o.a.s.c.c.ConnectionManager Waiting for client to connect to ZooKeeper
   [junit4]   2> 3477732 INFO  (zkCallback-11629-thread-1) [    ] o.a.s.c.c.ConnectionManager Watcher org.apache.solr.common.cloud.ConnectionManager@54749f09 name:ZooKeeperConnection Watcher:127.0.0.1:54149/solr got event WatchedEvent state:SyncConnected type:None path:null path:null type:None
   [junit4]   2> 3477732 INFO  (SUITE-TestManagedSchemaAPI-seed#[48CB1243F047CE4B]-worker) [    ] o.a.s.c.c.ConnectionManager Client is connected to ZooKeeper
   [junit4]   2> 3477733 INFO  (SUITE-TestManagedSchemaAPI-seed#[48CB1243F047CE4B]-worker) [    ] o.a.s.c.c.SolrZkClient Using default ZkACLProvider
   [junit4]   2> 3477733 INFO  (SUITE-TestManagedSchemaAPI-seed#[48CB1243F047CE4B]-worker) [    ] o.a.s.c.c.ZkStateReader Updating cluster state from ZooKeeper... 
   [junit4]   2> 3477734 INFO  (SUITE-TestManagedSchemaAPI-seed#[48CB1243F047CE4B]-worker) [    ] o.a.s.c.c.ZkStateReader Loaded empty cluster properties
   [junit4]   2> 3477736 INFO  (SUITE-TestManagedSchemaAPI-seed#[48CB1243F047CE4B]-worker) [    ] o.a.s.c.c.ZkStateReader Updated live nodes from ZooKeeper... (0) -> (2)
   [junit4]   2> 3477761 INFO  (SUITE-TestManagedSchemaAPI-seed#[48CB1243F047CE4B]-worker) [    ] o.a.s.c.c.SolrZkClient makePath: /configs/conf1/managed-schema
   [junit4]   2> 3477809 INFO  (SUITE-TestManagedSchemaAPI-seed#[48CB1243F047CE4B]-worker) [    ] o.a.s.c.c.SolrZkClient makePath: /configs/conf1/solrconfig.xml
   [junit4]   2> 3477832 INFO  (TEST-TestManagedSchemaAPI.test-seed#[48CB1243F047CE4B]) [    ] o.a.s.SolrTestCaseJ4 ###Starting test
   [junit4]   2> 3477835 INFO  (qtp1742322667-48964) [n:127.0.0.1:54151_solr    ] o.a.s.h.a.CollectionsHandler Invoked Collection Action :create with params replicationFactor=2&collection.configName=conf1&name=testschemaapi&action=CREATE&numShards=1&wt=javabin&version=2 and sendToOCPQueue=true
   [junit4]   2> 3477840 INFO  (OverseerCollectionConfigSetProcessor-95899556551655430-127.0.0.1:54151_solr-n_0000000000) [n:127.0.0.1:54151_solr    ] o.a.s.c.OverseerTaskProcessor Overseer Collection Message Handler: Get the message id:/overseer/collection-queue-work/qn-0000000000 message:{
   [junit4]   2>   "name":"testschemaapi",
   [junit4]   2>   "fromApi":"true",
   [junit4]   2>   "replicationFactor":"2",
   [junit4]   2>   "collection.configName":"conf1",
   [junit4]   2>   "numShards":"1",
   [junit4]   2>   "stateFormat":"2",
   [junit4]   2>   "operation":"create"}
   [junit4]   2> 3477840 INFO  (OverseerThreadFactory-12044-thread-1-processing-n:127.0.0.1:54151_solr) [n:127.0.0.1:54151_solr    ] o.a.s.c.OverseerCollectionMessageHandler OverseerCollectionMessageHandler.processMessage : create , {
   [junit4]   2>   "name":"testschemaapi",
   [junit4]   2>   "fromApi":"true",
   [junit4]   2>   "replicationFactor":"2",
   [junit4]   2>   "collection.configName":"conf1",
   [junit4]   2>   "numShards":"1",
   [junit4]   2>   "stateFormat":"2",
   [junit4]   2>   "operation":"create"}
   [junit4]   2> 3477840 INFO  (OverseerThreadFactory-12044-thread-1-processing-n:127.0.0.1:54151_solr) [n:127.0.0.1:54151_solr    ] o.a.s.c.OverseerCollectionMessageHandler Create collection testschemaapi
   [junit4]   2> 3477841 INFO  (OverseerThreadFactory-12044-thread-1-processing-n:127.0.0.1:54151_solr) [n:127.0.0.1:54151_solr    ] o.a.s.c.OverseerCollectionMessageHandler creating collections conf node /collections/testschemaapi 
   [junit4]   2> 3477842 INFO  (OverseerThreadFactory-12044-thread-1-processing-n:127.0.0.1:54151_solr) [n:127.0.0.1:54151_solr    ] o.a.s.c.c.SolrZkClient makePath: /collections/testschemaapi
   [junit4]   2> 3477844 INFO  (zkCallback-11629-thread-1) [    ] o.a.s.c.c.ZkStateReader A collections change: [WatchedEvent state:SyncConnected type:NodeChildrenChanged path:/collections], has occurred - updating...
   [junit4]   2> 3477844 INFO  (zkCallback-11623-thread-1-processing-n:127.0.0.1:54151_solr) [n:127.0.0.1:54151_solr    ] o.a.s.c.c.ZkStateReader A collections change: [WatchedEvent state:SyncConnected type:NodeChildrenChanged path:/collections], has occurred - updating...
   [junit4]   2> 3477844 INFO  (zkCallback-11622-thread-1-processing-n:127.0.0.1:54152_solr) [n:127.0.0.1:54152_solr    ] o.a.s.c.c.ZkStateReader A collections change: [WatchedEvent state:SyncConnected type:NodeChildrenChanged path:/collections], has occurred - updating...
   [junit4]   2> 3477851 INFO  (OverseerStateUpdate-95899556551655430-127.0.0.1:54151_solr-n_0000000000) [n:127.0.0.1:54151_solr    ] o.a.s.c.Overseer processMessage: queueSize: 1, message = {
   [junit4]   2>   "name":"testschemaapi",
   [junit4]   2>   "fromApi":"true",
   [junit4]   2>   "replicationFactor":"2",
   [junit4]   2>   "collection.configName":"conf1",
   [junit4]   2>   "numShards":"1",
   [junit4]   2>   "stateFormat":"2",
   [junit4]   2>   "operation":"create"} current state version: 0
   [junit4]   2> 3477851 INFO  (OverseerStateUpdate-95899556551655430-127.0.0.1:54151_solr-n_0000000000) [n:127.0.0.1:54151_solr    ] o.a.s.c.o.ClusterStateMutator building a new cName: testschemaapi
   [junit4]   2> 3477853 INFO  (OverseerStateUpdate-95899556551655430-127.0.0.1:54151_solr-n_0000000000) [n:127.0.0.1:54151_solr    ] o.a.s.c.o.ZkStateWriter going to create_collection /collections/testschemaapi/state.json
   [junit4]   2> 3477950 INFO  (OverseerThreadFactory-12044-thread-1-processing-n:127.0.0.1:54151_solr) [n:127.0.0.1:54151_solr    ] o.a.s.c.OverseerCollectionMessageHandler Creating SolrCores for new collection testschemaapi, shardNames [shard1] , replicationFactor : 2
   [junit4]   2> 3477950 INFO  (OverseerThreadFactory-12044-thread-1-processing-n:127.0.0.1:54151_solr) [n:127.0.0.1:54151_solr    ] o.a.s.c.OverseerCollectionMessageHandler Creating core testschemaapi_shard1_replica1 as part of shard shard1 of collection testschemaapi on 127.0.0.1:54152_solr
   [junit4]   2> 3477951 INFO  (OverseerThreadFactory-12044-thread-1-processing-n:127.0.0.1:54151_solr) [n:127.0.0.1:54151_solr    ] o.a.s.c.OverseerCollectionMessageHandler Creating core testschemaapi_shard1_replica2 as part of shard shard1 of collection testschemaapi on 127.0.0.1:54151_solr
   [junit4]   2> 3477954 INFO  (qtp1742322667-48963) [n:127.0.0.1:54151_solr    ] o.a.s.h.a.CoreAdminOperation core create command qt=/admin/cores&collection.configName=conf1&name=testschemaapi_shard1_replica2&action=CREATE&numShards=1&collection=testschemaapi&shard=shard1&wt=javabin&version=2
   [junit4]   2> 3477955 INFO  (qtp1061252110-48971) [n:127.0.0.1:54152_solr    ] o.a.s.h.a.CoreAdminOperation core create command qt=/admin/cores&collection.configName=conf1&name=testschemaapi_shard1_replica1&action=CREATE&numShards=1&collection=testschemaapi&shard=shard1&wt=javabin&version=2
   [junit4]   2> 3477956 INFO  (qtp1742322667-48963) [n:127.0.0.1:54151_solr    ] o.a.s.c.CoreDescriptor Created CoreDescriptor: {name=testschemaapi_shard1_replica2, collection.configName=conf1, config=solrconfig.xml, transient=false, schema=schema.xml, loadOnStartup=true, configSetProperties=configsetprops.json, collection=testschemaapi, numShards=1, dataDir=data/, shard=shard1}
   [junit4]   2> 3477956 INFO  (qtp1061252110-48971) [n:127.0.0.1:54152_solr    ] o.a.s.c.CoreDescriptor Created CoreDescriptor: {name=testschemaapi_shard1_replica1, collection.configName=conf1, config=solrconfig.xml, transient=false, schema=schema.xml, loadOnStartup=true, configSetProperties=configsetprops.json, collection=testschemaapi, numShards=1, dataDir=data/, shard=shard1}
   [junit4]   2> 3477957 INFO  (qtp1061252110-48971) [n:127.0.0.1:54152_solr c:testschemaapi s:shard1  x:testschemaapi_shard1_replica1] o.a.s.c.ZkController publishing state=down
   [junit4]   2> 3477958 INFO  (qtp1742322667-48963) [n:127.0.0.1:54151_solr c:testschemaapi s:shard1  x:testschemaapi_shard1_replica2] o.a.s.c.ZkController publishing state=down
   [junit4]   2> 3477959 INFO  (qtp1061252110-48971) [n:127.0.0.1:54152_solr c:testschemaapi s:shard1  x:testschemaapi_shard1_replica1] o.a.s.c.ZkController Registering watch for collection testschemaapi
   [junit4]   2> 3477960 INFO  (qtp1061252110-48971) [n:127.0.0.1:54152_solr c:testschemaapi s:shard1  x:testschemaapi_shard1_replica1] o.a.s.c.c.ZkStateReader Add data for [testschemaapi] ver [0]
   [junit4]   2> 3477960 INFO  (qtp1061252110-48971) [n:127.0.0.1:54152_solr c:testschemaapi s:shard1  x:testschemaapi_shard1_replica1] o.a.s.c.ZkController look for our core node name
   [junit4]   2> 3477961 INFO  (qtp1742322667-48963) [n:127.0.0.1:54151_solr c:testschemaapi s:shard1  x:testschemaapi_shard1_replica2] o.a.s.c.ZkController Registering watch for collection testschemaapi
   [junit4]   2> 3477962 INFO  (qtp1742322667-48963) [n:127.0.0.1:54151_solr c:testschemaapi s:shard1  x:testschemaapi_shard1_replica2] o.a.s.c.c.ZkStateReader Add data for [testschemaapi] ver [0]
   [junit4]   2> 3477962 INFO  (OverseerStateUpdate-95899556551655430-127.0.0.1:54151_solr-n_0000000000) [n:127.0.0.1:54151_solr    ] o.a.s.c.Overseer processMessage: queueSize: 2, message = {
   [junit4]   2>   "core":"testschemaapi_shard1_replica1",
   [junit4]   2>   "roles":null,
   [junit4]   2>   "base_url":"http://127.0.0.1:54152/solr",
   [junit4]   2>   "node_name":"127.0.0.1:54152_solr",
   [junit4]   2>   "numShards":"1",
   [junit4]   2>   "state":"down",
   [junit4]   2>   "shard":"shard1",
   [junit4]   2>   "collection":"testschemaapi",
   [junit4]   2>   "operation":"state"} current state version: 0
   [junit4]   2> 3477962 INFO  (qtp1742322667-48963) [n:127.0.0.1:54151_solr c:testschemaapi s:shard1  x:testschemaapi_shard1_replica2] o.a.s.c.ZkController look for our core node name
   [junit4]   2> 3477963 INFO  (OverseerStateUpdate-95899556551655430-127.0.0.1:54151_solr-n_0000000000) [n:127.0.0.1:54151_solr    ] o.a.s.c.o.ReplicaMutator Update state numShards=1 message={
   [junit4]   2>   "core":"testschemaapi_shard1_replica1",
   [junit4]   2>   "roles":null,
   [junit4]   2>   "base_url":"http://127.0.0.1:54152/solr",
   [junit4]   2>   "node_name":"127.0.0.1:54152_solr",
   [junit4]   2>   "numShards":"1",
   [junit4]   2>   "state":"down",
   [junit4]   2>   "shard":"shard1",
   [junit4]   2>   "collection":"testschemaapi",
   [junit4]   2>   "operation":"state"}
   [junit4]   2> 3477966 INFO  (OverseerStateUpdate-95899556551655430-127.0.0.1:54151_solr-n_0000000000) [n:127.0.0.1:54151_solr    ] o.a.s.c.Overseer processMessage: queueSize: 2, message = {
   [junit4]   2>   "core":"testschemaapi_shard1_replica2",
   [junit4]   2>   "roles":null,
   [junit4]   2>   "base_url":"http://127.0.0.1:54151/solr",
   [junit4]   2>   "node_name":"127.0.0.1:54151_solr",
   [junit4]   2>   "numShards":"1",
   [junit4]   2>   "state":"down",
   [junit4]   2>   "shard":"shard1",
   [junit4]   2>   "collection":"testschemaapi",
   [junit4]   2>   "operation":"state"} current state version: 0
   [junit4]   2> 3477967 INFO  (OverseerStateUpdate-95899556551655430-127.0.0.1:54151_solr-n_0000000000) [n:127.0.0.1:54151_solr    ] o.a.s.c.o.ReplicaMutator Update state numShards=1 message={
   [junit4]   2>   "core":"testschemaapi_shard1_replica2",
   [junit4]   2>   "roles":null,
   [junit4]   2>   "base_url":"http://127.0.0.1:54151/solr",
   [junit4]   2>   "node_name":"127.0.0.1:54151_solr",
   [junit4]   2>   "numShards":"1",
   [junit4]   2>   "state":"down",
   [junit4]   2>   "shard":"shard1",
   [junit4]   2>   "collection":"testschemaapi",
   [junit4]   2>   "operation":"state"}
   [junit4]   2> 3478079 INFO  (OverseerStateUpdate-95899556551655430-127.0.0.1:54151_solr-n_0000000000) [n:127.0.0.1:54151_solr    ] o.a.s.c.o.ZkStateWriter going to update_collection /collections/testschemaapi/state.json version: 0
   [junit4]   2> 3478080 INFO  (zkCallback-11622-thread-1-processing-n:127.0.0.1:54152_solr) [n:127.0.0.1:54152_solr    ] o.a.s.c.c.ZkStateReader A cluster state change: [WatchedEvent state:SyncConnected type:NodeDataChanged path:/collections/testschemaapi/state.json] for collection [testschemaapi] has occurred - updating... (live nodes size: [2])
   [junit4]   2> 3478081 INFO  (zkCallback-11622-thread-1-processing-n:127.0.0.1:54152_solr) [n:127.0.0.1:54152_solr    ] o.a.s.c.c.ZkStateReader Updating data for [testschemaapi] from [0] to [1]
   [junit4]   2> 3478082 INFO  (zkCallback-11623-thread-1-processing-n:127.0.0.1:54151_solr) [n:127.0.0.1:54151_solr    ] o.a.s.c.c.ZkStateReader A cluster state change: [WatchedEvent state:SyncConnected type:NodeDataChanged path:/collections/testschemaapi/state.json] for collection [testschemaapi] has occurred - updating... (live nodes size: [2])
   [junit4]   2> 3478084 INFO  (zkCallback-11623-thread-1-processing-n:127.0.0.1:54151_solr) [n:127.0.0.1:54151_solr    ] o.a.s.c.c.ZkStateReader Updating data for [testschemaapi] from [0] to [1]
   [junit4]   2> 3478960 INFO  (qtp1061252110-48971) [n:127.0.0.1:54152_solr c:testschemaapi s:shard1  x:testschemaapi_shard1_replica1] o.a.s.c.ZkController waiting to find shard id in clusterstate for testschemaapi_shard1_replica1
   [junit4]   2> 3478960 INFO  (qtp1061252110-48971) [n:127.0.0.1:54152_solr c:testschemaapi s:shard1  x:testschemaapi_shard1_replica1] o.a.s.c.ZkController Check for collection zkNode:testschemaapi
   [junit4]   2> 3478961 INFO  (qtp1061252110-48971) [n:127.0.0.1:54152_solr c:testschemaapi s:shard1  x:testschemaapi_shard1_replica1] o.a.s.c.ZkController Collection zkNode exists
   [junit4]   2> 3478961 INFO  (qtp1061252110-48971) [n:127.0.0.1:54152_solr c:testschemaapi s:shard1  x:testschemaapi_shard1_replica1] o.a.s.c.c.ZkStateReader Load collection config from: [/collections/testschemaapi]
   [junit4]   2> 3478962 INFO  (qtp1061252110-48971) [n:127.0.0.1:54152_solr c:testschemaapi s:shard1  x:testschemaapi_shard1_replica1] o.a.s.c.c.ZkStateReader path=[/collections/testschemaapi] [configName]=[conf1] specified config exists in ZooKeeper
   [junit4]   2> 3478962 INFO  (qtp1061252110-48971) [n:127.0.0.1:54152_solr c:testschemaapi s:shard1  x:testschemaapi_shard1_replica1] o.a.s.c.SolrResourceLoader new SolrResourceLoader for directory: '/Users/jenkins/workspace/Lucene-Solr-6.x-MacOSX/solr/build/solr-core/test/J1/temp/solr.schema.TestManagedSchemaAPI_48CB1243F047CE4B-001/tempDir-001/node2/testschemaapi_shard1_replica1'
   [junit4]   2> 3478963 INFO  (qtp1061252110-48971) [n:127.0.0.1:54152_solr c:testschemaapi s:shard1  x:testschemaapi_shard1_replica1] o.a.s.c.SolrResourceLoader JNDI not configured for solr (NoInitialContextEx)
   [junit4]   2> 3478963 INFO  (qtp1061252110-48971) [n:127.0.0.1:54152_solr c:testschemaapi s:shard1  x:testschemaapi_shard1_replica1] o.a.s.c.SolrResourceLoader solr home defaulted to 'solr/' (could not find system property or JNDI)
   [junit4]   2> 3478963 INFO  (qtp1742322667-48963) [n:127.0.0.1:54151_solr c:testschemaapi s:shard1  x:testschemaapi_shard1_replica2] o.a.s.c.ZkController waiting to find shard id in clusterstate for testschemaapi_shard1_replica2
   [junit4]   2> 3478963 INFO  (qtp1742322667-48963) [n:127.0.0.1:54151_solr c:testschemaapi s:shard1  x:testschemaapi_shard1_replica2] o.a.s.c.ZkController Check for collection zkNode:testschemaapi
   [junit4]   2> 3478964 INFO  (qtp1742322667-48963) [n:127.0.0.1:54151_solr c:testschemaapi s:shard1  x:testschemaapi_shard1_replica2] o.a.s.c.ZkController Collection zkNode exists
   [junit4]   2> 3478964 INFO  (qtp1742322667-48963) [n:127.0.0.1:54151_solr c:testschemaapi s:shard1  x:testschemaapi_shard1_replica2] o.a.s.c.c.ZkStateReader Load collection config from: [/collections/testschemaapi]
   [junit4]   2> 3478967 INFO  (qtp1061252110-48971) [n:127.0.0.1:54152_solr c:testschemaapi s:shard1  x:testschemaapi_shard1_replica1] o.a.s.c.Config loaded config solrconfig.xml with version 0 
   [junit4]   2> 3478968 INFO  (qtp1742322667-48963) [n:127.0.0.1:54151_solr c:testschemaapi s:shard1  x:testschemaapi_shard1_replica2] o.a.s.c.c.ZkStateReader path=[/collections/testschemaapi] [configName]=[conf1] specified config exists in ZooKeeper
   [junit4]   2> 3478969 INFO  (qtp1742322667-48963) [n:127.0.0.1:54151_solr c:testschemaapi s:shard1  x:testschemaapi_shard1_replica2] o.a.s.c.SolrResourceLoader new SolrResourceLoader for directory: '/Users/jenkins/workspace/Lucene-Solr-6.x-MacOSX/solr/build/solr-core/test/J1/temp/solr.schema.TestManagedSchemaAPI_48CB1243F047CE4B-001/tempDir-001/node1/testschemaapi_shard1_replica2'
   [junit4]   2> 3478969 INFO  (qtp1742322667-48963) [n:127.0.0.1:54151_solr c:testschemaapi s:shard1  x:testschemaapi_shard1_replica2] o.a.s.c.SolrResourceLoader JNDI not configured for solr (NoInitialContextEx)
   [junit4]   2> 3478969 INFO  (qtp1742322667-48963) [n:127.0.0.1:54151_solr c:testschemaapi s:shard1  x:testschemaapi_shard1_replica2] o.a.s.c.SolrResourceLoader solr home defaulted to 'solr/' (could not find system property or JNDI)
   [junit4]   2> 3478972 INFO  (qtp1742322667-48963) [n:127.0.0.1:54151_solr c:testschemaapi s:shard1  x:testschemaapi_shard1_replica2] o.a.s.c.Config loaded config solrconfig.xml with version 0 
   [junit4]   2> 3478973 INFO  (qtp1061252110-48971) [n:127.0.0.1:54152_solr c:testschemaapi s:shard1  x:testschemaapi_shard1_replica1] o.a.s.c.SolrConfig current version of requestparams : -1
   [junit4]   2> 3478975 INFO  (qtp1061252110-48971) [n:127.0.0.1:54152_solr c:testschemaapi s:shard1  x:testschemaapi_shard1_replica1] o.a.s.c.SolrConfig Using Lucene MatchVersion: 6.1.0
   [junit4]   2> 3478979 INFO  (qtp1742322667-48963) [n:127.0.0.1:54151_solr c:testschemaapi s:shard1  x:testschemaapi_shard1_replica2] o.a.s.c.SolrConfig current version of requestparams : -1
   [junit4]   2> 3478981 INFO  (qtp1061252110-48971) [n:127.0.0.1:54152_solr c:testschemaapi s:shard1  x:testschemaapi_shard1_replica1] o.a.s.c.SolrConfig Loaded SolrConfig: solrconfig.xml
   [junit4]   2> 3478981 INFO  (qtp1742322667-48963) [n:127.0.0.1:54151_solr c:testschemaapi s:shard1  x:testschemaapi_shard1_replica2] o.a.s.c.SolrConfig Using Lucene MatchVersion: 6.1.0
   [junit4]   2> 3478984 INFO  (qtp1061252110-48971) [n:127.0.0.1:54152_solr c:testschemaapi s:shard1  x:testschemaapi_shard1_replica1] o.a.s.s.IndexSchema [testschemaapi_shard1_replica1] Schema name=minimal
   [junit4]   2> 3478985 INFO  (qtp1742322667-48963) [n:127.0.0.1:54151_solr c:testschemaapi s:shard1  x:testschemaapi_shard1_replica2] o.a.s.c.SolrConfig Loaded SolrConfig: solrconfig.xml
   [junit4]   2> 3478989 INFO  (qtp1061252110-48971) [n:127.0.0.1:54152_solr c:testschemaapi s:shard1  x:testschemaapi_shard1_replica1] o.a.s.s.IndexSchema unique key field: id
   [junit4]   2> 3478991 INFO  (qtp1742322667-48963) [n:127.0.0.1:54151_solr c:testschemaapi s:shard1  x:testschemaapi_shard1_replica2] o.a.s.s.IndexSchema [testschemaapi_shard1_replica2] Schema name=minimal
   [junit4]   2> 3478993 INFO  (qtp1742322667-48963) [n:127.0.0.1:54151_solr c:testschemaapi s:shard1  x:testschemaapi_shard1_replica2] o.a.s.s.IndexSchema unique key field: id
   [junit4]   2> 3478993 INFO  (qtp1061252110-48971) [n:127.0.0.1:54152_solr c:testschemaapi s:shard1  x:testschemaapi_shard1_replica1] o.a.s.c.ConfigSetProperties Did not find ConfigSet properties, assuming default properties: Can't find resource 'configsetprops.json' in classpath or '/configs/conf1', cwd=/Users/jenkins/workspace/Lucene-Solr-6.x-MacOSX/solr/build/solr-core/test/J1
   [junit4]   2> 3478993 INFO  (qtp1061252110-48971) [n:127.0.0.1:54152_solr c:testschemaapi s:shard1  x:testschemaapi_shard1_replica1] o.a.s.c.CoreContainer Creating SolrCore 'testschemaapi_shard1_replica1' using configuration from collection testschemaapi
   [junit4]   2> 3478994 INFO  (qtp1061252110-48971) [n:127.0.0.1:54152_solr c:testschemaapi s:shard1 r:core_node1 x:testschemaapi_shard1_replica1] o.a.s.c.SolrCore org.apache.solr.core.MockDirectoryFactory
   [junit4]   2> 3478994 INFO  (qtp1061252110-48971) [n:127.0.0.1:54152_solr c:testschemaapi s:shard1 r:core_node1 x:testschemaapi_shard1_replica1] o.a.s.c.SolrCore [[testschemaapi_shard1_replica1] ] Opening new SolrCore at [/Users/jenkins/workspace/Lucene-Solr-6.x-MacOSX/solr/build/solr-core/test/J1/temp/solr.schema.TestManagedSchemaAPI_48CB1243F047CE4B-001/tempDir-001/node2/testschemaapi_shard1_replica1], dataDir=[/Users/jenkins/workspace/Lucene-Solr-6.x-MacOSX/solr/build/solr-core/test/J1/temp/solr.schema.TestManagedSchemaAPI_48CB1243F047CE4B-001/tempDir-001/node2/./testschemaapi_shard1_replica1/data/]
   [junit4]   2> 3478994 INFO  (qtp1061252110-48971) [n:127.0.0.1:54152_solr c:testschemaapi s:shard1 r:core_node1 x:testschemaapi_shard1_replica1] o.a.s.c.SolrCore JMX monitoring not detected for core: testschemaapi_shard1_replica1
   [junit4]   2> 3478995 INFO  (qtp1061252110-48971) [n:127.0.0.1:54152_solr c:testschemaapi s:shard1 r:core_node1 x:testschemaapi_shard1_replica1] o.a.s.c.CachingDirectoryFactory return new directory for /Users/jenkins/workspace/Lucene-Solr-6.x-MacOSX/solr/build/solr-core/test/J1/temp/solr.schema.TestManagedSchemaAPI_48CB1243F047CE4B-001/tempDir-001/node2/./testschemaapi_shard1_replica1/data
   [junit4]   2> 3478995 INFO  (qtp1061252110-48971) [n:127.0.0.1:54152_solr c:testschemaapi s:shard1 r:core_node1 x:testschemaapi_shard1_replica1] o.a.s.c.SolrCore New index directory detected: old=null new=/Users/jenkins/workspace/Lucene-Solr-6.x-MacOSX/solr/build/solr-core/test/J1/temp/solr.schema.TestManagedSchemaAPI_48CB1243F047CE4B-001/tempDir-001/node2/./testschemaapi_shard1_replica1/data/index/
   [junit4]   2> 3478995 WARN  (qtp1061252110-48971) [n:127.0.0.1:54152_solr c:testschemaapi s:shard1 r:core_node1 x:testschemaapi_shard1_replica1] o.a.s.c.SolrCore [testschemaapi_shard1_replica1] Solr index directory '/Users/jenkins/workspace/Lucene-Solr-6.x-MacOSX/solr/build/solr-core/test/J1/temp/solr.schema.TestManagedSchemaAPI_48CB1243F047CE4B-001/tempDir-001/node2/./testschemaapi_shard1_replica1/data/index' doesn't exist. Creating new index...
   [junit4]   2> 3478996 INFO  (qtp1061252110-48971) [n:127.0.0.1:54152_solr c:testschemaapi s:shard1 r:core_node1 x:testschemaapi_shard1_replica1] o.a.s.c.CachingDirectoryFactory return new directory for /Users/jenkins/workspace/Lucene-Solr-6.x-MacOSX/solr/build/solr-core/test/J1/temp/solr.schema.TestManagedSchemaAPI_48CB1243F047CE4B-001/tempDir-001/node2/./testschemaapi_shard1_replica1/data/index
   [junit4]   2> 3478996 INFO  (qtp1742322667-48963) [n:127.0.0.1:54151_solr c:testschemaapi s:shard1  x:testschemaapi_shard1_replica2] o.a.s.c.ConfigSetProperties Did not find ConfigSet properties, assuming default properties: Can't find resource 'configsetprops.json' in classpath or '/configs/conf1', cwd=/Users/jenkins/workspace/Lucene-Solr-6.x-MacOSX/solr/build/solr-core/test/J1
   [junit4]   2> 3478996 INFO  (qtp1742322667-48963) [n:127.0.0.1:54151_solr c:testschemaapi s:shard1  x:testschemaapi_shard1_replica2] o.a.s.c.CoreContainer Creating SolrCore 'testschemaapi_shard1_replica2' using configuration from collection testschemaapi
   [junit4]   2> 3478996 INFO  (qtp1742322667-48963) [n:127.0.0.1:54151_solr c:testschemaapi s:shard1 r:core_node2 x:testschemaapi_shard1_replica2] o.a.s.c.SolrCore org.apache.solr.core.MockDirectoryFactory
   [junit4]   2> 3478997 INFO  (qtp1742322667-48963) [n:127.0.0.1:54151_solr c:testschemaapi s:shard1 r:core_node2 x:testschemaapi_shard1_replica2] o.a.s.c.SolrCore [[testschemaapi_shard1_replica2] ] Opening new SolrCore at [/Users/jenkins/workspace/Lucene-Solr-6.x-MacOSX/solr/build/solr-core/test/J1/temp/solr.schema.TestManagedSchemaAPI_48CB1243F047CE4B-001/tempDir-001/node1/testschemaapi_shard1_replica2], dataDir=[/Users/jenkins/workspace/Lucene-Solr-6.x-MacOSX/solr/build/solr-core/test/J1/temp/solr.schema.TestManagedSchemaAPI_48CB1243F047CE4B-001/tempDir-001/node1/./testschemaapi_shard1_replica2/data/]
   [junit4]   2> 3478997 INFO  (qtp1742322667-48963) [n:127.0.0.1:54151_solr c:testschemaapi s:shard1 r:core_node2 x:testschemaapi_shard1_replica2] o.a.s.c.SolrCore JMX monitoring not detected for core: testschemaapi_shard1_replica2
   [junit4]   2> 3478997 INFO  (qtp1742322667-48963) [n:127.0.0.1:54151_solr c:testschemaapi s:shard1 r:core_node2 x:testschemaapi_shard1_replica2] o.a.s.c.CachingDirectoryFactory return new directory for /Users/jenkins/workspace/Lucene-Solr-6.x-MacOSX/solr/build/solr-core/test/J1/temp/solr.schema.TestManagedSchemaAPI_48CB1243F047CE4B-001/tempDir-001/node1/./testschemaapi_shard1_replica2/data
   [junit4]   2> 3478998 INFO  (qtp1742322667-48963) [n:127.0.0.1:54151_solr c:testschemaapi s:shard1 r:core_node2 x:testschemaapi_shard1_replica2] o.a.s.c.SolrCore New index directory detected: old=null new=/Users/jenkins/workspace/Lucene-Solr-6.x-MacOSX/solr/build/solr-core/test/J1/temp/solr.schema.TestManagedSchemaAPI_48CB1243F047CE4B-001/tempDir-001/node1/./testschemaapi_shard1_replica2/data/index/
   [junit4]   2> 3478998 INFO  (qtp1061252110-48971) [n:127.0.0.1:54152_solr c:testschemaapi s:shard1 r:core_node1 x:testschemaapi_shard1_replica1] o.a.s.c.SolrDeletionPolicy SolrDeletionPolicy.onCommit: commits: num=1
   [junit4]   2> 	commit{dir=MockDirectoryWrapper(RAMDirectory@6f932fff lockFactory=org.apache.lucene.store.SingleInstanceLockFactory@274be3f1),segFN=segments_1,generation=1}
   [junit4]   2> 3478998 WARN  (qtp1742322667-48963) [n:127.0.0.1:54151_solr c:testschemaapi s:shard1 r:core_node2 x:testschemaapi_shard1_replica2] o.a.s.c.SolrCore [testschemaapi_shard1_replica2] Solr index directory '/Users/jenkins/workspace/Lucene-Solr-6.x-MacOSX/solr/build/solr-core/test/J1/temp/solr.schema.TestManagedSchemaAPI_48CB1243F047CE4B-001/tempDir-001/node1/./testschemaapi_shard1_replica2/data/index' doesn't exist. Creating new index...
   [junit4]   2> 3478998 INFO  (qtp1061252110-48971) [n:127.0.0.1:54152_solr c:testschemaapi s:shard1 r:core_node1 x:testschemaapi_shard1_replica1] o.a.s.c.SolrDeletionPolicy newest commit generation = 1
   [junit4]   2> 3478998 INFO  (qtp1742322667-48963) [n:127.0.0.1:54151_solr c:testschemaapi s:shard1 r:core_node2 x:testschemaapi_shard1_replica2] o.a.s.c.CachingDirectoryFactory return new directory for /Users/jenkins/workspace/Lucene-Solr-6.x-MacOSX/solr/build/solr-core/test/J1/temp/solr.schema.TestManagedSchemaAPI_48CB1243F047CE4B-001/tempDir-001/node1/./testschemaapi_shard1_replica2/data/index
   [junit4]   2> 3478999 INFO  (OldIndexDirectoryCleanupThreadForCore-testschemaapi_shard1_replica1) [n:127.0.0.1:54152_solr c:testschemaapi s:shard1 r:core_node1 x:testschemaapi_shard1_replica1] o.a.s.c.SolrCore Looking for old index directories to cleanup for core testschemaapi_shard1_replica1 in /Users/jenkins/workspace/Lucene-Solr-6.x-MacOSX/solr/build/solr-core/test/J1/temp/solr.schema.TestManagedSchemaAPI_48CB1243F047CE4B-001/tempDir-001/node2/./testschemaapi_shard1_replica1/data/
   [junit4]   2> 3479000 WARN  (OldIndexDirectoryCleanupThreadForCore-testschemaapi_shard1_replica1) [n:127.0.0.1:54152_solr c:testschemaapi s:shard1 r:core_node1 x:testschemaapi_shard1_replica1] o.a.s.c.DirectoryFactory /Users/jenkins/workspace/Lucene-Solr-6.x-MacOSX/solr/build/solr-core/test/J1/temp/solr.schema.TestManagedSchemaAPI_48CB1243F047CE4B-001/tempDir-001/node2/./testschemaapi_shard1_replica1/data/ does not point to a valid data directory; skipping clean-up of old index directories.
   [junit4]   2> 3479001 INFO  (qtp1742322667-48963) [n:127.0.0.1:54151_solr c:testschemaapi s:shard1 r:core_node2 x:testschemaapi_shard1_replica2] o.a.s.c.SolrDeletionPolicy SolrDeletionPolicy.onCommit: commits: num=1
   [junit4]   2> 	commit{dir=MockDirectoryWrapper(RAMDirectory@11d1d1e2 lockFactory=org.apache.lucene.store.SingleInstanceLockFactory@c0065af),segFN=segments_1,generation=1}
   [junit4]   2> 3479001 INFO  (qtp1742322667-48963) [n:127.0.0.1:54151_solr c:testschemaapi s:shard1 r:core_node2 x:testschemaapi_shard1_replica2] o.a.s.c.SolrDeletionPolicy newest commit generation = 1
   [junit4]   2> 3479002 INFO  (qtp1061252110-48971) [n:127.0.0.1:54152_solr c:testschemaapi s:shard1 r:core_node1 x:testschemaapi_shard1_replica1] o.a.s.c.SolrCore no updateRequestProcessorChain defined as default, creating implicit default
   [junit4]   2> 3479002 INFO  (OldIndexDirectoryCleanupThreadForCore-testschemaapi_shard1_replica2) [n:127.0.0.1:54151_solr c:testschemaapi s:shard1 r:core_node2 x:testschemaapi_shard1_replica2] o.a.s.c.SolrCore Looking for old index directories to cleanup for core testschemaapi_shard1_replica2 in /Users/jenkins/workspace/Lucene-Solr-6.x-MacOSX/solr/build/solr-core/test/J1/temp/solr.schema.TestManagedSchemaAPI_48CB1243F047CE4B-001/tempDir-001/node1/./testschemaapi_shard1_replica2/data/
   [junit4]   2> 3479003 WARN  (OldIndexDirectoryCleanupThreadForCore-testschemaapi_shard1_replica2) [n:127.0.0.1:54151_solr c:testschemaapi s:shard1 r:core_node2 x:testschemaapi_shard1_replica2] o.a.s.c.DirectoryFactory /Users/jenkins/workspace/Lucene-Solr-6.x-MacOSX/solr/build/solr-core/test/J1/temp/solr.schema.TestManagedSchemaAPI_48CB1243F047CE4B-001/tempDir-001/node1/./testschemaapi_shard1_replica2/data/ does not point to a valid data directory; skipping clean-up of old index directories.
   [junit4]   2> 3479004 INFO  (qtp1742322667-48963) [n:127.0.0.1:54151_solr c:testschemaapi s:shard1 r:core_node2 x:testschemaapi_shard1_replica2] o.a.s.c.SolrCore no updateRequestProcessorChain defined as default, creating implicit default
   [junit4]   2> 3479007 INFO  (qtp1061252110-48971) [n:127.0.0.1:54152_solr c:testschemaapi s:shard1 r:core_node1 x:testschemaapi_shard1_replica1] o.a.s.h.l.XMLLoader xsltCacheLifetimeSeconds=60
   [junit4]   2> 3479008 INFO  (qtp1742322667-48963) [n:127.0.0.1:54151_solr c:testschemaapi s:shard1 r:core_node2 x:testschemaapi_shard1_replica2] o.a.s.h.l.XMLLoader xsltCacheLifetimeSeconds=60
   [junit4]   2> 3479008 INFO  (qtp1061252110-48971) [n:127.0.0.1:54152_solr c:testschemaapi s:shard1 r:core_node1 x:testschemaapi_shard1_replica1] o.a.s.h.l.XMLLoader xsltCacheLifetimeSeconds=60
   [junit4]   2> 3479009 INFO  (qtp1742322667-48963) [n:127.0.0.1:54151_solr c:testschemaapi s:shard1 r:core_node2 x:testschemaapi_shard1_replica2] o.a.s.h.l.XMLLoader xsltCacheLifetimeSeconds=60
   [junit4]   2> 3479010 INFO  (qtp1061252110-48971) [n:127.0.0.1:54152_solr c:testschemaapi s:shard1 r:core_node1 x:testschemaapi_shard1_replica1] o.a.s.h.l.XMLLoader xsltCacheLifetimeSeconds=60
   [junit4]   2> 3479011 INFO  (qtp1742322667-48963) [n:127.0.0.1:54151_solr c:testschemaapi s:shard1 r:core_node2 x:testschemaapi_shard1_replica2] o.a.s.h.l.XMLLoader xsltCacheLifetimeSeconds=60
   [junit4]   2> 3479013 INFO  (qtp1742322667-48963) [n:127.0.0.1:54151_solr c:testschemaapi s:shard1 r:core_node2 x:testschemaapi_shard1_replica2] o.a.s.h.l.XMLLoader xsltCacheLifetimeSeconds=60
   [junit4]   2> 3479018 INFO  (qtp1061252110-48971) [n:127.0.0.1:54152_solr c:testschemaapi s:shard1 r:core_node1 x:testschemaapi_shard1_replica1] o.a.s.h.l.XMLLoader xsltCacheLifetimeSeconds=60
   [junit4]   2> 3479020 INFO  (qtp1742322667-48963) [n:127.0.0.1:54151_solr c:testschemaapi s:shard1 r:core_node2 x:testschemaapi_shard1_replica2] o.a.s.c.RequestHandlers Registered paths: /admin/mbeans,/update/csv,/sql,/update/json/docs,/admin/luke,/graph,/export,/select,/admin/segments,/get,/admin/system,/replication,/admin/properties,/config,/stream,/schema,/admin/plugins,/admin/logging,/update/json,/admin/ping,/admin/threads,/update,/admin/file
   [junit4]   2> 3479020 INFO  (qtp1742322667-48963) [n:127.0.0.1:54151_solr c:testschemaapi s:shard1 r:core_node2 x:testschemaapi_shard1_replica2] o.a.s.c.SolrCore Using default statsCache cache: org.apache.solr.search.stats.LocalStatsCache
   [junit4]   2> 3479021 INFO  (qtp1742322667-48963) [n:127.0.0.1:54151_solr c:testschemaapi s:shard1 r:core_node2 x:testschemaapi_shard1_replica2] o.a.s.u.UpdateHandler Using UpdateLog implementation: org.apache.solr.update.UpdateLog
   [junit4]   2> 3479021 INFO  (qtp1742322667-48963) [n:127.0.0.1:54151_solr c:testschemaapi s:shard1 r:core_node2 x:testschemaapi_shard1_replica2] o.a.s.u.UpdateLog Initializing UpdateLog: dataDir=null defaultSyncLevel=FLUSH numRecordsToKeep=100 maxNumLogsToKeep=10 numVersionBuckets=65536
   [junit4]   2> 3479021 INFO  (qtp1061252110-48971) [n:127.0.0.1:54152_solr c:testschemaapi s:shard1 r:core_node1 x:testschemaapi_shard1_replica1] o.a.s.c.RequestHandlers Registered paths: /admin/mbeans,/update/csv,/sql,/update/json/docs,/admin/luke,/graph,/export,/select,/admin/segments,/get,/admin/system,/replication,/admin/properties,/config,/stream,/schema,/admin/plugins,/admin/logging,/update/json,/admin/ping,/admin/threads,/update,/admin/file
   [junit4]   2> 3479021 INFO  (qtp1061252110-48971) [n:127.0.0.1:54152_solr c:testschemaapi s:shard1 r:core_node1 x:testschemaapi_shard1_replica1] o.a.s.c.SolrCore Using default statsCache cache: org.apache.solr.search.stats.LocalStatsCache
   [junit4]   2> 3479027 INFO  (qtp1742322667-48963) [n:127.0.0.1:54151_solr c:testschemaapi s:shard1 r:core_node2 x:testschemaapi_shard1_replica2] o.a.s.u.CommitTracker Hard AutoCommit: disabled
   [junit4]   2> 3479027 INFO  (qtp1061252110-48971) [n:127.0.0.1:54152_solr c:testschemaapi s:shard1 r:core_node1 x:testschemaapi_shard1_replica1] o.a.s.u.UpdateHandler Using UpdateLog implementation: org.apache.solr.update.UpdateLog
   [junit4]   2> 3479027 INFO  (qtp1742322667-48963) [n:127.0.0.1:54151_solr c:testschemaapi s:shard1 r:core_node2 x:testschemaapi_shard1_replica2] o.a.s.u.CommitTracker Soft AutoCommit: disabled
   [junit4]   2> 3479027 INFO  (qtp1061252110-48971) [n:127.0.0.1:54152_solr c:testschemaapi s:shard1 r:core_node1 x:testschemaapi_shard1_replica1] o.a.s.u.UpdateLog Initializing UpdateLog: dataDir=null defaultSyncLevel=FLUSH numRecordsToKeep=100 maxNumLogsToKeep=10 numVersionBuckets=65536
   [junit4]   2> 3479028 INFO  (qtp1742322667-48963) [n:127.0.0.1:54151_solr c:testschemaapi s:shard1 r:core_node2 x:testschemaapi_shard1_replica2] o.a.s.c.SolrDeletionPolicy SolrDeletionPolicy.onInit: commits: num=1
   [junit4]   2> 	commit{dir=MockDirectoryWrapper(RAMDirectory@11d1d1e2 lockFactory=org.apache.lucene.store.SingleInstanceLockFactory@c0065af),segFN=segments_1,generation=1}
   [junit4]   2> 3479028 INFO  (qtp1742322667-48963) [n:127.0.0.1:54151_solr c:testschemaapi s:shard1 r:core_node2 x:testschemaapi_shard1_replica2] o.a.s.c.SolrDeletionPolicy newest commit generation = 1
   [junit4]   2> 3479028 INFO  (qtp1742322667-48963) [n:127.0.0.1:54151_solr c:testschemaapi s:shard1 r:core_node2 x:testschemaapi_shard1_replica2] o.a.s.s.SolrIndexSearcher Opening [Searcher@427f84fe[testschemaapi_shard1_replica2] main]
   [junit4]   2> 3479028 INFO  (qtp1742322667-48963) [n:127.0.0.1:54151_solr c:testschemaapi s:shard1 r:core_node2 x:testschemaapi_shard1_replica2] o.a.s.c.c.ZkStateReader Load collection config from: [/collections/testschemaapi]
   [junit4]   2> 3479030 INFO  (qtp1742322667-48963) [n:127.0.0.1:54151_solr c:testschemaapi s:shard1 r:core_node2 x:testschemaapi_shard1_replica2] o.a.s.c.c.ZkStateReader path=[/collections/testschemaapi] [configName]=[conf1] specified config exists in ZooKeeper
   [junit4]   2> 3479030 INFO  (qtp1061252110-48971) [n:127.0.0.1:54152_solr c:testschemaapi s:shard1 r:core_node1 x:testschemaapi_shard1_replica1] o.a.s.u.CommitTracker Hard AutoCommit: disabled
   [junit4]   2> 3479030 INFO  (qtp1742322667-48963) [n:127.0.0.1:54151_solr c:testschemaapi s:shard1 r:core_node2 x:testschemaapi_shard1_replica2] o.a.s.r.ManagedResourceStorage Setting up ZooKeeper-based storage for the RestManager with znodeBase: /configs/conf1
   [junit4]   2> 3479030 INFO  (qtp1061252110-48971) [n:127.0.0.1:54152_solr c:testschemaapi s:shard1 r:core_node1 x:testschemaapi_shard1_replica1] o.a.s.u.CommitTracker Soft AutoCommit: disabled
   [junit4]   2> 3479031 INFO  (qtp1742322667-48963) [n:127.0.0.1:54151_solr c:testschemaapi s:shard1 r:core_node2 x:testschemaapi_shard1_replica2] o.a.s.r.ManagedResourceStorage Configured ZooKeeperStorageIO with znodeBase: /configs/conf1
   [junit4]   2> 3479031 INFO  (qtp1742322667-48963) [n:127.0.0.1:54151_solr c:testschemaapi s:shard1 r:core_node2 x:testschemaapi_shard1_replica2] o.a.s.r.RestManager Initializing RestManager with initArgs: {}
   [junit4]   2> 3479031 INFO  (qtp1742322667-48963) [n:127.0.0.1:54151_solr c:testschemaapi s:shard1 r:core_node2 x:testschemaapi_shard1_replica2] o.a.s.r.ManagedResourceStorage Reading _rest_managed.json using ZooKeeperStorageIO:path=/configs/conf1
   [junit4]   2> 3479032 INFO  (qtp1742322667-48963) [n:127.0.0.1:54151_solr c:testschemaapi s:shard1 r:core_node2 x:testschemaapi_shard1_replica2] o.a.s.r.ManagedResourceStorage No data found for znode /configs/conf1/_rest_managed.json
   [junit4]   2> 3479032 INFO  (qtp1061252110-48971) [n:127.0.0.1:54152_solr c:testschemaapi s:shard1 r:core_node1 x:testschemaapi_shard1_replica1] o.a.s.c.SolrDeletionPolicy SolrDeletionPolicy.onInit: commits: num=1
   [junit4]   2> 	commit{dir=MockDirectoryWrapper(RAMDirectory@6f932fff lockFactory=org.apache.lucene.store.SingleInstanceLockFactory@274be3f1),segFN=segments_1,generation=1}
   [junit4]   2> 3479032 INFO  (qtp1742322667-48963) [n:127.0.0.1:54151_solr c:testschemaapi s:shard1 r:core_node2 x:testschemaapi_shard1_replica2] o.a.s.r.ManagedResourceStorage Loaded null at path _rest_managed.json using ZooKeeperStorageIO:path=/configs/conf1
   [junit4]   2> 3479032 INFO  (qtp1742322667-48963) [n:127.0.0.1:54151_solr c:testschemaapi s:shard1 r:core_node2 x:testschemaapi_shard1_replica2] o.a.s.r.RestManager Initializing 0 registered ManagedResources
   [junit4]   2> 3479032 INFO  (qtp1742322667-48963) [n:127.0.0.1:54151_solr c:testschemaapi s:shard1 r:core_node2 x:testschemaapi_shard1_replica2] o.a.s.s.ZkIndexSchemaReader Creating ZooKeeper watch for the managed schema at /configs/conf1/managed-schema
   [junit4]   2> 3479032 INFO  (qtp1061252110-48971) [n:127.0.0.1:54152_solr c:testschemaapi s:shard1 r:core_node1 x:testschemaapi_shard1_replica1] o.a.s.c.SolrDeletionPolicy newest commit generation = 1
   [junit4]   2> 3479032 INFO  (qtp1061252110-48971) [n:127.0.0.1:54152_solr c:testschemaapi s:shard1 r:core_node1 x:testschemaapi_shard1_replica1] o.a.s.s.SolrIndexSearcher Opening [Searcher@371368c3[testschemaapi_shard1_replica1] main]
   [junit4]   2> 3479033 INFO  (qtp1061252110-48971) [n:127.0.0.1:54152_solr c:testschemaapi s:shard1 r:core_node1 x:testschemaapi_shard1_replica1] o.a.s.c.c.ZkStateReader Load collection config from: [/collections/testschemaapi]
   [junit4]   2> 3479033 INFO  (qtp1742322667-48963) [n:127.0.0.1:54151_solr c:testschemaapi s:shard1 r:core_node2 x:testschemaapi_shard1_replica2] o.a.s.c.ZkController Added new OnReconnect listener ZkIndexSchemaReader: /configs/conf1/managed-schema, uniqueCoreId: testschemaapi_shard1_replica2:769240622403899
   [junit4]   2> 3479033 INFO  (qtp1742322667-48963) [n:127.0.0.1:54151_solr c:testschemaapi s:shard1 r:core_node2 x:testschemaapi_shard1_replica2] o.a.s.h.ReplicationHandler Commits will be reserved for  10000
   [junit4]   2> 3479033 INFO  (qtp1742322667-48963) [n:127.0.0.1:54151_solr c:testschemaapi s:shard1 r:core_node2 x:testschemaapi_shard1_replica2] o.a.s.u.UpdateLog Looking up max value of version field to seed version buckets
   [junit4]   2> 3479033 INFO  (searcherExecutor-12048-thread-1-processing-n:127.0.0.1:54151_solr x:testschemaapi_shard1_replica2 s:shard1 c:testschemaapi r:core_node2) [n:127.0.0.1:54151_solr c:testschemaapi s:shard1 r:core_node2 x:testschemaapi_shard1_replica2] o.a.s.c.SolrCore [testschemaapi_shard1_replica2] Registered new searcher Searcher@427f84fe[testschemaapi_shard1_replica2] main{ExitableDirectoryReader(UninvertingDirectoryReader())}
   [junit4]   2> 3479034 INFO  (qtp1742322667-48963) [n:127.0.0.1:54151_solr c:testschemaapi s:shard1 r:core_node2 x:testschemaapi_shard1_replica2] o.a.s.u.VersionInfo Refreshing highest value of _version_ for 65536 version buckets from index
   [junit4]   2> 3479034 INFO  (qtp1742322667-48963) [n:127.0.0.1:54151_solr c:testschemaapi s:shard1 r:core_node2 x:testschemaapi_shard1_replica2] o.a.s.u.VersionInfo No terms found for _version_, cannot seed version bucket highest value from index
   [junit4]   2> 3479034 INFO  (qtp1742322667-48963) [n:127.0.0.1:54151_solr c:testschemaapi s:shard1 r:core_node2 x:testschemaapi_shard1_replica2] o.a.s.u.UpdateLog Could not find max version in index or recent updates, using new clock 1534392907525521408
   [junit4]   2> 3479035 INFO  (qtp1061252110-48971) [n:127.0.0.1:54152_solr c:testschemaapi s:shard1 r:core_node1 x:testschemaapi_shard1_replica1] o.a.s.c.c.ZkStateReader path=[/collections/testschemaapi] [configName]=[conf1] specified config exists in ZooKeeper
   [junit4]   2> 3479035 INFO  (qtp1061252110-48971) [n:127.0.0.1:54152_solr c:testschemaapi s:shard1 r:core_node1 x:testschemaapi_shard1_replica1] o.a.s.r.ManagedResourceStorage Setting up ZooKeeper-based storage for the RestManager with znodeBase: /configs/conf1
   [junit4]   2> 3479036 INFO  (qtp1742322667-48963) [n:127.0.0.1:54151_solr c:testschemaapi s:shard1 r:core_node2 x:testschemaapi_shard1_replica2] o.a.s.u.UpdateLog Took 2.0ms to seed version buckets with highest version 1534392907525521408
   [junit4]   2> 3479036 INFO  (qtp1742322667-48963) [n:127.0.0.1:54151_solr c:testschemaapi s:shard1 r:core_node2 x:testschemaapi_shard1_replica2] o.a.s.c.ZkController watch zkdir /configs/conf1
   [junit4]   2> 3479036 INFO  (qtp1061252110-48971) [n:127.0.0.1:54152_solr c:testschemaapi s:shard1 r:core_node1 x:testschemaapi_shard1_replica1] o.a.s.r.ManagedResourceStorage Configured ZooKeeperStorageIO with znodeBase: /configs/conf1
   [junit4]   2> 3479036 INFO  (qtp1061252110-48971) [n:127.0.0.1:54152_solr c:testschemaapi s:shard1 r:core_node1 x:testschemaapi_shard1_replica1] o.a.s.r.RestManager Initializing RestManager with initArgs: {}
   [junit4]   2> 3479036 INFO  (qtp1061252110-48971) [n:127.0.0.1:54152_solr c:testschemaapi s:shard1 r:core_node1 x:testschemaapi_shard1_replica1] o.a.s.r.ManagedResourceStorage Reading _rest_managed.json using ZooKeeperStorageIO:path=/configs/conf1
   [junit4]   2> 3479037 INFO  (qtp1742322667-48963) [n:127.0.0.1:54151_solr c:testschemaapi s:shard1 r:core_node2 x:testschemaapi_shard1_replica2] o.a.s.c.CoreContainer registering core: testschemaapi_shard1_replica2
   [junit4]   2> 3479038 INFO  (qtp1742322667-48963) [n:127.0.0.1:54151_solr c:testschemaapi s:shard1 r:core_node2 x:testschemaapi_shard1_replica2] o.a.s.c.ZkController Register replica - core:testschemaapi_shard1_replica2 address:http://127.0.0.1:54151/solr collection:testschemaapi shard:shard1
   [junit4]   2> 3479038 INFO  (qtp1061252110-48971) [n:127.0.0.1:54152_solr c:testschemaapi s:shard1 r:core_node1 x:testschemaapi_shard1_replica1] o.a.s.r.ManagedResourceStorage No data found for znode /configs/conf1/_rest_managed.json
   [junit4]   2> 3479038 INFO  (qtp1061252110-48971) [n:127.0.0.1:54152_solr c:testschemaapi s:shard1 r:core_node1 x:testschemaapi_shard1_replica1] o.a.s.r.ManagedResourceStorage Loaded null at path _rest_managed.json using ZooKeeperStorageIO:path=/configs/conf1
   [junit4]   2> 3479039 INFO  (qtp1061252110-48971) [n:127.0.0.1:54152_solr c:testschemaapi s:shard1 r:core_node1 x:testschemaapi_shard1_replica1] o.a.s.r.RestManager Initializing 0 registered ManagedResources
   [junit4]   2> 3479039 INFO  (qtp1061252110-48971) [n:127.0.0.1:54152_solr c:testschemaapi s:shard1 r:core_node1 x:testschemaapi_shard1_replica1] o.a.s.s.ZkIndexSchemaReader Creating ZooKeeper watch for the managed schema at /configs/conf1/managed-schema
   [junit4]   2> 3479040 INFO  (qtp1061252110-48971) [n:127.0.0.1:54152_solr c:testschemaapi s:shard1 r:core_node1 x:testschemaapi_shard1_replica1] o.a.s.c.ZkController Added new OnReconnect listener ZkIndexSchemaReader: /configs/conf1/managed-schema, uniqueCoreId: testschemaapi_shard1_replica1:769240619768095
   [junit4]   2> 3479040 INFO  (qtp1061252110-48971) [n:127.0.0.1:54152_solr c:testschemaapi s:shard1 r:core_node1 x:testschemaapi_shard1_replica1] o.a.s.h.ReplicationHandler Commits will be reserved for  10000
   [junit4]   2> 3479040 INFO  (qtp1742322667-48963) [n:127.0.0.1:54151_solr c:testschemaapi s:shard1 r:core_node2 x:testschemaapi_shard1_replica2] o.a.s.c.c.SolrZkClient makePath: /collections/testschemaapi/leader_elect/shard1/election
   [junit4]   2> 3479040 INFO  (searcherExecutor-12047-thread-1-processing-n:127.0.0.1:54152_solr x:testschemaapi_shard1_replica1 s:shard1 c:testschemaapi r:core_node1) [n:127.0.0.1:54152_solr c:testschemaapi s:shard1 r:core_node1 x:testschemaapi_shard1_replica1] o.a.s.c.SolrCore [testschemaapi_shard1_replica1] Registered new searcher Searcher@371368c3[testschemaapi_shard1_replica1] main{ExitableDirectoryReader(UninvertingDirectoryReader())}
   [junit4]   2> 3479040 INFO  (qtp1061252110-48971) [n:127.0.0.1:54152_solr c:testschemaapi s:shard1 r:core_node1 x:testschemaapi_shard1_replica1] o.a.s.u.UpdateLog Looking up max value of version field to seed version buckets
   [junit4]   2> 3479040 INFO  (qtp1061252110-48971) [n:127.0.0.1:54152_solr c:testschemaapi s:shard1 r:core_node1 x:testschemaapi_shard1_replica1] o.a.s.u.VersionInfo Refreshing highest value of _version_ for 65536 version buckets from index
   [junit4]   2> 3479040 INFO  (qtp1061252110-48971) [n:127.0.0.1:54152_solr c:testschemaapi s:shard1 r:core_node1 x:testschemaapi_shard1_replica1] o.a.s.u.VersionInfo No terms found for _version_, cannot seed version bucket highest value from index
   [junit4]   2> 3479041 INFO  (qtp1061252110-48971) [n:127.0.0.1:54152_solr c:testschemaapi s:shard1 r:core_node1 x:testschemaapi_shard1_replica1] o.a.s.u.UpdateLog Could not find max version in index or recent updates, using new clock 1534392907532861440
   [junit4]   2> 3479043 INFO  (qtp1061252110-48971) [n:127.0.0.1:54152_solr c:testschemaapi s:shard1 r:core_node1 x:testschemaapi_shard1_replica1] o.a.s.u.UpdateLog Took 2.0ms to seed version buckets with highest version 1534392907532861440
   [junit4]   2> 3479045 INFO  (qtp1061252110-48971) [n:127.0.0.1:54152_solr c:testschemaapi s:shard1 r:core_node1 x:testschemaapi_shard1_replica1] o.a.s.c.ZkController watch zkdir /configs/conf1
   [junit4]   2> 3479046 INFO  (qtp1061252110-48971) [n:127.0.0.1:54152_solr c:testschemaapi s:shard1 r:core_node1 x:testschemaapi_shard1_replica1] o.a.s.c.CoreContainer registering core: testschemaapi_shard1_replica1
   [junit4]   2> 3479047 INFO  (qtp1061252110-48971) [n:127.0.0.1:54152_solr c:testschemaapi s:shard1 r:core_node1 x:testschemaapi_shard1_replica1] o.a.s.c.ZkController Register replica - core:testschemaapi_shard1_replica1 address:http://127.0.0.1:54152/solr collection:testschemaapi shard:shard1
   [junit4]   2> 3479048 INFO  (qtp1742322667-48963) [n:127.0.0.1:54151_solr c:testschemaapi s:shard1 r:core_node2 x:testschemaapi_shard1_replica2] o.a.s.c.LeaderElector Joined leadership election with path: /collections/testschemaapi/leader_elect/shard1/election/95899556551655430-core_node2-n_0000000000
   [junit4]   2> 3479050 INFO  (qtp1742322667-48963) [n:127.0.0.1:54151_solr c:testschemaapi s:shard1 r:core_node2 x:testschemaapi_shard1_replica2] o.a.s.c.ShardLeaderElectionContext Running the leader process for shard=shard1 and weAreReplacement=false and leaderVoteWait=10000
   [junit4]   2> 3479078 INFO  (qtp1061252110-48971) [n:127.0.0.1:54152_solr c:testschemaapi s:shard1 r:core_node1 x:testschemaapi_shard1_replica1] o.a.s.c.LeaderElector Joined leadership election with path: /collections/testschemaapi/leader_elect/shard1/election/95899556551655429-core_node1-n_0000000001
   [junit4]   2> 3479080 INFO  (qtp1061252110-48971) [n:127.0.0.1:54152_solr c:testschemaapi s:shard1 r:core_node1 x:testschemaapi_shard1_replica1] o.a.s.c.LeaderElector Watching path /collections/testschemaapi/leader_elect/shard1/election/95899556551655430-core_node2-n_0000000000 to know if I could be the leader
   [junit4]   2> 3479082 INFO  (qtp1742322667-48963) [n:127.0.0.1:54151_solr c:testschemaapi s:shard1 r:core_node2 x:testschemaapi_shard1_replica2] o.a.s.c.ShardLeaderElectionContext Enough replicas found to continue.
   [junit4]   2> 3479082 INFO  (OverseerStateUpdate-95899556551655430-127.0.0.1:54151_solr-n_0000000000) [n:127.0.0.1:54151_solr    ] o.a.s.c.Overseer processMessage: queueSize: 1, message = {
   [junit4]   2>   "operation":"leader",
   [junit4]   2>   "shard":"shard1",
   [junit4]   2>   "collection":"testschemaapi"} current state version: 0
   [junit4]   2> 3479082 INFO  (qtp1742322667-48963) [n:127.0.0.1:54151_solr c:testschemaapi s:shard1 r:core_node2 x:testschemaapi_shard1_replica2] o.a.s.c.ShardLeaderElectionContext I may be the new leader - try and sync
   [junit4]   2> 3479083 INFO  (qtp1742322667-48963) [n:127.0.0.1:54151_solr c:testschemaapi s:shard1 r:core_node2 x:testschemaapi_shard1_replica2] o.a.s.c.SyncStrategy Sync replicas to http://127.0.0.1:54151/solr/testschemaapi_shard1_replica2/
   [junit4]   2> 3479083 INFO  (qtp1742322667-48963) [n:127.0.0.1:54151_solr c:testschemaapi s:shard1 r:core_node2 x:testschemaapi_shard1_replica2] o.a.s.u.PeerSync PeerSync: core=testschemaapi_shard1_replica2 url=http://127.0.0.1:54151/solr START replicas=[http://127.0.0.1:54152/solr/testschemaapi_shard1_replica1/] nUpdates=100
   [junit4]   2> 3479084 INFO  (qtp1742322667-48963) [n:127.0.0.1:54151_solr c:testschemaapi s:shard1 r:core_node2 x:testschemaapi_shard1_replica2] o.a.s.u.PeerSync PeerSync: core=testschemaapi_shard1_replica2 url=http://127.0.0.1:54151/solr DONE.  We have no versions.  sync failed.
   [junit4]   2> 3479085 INFO  (qtp1742322667-48963) [n:127.0.0.1:54151_solr c:testschemaapi s:shard1 r:core_node2 x:testschemaapi_shard1_replica2] o.a.s.c.SyncStrategy Leader's attempt to sync with shard failed, moving to the next candidate
   [junit4]   2> 3479085 INFO  (qtp1742322667-48963) [n:127.0.0.1:54151_solr c:testschemaapi s:shard1 r:core_node2 x:testschemaapi_shard1_replica2] o.a.s.c.ShardLeaderElectionContext We failed sync, but we have no versions - we can't sync in that case - we were active before, so become leader anyway
   [junit4]   2> 3479087 INFO  (qtp1061252110-48973) [n:127.0.0.1:54152_solr c:testschemaapi s:shard1 r:core_node1 x:testschemaapi_shard1_replica1] o.a.s.c.S.Request [testschemaapi_shard1_replica1]  webapp=/solr path=/get params={distrib=false&qt=/get&fingerprint=false&getVersions=100&wt=javabin&version=2} status=0 QTime=0
   [junit4]   2> 3479091 INFO  (qtp1742322667-48963) [n:127.0.0.1:54151_solr c:testschemaapi s:shard1 r:core_node2 x:testschemaapi_shard1_replica2] o.a.s.c.c.SolrZkClient makePath: /collections/testschemaapi/leaders/shard1
   [junit4]   2> 3479099 INFO  (qtp1742322667-48963) [n:127.0.0.1:54151_solr c:testschemaapi s:shard1 r:core_node2 x:testschemaapi_shard1_replica2] o.a.s.c.ShardLeaderElectionContextBase Creating leader registration node /collections/testschemaapi/leaders/shard1/leader after winning as /collections/testschemaapi/leader_elect/shard1/election/95899556551655430-core_node2-n_0000000000
   [junit4]   2> 3479106 INFO  (qtp1742322667-48963) [n:127.0.0.1:54151_solr c:testschemaapi s:shard1 r:core_node2 x:testschemaapi_shard1_replica2] o.a.s.c.ShardLeaderElectionContext I am the new leader: http://127.0.0.1:54151/solr/testschemaapi_shard1_replica2/ shard1
   [junit4]   2> 3479108 INFO  (OverseerStateUpdate-95899556551655430-127.0.0.1:54151_solr-n_0000000000) [n:127.0.0.1:54151_solr    ] o.a.s.c.Overseer processMessage: queueSize: 1, message = {
   [junit4]   2>   "operation":"leader",
   [junit4]   2>   "shard":"shard1",
   [junit4]   2>   "collection":"testschemaapi",
   [junit4]   2>   "base_url":"http://127.0.0.1:54151/solr",
   [junit4]   2>   "core":"testschemaapi_shard1_replica2",
   [junit4]   2>   "state":"active"} current state version: 0
   [junit4]   2> 3479212 INFO  (OverseerStateUpdate-95899556551655430-127.0.0.1:54151_solr-n_0000000000) [n:127.0.0.1:54151_solr    ] o.a.s.c.o.ZkStateWriter going to update_collection /collections/testschemaapi/state.json version: 1
   [junit4]   2> 3479213 INFO  (zkCallback-11622-thread-1-processing-n:127.0.0.1:54152_solr) [n:127.0.0.1:54152_solr    ] o.a.s.c.c.ZkStateReader A cluster state change: [WatchedEvent state:SyncConnected type:NodeDataChanged path:/collections/testschemaapi/state.json] for collection [testschemaapi] has occurred - updating... (live nodes size: [2])
   [junit4]   2> 3479213 INFO  (zkCallback-11623-thread-1-processing-n:127.0.0.1:54151_solr) [n:127.0.0.1:54151_solr    ] o.a.s.c.c.ZkStateReader A cluster state change: [WatchedEvent state:SyncConnected type:NodeDataChanged path:/collections/testschemaapi/state.json] for collection [testschemaapi] has occurred - updating... (live nodes size: [2])
   [junit4]   2> 3479214 INFO  (zkCallback-11622-thread-1-processing-n:127.0.0.1:54152_solr) [n:127.0.0.1:54152_solr    ] o.a.s.c.c.ZkStateReader Updating data for [testschemaapi] from [1] to [2]
   [junit4]   2> 3479215 INFO  (zkCallback-11623-thread-1-processing-n:127.0.0.1:54151_solr) [n:127.0.0.1:54151_solr    ] o.a.s.c.c.ZkStateReader Updating data for [testschemaapi] from [1] to [2]
   [junit4]   2> 3479261 INFO  (qtp1742322667-48963) [n:127.0.0.1:54151_solr c:testschemaapi s:shard1 r:core_node2 x:testschemaapi_shard1_replica2] o.a.s.c.ZkController We are http://127.0.0.1:54151/solr/testschemaapi_shard1_replica2/ and leader is http://127.0.0.1:54151/solr/testschemaapi_shard1_replica2/
   [junit4]   2> 3479261 INFO  (qtp1742322667-48963) [n:127.0.0.1:54151_solr c:testschemaapi s:shard1 r:core_node2 x:testschemaapi_shard1_replica2] o.a.s.c.ZkController No LogReplay needed for core=testschemaapi_shard1_replica2 baseURL=http://127.0.0.1:54151/solr
   [junit4]   2> 3479261 INFO  (qtp1742322667-48963) [n:127.0.0.1:54151_solr c:testschemaapi s:shard1 r:core_node2 x:testschemaapi_shard1_replica2] o.a.s.c.ZkController I am the leader, no recovery necessary
   [junit4]   2> 3479261 INFO  (qtp1742322667-48963) [n:127.0.0.1:54151_solr c:testschemaapi s:shard1 r:core_node2 x:testschemaapi_shard1_replica2] o.a.s.c.ZkController publishing state=active
   [junit4]   2> 3479266 INFO  (OverseerStateUpdate-95899556551655430-127.0.0.1:54151_solr-n_0000000000) [n:127.0.0.1:54151_solr    ] o.a.s.c.Overseer processMessage: queueSize: 1, message = {
   [junit4]   2>   "core":"testschemaapi_shard1_replica2",
   [junit4]   2>   "core_node_name":"core_node2",
   [junit4]   2>   "roles":null,
   [junit4]   2>   "base_url":"http://127.0.0.1:54151/solr",
   [junit4]   2>   "node_name":"127.0.0.1:54151_solr",
   [junit4]   2>   "numShards":"1",
   [junit4]   2>   "state":"active",
   [junit4]   2>   "shard":"shard1",
   [junit4]   2>   "collection":"testschemaapi",
   [junit4]   2>   "operation":"state"} current state version: 0
   [junit4]   2> 3479266 INFO  (OverseerStateUpdate-95899556551655430-127.0.0.1:54151_solr-n_0000000000) [n:127.0.0.1:54151_solr    ] o.a.s.c.o.ReplicaMutator Update state numShards=1 message={
   [junit4]   2>   "core":"testschemaapi_shard1_replica2",
   [junit4]   2>   "core_node_name":"core_node2",
   [junit4]   2>   "roles":null,
   [junit4]   2>   "base_url":"http://127.0.0.1:54151/solr",
   [junit4]   2>   "node_name":"127.0.0.1:54151

[...truncated too long message...]

t4]   2> Caused by: java.io.IOException: We re-tried 10 times but was still unable to fetch resource=configsetprops.json from ZK
   [junit4]   2> 	at org.apache.solr.cloud.ZkSolrResourceLoader.openResource(ZkSolrResourceLoader.java:116)
   [junit4]   2> 	at org.apache.solr.core.ConfigSetProperties.readFromResourceLoader(ConfigSetProperties.java:52)
   [junit4]   2> 	... 5 more
   [junit4]   2> Caused by: org.apache.zookeeper.KeeperException$SessionExpiredException: KeeperErrorCode = Session expired for /configs/conf1/configsetprops.json
   [junit4]   2> 	at org.apache.zookeeper.KeeperException.create(KeeperException.java:127)
   [junit4]   2> 	at org.apache.zookeeper.KeeperException.create(KeeperException.java:51)
   [junit4]   2> 	at org.apache.zookeeper.ZooKeeper.exists(ZooKeeper.java:1045)
   [junit4]   2> 	at org.apache.solr.common.cloud.SolrZkClient$5.execute(SolrZkClient.java:314)
   [junit4]   2> 	at org.apache.solr.common.cloud.SolrZkClient$5.execute(SolrZkClient.java:311)
   [junit4]   2> 	at org.apache.solr.common.cloud.ZkCmdExecutor.retryOperation(ZkCmdExecutor.java:60)
   [junit4]   2> 	at org.apache.solr.common.cloud.SolrZkClient.exists(SolrZkClient.java:311)
   [junit4]   2> 	at org.apache.solr.cloud.ZkController.pathExists(ZkController.java:797)
   [junit4]   2> 	at org.apache.solr.cloud.ZkSolrResourceLoader.openResource(ZkSolrResourceLoader.java:89)
   [junit4]   2> 	... 6 more
   [junit4]   2> NOTE: test params are: codec=Asserting(Lucene60): {_version_=FST50, id=Lucene50(blocksize=128), myNewField=FST50}, docValues:{}, maxPointsInLeafNode=732, maxMBSortInHeap=6.399654846416939, sim=RandomSimilarity(queryNorm=true,coord=no): {}, locale=ar, timezone=Atlantic/Cape_Verde
   [junit4]   2> NOTE: Mac OS X 10.11.4 x86_64/Oracle Corporation 1.8.0_72 (64-bit)/cpus=3,threads=1,free=244721272,total=518979584
   [junit4]   2> NOTE: All tests run in this JVM: [TestSolrDeletionPolicy2, TestRestoreCore, TestManagedResourceStorage, DirectSolrConnectionTest, TestSearcherReuse, CurrencyFieldOpenExchangeTest, TestSolrJ, TestDocBasedVersionConstraints, TestFieldCollectionResource, QueryResultKeyTest, BasicZkTest, TestRandomRequestDistribution, TestConfigSetsAPIZkFailure, TestConfigSets, TestExactStatsCache, TestTolerantUpdateProcessorCloud, CacheHeaderTest, TestReplicaProperties, TestAnalyzeInfixSuggestions, TestFieldTypeCollectionResource, DistributedFacetPivotLargeTest, DistributedQueryComponentOptimizationTest, TestInitParams, DirectUpdateHandlerOptimizeTest, TestDistributedMissingSort, SuggesterWFSTTest, ResourceLoaderTest, TestSolrCoreProperties, AutoCommitTest, TestJettySolrRunner, DistanceFunctionTest, HdfsWriteToMultipleCollectionsTest, IndexSchemaRuntimeFieldTest, TestUtils, BlockJoinFacetDistribTest, SolrCloudExampleTest, SignatureUpdateProcessorFactoryTest, TestSolrConfigHandler, ZkSolrClientTest, TestBulkSchemaConcurrent, TestBinaryResponseWriter, AsyncCallRequestStatusResponseTest, TestObjectReleaseTracker, RemoteQueryErrorTest, SpellCheckComponentTest, WordBreakSolrSpellCheckerTest, CSVRequestHandlerTest, FileBasedSpellCheckerTest, ConfigSetsAPITest, ConnectionReuseTest, TestFileDictionaryLookup, DistributedMLTComponentTest, ForceLeaderTest, BlobRepositoryCloudTest, TestSubQueryTransformerDistrib, JavabinLoaderTest, CursorMarkTest, TestCollapseQParserPlugin, NoCacheHeaderTest, DeleteStatusTest, CleanupOldIndexTest, TestBulkSchemaAPI, TestSolrQueryParser, ShardRoutingCustomTest, TestSchemaNameResource, AddSchemaFieldsUpdateProcessorFactoryTest, TestDFISimilarityFactory, TestSolrQueryParserResource, TestSolr4Spatial, SolrPluginUtilsTest, TestLMJelinekMercerSimilarityFactory, BasicFunctionalityTest, TestCloudDeleteByQuery, TestFilteredDocIdSet, BlockJoinFacetSimpleTest, ZkNodePropsTest, TestClusterStateMutator, TestTrie, ConvertedLegacyTest, BlockDirectoryTest, TestFastWriter, SpellCheckCollatorTest, TestBM25SimilarityFactory, TestCollationField, TestMinMaxOnMultiValuedField, TestSimpleTrackingShardHandler, TermVectorComponentDistributedTest, TestNamedUpdateProcessors, SpellingQueryConverterTest, DefaultValueUpdateProcessorTest, TestRecoveryHdfs, SecurityConfHandlerTest, TestCharFilters, TestRandomFaceting, SuggesterTest, TestFiltering, LoggingHandlerTest, TestRequestStatusCollectionAPI, ExitableDirectoryReaderTest, TestRangeQuery, TestRTGBase, CollectionsAPIDistributedZkTest, CachingDirectoryFactoryTest, MultiThreadedOCPTest, OutputWriterTest, TestReloadAndDeleteDocs, TestCloudPivotFacet, SimpleMLTQParserTest, DebugComponentTest, TestIndexingPerformance, TestReversedWildcardFilterFactory, HLLUtilTest, UUIDUpdateProcessorFallbackTest, CoreAdminHandlerTest, CoreAdminCreateDiscoverTest, TestMaxScoreQueryParser, TestPerFieldSimilarityClassic, TlogReplayBufferedWhileIndexingTest, HighlighterConfigTest, TestNoOpRegenerator, HdfsRecoveryZkTest, OverseerRolesTest, TestCSVResponseWriter, TestFuzzyAnalyzedSuggestions, TestConfigSetImmutable, RestartWhileUpdatingTest, TestRealTimeGet, BitVectorTest, BaseCdcrDistributedZkTest, TestQueryWrapperFilter, ShowFileRequestHandlerTest, DateFieldTest, SynonymTokenizerTest, TestPerFieldSimilarity, ShardSplitTest, TestReload, TestLeaderInitiatedRecoveryThread, TestShortCircuitedRequests, TestManagedStopFilterFactory, CreateCollectionCleanupTest, SolrInfoMBeanTest, DistributedDebugComponentTest, CollectionReloadTest, BasicDistributedZkTest, ChaosMonkeySafeLeaderTest, SyncSliceTest, ShardRoutingTest, ClusterStateUpdateTest, LeaderElectionTest, TestZkChroot, TestFaceting, TestRecovery, DistributedSpellCheckComponentTest, TestStressReorder, TestJoin, DistributedTermsComponentTest, StatsComponentTest, BadIndexSchemaTest, TestSort, TestFunctionQuery, DirectUpdateHandlerTest, TestIndexSearcher, CurrencyFieldXmlFileTest, SolrIndexSplitterTest, TestCoreDiscovery, TestFoldingMultitermQuery, SuggesterTSTTest, SpatialFilterTest, SchemaVersionSpecificBehaviorTest, SolrCoreCheckLockOnStartupTest, FieldMutatingUpdateProcessorTest, TestAtomicUpdateErrorCases, DocValuesMultiTest, IndexBasedSpellCheckerTest, LukeRequestHandlerTest, TestWriterPerf, PrimitiveFieldTypeTest, TestOmitPositions, RequestHandlersTest, TermVectorComponentTest, RequiredFieldsTest, ReturnFieldsTest, UpdateRequestProcessorFactoryTest, QueryParsingTest, TestPartialUpdateDeduplication, TestPHPSerializedResponseWriter, SOLR749Test, TestQuerySenderListener, TestSolrIndexConfig, TestQuerySenderNoQuery, CopyFieldTest, ResponseLogComponentTest, BadComponentTest, TestStressRecovery, MultiTermTest, SampleTest, TestDocSet, TestBinaryField, TestSearchPerf, MinimalSchemaTest, TestPostingsSolrHighlighter, TestCodecSupport, TestFastOutputStream, OpenExchangeRatesOrgProviderTest, PluginInfoTest, DateMathParserTest, ChaosMonkeyNothingIsSafeTest, CdcrReplicationHandlerTest, CdcrVersionReplicationTest, CollectionTooManyReplicasTest, DeleteInactiveReplicaTest, DeleteReplicaTest, DistribDocExpirationUpdateProcessorTest, DistributedQueueTest, LeaderFailoverAfterPartitionTest, LeaderInitiatedRecoveryOnShardRestartTest, MigrateRouteKeyTest, OutOfBoxZkACLAndCredentialsProvidersTest, OverriddenZkACLAndCredentialsProvidersTest, OverseerCollectionConfigSetProcessorTest, OverseerTaskQueueTest, RecoveryAfterSoftCommitTest, TestCollectionAPI, TestConfigSetsAPI, TestCryptoKeys, TestDistribDocBasedVersion, TestDownShardTolerantSearch, TestExclusionRuleCollectionAccess, TestMiniSolrCloudClusterBase, TestMiniSolrCloudClusterSSL, TestSSLRandomization, TestSolrCloudWithKerberosAlt, TestStressLiveNodes, HdfsBasicDistributedZk2Test, HdfsBasicDistributedZkTest, HdfsChaosMonkeyNothingIsSafeTest, HdfsChaosMonkeySafeLeaderTest, HdfsNNFailoverTest, HdfsRecoverLeaseTest, HdfsRestartWhileUpdatingTest, HdfsSyncSliceTest, HdfsTlogReplayBufferedWhileIndexingTest, StressHdfsTest, ZkStateReaderTest, RuleEngineTest, DirectoryFactoryTest, TestDynamicLoading, TestReplicationHandlerBackup, TestSolrConfigHandlerCloud, TestPivotHelperCode, WrapperMergePolicyFactoryTest, SmileWriterTest, TestIntervalFaceting, TestCustomDocTransformer, TestGraphMLResponseWriter, TestRawResponseWriter, TestRawTransformer, TestSolrQueryResponse, TestSortingResponseWriter, TestSubQueryTransformer, TestRestManager, TestCopyFieldCollectionResource, TestDynamicFieldCollectionResource, TestFieldResource, TestFieldTypeResource, TestSchemaResource, TestSchemaSimilarityResource, TestSerializedLuceneMatchVersion, TestUniqueKeyFieldResource, TestManagedSynonymFilterFactory, BadCopyFieldTest, ChangedSchemaMergeTest, DateRangeFieldTest, DocValuesMissingTest, EnumFieldTest, SpatialRPTFieldTypeTest, TestCloudManagedSchema, TestCollationFieldDocValues, TestManagedSchema, TestManagedSchemaAPI]
   [junit4] Completed [538/598 (1!)] on J1 in 24.03s, 1 test, 1 error <<< FAILURES!

[...truncated 222 lines...]
BUILD FAILED
/Users/jenkins/workspace/Lucene-Solr-6.x-MacOSX/build.xml:740: The following error occurred while executing this line:
/Users/jenkins/workspace/Lucene-Solr-6.x-MacOSX/build.xml:684: The following error occurred while executing this line:
/Users/jenkins/workspace/Lucene-Solr-6.x-MacOSX/build.xml:59: The following error occurred while executing this line:
/Users/jenkins/workspace/Lucene-Solr-6.x-MacOSX/solr/build.xml:233: The following error occurred while executing this line:
/Users/jenkins/workspace/Lucene-Solr-6.x-MacOSX/solr/common-build.xml:529: The following error occurred while executing this line:
/Users/jenkins/workspace/Lucene-Solr-6.x-MacOSX/lucene/common-build.xml:1457: The following error occurred while executing this line:
/Users/jenkins/workspace/Lucene-Solr-6.x-MacOSX/lucene/common-build.xml:1014: There were test failures: 598 suites (10 ignored), 2420 tests, 1 error, 121 ignored (71 assumptions) [seed: 48CB1243F047CE4B]

Total time: 83 minutes 42 seconds
Build step 'Invoke Ant' marked build as failure
Archiving artifacts
[WARNINGS] Skipping publisher since build result is FAILURE
Recording test results
Email was triggered for: Failure - Any
Sending email for trigger: Failure - Any



Mime
View raw message